Une MAJ de sécurité est nécessaire sur notre version actuelle. Elle sera effectuée lundi 02/08 entre 12h30 et 13h. L'interruption de service devrait durer quelques minutes (probablement moins de 5 minutes).

In ResultsUploader, use ExponentialBackoff for wait times

13 jobs for !37 with client_wait in 15 minutes and 7 seconds (queued for 4 seconds)
latest detached
Status Job ID Name Coverage
  Early
passed #1120573
checks on alpine system with gcc

00:10:58

passed #1120575
checks on debian10 system with gcc

00:08:51

passed #1120576
checks on debian9 system with gcc

00:11:27

failed #1120574
checks on debian system with 32-bit gcc

00:14:12

passed #1120577
checks on opensuse system with gcc

00:09:56

passed #1120580
osx
checks on osx system

00:01:54

passed #1120578
checks with clang

00:15:06

failed #1120572
checks with gcc

00:07:32

passed #1120579
icc
checks with icc

00:09:44

 
  Thorough
skipped #1120583
freebsd-tanker
checks on freebsd12.2 system with gcc
skipped #1120582
coverage tests on checks with gcc
skipped #1120581
expensive checks with gcc
 
  Publish
skipped #1120584
merge coverage tests
 
Name Stage Failure
failed
checks with gcc Early
[  4%] Built target las_core_b
gmake[1]: *** [CMakeFiles/Makefile2:2392: sieve/CMakeFiles/las_multi_a_prod.dir/all] Error 2
gmake: *** [Makefile:160: all] Error 2
gmake: *** [Makefile:7: all] Error 2
Uploading artifacts for failed job
Uploading artifacts...
WARNING: junit.xml: no matching files
ERROR: No files to upload
ERROR: Job failed: exit code 1
failed
checks on debian system with 32-bit gcc Early
253.94 test_matpoly_basecase_u64k1
259.67 test_bwc_lingen_binary_test0
269.802 test_bwc_mod2_oddthr

Uploading artifacts for failed job
Uploading artifacts...
junit.xml: found 1 matching files and directories

Uploading artifacts as "junit" to coordinator... ok
id=1120574 responseStatus=201 Created token=wycsoTG9
ERROR: Job failed: exit code 1