
radix.elf:     file format elf32-littlearm


Disassembly of section .interp:

00010154 <.interp>:
   10154:	62696c2f 	rsbvs	r6, r9, #12032	; 0x2f00
   10158:	2d646c2f 	stclcs	12, cr6, [r4, #-188]!	; 0xffffff44
   1015c:	756e696c 	strbvc	r6, [lr, #-2412]!	; 0xfffff694
   10160:	6f732e78 	svcvs	0x00732e78
   10164:	Address 0x0000000000010164 is out of bounds.


Disassembly of section .note.ABI-tag:

00010168 <.note.ABI-tag>:
   10168:	00000004 	andeq	r0, r0, r4
   1016c:	00000010 	andeq	r0, r0, r0, lsl r0
   10170:	00000001 	andeq	r0, r0, r1
   10174:	00554e47 	subseq	r4, r5, r7, asr #28
   10178:	00000000 	andeq	r0, r0, r0
   1017c:	00000003 	andeq	r0, r0, r3
   10180:	00000002 	andeq	r0, r0, r2
   10184:	00000000 	andeq	r0, r0, r0

Disassembly of section .gnu.hash:

00010188 <.gnu.hash>:
   10188:	00000003 	andeq	r0, r0, r3
   1018c:	00000005 	andeq	r0, r0, r5
   10190:	00000002 	andeq	r0, r0, r2
   10194:	00000006 	andeq	r0, r0, r6
   10198:	18140c04 	ldmdane	r4, {r2, sl, fp}
   1019c:	23a14403 			; <UNDEFINED> instruction: 0x23a14403
   101a0:	00000005 	andeq	r0, r0, r5
   101a4:	0000000a 	andeq	r0, r0, sl
   101a8:	0000000d 	andeq	r0, r0, sp
   101ac:	ff878ec2 			; <UNDEFINED> instruction: 0xff878ec2
   101b0:	1060307c 	rsbne	r3, r0, ip, ror r0
   101b4:	0d82b830 	stceq	8, cr11, [r2, #192]	; 0xc0
   101b8:	7c9d3dea 	ldcvc	13, cr3, [sp], {234}	; 0xea
   101bc:	a5b50f0b 	ldrge	r0, [r5, #3851]!	; 0xf0b
   101c0:	1044e838 	subne	lr, r4, r8, lsr r8
   101c4:	7c9e7894 	ldcvc	8, cr7, [lr], {148}	; 0x94
   101c8:	0f11ed7d 	svceq	0x0011ed7d
   101cc:	f63d4e2e 			; <UNDEFINED> instruction: 0xf63d4e2e
   101d0:	1ceee48b 	cfstrdne	mvd14, [lr], #556	; 0x22c

Disassembly of section .dynsym:

000101d4 <.dynsym>:
	...
   101e4:	0000000b 	andeq	r0, r0, fp
	...
   101f0:	00000020 	andeq	r0, r0, r0, lsr #32
   101f4:	00000027 	andeq	r0, r0, r7, lsr #32
	...
   10200:	00000020 	andeq	r0, r0, r0, lsr #32
   10204:	00000036 	andeq	r0, r0, r6, lsr r0
	...
   10210:	00000020 	andeq	r0, r0, r0, lsr #32
   10214:	0000004a 	andeq	r0, r0, sl, asr #32
	...
   10220:	00000020 	andeq	r0, r0, r0, lsr #32
   10224:	00000087 	andeq	r0, r0, r7, lsl #1
	...
   10230:	00000012 	andeq	r0, r0, r2, lsl r0
   10234:	00000076 	andeq	r0, r0, r6, ror r0
	...
   10240:	00000012 	andeq	r0, r0, r2, lsl r0
   10244:	0000008e 	andeq	r0, r0, lr, lsl #1
	...
   10250:	00000012 	andeq	r0, r0, r2, lsl r0
   10254:	00000077 	andeq	r0, r0, r7, ror r0
	...
   10260:	00000012 	andeq	r0, r0, r2, lsl r0
   10264:	0000006e 	andeq	r0, r0, lr, rrx
	...
   10270:	00000012 	andeq	r0, r0, r2, lsl r0
   10274:	00000095 	muleq	r0, r5, r0
	...
   10280:	00000012 	andeq	r0, r0, r2, lsl r0
   10284:	0000007c 	andeq	r0, r0, ip, ror r0
	...
   10290:	00000012 	andeq	r0, r0, r2, lsl r0
   10294:	00000081 	andeq	r0, r0, r1, lsl #1
	...
   102a0:	00000012 	andeq	r0, r0, r2, lsl r0
   102a4:	000000a2 	andeq	r0, r0, r2, lsr #1
	...
   102b0:	00000012 	andeq	r0, r0, r2, lsl r0
   102b4:	0000009b 	muleq	r0, fp, r0
	...
   102c0:	00000012 	andeq	r0, r0, r2, lsl r0

Disassembly of section .dynstr:

000102c4 <.dynstr>:
   102c4:	62696c00 	rsbvs	r6, r9, #0, 24
   102c8:	6f732e6d 	svcvs	0x00732e6d
   102cc:	5f00362e 	svcpl	0x0000362e
   102d0:	5f4d5449 	svcpl	0x004d5449
   102d4:	65726564 	ldrbvs	r6, [r2, #-1380]!	; 0xfffffa9c
   102d8:	74736967 	ldrbtvc	r6, [r3], #-2407	; 0xfffff699
   102dc:	4d547265 	lfmmi	f7, 2, [r4, #-404]	; 0xfffffe6c
   102e0:	6e6f6c43 	cdpvs	12, 6, cr6, cr15, cr3, {2}
   102e4:	62615465 	rsbvs	r5, r1, #1694498816	; 0x65000000
   102e8:	5f00656c 	svcpl	0x0000656c
   102ec:	6f6d675f 	svcvs	0x006d675f
   102f0:	74735f6e 	ldrbtvc	r5, [r3], #-3950	; 0xfffff092
   102f4:	5f747261 	svcpl	0x00747261
   102f8:	4a5f005f 	bmi	17d047c <__bss_end__+0x17af034>
   102fc:	65525f76 	ldrbvs	r5, [r2, #-3958]	; 0xfffff08a
   10300:	74736967 	ldrbtvc	r6, [r3], #-2407	; 0xfffff699
   10304:	6c437265 	sfmvs	f7, 2, [r3], {101}	; 0x65
   10308:	65737361 	ldrbvs	r7, [r3, #-865]!	; 0xfffffc9f
   1030c:	495f0073 	ldmdbmi	pc, {r0, r1, r4, r5, r6}^	; <UNPREDICTABLE>
   10310:	725f4d54 	subsvc	r4, pc, #84, 26	; 0x1500
   10314:	73696765 	cmnvc	r9, #26476544	; 0x1940000
   10318:	54726574 	ldrbtpl	r6, [r2], #-1396	; 0xfffffa8c
   1031c:	6f6c434d 	svcvs	0x006c434d
   10320:	6154656e 	cmpvs	r4, lr, ror #10
   10324:	00656c62 	rsbeq	r6, r5, r2, ror #24
   10328:	6362696c 	cmnvs	r2, #108, 18	; 0x1b0000
   1032c:	2e6f732e 	cdpcs	3, 6, cr7, cr15, cr14, {1}
   10330:	70730036 	rsbsvc	r0, r3, r6, lsr r0
   10334:	746e6972 	strbtvc	r6, [lr], #-2418	; 0xfffff68e
   10338:	72730066 	rsbsvc	r0, r3, #102	; 0x66
   1033c:	00646e61 	rsbeq	r6, r4, r1, ror #28
   10340:	656d6974 	strbvs	r6, [sp, #-2420]!	; 0xfffff68c
   10344:	6f626100 	svcvs	0x00626100
   10348:	67007472 	smlsdxvs	r0, r2, r4, r7
   1034c:	69707465 	ldmdbvs	r0!, {r0, r2, r5, r6, sl, ip, sp, lr}^
   10350:	656d0064 	strbvs	r0, [sp, #-100]!	; 0xffffff9c
   10354:	7465736d 	strbtvc	r7, [r5], #-877	; 0xfffffc93
   10358:	69617200 	stmdbvs	r1!, {r9, ip, sp, lr}^
   1035c:	73006573 	movwvc	r6, #1395	; 0x573
   10360:	65747379 	ldrbvs	r7, [r4, #-889]!	; 0xfffffc87
   10364:	5f5f006d 	svcpl	0x005f006d
   10368:	6362696c 	cmnvs	r2, #108, 18	; 0x1b0000
   1036c:	6174735f 	cmnvs	r4, pc, asr r3
   10370:	6d5f7472 	cfldrdvs	mvd7, [pc, #-456]	; 101b0 <shift+0x101b0>
   10374:	006e6961 	rsbeq	r6, lr, r1, ror #18
   10378:	42494c47 	submi	r4, r9, #18176	; 0x4700
   1037c:	2e325f43 	cdpcs	15, 3, cr5, cr2, cr3, {2}
   10380:	Address 0x0000000000010380 is out of bounds.


Disassembly of section .gnu.version:

00010382 <.gnu.version>:
	...
   1038a:	00020000 	andeq	r0, r2, r0
   1038e:	00020002 	andeq	r0, r2, r2
   10392:	00020002 	andeq	r0, r2, r2
   10396:	00020002 	andeq	r0, r2, r2
   1039a:	00020002 	andeq	r0, r2, r2
   1039e:	Address 0x000000000001039e is out of bounds.


Disassembly of section .gnu.version_r:

000103a0 <.gnu.version_r>:
   103a0:	00010001 	andeq	r0, r1, r1
   103a4:	00000064 	andeq	r0, r0, r4, rrx
   103a8:	00000010 	andeq	r0, r0, r0, lsl r0
   103ac:	00000000 	andeq	r0, r0, r0
   103b0:	0d696914 	stcleq	9, cr6, [r9, #-80]!	; 0xffffffb0
   103b4:	00020000 	andeq	r0, r2, r0
   103b8:	000000b4 	strheq	r0, [r0], -r4
   103bc:	00000000 	andeq	r0, r0, r0

Disassembly of section .rel.dyn:

000103c0 <.rel.dyn>:
   103c0:	00021038 	andeq	r1, r2, r8, lsr r0
   103c4:	00000215 	andeq	r0, r0, r5, lsl r2

Disassembly of section .rel.plt:

000103c8 <.rel.plt>:
   103c8:	0002100c 	andeq	r1, r2, ip
   103cc:	00000a16 	andeq	r0, r0, r6, lsl sl
   103d0:	00021010 	andeq	r1, r2, r0, lsl r0
   103d4:	00000b16 	andeq	r0, r0, r6, lsl fp
   103d8:	00021014 	andeq	r1, r2, r4, lsl r0
   103dc:	00000d16 	andeq	r0, r0, r6, lsl sp
   103e0:	00021018 	andeq	r1, r2, r8, lsl r0
   103e4:	00000e16 	andeq	r0, r0, r6, lsl lr
   103e8:	0002101c 	andeq	r1, r2, ip, lsl r0
   103ec:	00000216 	andeq	r0, r0, r6, lsl r2
   103f0:	00021020 	andeq	r1, r2, r0, lsr #32
   103f4:	00000516 	andeq	r0, r0, r6, lsl r5
   103f8:	00021024 	andeq	r1, r2, r4, lsr #32
   103fc:	00000616 	andeq	r0, r0, r6, lsl r6
   10400:	00021028 	andeq	r1, r2, r8, lsr #32
   10404:	00000716 	andeq	r0, r0, r6, lsl r7
   10408:	0002102c 	andeq	r1, r2, ip, lsr #32
   1040c:	00000816 	andeq	r0, r0, r6, lsl r8
   10410:	00021030 	andeq	r1, r2, r0, lsr r0
   10414:	00000916 	andeq	r0, r0, r6, lsl r9
   10418:	00021034 	andeq	r1, r2, r4, lsr r0
   1041c:	00000c16 	andeq	r0, r0, r6, lsl ip

Disassembly of section .init:

00010420 <_init>:
   10420:	e92d4008 	push	{r3, lr}
   10424:	eb000035 	bl	10500 <call_weak_fn>
   10428:	e8bd8008 	pop	{r3, pc}

Disassembly of section .plt:

0001042c <raise@plt-0x14>:
   1042c:	e52de004 	push	{lr}		; (str lr, [sp, #-4]!)
   10430:	e59fe004 	ldr	lr, [pc, #4]	; 1043c <_init+0x1c>
   10434:	e08fe00e 	add	lr, pc, lr
   10438:	e5bef008 	ldr	pc, [lr, #8]!
   1043c:	00010bc4 	andeq	r0, r1, r4, asr #23

00010440 <raise@plt>:
   10440:	e28fc600 	add	ip, pc, #0, 12
   10444:	e28cca10 	add	ip, ip, #16, 20	; 0x10000
   10448:	e5bcfbc4 	ldr	pc, [ip, #3012]!	; 0xbc4

0001044c <time@plt>:
   1044c:	e28fc600 	add	ip, pc, #0, 12
   10450:	e28cca10 	add	ip, ip, #16, 20	; 0x10000
   10454:	e5bcfbbc 	ldr	pc, [ip, #3004]!	; 0xbbc

00010458 <__libc_start_main@plt>:
   10458:	e28fc600 	add	ip, pc, #0, 12
   1045c:	e28cca10 	add	ip, ip, #16, 20	; 0x10000
   10460:	e5bcfbb4 	ldr	pc, [ip, #2996]!	; 0xbb4

00010464 <system@plt>:
   10464:	e28fc600 	add	ip, pc, #0, 12
   10468:	e28cca10 	add	ip, ip, #16, 20	; 0x10000
   1046c:	e5bcfbac 	ldr	pc, [ip, #2988]!	; 0xbac

00010470 <__gmon_start__@plt>:
   10470:	e28fc600 	add	ip, pc, #0, 12
   10474:	e28cca10 	add	ip, ip, #16, 20	; 0x10000
   10478:	e5bcfba4 	ldr	pc, [ip, #2980]!	; 0xba4

0001047c <getpid@plt>:
   1047c:	e28fc600 	add	ip, pc, #0, 12
   10480:	e28cca10 	add	ip, ip, #16, 20	; 0x10000
   10484:	e5bcfb9c 	ldr	pc, [ip, #2972]!	; 0xb9c

00010488 <srand@plt>:
   10488:	e28fc600 	add	ip, pc, #0, 12
   1048c:	e28cca10 	add	ip, ip, #16, 20	; 0x10000
   10490:	e5bcfb94 	ldr	pc, [ip, #2964]!	; 0xb94

00010494 <memset@plt>:
   10494:	e28fc600 	add	ip, pc, #0, 12
   10498:	e28cca10 	add	ip, ip, #16, 20	; 0x10000
   1049c:	e5bcfb8c 	ldr	pc, [ip, #2956]!	; 0xb8c

000104a0 <rand@plt>:
   104a0:	e28fc600 	add	ip, pc, #0, 12
   104a4:	e28cca10 	add	ip, ip, #16, 20	; 0x10000
   104a8:	e5bcfb84 	ldr	pc, [ip, #2948]!	; 0xb84

000104ac <sprintf@plt>:
   104ac:	e28fc600 	add	ip, pc, #0, 12
   104b0:	e28cca10 	add	ip, ip, #16, 20	; 0x10000
   104b4:	e5bcfb7c 	ldr	pc, [ip, #2940]!	; 0xb7c

000104b8 <abort@plt>:
   104b8:	e28fc600 	add	ip, pc, #0, 12
   104bc:	e28cca10 	add	ip, ip, #16, 20	; 0x10000
   104c0:	e5bcfb74 	ldr	pc, [ip, #2932]!	; 0xb74

Disassembly of section .text:

000104c4 <_start>:
   104c4:	e3a0b000 	mov	fp, #0
   104c8:	e3a0e000 	mov	lr, #0
   104cc:	e49d1004 	pop	{r1}		; (ldr r1, [sp], #4)
   104d0:	e1a0200d 	mov	r2, sp
   104d4:	e52d2004 	push	{r2}		; (str r2, [sp, #-4]!)
   104d8:	e52d0004 	push	{r0}		; (str r0, [sp, #-4]!)
   104dc:	e59fc010 	ldr	ip, [pc, #16]	; 104f4 <_start+0x30>
   104e0:	e52dc004 	push	{ip}		; (str ip, [sp, #-4]!)
   104e4:	e59f000c 	ldr	r0, [pc, #12]	; 104f8 <_start+0x34>
   104e8:	e59f300c 	ldr	r3, [pc, #12]	; 104fc <_start+0x38>
   104ec:	ebffffd9 	bl	10458 <__libc_start_main@plt>
   104f0:	ebfffff0 	bl	104b8 <abort@plt>
   104f4:	00010c1c 	andeq	r0, r1, ip, lsl ip
   104f8:	000108e0 	andeq	r0, r1, r0, ror #17
   104fc:	00010bbc 			; <UNDEFINED> instruction: 0x00010bbc

00010500 <call_weak_fn>:
   10500:	e59f3014 	ldr	r3, [pc, #20]	; 1051c <call_weak_fn+0x1c>
   10504:	e59f2014 	ldr	r2, [pc, #20]	; 10520 <call_weak_fn+0x20>
   10508:	e08f3003 	add	r3, pc, r3
   1050c:	e7932002 	ldr	r2, [r3, r2]
   10510:	e3520000 	cmp	r2, #0
   10514:	012fff1e 	bxeq	lr
   10518:	eaffffd4 	b	10470 <__gmon_start__@plt>
   1051c:	00010af0 	strdeq	r0, [r1], -r0	; <UNPREDICTABLE>
   10520:	00000038 	andeq	r0, r0, r8, lsr r0

00010524 <deregister_tm_clones>:
   10524:	e59f301c 	ldr	r3, [pc, #28]	; 10548 <deregister_tm_clones+0x24>
   10528:	e59f001c 	ldr	r0, [pc, #28]	; 1054c <deregister_tm_clones+0x28>
   1052c:	e0433000 	sub	r3, r3, r0
   10530:	e3530006 	cmp	r3, #6
   10534:	912fff1e 	bxls	lr
   10538:	e59f3010 	ldr	r3, [pc, #16]	; 10550 <deregister_tm_clones+0x2c>
   1053c:	e3530000 	cmp	r3, #0
   10540:	012fff1e 	bxeq	lr
   10544:	e12fff13 	bx	r3
   10548:	00021047 	andeq	r1, r2, r7, asr #32
   1054c:	00021044 	andeq	r1, r2, r4, asr #32
   10550:	00000000 	andeq	r0, r0, r0

00010554 <register_tm_clones>:
   10554:	e59f1024 	ldr	r1, [pc, #36]	; 10580 <register_tm_clones+0x2c>
   10558:	e59f0024 	ldr	r0, [pc, #36]	; 10584 <register_tm_clones+0x30>
   1055c:	e0411000 	sub	r1, r1, r0
   10560:	e1a01141 	asr	r1, r1, #2
   10564:	e0811fa1 	add	r1, r1, r1, lsr #31
   10568:	e1b010c1 	asrs	r1, r1, #1
   1056c:	012fff1e 	bxeq	lr
   10570:	e59f3010 	ldr	r3, [pc, #16]	; 10588 <register_tm_clones+0x34>
   10574:	e3530000 	cmp	r3, #0
   10578:	012fff1e 	bxeq	lr
   1057c:	e12fff13 	bx	r3
   10580:	00021044 	andeq	r1, r2, r4, asr #32
   10584:	00021044 	andeq	r1, r2, r4, asr #32
   10588:	00000000 	andeq	r0, r0, r0

0001058c <__do_global_dtors_aux>:
   1058c:	e92d4010 	push	{r4, lr}
   10590:	e59f4018 	ldr	r4, [pc, #24]	; 105b0 <__do_global_dtors_aux+0x24>
   10594:	e5d43000 	ldrb	r3, [r4]
   10598:	e3530000 	cmp	r3, #0
   1059c:	18bd8010 	popne	{r4, pc}
   105a0:	ebffffdf 	bl	10524 <deregister_tm_clones>
   105a4:	e3a03001 	mov	r3, #1
   105a8:	e5c43000 	strb	r3, [r4]
   105ac:	e8bd8010 	pop	{r4, pc}
   105b0:	00021044 	andeq	r1, r2, r4, asr #32

000105b4 <frame_dummy>:
   105b4:	e59f0028 	ldr	r0, [pc, #40]	; 105e4 <frame_dummy+0x30>
   105b8:	e5903000 	ldr	r3, [r0]
   105bc:	e3530000 	cmp	r3, #0
   105c0:	1a000000 	bne	105c8 <frame_dummy+0x14>
   105c4:	eaffffe2 	b	10554 <register_tm_clones>
   105c8:	e59f3018 	ldr	r3, [pc, #24]	; 105e8 <frame_dummy+0x34>
   105cc:	e3530000 	cmp	r3, #0
   105d0:	0afffffb 	beq	105c4 <frame_dummy+0x10>
   105d4:	e92d4010 	push	{r4, lr}
   105d8:	e12fff33 	blx	r3
   105dc:	e8bd4010 	pop	{r4, lr}
   105e0:	eaffffdb 	b	10554 <register_tm_clones>
   105e4:	00020f0c 	andeq	r0, r2, ip, lsl #30
   105e8:	00000000 	andeq	r0, r0, r0

000105ec <radixsort>:
   105ec:	e92d4830 	push	{r4, r5, fp, lr}
   105f0:	e28db008 	add	fp, sp, #8
   105f4:	e24dd058 	sub	sp, sp, #88	; 0x58
   105f8:	e24ddb01 	sub	sp, sp, #1024	; 0x400
   105fc:	e1a02001 	mov	r2, r1
   10600:	e1a03000 	mov	r3, r0
   10604:	e50b000c 	str	r0, [fp, #-12]
   10608:	e50b1010 	str	r1, [fp, #-16]
   1060c:	e3a00000 	mov	r0, #0
   10610:	e58d0048 	str	r0, [sp, #72]	; 0x48
   10614:	e3a01001 	mov	r1, #1
   10618:	e58d1044 	str	r1, [sp, #68]	; 0x44
   1061c:	e50b0014 	str	r0, [fp, #-20]	; 0xffffffec
   10620:	e58d2018 	str	r2, [sp, #24]
   10624:	e58d3014 	str	r3, [sp, #20]
   10628:	eaffffff 	b	1062c <radixsort+0x40>
   1062c:	e51b0014 	ldr	r0, [fp, #-20]	; 0xffffffec
   10630:	e51b1010 	ldr	r1, [fp, #-16]
   10634:	e1500001 	cmp	r0, r1
   10638:	aa000011 	bge	10684 <radixsort+0x98>
   1063c:	eaffffff 	b	10640 <radixsort+0x54>
   10640:	e51b0014 	ldr	r0, [fp, #-20]	; 0xffffffec
   10644:	e51b100c 	ldr	r1, [fp, #-12]
   10648:	e7910100 	ldr	r0, [r1, r0, lsl #2]
   1064c:	e59d1048 	ldr	r1, [sp, #72]	; 0x48
   10650:	e1500001 	cmp	r0, r1
   10654:	da000005 	ble	10670 <radixsort+0x84>
   10658:	eaffffff 	b	1065c <radixsort+0x70>
   1065c:	e51b0014 	ldr	r0, [fp, #-20]	; 0xffffffec
   10660:	e51b100c 	ldr	r1, [fp, #-12]
   10664:	e7910100 	ldr	r0, [r1, r0, lsl #2]
   10668:	e58d0048 	str	r0, [sp, #72]	; 0x48
   1066c:	eaffffff 	b	10670 <radixsort+0x84>
   10670:	eaffffff 	b	10674 <radixsort+0x88>
   10674:	e51b0014 	ldr	r0, [fp, #-20]	; 0xffffffec
   10678:	e2800001 	add	r0, r0, #1
   1067c:	e50b0014 	str	r0, [fp, #-20]	; 0xffffffec
   10680:	eaffffe9 	b	1062c <radixsort+0x40>
   10684:	eaffffff 	b	10688 <radixsort+0x9c>
   10688:	e59d0048 	ldr	r0, [sp, #72]	; 0x48
   1068c:	e59d1044 	ldr	r1, [sp, #68]	; 0x44
   10690:	eb0000b5 	bl	1096c <__aeabi_idiv>
   10694:	e3500001 	cmp	r0, #1
   10698:	ba00006e 	blt	10858 <radixsort+0x26c>
   1069c:	eaffffff 	b	106a0 <radixsort+0xb4>
   106a0:	e28d001c 	add	r0, sp, #28
   106a4:	e3a01000 	mov	r1, #0
   106a8:	e3a02028 	mov	r2, #40	; 0x28
   106ac:	e58d1010 	str	r1, [sp, #16]
   106b0:	ebffff77 	bl	10494 <memset@plt>
   106b4:	e59d1010 	ldr	r1, [sp, #16]
   106b8:	e50b1014 	str	r1, [fp, #-20]	; 0xffffffec
   106bc:	e58d000c 	str	r0, [sp, #12]
   106c0:	eaffffff 	b	106c4 <radixsort+0xd8>
   106c4:	e51b0014 	ldr	r0, [fp, #-20]	; 0xffffffec
   106c8:	e51b1010 	ldr	r1, [fp, #-16]
   106cc:	e1500001 	cmp	r0, r1
   106d0:	aa000015 	bge	1072c <radixsort+0x140>
   106d4:	eaffffff 	b	106d8 <radixsort+0xec>
   106d8:	e51b0014 	ldr	r0, [fp, #-20]	; 0xffffffec
   106dc:	e51b100c 	ldr	r1, [fp, #-12]
   106e0:	e7910100 	ldr	r0, [r1, r0, lsl #2]
   106e4:	e59d1044 	ldr	r1, [sp, #68]	; 0x44
   106e8:	eb00009f 	bl	1096c <__aeabi_idiv>
   106ec:	e59f1170 	ldr	r1, [pc, #368]	; 10864 <radixsort+0x278>
   106f0:	e0c2e190 	smull	lr, r2, r0, r1
   106f4:	e1a01122 	lsr	r1, r2, #2
   106f8:	e0811fa2 	add	r1, r1, r2, lsr #31
   106fc:	e0811101 	add	r1, r1, r1, lsl #2
   10700:	e0400081 	sub	r0, r0, r1, lsl #1
   10704:	e28d101c 	add	r1, sp, #28
   10708:	e7912100 	ldr	r2, [r1, r0, lsl #2]
   1070c:	e2822001 	add	r2, r2, #1
   10710:	e7812100 	str	r2, [r1, r0, lsl #2]
   10714:	e58de008 	str	lr, [sp, #8]
   10718:	eaffffff 	b	1071c <radixsort+0x130>
   1071c:	e51b0014 	ldr	r0, [fp, #-20]	; 0xffffffec
   10720:	e2800001 	add	r0, r0, #1
   10724:	e50b0014 	str	r0, [fp, #-20]	; 0xffffffec
   10728:	eaffffe5 	b	106c4 <radixsort+0xd8>
   1072c:	e3a00001 	mov	r0, #1
   10730:	e50b0014 	str	r0, [fp, #-20]	; 0xffffffec
   10734:	eaffffff 	b	10738 <radixsort+0x14c>
   10738:	e51b0014 	ldr	r0, [fp, #-20]	; 0xffffffec
   1073c:	e3500009 	cmp	r0, #9
   10740:	ca00000c 	bgt	10778 <radixsort+0x18c>
   10744:	eaffffff 	b	10748 <radixsort+0x15c>
   10748:	e51b0014 	ldr	r0, [fp, #-20]	; 0xffffffec
   1074c:	e28d101c 	add	r1, sp, #28
   10750:	e0812100 	add	r2, r1, r0, lsl #2
   10754:	e5122004 	ldr	r2, [r2, #-4]
   10758:	e7913100 	ldr	r3, [r1, r0, lsl #2]
   1075c:	e0832002 	add	r2, r3, r2
   10760:	e7812100 	str	r2, [r1, r0, lsl #2]
   10764:	eaffffff 	b	10768 <radixsort+0x17c>
   10768:	e51b0014 	ldr	r0, [fp, #-20]	; 0xffffffec
   1076c:	e2800001 	add	r0, r0, #1
   10770:	e50b0014 	str	r0, [fp, #-20]	; 0xffffffec
   10774:	eaffffef 	b	10738 <radixsort+0x14c>
   10778:	e51b0010 	ldr	r0, [fp, #-16]
   1077c:	e2400001 	sub	r0, r0, #1
   10780:	e50b0014 	str	r0, [fp, #-20]	; 0xffffffec
   10784:	eaffffff 	b	10788 <radixsort+0x19c>
   10788:	e51b0014 	ldr	r0, [fp, #-20]	; 0xffffffec
   1078c:	e3500000 	cmp	r0, #0
   10790:	ba000019 	blt	107fc <radixsort+0x210>
   10794:	eaffffff 	b	10798 <radixsort+0x1ac>
   10798:	e51b0014 	ldr	r0, [fp, #-20]	; 0xffffffec
   1079c:	e51b100c 	ldr	r1, [fp, #-12]
   107a0:	e7910100 	ldr	r0, [r1, r0, lsl #2]
   107a4:	e59d1044 	ldr	r1, [sp, #68]	; 0x44
   107a8:	e58d0004 	str	r0, [sp, #4]
   107ac:	eb00006e 	bl	1096c <__aeabi_idiv>
   107b0:	e59f10ac 	ldr	r1, [pc, #172]	; 10864 <radixsort+0x278>
   107b4:	e0c2e190 	smull	lr, r2, r0, r1
   107b8:	e1a01122 	lsr	r1, r2, #2
   107bc:	e0811fa2 	add	r1, r1, r2, lsr #31
   107c0:	e0811101 	add	r1, r1, r1, lsl #2
   107c4:	e0400081 	sub	r0, r0, r1, lsl #1
   107c8:	e28d101c 	add	r1, sp, #28
   107cc:	e7912100 	ldr	r2, [r1, r0, lsl #2]
   107d0:	e2422001 	sub	r2, r2, #1
   107d4:	e7812100 	str	r2, [r1, r0, lsl #2]
   107d8:	e28d004c 	add	r0, sp, #76	; 0x4c
   107dc:	e59d1004 	ldr	r1, [sp, #4]
   107e0:	e7801102 	str	r1, [r0, r2, lsl #2]
   107e4:	e58de000 	str	lr, [sp]
   107e8:	eaffffff 	b	107ec <radixsort+0x200>
   107ec:	e51b0014 	ldr	r0, [fp, #-20]	; 0xffffffec
   107f0:	e2400001 	sub	r0, r0, #1
   107f4:	e50b0014 	str	r0, [fp, #-20]	; 0xffffffec
   107f8:	eaffffe2 	b	10788 <radixsort+0x19c>
   107fc:	e3a00000 	mov	r0, #0
   10800:	e50b0014 	str	r0, [fp, #-20]	; 0xffffffec
   10804:	eaffffff 	b	10808 <radixsort+0x21c>
   10808:	e51b0014 	ldr	r0, [fp, #-20]	; 0xffffffec
   1080c:	e51b1010 	ldr	r1, [fp, #-16]
   10810:	e1500001 	cmp	r0, r1
   10814:	aa00000a 	bge	10844 <radixsort+0x258>
   10818:	eaffffff 	b	1081c <radixsort+0x230>
   1081c:	e51b0014 	ldr	r0, [fp, #-20]	; 0xffffffec
   10820:	e28d104c 	add	r1, sp, #76	; 0x4c
   10824:	e7911100 	ldr	r1, [r1, r0, lsl #2]
   10828:	e51b200c 	ldr	r2, [fp, #-12]
   1082c:	e7821100 	str	r1, [r2, r0, lsl #2]
   10830:	eaffffff 	b	10834 <radixsort+0x248>
   10834:	e51b0014 	ldr	r0, [fp, #-20]	; 0xffffffec
   10838:	e2800001 	add	r0, r0, #1
   1083c:	e50b0014 	str	r0, [fp, #-20]	; 0xffffffec
   10840:	eafffff0 	b	10808 <radixsort+0x21c>
   10844:	e59d0044 	ldr	r0, [sp, #68]	; 0x44
   10848:	e0800100 	add	r0, r0, r0, lsl #2
   1084c:	e1a00080 	lsl	r0, r0, #1
   10850:	e58d0044 	str	r0, [sp, #68]	; 0x44
   10854:	eaffff8b 	b	10688 <radixsort+0x9c>
   10858:	e24bd008 	sub	sp, fp, #8
   1085c:	e8bd4830 	pop	{r4, r5, fp, lr}
   10860:	e12fff1e 	bx	lr
   10864:	66666667 	strbtvs	r6, [r6], -r7, ror #12

00010868 <app_radix>:
   10868:	e92d4800 	push	{fp, lr}
   1086c:	e1a0b00d 	mov	fp, sp
   10870:	e24dd008 	sub	sp, sp, #8
   10874:	e3a00000 	mov	r0, #0
   10878:	e58d0000 	str	r0, [sp]
   1087c:	ebfffef2 	bl	1044c <time@plt>
   10880:	ebffff00 	bl	10488 <srand@plt>
   10884:	e59d0000 	ldr	r0, [sp]
   10888:	e58d0004 	str	r0, [sp, #4]
   1088c:	eaffffff 	b	10890 <app_radix+0x28>
   10890:	e59d0004 	ldr	r0, [sp, #4]
   10894:	e35000ff 	cmp	r0, #255	; 0xff
   10898:	ca000009 	bgt	108c4 <app_radix+0x5c>
   1089c:	eaffffff 	b	108a0 <app_radix+0x38>
   108a0:	ebfffefe 	bl	104a0 <rand@plt>
   108a4:	e59de004 	ldr	lr, [sp, #4]
   108a8:	e59f102c 	ldr	r1, [pc, #44]	; 108dc <app_radix+0x74>
   108ac:	e781010e 	str	r0, [r1, lr, lsl #2]
   108b0:	eaffffff 	b	108b4 <app_radix+0x4c>
   108b4:	e59d0004 	ldr	r0, [sp, #4]
   108b8:	e2800001 	add	r0, r0, #1
   108bc:	e58d0004 	str	r0, [sp, #4]
   108c0:	eafffff2 	b	10890 <app_radix+0x28>
   108c4:	e59f0010 	ldr	r0, [pc, #16]	; 108dc <app_radix+0x74>
   108c8:	e3a01c01 	mov	r1, #256	; 0x100
   108cc:	ebffff46 	bl	105ec <radixsort>
   108d0:	e1a0d00b 	mov	sp, fp
   108d4:	e8bd4800 	pop	{fp, lr}
   108d8:	e12fff1e 	bx	lr
   108dc:	00021048 	andeq	r1, r2, r8, asr #32

000108e0 <main>:
   108e0:	e92d4800 	push	{fp, lr}
   108e4:	e1a0b00d 	mov	fp, sp
   108e8:	e24dd068 	sub	sp, sp, #104	; 0x68
   108ec:	e1a02001 	mov	r2, r1
   108f0:	e1a03000 	mov	r3, r0
   108f4:	e3a0c000 	mov	ip, #0
   108f8:	e50bc004 	str	ip, [fp, #-4]
   108fc:	e50b0008 	str	r0, [fp, #-8]
   10900:	e50b100c 	str	r1, [fp, #-12]
   10904:	e58d3018 	str	r3, [sp, #24]
   10908:	e58dc014 	str	ip, [sp, #20]
   1090c:	e58d2010 	str	r2, [sp, #16]
   10910:	ebffffd4 	bl	10868 <app_radix>
   10914:	ebfffed8 	bl	1047c <getpid@plt>
   10918:	e51b100c 	ldr	r1, [fp, #-12]
   1091c:	e5913000 	ldr	r3, [r1]
   10920:	e59f1040 	ldr	r1, [pc, #64]	; 10968 <main+0x88>
   10924:	e28d201c 	add	r2, sp, #28
   10928:	e58d000c 	str	r0, [sp, #12]
   1092c:	e1a00002 	mov	r0, r2
   10930:	e59dc00c 	ldr	ip, [sp, #12]
   10934:	e58d2008 	str	r2, [sp, #8]
   10938:	e1a0200c 	mov	r2, ip
   1093c:	ebfffeda 	bl	104ac <sprintf@plt>
   10940:	e59d1008 	ldr	r1, [sp, #8]
   10944:	e58d0004 	str	r0, [sp, #4]
   10948:	e1a00001 	mov	r0, r1
   1094c:	ebfffec4 	bl	10464 <system@plt>
   10950:	e59d1014 	ldr	r1, [sp, #20]
   10954:	e58d0000 	str	r0, [sp]
   10958:	e1a00001 	mov	r0, r1
   1095c:	e1a0d00b 	mov	sp, fp
   10960:	e8bd4800 	pop	{fp, lr}
   10964:	e12fff1e 	bx	lr
   10968:	00010c2c 	andeq	r0, r1, ip, lsr #24

0001096c <__aeabi_idiv>:
   1096c:	e3510000 	cmp	r1, #0
   10970:	0a000081 	beq	10b7c <.divsi3_skip_div0_test+0x208>

00010974 <.divsi3_skip_div0_test>:
   10974:	e020c001 	eor	ip, r0, r1
   10978:	42611000 	rsbmi	r1, r1, #0
   1097c:	e2512001 	subs	r2, r1, #1
   10980:	0a000070 	beq	10b48 <.divsi3_skip_div0_test+0x1d4>
   10984:	e1b03000 	movs	r3, r0
   10988:	42603000 	rsbmi	r3, r0, #0
   1098c:	e1530001 	cmp	r3, r1
   10990:	9a00006f 	bls	10b54 <.divsi3_skip_div0_test+0x1e0>
   10994:	e1110002 	tst	r1, r2
   10998:	0a000071 	beq	10b64 <.divsi3_skip_div0_test+0x1f0>
   1099c:	e16f2f13 	clz	r2, r3
   109a0:	e16f0f11 	clz	r0, r1
   109a4:	e0402002 	sub	r2, r0, r2
   109a8:	e272201f 	rsbs	r2, r2, #31
   109ac:	10822082 	addne	r2, r2, r2, lsl #1
   109b0:	e3a00000 	mov	r0, #0
   109b4:	108ff102 	addne	pc, pc, r2, lsl #2
   109b8:	e1a00000 	nop			; (mov r0, r0)
   109bc:	e1530f81 	cmp	r3, r1, lsl #31
   109c0:	e0a00000 	adc	r0, r0, r0
   109c4:	20433f81 	subcs	r3, r3, r1, lsl #31
   109c8:	e1530f01 	cmp	r3, r1, lsl #30
   109cc:	e0a00000 	adc	r0, r0, r0
   109d0:	20433f01 	subcs	r3, r3, r1, lsl #30
   109d4:	e1530e81 	cmp	r3, r1, lsl #29
   109d8:	e0a00000 	adc	r0, r0, r0
   109dc:	20433e81 	subcs	r3, r3, r1, lsl #29
   109e0:	e1530e01 	cmp	r3, r1, lsl #28
   109e4:	e0a00000 	adc	r0, r0, r0
   109e8:	20433e01 	subcs	r3, r3, r1, lsl #28
   109ec:	e1530d81 	cmp	r3, r1, lsl #27
   109f0:	e0a00000 	adc	r0, r0, r0
   109f4:	20433d81 	subcs	r3, r3, r1, lsl #27
   109f8:	e1530d01 	cmp	r3, r1, lsl #26
   109fc:	e0a00000 	adc	r0, r0, r0
   10a00:	20433d01 	subcs	r3, r3, r1, lsl #26
   10a04:	e1530c81 	cmp	r3, r1, lsl #25
   10a08:	e0a00000 	adc	r0, r0, r0
   10a0c:	20433c81 	subcs	r3, r3, r1, lsl #25
   10a10:	e1530c01 	cmp	r3, r1, lsl #24
   10a14:	e0a00000 	adc	r0, r0, r0
   10a18:	20433c01 	subcs	r3, r3, r1, lsl #24
   10a1c:	e1530b81 	cmp	r3, r1, lsl #23
   10a20:	e0a00000 	adc	r0, r0, r0
   10a24:	20433b81 	subcs	r3, r3, r1, lsl #23
   10a28:	e1530b01 	cmp	r3, r1, lsl #22
   10a2c:	e0a00000 	adc	r0, r0, r0
   10a30:	20433b01 	subcs	r3, r3, r1, lsl #22
   10a34:	e1530a81 	cmp	r3, r1, lsl #21
   10a38:	e0a00000 	adc	r0, r0, r0
   10a3c:	20433a81 	subcs	r3, r3, r1, lsl #21
   10a40:	e1530a01 	cmp	r3, r1, lsl #20
   10a44:	e0a00000 	adc	r0, r0, r0
   10a48:	20433a01 	subcs	r3, r3, r1, lsl #20
   10a4c:	e1530981 	cmp	r3, r1, lsl #19
   10a50:	e0a00000 	adc	r0, r0, r0
   10a54:	20433981 	subcs	r3, r3, r1, lsl #19
   10a58:	e1530901 	cmp	r3, r1, lsl #18
   10a5c:	e0a00000 	adc	r0, r0, r0
   10a60:	20433901 	subcs	r3, r3, r1, lsl #18
   10a64:	e1530881 	cmp	r3, r1, lsl #17
   10a68:	e0a00000 	adc	r0, r0, r0
   10a6c:	20433881 	subcs	r3, r3, r1, lsl #17
   10a70:	e1530801 	cmp	r3, r1, lsl #16
   10a74:	e0a00000 	adc	r0, r0, r0
   10a78:	20433801 	subcs	r3, r3, r1, lsl #16
   10a7c:	e1530781 	cmp	r3, r1, lsl #15
   10a80:	e0a00000 	adc	r0, r0, r0
   10a84:	20433781 	subcs	r3, r3, r1, lsl #15
   10a88:	e1530701 	cmp	r3, r1, lsl #14
   10a8c:	e0a00000 	adc	r0, r0, r0
   10a90:	20433701 	subcs	r3, r3, r1, lsl #14
   10a94:	e1530681 	cmp	r3, r1, lsl #13
   10a98:	e0a00000 	adc	r0, r0, r0
   10a9c:	20433681 	subcs	r3, r3, r1, lsl #13
   10aa0:	e1530601 	cmp	r3, r1, lsl #12
   10aa4:	e0a00000 	adc	r0, r0, r0
   10aa8:	20433601 	subcs	r3, r3, r1, lsl #12
   10aac:	e1530581 	cmp	r3, r1, lsl #11
   10ab0:	e0a00000 	adc	r0, r0, r0
   10ab4:	20433581 	subcs	r3, r3, r1, lsl #11
   10ab8:	e1530501 	cmp	r3, r1, lsl #10
   10abc:	e0a00000 	adc	r0, r0, r0
   10ac0:	20433501 	subcs	r3, r3, r1, lsl #10
   10ac4:	e1530481 	cmp	r3, r1, lsl #9
   10ac8:	e0a00000 	adc	r0, r0, r0
   10acc:	20433481 	subcs	r3, r3, r1, lsl #9
   10ad0:	e1530401 	cmp	r3, r1, lsl #8
   10ad4:	e0a00000 	adc	r0, r0, r0
   10ad8:	20433401 	subcs	r3, r3, r1, lsl #8
   10adc:	e1530381 	cmp	r3, r1, lsl #7
   10ae0:	e0a00000 	adc	r0, r0, r0
   10ae4:	20433381 	subcs	r3, r3, r1, lsl #7
   10ae8:	e1530301 	cmp	r3, r1, lsl #6
   10aec:	e0a00000 	adc	r0, r0, r0
   10af0:	20433301 	subcs	r3, r3, r1, lsl #6
   10af4:	e1530281 	cmp	r3, r1, lsl #5
   10af8:	e0a00000 	adc	r0, r0, r0
   10afc:	20433281 	subcs	r3, r3, r1, lsl #5
   10b00:	e1530201 	cmp	r3, r1, lsl #4
   10b04:	e0a00000 	adc	r0, r0, r0
   10b08:	20433201 	subcs	r3, r3, r1, lsl #4
   10b0c:	e1530181 	cmp	r3, r1, lsl #3
   10b10:	e0a00000 	adc	r0, r0, r0
   10b14:	20433181 	subcs	r3, r3, r1, lsl #3
   10b18:	e1530101 	cmp	r3, r1, lsl #2
   10b1c:	e0a00000 	adc	r0, r0, r0
   10b20:	20433101 	subcs	r3, r3, r1, lsl #2
   10b24:	e1530081 	cmp	r3, r1, lsl #1
   10b28:	e0a00000 	adc	r0, r0, r0
   10b2c:	20433081 	subcs	r3, r3, r1, lsl #1
   10b30:	e1530001 	cmp	r3, r1
   10b34:	e0a00000 	adc	r0, r0, r0
   10b38:	20433001 	subcs	r3, r3, r1
   10b3c:	e35c0000 	cmp	ip, #0
   10b40:	42600000 	rsbmi	r0, r0, #0
   10b44:	e12fff1e 	bx	lr
   10b48:	e13c0000 	teq	ip, r0
   10b4c:	42600000 	rsbmi	r0, r0, #0
   10b50:	e12fff1e 	bx	lr
   10b54:	33a00000 	movcc	r0, #0
   10b58:	01a00fcc 	asreq	r0, ip, #31
   10b5c:	03800001 	orreq	r0, r0, #1
   10b60:	e12fff1e 	bx	lr
   10b64:	e16f2f11 	clz	r2, r1
   10b68:	e262201f 	rsb	r2, r2, #31
   10b6c:	e35c0000 	cmp	ip, #0
   10b70:	e1a00233 	lsr	r0, r3, r2
   10b74:	42600000 	rsbmi	r0, r0, #0
   10b78:	e12fff1e 	bx	lr
   10b7c:	e3500000 	cmp	r0, #0
   10b80:	c3e00102 	mvngt	r0, #-2147483648	; 0x80000000
   10b84:	b3a00102 	movlt	r0, #-2147483648	; 0x80000000
   10b88:	ea000007 	b	10bac <__aeabi_idiv0>

00010b8c <__aeabi_idivmod>:
   10b8c:	e3510000 	cmp	r1, #0
   10b90:	0afffff9 	beq	10b7c <.divsi3_skip_div0_test+0x208>
   10b94:	e92d4003 	push	{r0, r1, lr}
   10b98:	ebffff75 	bl	10974 <.divsi3_skip_div0_test>
   10b9c:	e8bd4006 	pop	{r1, r2, lr}
   10ba0:	e0030092 	mul	r3, r2, r0
   10ba4:	e0411003 	sub	r1, r1, r3
   10ba8:	e12fff1e 	bx	lr

00010bac <__aeabi_idiv0>:
   10bac:	e92d4002 	push	{r1, lr}
   10bb0:	e3a00008 	mov	r0, #8
   10bb4:	ebfffe21 	bl	10440 <raise@plt>
   10bb8:	e8bd8002 	pop	{r1, pc}

00010bbc <__libc_csu_init>:
   10bbc:	e92d47f0 	push	{r4, r5, r6, r7, r8, r9, sl, lr}
   10bc0:	e59f604c 	ldr	r6, [pc, #76]	; 10c14 <__libc_csu_init+0x58>
   10bc4:	e59f504c 	ldr	r5, [pc, #76]	; 10c18 <__libc_csu_init+0x5c>
   10bc8:	e08f6006 	add	r6, pc, r6
   10bcc:	e08f5005 	add	r5, pc, r5
   10bd0:	e0466005 	sub	r6, r6, r5
   10bd4:	e1a07000 	mov	r7, r0
   10bd8:	e1a08001 	mov	r8, r1
   10bdc:	e1a09002 	mov	r9, r2
   10be0:	ebfffe0e 	bl	10420 <_init>
   10be4:	e1b06146 	asrs	r6, r6, #2
   10be8:	08bd87f0 	popeq	{r4, r5, r6, r7, r8, r9, sl, pc}
   10bec:	e3a04000 	mov	r4, #0
   10bf0:	e2844001 	add	r4, r4, #1
   10bf4:	e4953004 	ldr	r3, [r5], #4
   10bf8:	e1a02009 	mov	r2, r9
   10bfc:	e1a01008 	mov	r1, r8
   10c00:	e1a00007 	mov	r0, r7
   10c04:	e12fff33 	blx	r3
   10c08:	e1540006 	cmp	r4, r6
   10c0c:	1afffff7 	bne	10bf0 <__libc_csu_init+0x34>
   10c10:	e8bd87f0 	pop	{r4, r5, r6, r7, r8, r9, sl, pc}
   10c14:	00010338 	andeq	r0, r1, r8, lsr r3
   10c18:	00010330 	andeq	r0, r1, r0, lsr r3

00010c1c <__libc_csu_fini>:
   10c1c:	e12fff1e 	bx	lr

Disassembly of section .fini:

00010c20 <_fini>:
   10c20:	e92d4008 	push	{r3, lr}
   10c24:	e8bd8008 	pop	{r3, pc}

Disassembly of section .rodata:

00010c28 <_IO_stdin_used>:
   10c28:	00020001 	andeq	r0, r2, r1
   10c2c:	20746163 	rsbscs	r6, r4, r3, ror #2
   10c30:	6f72702f 	svcvs	0x0072702f
   10c34:	64252f63 	strtvs	r2, [r5], #-3939	; 0xfffff09d
   10c38:	70616d2f 	rsbvc	r6, r1, pc, lsr #26
   10c3c:	203e2073 	eorscs	r2, lr, r3, ror r0
   10c40:	6d2e7325 	stcvs	3, cr7, [lr, #-148]!	; 0xffffff6c
   10c44:	00737061 	rsbseq	r7, r3, r1, rrx

Disassembly of section .hardblare_info:

00010c48 <.hardblare_info>:
   10c48:	00010001 	andeq	r0, r1, r1
   10c4c:	0000001f 	andeq	r0, r0, pc, lsl r0
   10c50:	00010001 	andeq	r0, r1, r1
   10c54:	0000001f 	andeq	r0, r0, pc, lsl r0
   10c58:	00010001 	andeq	r0, r1, r1
   10c5c:	00000001 	andeq	r0, r0, r1
   10c60:	00010001 	andeq	r0, r1, r1
   10c64:	00000001 	andeq	r0, r0, r1

Disassembly of section .hardblare_annotations:

00010c68 <.hardblare_annotations>:
   10c68:	002a002a 	eoreq	r0, sl, sl, lsr #32
   10c6c:	002a002a 	eoreq	r0, sl, sl, lsr #32
   10c70:	002a002a 	eoreq	r0, sl, sl, lsr #32
   10c74:	002a002a 	eoreq	r0, sl, sl, lsr #32
   10c78:	002a002a 	eoreq	r0, sl, sl, lsr #32
   10c7c:	002a002a 	eoreq	r0, sl, sl, lsr #32
   10c80:	002a002a 	eoreq	r0, sl, sl, lsr #32
   10c84:	002a002a 	eoreq	r0, sl, sl, lsr #32
   10c88:	002a002a 	eoreq	r0, sl, sl, lsr #32
   10c8c:	002a002a 	eoreq	r0, sl, sl, lsr #32
   10c90:	002a002a 	eoreq	r0, sl, sl, lsr #32
   10c94:	002a002a 	eoreq	r0, sl, sl, lsr #32
   10c98:	002a002a 	eoreq	r0, sl, sl, lsr #32
   10c9c:	002a002a 	eoreq	r0, sl, sl, lsr #32
   10ca0:	002a002a 	eoreq	r0, sl, sl, lsr #32
   10ca4:	002a002a 	eoreq	r0, sl, sl, lsr #32
   10ca8:	002a002a 	eoreq	r0, sl, sl, lsr #32
   10cac:	002a002a 	eoreq	r0, sl, sl, lsr #32
   10cb0:	002a002a 	eoreq	r0, sl, sl, lsr #32
   10cb4:	002a002a 	eoreq	r0, sl, sl, lsr #32
   10cb8:	002a002a 	eoreq	r0, sl, sl, lsr #32
   10cbc:	002a002a 	eoreq	r0, sl, sl, lsr #32
   10cc0:	002a002a 	eoreq	r0, sl, sl, lsr #32
   10cc4:	002a002a 	eoreq	r0, sl, sl, lsr #32
   10cc8:	002a002a 	eoreq	r0, sl, sl, lsr #32
   10ccc:	002a002a 	eoreq	r0, sl, sl, lsr #32
   10cd0:	002a002a 	eoreq	r0, sl, sl, lsr #32
   10cd4:	002a002a 	eoreq	r0, sl, sl, lsr #32
   10cd8:	002a002a 	eoreq	r0, sl, sl, lsr #32
   10cdc:	002a002a 	eoreq	r0, sl, sl, lsr #32
   10ce0:	002a002a 	eoreq	r0, sl, sl, lsr #32
   10ce4:	002a002a 	eoreq	r0, sl, sl, lsr #32

Disassembly of section .ARM.exidx:

00010ce8 <.ARM.exidx>:
   10ce8:	7ffff7dc 	svcvc	0x00fff7dc
   10cec:	00000001 	andeq	r0, r0, r1

Disassembly of section .eh_frame:

00010cf0 <__FRAME_END__>:
   10cf0:	00000000 	andeq	r0, r0, r0

Disassembly of section .init_array:

00020f04 <__frame_dummy_init_array_entry>:
   20f04:	000105b4 			; <UNDEFINED> instruction: 0x000105b4

Disassembly of section .fini_array:

00020f08 <__do_global_dtors_aux_fini_array_entry>:
   20f08:	0001058c 	andeq	r0, r1, ip, lsl #11

Disassembly of section .jcr:

00020f0c <__JCR_END__>:
   20f0c:	00000000 	andeq	r0, r0, r0

Disassembly of section .dynamic:

00020f10 <_DYNAMIC>:
   20f10:	00000001 	andeq	r0, r0, r1
   20f14:	00000001 	andeq	r0, r0, r1
   20f18:	00000001 	andeq	r0, r0, r1
   20f1c:	00000064 	andeq	r0, r0, r4, rrx
   20f20:	0000000c 	andeq	r0, r0, ip
   20f24:	00010420 	andeq	r0, r1, r0, lsr #8
   20f28:	0000000d 	andeq	r0, r0, sp
   20f2c:	00010c20 	andeq	r0, r1, r0, lsr #24
   20f30:	00000019 	andeq	r0, r0, r9, lsl r0
   20f34:	00020f04 	andeq	r0, r2, r4, lsl #30
   20f38:	0000001b 	andeq	r0, r0, fp, lsl r0
   20f3c:	00000004 	andeq	r0, r0, r4
   20f40:	0000001a 	andeq	r0, r0, sl, lsl r0
   20f44:	00020f08 	andeq	r0, r2, r8, lsl #30
   20f48:	0000001c 	andeq	r0, r0, ip, lsl r0
   20f4c:	00000004 	andeq	r0, r0, r4
   20f50:	6ffffef5 	svcvs	0x00fffef5
   20f54:	00010188 	andeq	r0, r1, r8, lsl #3
   20f58:	00000005 	andeq	r0, r0, r5
   20f5c:	000102c4 	andeq	r0, r1, r4, asr #5
   20f60:	00000006 	andeq	r0, r0, r6
   20f64:	000101d4 	ldrdeq	r0, [r1], -r4
   20f68:	0000000a 	andeq	r0, r0, sl
   20f6c:	000000be 	strheq	r0, [r0], -lr
   20f70:	0000000b 	andeq	r0, r0, fp
   20f74:	00000010 	andeq	r0, r0, r0, lsl r0
   20f78:	00000015 	andeq	r0, r0, r5, lsl r0
   20f7c:	00000000 	andeq	r0, r0, r0
   20f80:	00000003 	andeq	r0, r0, r3
   20f84:	00021000 	andeq	r1, r2, r0
   20f88:	00000002 	andeq	r0, r0, r2
   20f8c:	00000058 	andeq	r0, r0, r8, asr r0
   20f90:	00000014 	andeq	r0, r0, r4, lsl r0
   20f94:	00000011 	andeq	r0, r0, r1, lsl r0
   20f98:	00000017 	andeq	r0, r0, r7, lsl r0
   20f9c:	000103c8 	andeq	r0, r1, r8, asr #7
   20fa0:	00000011 	andeq	r0, r0, r1, lsl r0
   20fa4:	000103c0 	andeq	r0, r1, r0, asr #7
   20fa8:	00000012 	andeq	r0, r0, r2, lsl r0
   20fac:	00000008 	andeq	r0, r0, r8
   20fb0:	00000013 	andeq	r0, r0, r3, lsl r0
   20fb4:	00000008 	andeq	r0, r0, r8
   20fb8:	6ffffffe 	svcvs	0x00fffffe
   20fbc:	000103a0 	andeq	r0, r1, r0, lsr #7
   20fc0:	6fffffff 	svcvs	0x00ffffff
   20fc4:	00000001 	andeq	r0, r0, r1
   20fc8:	6ffffff0 	svcvs	0x00fffff0
   20fcc:	00010382 	andeq	r0, r1, r2, lsl #7
	...

Disassembly of section .got:

00021000 <_GLOBAL_OFFSET_TABLE_>:
   21000:	00020f10 	andeq	r0, r2, r0, lsl pc
	...
   2100c:	0001042c 	andeq	r0, r1, ip, lsr #8
   21010:	0001042c 	andeq	r0, r1, ip, lsr #8
   21014:	0001042c 	andeq	r0, r1, ip, lsr #8
   21018:	0001042c 	andeq	r0, r1, ip, lsr #8
   2101c:	0001042c 	andeq	r0, r1, ip, lsr #8
   21020:	0001042c 	andeq	r0, r1, ip, lsr #8
   21024:	0001042c 	andeq	r0, r1, ip, lsr #8
   21028:	0001042c 	andeq	r0, r1, ip, lsr #8
   2102c:	0001042c 	andeq	r0, r1, ip, lsr #8
   21030:	0001042c 	andeq	r0, r1, ip, lsr #8
   21034:	0001042c 	andeq	r0, r1, ip, lsr #8
   21038:	00000000 	andeq	r0, r0, r0

Disassembly of section .data:

0002103c <__data_start>:
   2103c:	00000000 	andeq	r0, r0, r0

00021040 <__dso_handle>:
   21040:	00000000 	andeq	r0, r0, r0

Disassembly of section .bss:

00021044 <__bss_start>:
   21044:	00000000 	andeq	r0, r0, r0

00021048 <app_radix.arr>:
	...

Disassembly of section .comment:

00000000 <.comment>:
   0:	3a434347 	bcc	10d0d24 <__bss_end__+0x10af8dc>
   4:	62552820 	subsvs	r2, r5, #32, 16	; 0x200000
   8:	75746e75 	ldrbvc	r6, [r4, #-3701]!	; 0xfffff18b
   c:	6e694c2f 	cdpvs	12, 6, cr4, cr9, cr15, {1}
  10:	206f7261 	rsbcs	r7, pc, r1, ror #4
  14:	2e342e35 	mrccs	14, 1, r2, cr4, cr5, {1}
  18:	75362d30 	ldrvc	r2, [r6, #-3376]!	; 0xfffff2d0
  1c:	746e7562 	strbtvc	r7, [lr], #-1378	; 0xfffffa9e
  20:	317e3175 	cmncc	lr, r5, ror r1
  24:	34302e36 	ldrtcc	r2, [r0], #-3638	; 0xfffff1ca
  28:	2029342e 	eorcs	r3, r9, lr, lsr #8
  2c:	2e342e35 	mrccs	14, 1, r2, cr4, cr5, {1}
  30:	30322030 	eorscc	r2, r2, r0, lsr r0
  34:	36303631 			; <UNDEFINED> instruction: 0x36303631
  38:	63003930 	movwvs	r3, #2352	; 0x930
  3c:	676e616c 	strbvs	r6, [lr, -ip, ror #2]!
  40:	72657620 	rsbvc	r7, r5, #32, 12	; 0x2000000
  44:	6e6f6973 	mcrvs	9, 3, r6, cr15, cr3, {3}
  48:	392e3320 	stmdbcc	lr!, {r5, r8, r9, ip, sp}
  4c:	2820302e 	stmdacs	r0!, {r1, r2, r3, r5, ip, sp}
  50:	656c6966 	strbvs	r6, [ip, #-2406]!	; 0xfffff69a
  54:	2f2f2f3a 	svccs	0x002f2f3a
  58:	656d6f68 	strbvs	r6, [sp, #-3944]!	; 0xfffff098
  5c:	68756d2f 	ldmdavs	r5!, {r0, r1, r2, r3, r5, r8, sl, fp, sp, lr}^
  60:	616d6d61 	cmnvs	sp, r1, ror #26
  64:	61482f64 	cmpvs	r8, r4, ror #30
  68:	6c426472 	cfstrdvs	mvd6, [r2], {114}	; 0x72
  6c:	2f657261 	svccs	0x00657261
  70:	6e616c63 	cdpvs	12, 6, cr6, cr1, cr3, {3}
  74:	61682d67 	cmnvs	r8, r7, ror #26
  78:	6c626472 	cfstrdvs	mvd6, [r2], #-456	; 0xfffffe38
  7c:	20657261 	rsbcs	r7, r5, r1, ror #4
  80:	38306333 	ldmdacc	r0!, {r0, r1, r4, r5, r8, r9, sp, lr}
  84:	34616536 	strbtcc	r6, [r1], #-1334	; 0xfffffaca
  88:	39386164 	ldmdbcc	r8!, {r2, r5, r6, r8, sp, lr}
  8c:	30663162 	rsbcc	r3, r6, r2, ror #2
  90:	39663733 	stmdbcc	r6!, {r0, r1, r4, r5, r8, r9, sl, ip, sp}^
  94:	38663462 	stmdacc	r6!, {r1, r5, r6, sl, ip, sp}^
  98:	65656632 	strbvs	r6, [r5, #-1586]!	; 0xfffff9ce
  9c:	61333865 	teqvs	r3, r5, ror #16
  a0:	33383237 	teqcc	r8, #1879048195	; 0x70000003
  a4:	35656262 	strbcc	r6, [r5, #-610]!	; 0xfffffd9e
  a8:	66282029 	strtvs	r2, [r8], -r9, lsr #32
  ac:	3a656c69 	bcc	195b258 <__bss_end__+0x1939e10>
  b0:	682f2f2f 	stmdavs	pc!, {r0, r1, r2, r3, r5, r8, r9, sl, fp, sp}	; <UNPREDICTABLE>
  b4:	2f656d6f 	svccs	0x00656d6f
  b8:	6168756d 	cmnvs	r8, sp, ror #10
  bc:	64616d6d 	strbtvs	r6, [r1], #-3437	; 0xfffff293
  c0:	7261482f 	rsbvc	r4, r1, #3080192	; 0x2f0000
  c4:	616c4264 	cmnvs	ip, r4, ror #4
  c8:	6c2f6572 	cfstr32vs	mvfx6, [pc], #-456	; ffffff08 <__bss_end__+0xfffdeac0>
  cc:	206d766c 	rsbcs	r7, sp, ip, ror #12
  d0:	36633066 	strbtcc	r3, [r3], -r6, rrx
  d4:	37326632 			; <UNDEFINED> instruction: 0x37326632
  d8:	37303566 	ldrcc	r3, [r0, -r6, ror #10]!
  dc:	64633466 	strbtvs	r3, [r3], #-1126	; 0xfffffb9a
  e0:	31376632 	teqcc	r7, r2, lsr r6
  e4:	31316132 	teqcc	r1, r2, lsr r1
  e8:	35313338 	ldrcc	r3, [r1, #-824]!	; 0xfffffcc8
  ec:	64323534 	ldrtvs	r3, [r2], #-1332	; 0xfffffacc
  f0:	37346636 			; <UNDEFINED> instruction: 0x37346636
  f4:	62396461 	eorsvs	r6, r9, #1627389952	; 0x61000000
  f8:	Address 0x00000000000000f8 is out of bounds.


Disassembly of section .ARM.attributes:

00000000 <.ARM.attributes>:
   0:	00002d41 	andeq	r2, r0, r1, asr #26
   4:	61656100 	cmnvs	r5, r0, lsl #2
   8:	01006962 	tsteq	r0, r2, ror #18
   c:	00000023 	andeq	r0, r0, r3, lsr #32
  10:	00543505 	subseq	r3, r4, r5, lsl #10
  14:	01080306 	tsteq	r8, r6, lsl #6
  18:	01110109 	tsteq	r1, r9, lsl #2
  1c:	01130412 	tsteq	r3, r2, lsl r4
  20:	01150114 	tsteq	r5, r4, lsl r1
  24:	01180317 	tsteq	r8, r7, lsl r3
  28:	021a0119 	andseq	r0, sl, #1073741830	; 0x40000006
  2c:	Address 0x000000000000002c is out of bounds.

