00111100000111000000000000000001
00100111100111001001101001100000
00111100000001010000000000000000
00100100101001010001101001110000
00111100000001000000000000000000
00100100100001000011110010111000
00111100000111010000000000000000
00100111101111010001110011101000
10101100101000000000000000000000
00000000101001000001100000101010
00010100011000001111111111111101
00100100101001010000000000000100
00001100000000000000000010101111
00000000000000000000000000000000
00001000000000000000000000001110
00100011101111011111111110011000
10101111101000010000000000010000
10101111101000100000000000010100
10101111101000110000000000011000
10101111101001000000000000011100
10101111101001010000000000100000
10101111101001100000000000100100
10101111101001110000000000101000
10101111101010000000000000101100
10101111101010010000000000110000
10101111101010100000000000110100
10101111101010110000000000111000
10101111101011000000000000111100
10101111101011010000000001000000
10101111101011100000000001000100
10101111101011110000000001001000
10101111101110000000000001001100
10101111101110010000000001010000
10101111101111110000000001010100
01000000000110100111000000000000
00100011010110101111111111111100
10101111101110100000000001011000
00000000000000001101100000010000
10101111101110110000000001011100
00000000000000001101100000010010
10101111101110110000000001100000
00111100000001100010000000000000
10001100110001000000000000100000
10001100110001100000000000010000
00000000100001100010000000100100
00001100000000000000000100111001
00100011101001010000000000000000
10001111101000010000000000010000
10001111101000100000000000010100
10001111101000110000000000011000
10001111101001000000000000011100
10001111101001010000000000100000
10001111101001100000000000100100
10001111101001110000000000101000
10001111101010000000000000101100
10001111101010010000000000110000
10001111101010100000000000110100
10001111101010110000000000111000
10001111101011000000000000111100
10001111101011010000000001000000
10001111101011100000000001000100
10001111101011110000000001001000
10001111101110000000000001001100
10001111101110010000000001010000
10001111101111110000000001010100
10001111101110100000000001011000
10001111101110110000000001011100
00000011011000000000000000010001
10001111101110110000000001100000
00000011011000000000000000010011
00100011101111010000000001101000
00110100000110110000000000000001
00000011010000000000000000001000
01000000100110110110000000000000
01000000000000100110000000000000
00000011111000000000000000001000
01000000100001000110000000000000
00111100000001010000000000000000
00100100101001010000000101100000
10001100101001100000000000000000
10101100000001100000000000111100
10001100101001100000000000000100
10101100000001100000000001000000
10001100101001100000000000001000
10101100000001100000000001000100
10001100101001100000000000001100
00000011111000000000000000001000
10101100000001100000000001001000
00111100000110100001000000000000
00110111010110100000000000111100
00000011010000000000000000001000
00000000000000000000000000000000
10101100100100000000000000000000
10101100100100010000000000000100
10101100100100100000000000001000
10101100100100110000000000001100
10101100100101000000000000010000
10101100100101010000000000010100
10101100100101100000000000011000
10101100100101110000000000011100
10101100100111100000000000100000
10101100100111000000000000100100
10101100100111010000000000101000
10101100100111110000000000101100
00000011111000000000000000001000
00110100000000100000000000000000
10001100100100000000000000000000
10001100100100010000000000000100
10001100100100100000000000001000
10001100100100110000000000001100
10001100100101000000000000010000
10001100100101010000000000010100
10001100100101100000000000011000
10001100100101110000000000011100
10001100100111100000000000100000
10001100100111000000000000100100
10001100100111010000000000101000
10001100100111110000000000101100
00000011111000000000000000001000
00110100101000100000000000000000
00000000100001010000000000011001
00000000000000000001000000010010
00000000000000000010000000010000
00000011111000000000000000001000
10101100110001000000000000000000
00000000000000000000000000001100
00000011111000000000000000001000
00000000000000000000000000000000
00111100000001001010000000000000
00111100000000100000000000000000
00111100000000110000000000000000
00100100010001010001110100000000
00100100011001110001101000110000
00110100100001100000000001100100
10001100100000100000000000000000
00100100100001000000000000000100
00000000000000100001000010000000
00000000010001110001000000100001
10001100010000110000000000000000
00000000000000000000000000000000
10101100101000110000000000000000
00010100100001101111111111111000
00100100101001010000000000000100
00111100000000111010000000000000
00111100000000100000000000000000
00100100010001010001110101100100
00110100011001100000000010000000
00110100011001000000000001100100
10001100100000100000000000000000
00100100100001000000000000000100
10101100101000100000000000000000
00010100100001101111111111111100
00100100101001010000000000000100
00000011111000000000000000001000
00000000000000000000000000000000
00111100000000111000001000010000
10001100011000100000000000000000
00000000000000000000000000000000
00010100010000001111111111111101
00000000000000000000000000000000
00000011111000000000000000001000
00000000000000000000000000000000
00100111101111011111111111101000
10101111101100000000000000010000
00111100000100000000000000000000
10101111101111110000000000010100
00001100000000000000001001100010
00100110000100000001101010000000
00001100000000000000001001100010
10101110000000100000000001111000
10101110000000100000000001110100
10001111101111110000000000010100
10001111101100000000000000010000
00000011111000000000000000001000
00100111101111010000000000011000
00100111101111011111111111010000
00111100000000100000000000000000
00111100000000111111111111111111
10101111101100000000000000010000
10101111101111110000000000101000
10101111101101010000000000100100
10101111101101000000000000100000
10101111101100110000000000011100
10101111101100100000000000011000
10101111101100010000000000010100
00110100011100000000000000001000
10101100010000000001101001110000
00001100000000000000000010011011
00000000000000000000000000000000
00001100000000000000010100110000
00000000000000000000000000000000
10001100010000110000000000000000
00000000000000000000000000000000
00010100011100001111111111111001
00000000000000000000000000000000
00001100000000000000000010100010
00111100000101000001000000000000
00001100000000000000000010000000
00110110100101010000000000000100
00001100000000000000000010011011
00000000000000000000000000000000
00001100000000000000010100110000
00000000000000000000000000000000
10001100010100000000000000000000
10001110100001010000000000000000
00000000000000000000000000000000
00010000101000001111111111111000
00000000000000000000000000000000
10001110101000110000000000000000
00000000000000000000000000000000
00010010000000110000000000011100
00000010101000000010000000100001
00000000000000000001100000100001
00100100011000110000000000000001
00010000101000111111111111110000
00100100100001000000000000001000
10001100100000100000000000000000
00000000000000000000000000000000
00010110000000101111111111111011
00100100011000110000000000000001
00100100011000111111111111111111
00100100100000100000000000000100
10001100010000100000000000000000
00000000000000000000000000000000
00010000010000001111111111100110
00000000010101000001000000100001
10001100010100110000000000000000
00000000000000000000000000000000
00010010011000001111111111100010
00100100010100010000000000000100
00000000000000001001000000100001
10001110001001010000000000000000
00000010000000000010000000100001
00001100000000000000010001101111
00100110010100100000000000000001
00010110011100101111111111111011
00100110001100010000000000000100
00001000000000000000000011000111
00000000000000000000000000000000
00001000000000000000000011011110
00110110100000100000000000001000
00000000000000000000000000000000
00000000000000000000000000000000
00000000000000000000000000000000
00111100000001010010000000000000
00110100101000110000000000100000
10001100011000100000000000000000
00000000000000000000000000000000
00110000010000100000000000000010
00010000010000001111111111111100
00000000000000000001000000100001
10101100101001000000000000000000
00000011111000000000000000001000
00000000000000000000000000000000
00100111101111011111111111100000
10101111101100000000000000010000
10101111101111110000000000011000
10101111101100010000000000010100
10000000100000100000000000000000
00000000000000000000000000000000
00010000010000000000000000010110
00000000100000001000000000100001
00001000000000000000000100001111
00100100000100010000000000001010
00000000010000000010000000100001
00001100000000000000000011110100
00100110000100000000000000000001
10000010000000100000000000000000
00000000000000000000000000000000
00010000010000000000000000001101
00000000000000000000000000000000
00010100010100011111111111111000
00100100000001000000000000001101
00001100000000000000000011110100
00000000000000000000000000000000
10000010000000100000000000000000
00100110000100000000000000000001
00001100000000000000000011110100
00000000010000000010000000100001
10000010000000100000000000000000
00000000000000000000000000000000
00010100010000001111111111110101
00000000000000000000000000000000
10001111101111110000000000011000
10001111101100010000000000010100
10001111101100000000000000010000
00000000000000000001000000100001
00000011111000000000000000001000
00100111101111010000000000100000
00100111101111011111111111100000
10101111101100100000000000011000
10101111101100010000000000010100
10101111101100000000000000010000
10101111101111110000000000011100
00000000100000001001000000100001
00100100000100000000000000011100
00100100000100011111111111111100
00000010000100100001000000000110
00110000010000110000000000001111
00101100011000100000000000001010
00010100010000000000000000000010
00100100011001000000000000110000
00100100011001000000000001010111
00001100000000000000000011110100
00100110000100001111111111111100
00010110000100011111111111111000
00000010000100100001000000000110
10001111101111110000000000011100
10001111101100100000000000011000
10001111101100010000000000010100
10001111101100000000000000010000
00000011111000000000000000001000
00100111101111010000000000100000
00001000000000000000000011110100
00100100000001000000000001001001
00111100000000110010000000000000
00110100011000110000000000100000
10001100011000100000000000000000
00000011111000000000000000001000
00110000010000100000000000000001
00100111101111011111111111101000
10101111101111110000000000010000
00001100000000000000000100111011
00000000000000000000000000000000
00010000010000001111111111111101
00111100000000110010000000000000
10001100011000100000000000000000
10001111101111110000000000010000
00000000000000000000000000000000
00000011111000000000000000001000
00100111101111010000000000011000
00000000000000000000000000000000
00000000100001010010000000100101
00111100000000101111000000000000
00000011111000000000000000001000
00000000100000100001000000100100
00111100000000111111000000000000
00000000100000110001000000100100
00000011111000000000000000001000
00000000101000100001000000100100
00111100000000100000111111111111
00110100010000101111111111111111
00000011111000000000000000001000
00000000100000100001000000100100
00100111101111011111111111100000
10101111101100000000000000010000
00000000100000001000000000100001
10101111101111110000000000011100
10101111101100100000000000011000
10101111101100010000000000010100
00001100000000000000000101001100
00000000101000001000100000100001
00000010000000000010000000100001
00001100000000000000000101010100
00000000010000001001000000100001
00000010001000000010000000100001
00001100000000000000000101010100
00000000010000001000000000100001
00000010000000101000000000100101
00000010010100000001000000100101
10001111101111110000000000011100
10001111101100100000000000011000
10001111101100010000000000010100
10001111101100000000000000010000
00000011111000000000000000001000
00100111101111010000000000100000
00100111101111011111111111100000
10101111101100000000000000010000
00000000100000001000000000100001
10101111101111110000000000011100
10101111101100100000000000011000
10101111101100010000000000010100
00001100000000000000000101001100
00000000101000001000100000100001
00000010000000000010000000100001
00001100000000000000000101010100
00000000010000001001000000100001
00000010001000000010000000100001
00001100000000000000000101010100
00000000010000001000000000100001
00000010000000101000000000100101
00000000000100001000000000100111
00000010010100000001000000100101
10001111101111110000000000011100
10001111101100100000000000011000
10001111101100010000000000010100
10001111101100000000000000010000
00000011111000000000000000001000
00100111101111010000000000100000
00100111101111011111111111100000
10101111101100000000000000010000
00000000100000001000000000100001
10101111101111110000000000011100
10101111101100100000000000011000
10101111101100010000000000010100
00001100000000000000000101001100
00000000101000001000100000100001
00000010000000000010000000100001
00001100000000000000000101010100
00000000010000001001000000100001
00000010001000000010000000100001
00001100000000000000000101010100
00000000010000001000000000100001
00000010000000101000000000100100
00000010010100000001000000100101
10001111101111110000000000011100
10001111101100100000000000011000
10001111101100010000000000010100
10001111101100000000000000010000
00000011111000000000000000001000
00100111101111010000000000100000
00100111101111011111111111100000
10101111101100000000000000010000
00000000100000001000000000100001
10101111101111110000000000011100
10101111101100100000000000011000
10101111101100010000000000010100
00001100000000000000000101001100
00000000101000001000100000100001
00000010000000000010000000100001
00001100000000000000000101010100
00000000010000001001000000100001
00000010001000000010000000100001
00001100000000000000000101010100
00000000010000001000000000100001
00000010000000101000000000100100
00000000000100001000000000100111
00000010010100000001000000100101
10001111101111110000000000011100
10001111101100100000000000011000
10001111101100010000000000010100
10001111101100000000000000010000
00000011111000000000000000001000
00100111101111010000000000100000
00100111101111011111111111100000
10101111101100000000000000010000
00000000100000001000000000100001
10101111101111110000000000011100
10101111101100100000000000011000
10101111101100010000000000010100
00001100000000000000000101001100
00000000101000001000100000100001
00000010000000000010000000100001
00001100000000000000000101010100
00000000010000001001000000100001
00000010001000000010000000100001
00001100000000000000000101010100
00000000010000001000000000100001
00000010000000101000000000100110
00000010010100000001000000100101
10001111101111110000000000011100
10001111101100100000000000011000
10001111101100010000000000010100
10001111101100000000000000010000
00000011111000000000000000001000
00100111101111010000000000100000
00100111101111011111111111100000
10101111101100000000000000010000
00000000100000001000000000100001
10101111101111110000000000011100
10101111101100100000000000011000
10101111101100010000000000010100
00001100000000000000000101001100
00000000101000001000100000100001
00000010000000000010000000100001
00001100000000000000000101010100
00000000010000001001000000100001
00000010001000000010000000100001
00001100000000000000000101010100
00000000010000001000000000100001
00000010000000101000000000100110
00000000000100001000000000100111
00000010010100000001000000100101
10001111101111110000000000011100
10001111101100100000000000011000
10001111101100010000000000010100
10001111101100000000000000010000
00000011111000000000000000001000
00100111101111010000000000100000
00100111101111011111111111011000
10101111101100010000000000010100
00000000101000001000100000100001
10101111101111110000000000100000
10101111101100110000000000011100
10101111101100100000000000011000
00000000100000001001100000100001
00001100000000000000000101010100
10101111101100000000000000010000
00000010001000000010000000100001
00001100000000000000000101010100
00000000010000001001000000100001
00000000010000001000000000100001
00000000010100100001000000101011
00000010011000000010000000100001
00010000010000000000000000001011
00000010001000000010100000100001
00001100000000000000000101001100
00000000000000000000000000000000
00000010010000100001000000100101
10001111101111110000000000100000
10001111101100110000000000011100
10001111101100100000000000011000
10001111101100010000000000010100
10001111101100000000000000010000
00000011111000000000000000001000
00100111101111010000000000101000
00001100000000000000000101001100
00000010001000000010100000100001
00000010000000100001000000100101
10001111101111110000000000100000
10001111101100110000000000011100
10001111101100100000000000011000
10001111101100010000000000010100
10001111101100000000000000010000
00000011111000000000000000001000
00100111101111010000000000101000
00100111101111011111111111100000
00000000100001010001000000101011
10101111101100100000000000011000
10101111101100010000000000010100
10101111101111110000000000011100
10101111101100000000000000010000
00000000101000001001000000100001
00010000010000000000000000001101
00000000100000001000100000100001
00001100000000000000000101001100
00000000000000000000000000000000
00000010001000000010000000100001
00001100000000000000000101010100
00000000010000001000000000100001
00000010000000100001000000100101
10001111101111110000000000011100
10001111101100100000000000011000
10001111101100010000000000010100
10001111101100000000000000010000
00000011111000000000000000001000
00100111101111010000000000100000
00001100000000000000000101001100
00000000000000000000000000000000
00000010010000000010000000100001
00001100000000000000000101010100
00000000010000001000000000100001
00000010000000100001000000100101
10001111101111110000000000011100
10001111101100100000000000011000
10001111101100010000000000010100
10001111101100000000000000010000
00000011111000000000000000001000
00100111101111010000000000100000
00100111101111011111111111100000
10101111101100000000000000010000
00000000100000001000000000100001
10101111101111110000000000011100
10101111101100100000000000011000
10101111101100010000000000010100
00001100000000000000000101001100
00000000101000001000100000100001
00000010000000000010000000100001
00001100000000000000000101010100
00000000010000001001000000100001
00000010001000000010000000100001
00001100000000000000000101010100
00000000010000001000000000100001
00000010000000101000000000100001
00000010010100000001000000100101
10001111101111110000000000011100
10001111101100100000000000011000
10001111101100010000000000010100
10001111101100000000000000010000
00000011111000000000000000001000
00100111101111010000000000100000
00100111101111011111111111100000
10101111101100000000000000010000
00000000100000001000000000100001
10101111101111110000000000011100
10101111101100100000000000011000
10101111101100010000000000010100
00001100000000000000000101001100
00000000101000001000100000100001
00000010000000000010000000100001
00001100000000000000000101010100
00000000010000001001000000100001
00000010001000000010000000100001
00001100000000000000000101010100
00000000010000001000000000100001
00000010000000101000000000100011
00000010010100000001000000100101
10001111101111110000000000011100
10001111101100100000000000011000
10001111101100010000000000010100
10001111101100000000000000010000
00000011111000000000000000001000
00100111101111010000000000100000
00111100000000111000010100110000
10001100011000100000000000000000
00000000000000000000000000000000
00010100010000001111111111111101
00111100000000100101000000000000
10101100010001000000000000000000
00000011111000000000000000001000
00000000000000000000000000000000
00111100000000111000010000010000
10001100011000100000000000000000
00000000000000000000000000000000
00010100010000001111111111111101
00000000000000000000000000000000
00111100000000110100000000000000
10001100011000100000000000000000
00000011111000000000000000001000
00000000000000000000000000000000
00111100000001001000001100010000
00100100000000110000000000000001
10001100100000100000000000000000
00000000000000000000000000000000
00010000010000111111111111111101
00000000000000000000000000000000
00111100000000110011000000000000
10001100011000100000000000000000
00000011111000000000000000001000
00000000000000000000000000000000
00100111101111011111111111100000
10101111101100000000000000010000
00000000000001010001001010000010
00111100000100000000000000000000
00000000000001010001100101000010
00100110000001000001101010000000
00110000010000100000000001111100
10101111101111110000000000011000
10101111101100010000000000010100
00000000010001000001000000100001
00110000011000110000000001111100
00000000101000000011000000100001
00000000011001000001100000100001
10001100010001110000000000000000
00000000000001010010111010000010
00100100000000100000000000100011
10001100011010000000000000000000
00010000101000100000000000000110
00000000000001100001010110000010
10001111101111110000000000011000
10001111101100010000000000010100
10001111101100000000000000010000
00000011111000000000000000001000
00100111101111010000000000100000
00110000010001000000000000001111
00000000000001100001110001000010
00101100100000100000000000010000
00010000010000001111111111110111
00110000011100010000000000011111
00111100000000110000000000000000
00000000000001000001000010000000
00100100011000110001100000010000
00000000010000110001000000100001
10001100010001000000000000000000
00000000000000000000000000000000
00000000100000000000000000001000
00000000000000000000000000000000
00111100000000110000000000000000
10001100011000100001110100000000
00000000111000000010000000100001
00000000010000001111100000001001
00000001000000000010100000100001
00000000000100010001100010000000
00100110000001000001101010000000
00000000011001000001100000100001
10101100011000100000000000000000
10001111101111110000000000011000
10001111101100010000000000010100
10001111101100000000000000010000
00000011111000000000000000001000
00100111101111010000000000100000
00111100000000110000000000000000
10001100011000100001110100000100
00001000000000000000001010010100
00000000111000000010000000100001
00111100000000110000000000000000
10001100011000100001110100001000
00001000000000000000001010010100
00000000111000000010000000100001
00111100000000110000000000000000
10001100011000100001110100001100
00001000000000000000001010010100
00000000111000000010000000100001
00111100000000110000000000000000
10001100011000100001110100010000
00001000000000000000001010010100
00000000111000000010000000100001
00111100000000110000000000000000
10001100011000100001110100010100
00001000000000000000001010010100
00000000111000000010000000100001
00111100000000110000000000000000
10001100011000100001110100011000
00001000000000000000001010010100
00000000111000000010000000100001
00111100000000110000000000000000
10001100011000100001110100011100
00001000000000000000001010010100
00000000111000000010000000100001
00111100000000110000000000000000
10001100011000100001110100100000
00001000000000000000001010010100
00000000111000000010000000100001
00111100000000110000000000000000
10001100011000100001110100100100
00001000000000000000001010010100
00000000111000000010000000100001
00111100000000110000000000000000
10001100011000100001110100101000
00001000000000000000001010010100
00000000111000000010000000100001
00111100000000110000000000000000
10001100011000100001110100101100
00001000000000000000001010010100
00000000111000000010000000100001
00111100000000110000000000000000
10001100011000100001110100110000
00001000000000000000001010010100
00000000111000000010000000100001
00111100000000110000000000000000
10001100011000100001110100110100
00001000000000000000001010010100
00000000111000000010000000100001
00111100000000110000000000000000
10001100011000100001110100111000
00001000000000000000001010010100
00000000111000000010000000100001
00111100000000110000000000000000
10001100011000100001110100111100
00001000000000000000001010010100
00000000111000000010000000100001
00100111101111011111111111011000
00110000101001100000111111111111
00000000000001010001010001000010
00000000000001010001101100000010
10101111101100010000000000010100
00000000101000001000100000100001
00000000000001100010100000101011
10101111101101000000000000100000
10101111101100110000000000011100
10101111101100100000000000011000
10101111101111110000000000100100
10101111101100000000000000010000
00000000100000001010000000100001
00110000010100100000000000011111
00010000101000000000000000000010
00110000011100110000000000011111
00110010001001100000011111111111
00000000000100010001011010000010
00100100010000101111111111101100
00101100010000110000000000011100
00010000011000000000000000101000
00111100000000110000000000000000
00000000000000100001000010000000
00100100011000110001100001010000
00000000010000110001000000100001
10001100010001000000000000000000
00000000000000000000000000000000
00000000100000000000000000001000
00000000000000000000000000000000
00111100000000100000000000000000
00000000000100100001100010000000
00100100010000100001110101100100
00000000011000100001100000100001
10001100011100000000000000000000
00010000101000000000000001111101
00111100000000110000000000000000
00000000000100110001000010000000
00100100011000110001101010000000
00000000010000110001000000100001
10001100010001000000000000000000
00000000000000000000000000000000
00000000100001100010000000100011
00001100000000000000010010100110
00000000000000000000000000000000
00000000010000000101000000100001
00000010000000100001000000100100
00010100010000000000000000001110
00111100000000100111000000000000
00110100010010010000000000010100
00110100010001010000000000000100
00110100010001100000000000001000
00110100010001110000000000001100
00110100010010000000000000010000
00100100000000110000000000000001
00100100000001000000000000000101
10101100010000110000000000000000
10101100101001000000000000000000
10101100110101000000000000000000
10101100111100010000000000000000
10101101000010100000000000000000
10101101001100000000000000000000
10001111101111110000000000100100
10001111101101000000000000100000
10001111101100110000000000011100
10001111101100100000000000011000
10001111101100010000000000010100
10001111101100000000000000010000
00000011111000000000000000001000
00100111101111010000000000101000
00010000101000000000000001010100
00111100000100010000000000000000
00000000000100100001000010000000
00100110001000110001101010000000
00000000010000110001000000100001
10001100010001000000000000000000
00000000000000000000000000000000
00000000100001101000000000100011
00000000000100110001100010000000
00100110001000100001101010000000
00000000011000101000100000100001
10001110001001010000000000000000
00001100000000000000010010111101
00000010000000000010000000100001
00010100010000001111111111101001
00000000000000000000000000000000
00001100000000000000010010010100
00000010000000000010000000100001
10001110001001010000000000000000
00000010000000000010000000100001
10001111101111110000000000100100
10001111101101000000000000100000
10001111101100110000000000011100
10001111101100100000000000011000
10001111101100010000000000010100
10001111101100000000000000010000
00001000000000000000010010111101
00100111101111010000000000101000
00010000101000000000000000110010
00111100000100010000000000000000
00000000000100110001000010000000
00100110001000110001101010000000
00000000010000110001000000100001
10001100010001000000000000000000
00000000000000000000000000000000
00000000100001100010000000100011
00001100000000000000010010100110
00000000000000000000000000000000
00000000000100100001100010000000
00100110001001000001101010000000
00000000011001000001100000100001
10101100011000100000000000000000
10001111101111110000000000100100
10001111101101000000000000100000
10001111101100110000000000011100
10001111101100100000000000011000
10001111101100010000000000010100
10001111101100000000000000010000
00000011111000000000000000001000
00100111101111010000000000101000
00111100000100000000000000000000
00100110000100000001101010000000
00000000000100100001000010000000
00000000010100000001000000100001
10001100010001000000000000000000
00001100000000000000010010100110
00000000000000000000000000000000
00000000010000000101100000100001
00000000000100110001000010000000
00000000010100000001000000100001
10001100010010100000000000000000
00000000000000000000000000000000
00010001011010101111111110111001
00111100000000100111000000000000
00110100010010010000000000010100
00110100010001010000000000000100
00110100010001100000000000001000
00110100010001110000000000001100
00110100010010000000000000010000
00100100000000110000000000000001
00100100000001000000000000000100
10101100010000110000000000000000
10101100101001000000000000000000
10101100110101000000000000000000
10101100111100010000000000000000
10101101000010110000000000000000
10101101001010100000000000000000
00001000000000000000001100011000
00000000000000000000000000000000
00000000000100110001000010000000
00100110001000110001101010000000
00000000010000110001000000100001
10001100010001000000000000000000
00001000000000000000001101000100
00000000110001000010000000100001
00000000000100100001000010000000
00100110001000110001101010000000
00000000010000110001000000100001
10001100010001000000000000000000
00001000000000000000001100101000
00000000110001001000000000100001
00000000000100110001000010000000
00100100011000110001101010000000
00000000010000110001000000100001
10001100010001000000000000000000
00001000000000000000001100000101
00000000110001000010000000100001
00100111101111011111111111011000
00111100000000100000000000000000
10101111101101000000000000100000
10101111101111110000000000100100
10101111101100110000000000011100
10101111101100100000000000011000
10101111101100010000000000010100
10101111101100000000000000010000
00100100010101000001110101100100
00001100000000000000001001011001
00000000000000000000000000000000
00000000010000000001100000100001
00100100000000100000000000000010
00010000011000100000000000100111
00101100011000100000000000000011
00010000010000000000000000001100
00100100000000100000000000000011
00100100000000100000000000000001
00010000011000100000000001000001
00000000000000000000000000000000
10001111101111110000000000100100
10001111101101000000000000100000
10001111101100110000000000011100
10001111101100100000000000011000
10001111101100010000000000010100
10001111101100000000000000010000
00000011111000000000000000001000
00100111101111010000000000101000
00010000011000100000000000100011
00100100000000100000000000000100
00010100011000101111111111110101
00000000000000000000000000000000
00001100000000000000001001011001
00000000000000000000000000000000
00001100000000000000001001011001
00000000010000001001000000100001
00000000010000000010100000100001
00000010010000000010000000100001
00001100000000000000010011010011
00000000010000001000100000100001
10001110100100000000000000001100
00000000010000000010000000100001
00000010000000000010100000100001
00001100000000000000000101010000
00000000010000001001100000100001
00010000010000000000000000111000
00000010010000000010000000100001
00000010001000000010100000100001
00000010011000000011000000100001
00001100000000000000010101100111
00000010000000000011100000100001
00001000000000000000001110001010
00000000000000000000000000000000
00001100000000000000001001011001
00000000000000000000000000000000
00001100000000000000001001011001
00000000010000001000000000100001
00000000010000000010100000100001
00001100000000000000010011010011
00000010000000000010000000100001
00001100000000000000001001010001
00000000010000000010000000100001
00001000000000000000001110001010
00000000000000000000000000000000
00001100000000000000001001011001
00000000000000000000000000000000
00001100000000000000001001011001
00000000010000001000100000100001
00000000010000000010100000100001
00000010001000000010000000100001
00001100000000000000010011010011
00000000010000001001000000100001
10001110100100000000000000001000
00000000010000000010000000100001
00000010000000000010100000100001
00001100000000000000000101010000
00000000010000001001100000100001
00010100010000000000000000010010
00000010001000000010000000100001
00000010010000000010100000100001
00001100000000000000010011110111
00000010000000000011000000100001
00001000000000000000001110001010
00000000000000000000000000000000
00001100000000000000001001011001
00000000000000000000000000000000
00001100000000000000001001011001
00000000010000001000100000100001
00001100000000000000001001011001
00000000010000001000000000100001
00000000010000000011000000100001
00000010001000000010000000100001
00001100000000000000010011110111
00000010000000000010100000100001
00001000000000000000001110001010
00000000000000000000000000000000
00000010010000000010100000100001
00000010011000000011000000100001
00001100000000000000010101000000
00000010000000000011100000100001
00001000000000000000001110001010
00000000000000000000000000000000
00000010001000000010100000100001
00001100000000000000010011110111
00000010000000000011000000100001
00001000000000000000001110001010
00000000000000000000000000000000
00110000101010001111111111111111
00100111101111011111111111100000
00000000000001010001010101000010
00000000000001010001110000000010
00000000000010000011100000101011
10101111101100000000000000010000
10101111101111110000000000011000
10101111101100010000000000010100
00110000010100000000000000011111
00010100111000000000000000011100
00110000011010010000000000011111
00000000000000000101000000100001
00000000000001010001111010000010
00101100011000100000000000101100
00010000010000000000000000010010
00000000000000110001000010000000
00111100000000110000000000000000
00100100011000110001100011000000
00000000010000110001000000100001
10001100010001000000000000000000
00000000000000000000000000000000
00000000100000000000000000001000
00000000000000000000000000000000
00111100000001010000000000000000
00100100101001010001101010000000
00000000000010010001000010000000
00000000010001010001000000100001
10001100010001000000000000000000
00000000000100000001100010000000
00000000000010000001010000000000
00000000100000100010000000100101
00000000011001010001100000100001
10101100011001000000000000000000
10001111101111110000000000011000
10001111101100010000000000010100
10001111101100000000000000010000
00000011111000000000000000001000
00100111101111010000000000100000
00001000000000000000001111111000
00110000101010100111111111111111
00111100000000100000000000000000
00111100000000110000000000000000
00000000000100000011000010000000
00100100010000100001101010000000
00000000000010100010000010000000
00100100011000110001110101100100
00000000110000100011000000100001
00000000100000110010000000100001
10001100110000100000000000000000
10001100100001010000000000000000
00000000000000000000000000000000
00000000010001010001000000100101
10101100110000100000000000000000
10001111101111110000000000011000
10001111101100010000000000010100
10001111101100000000000000010000
00000011111000000000000000001000
00100111101111010000000000100000
00001100000000000000001001100010
00000000000000000000000000000000
00111100000000110000000000000000
00000000000100000010000010000000
00100100011000110001101010000000
00000000100000110010000000100001
00001000000000000000010000001101
10101100100000100000000000000000
10001111101111110000000000011000
10001111101100010000000000010100
10001111101100000000000000010000
00001000000000000000001110000001
00100111101111010000000000100000
00010100111000000000000000110010
00111100000001010000000000000000
00100100101001010001101010000000
00000000000010010001000010000000
00000000010001010001000000100001
10001100010001000000000000000000
00000000000100000001100010000000
00000001010001000010000000100001
00000000011001010001100000100001
00001000000000000000010000001101
10101100011001000000000000000000
00111100000000100000000000000000
00100100010000100001101010000000
00000000000010010001100010000000
00000000000100000010000010000000
00000000011000100001100000100001
00000000100000100010000000100001
10001100011100010000000000000000
10001100100000100000000000000000
00010000111000000000000000000010
00000001010000101000000000100001
00000000010010101000000000100011
00000010000000000010000000100001
00001100000000000000010010111101
00000010001000000010100000100001
00010100010000001111111111000000
00000000000000000000000000000000
00001100000000000000010010010100
00000010000000000010000000100001
00000010000000000010000000100001
00000010001000000010100000100001
10001111101111110000000000011000
10001111101100010000000000010100
10001111101100000000000000010000
00001000000000000000010010111101
00100111101111010000000000100000
00111100000001000000000000000000
00100100100001000001101010000000
00000000000010010001000010000000
00000000010001000001000000100001
00000000000100000001100010000000
10001100010001010000000000000000
00000000011001000001100000100001
00001000000000000000010000001101
10101100011001010000000000000000
00111100000000100000000000000000
00000000000100000001100010000000
00100100010000100001101010000000
00000000011000100001100000100001
00001000000000000000010000001101
10101100011010000000000000000000
00100100101001010001101010000000
00000000000010010001000010000000
00000000010001010001000000100001
10001100010001000000000000000000
00000000000100000001100010000000
00000000100010100010000000100011
00000000011001010001100000100001
00001000000000000000010000001101
10101100011001000000000000000000
00000000000001010001111010000010
00100111101111011111111111101000
00101100011000100000000000110000
10101111101111110000000000010000
00010000010000000000000000001011
00000000100000000011000000100001
00000000000000110001000010000000
00111100000000110000000000000000
00100100011000110001100101110000
00000000010000110001000000100001
10001100010001000000000000000000
00000000000000000000000000000000
00000000100000000000000000001000
00000000000000000000000000000000
00001100000000000000001011011011
00000000110000000010000000100001
10001111101111110000000000010000
00000000000000000001000000100001
00000011111000000000000000001000
00100111101111010000000000011000
00001100000000000000001111101100
00000000110000000010000000100001
10001111101111110000000000010000
00000000000000000001000000100001
00000011111000000000000000001000
00100111101111010000000000011000
00001100000000000000001001101100
00000000110000000010000000100001
10001111101111110000000000010000
00000000000000000001000000100001
00000011111000000000000000001000
00100111101111010000000000011000
00000000000000000000000000000000
00000011111000000000000000001000
00000000000000000000000000000000
00000011111000000000000000001000
00000000000000000000000000000000
00111100000010000000000000000000
10001101000000100001101001110000
00111100000000110000000000000000
00000000000000100010100011000000
00100100011000110001110110000000
00100100010001100000000000000001
00101100010000100000001111100111
00000000000000000011100000100001
00010000010000000000000000000111
00000000101000110010100000100001
00111100000000100000000000000000
10001100010000110001110101111100
10101101000001100001101001110000
00100100000001110000000000000001
10101100101000110000000000000100
10101100101001000000000000000000
00000011111000000000000000001000
00000000111000000001000000100001
00111100000000100000000000000000
00111100000000110000000000000000
00100100010001010001110110000000
10001100011001110001101001110000
00100100101001100000000000000100
00000000000000000001100000100001
00000000011001110001000000101011
00010100010000000000000000000110
00000000000000000000000000000000
00010000011000000000000000000100
00111100000000100000000000000000
10001100010000100001110101111100
00000011111000000000000000001000
00000000000000000000000000000000
10001100101000100000000000000000
00100100011000110000000000000001
00010000010001000000000000000011
00100100101001010000000000001000
00001000000000000000010010101100
00100100110001100000000000001000
10001100110000100000000000000000
00000011111000000000000000001000
00000000000000000000000000000000
00111100000000100000000000000000
00111100000000110000000000000000
00100100010001100001110110000000
10001100011010000001101001110000
00100100110001110000000000000100
00000000000000000001100000100001
00000000011010000001000000101011
00010100010000000000000000000101
00000000000000000000000000000000
00010000011000000000000000000011
00000000000000000001000000100001
00000011111000000000000000001000
00000000000000000000000000000000
10001100110000100000000000000000
00100100011000110000000000000001
00010000010001000000000000000011
00100100110001100000000000001000
00001000000000000000010011000011
00100100111001110000000000001000
00100100000000100000000000000001
00000011111000000000000000001000
10101100111001010000000000000000
00100111101111011111111111010000
10101111101101010000000000100100
10101111101101000000000000100000
10101111101111110000000000101000
10101111101100110000000000011100
10101111101100100000000000011000
10101111101100010000000000010100
10101111101100000000000000010000
00000000101000001010000000100001
00010000101000000000000000011000
00000000100000001010100000100001
00111100000000100000000000000000
00100100010100110001110100000000
00000000000000001000100000100001
00000000000000001001000000100001
10001110011100000000000001000000
00001100000000000000010010100110
00000010001101010010000000100001
00000000010000000010100000100001
00000010000000001111100000001001
00000010010000000010000000100001
00100110001100010000000000000001
00010110100100011111111111111000
00000000010000001001000000100001
00000010010000000001000000100001
10001111101111110000000000101000
10001111101101010000000000100100
10001111101101000000000000100000
10001111101100110000000000011100
10001111101100100000000000011000
10001111101100010000000000010100
10001111101100000000000000010000
00000011111000000000000000001000
00100111101111010000000000110000
00001000000000000000010011101011
00000000000000001001000000100001
00100111101111011111111111011000
10101111101101000000000000100000
10101111101100110000000000011100
10101111101100100000000000011000
10101111101111110000000000100100
10101111101100010000000000010100
10101111101100000000000000010000
00000000101000001001100000100001
00000000100000001010000000100001
00010000101000000000000000001011
00000000110000001001000000100001
00000000000000001000100000100001
00000010100100011000000000100001
00000010000000000010000000100001
00001100000000000000010010111101
00000010010000000010100000100001
00100110001100010000000000000001
00010000010000000000000000001011
00000010000000000010000000100001
00010110011100011111111111111001
00000010100100011000000000100001
10001111101111110000000000100100
10001111101101000000000000100000
10001111101100110000000000011100
10001111101100100000000000011000
10001111101100010000000000010100
10001111101100000000000000010000
00000011111000000000000000001000
00100111101111010000000000101000
00001100000000000000010010010100
00000000000000000000000000000000
00000010011000000011000000100001
00000010010000000011100000100001
00000010000000000010000000100001
00010000010000000000000000001111
00000010100000000010100000100001
00000010000000000010000000100001
00001100000000000000010010111101
00000010010000000010100000100001
00000010000000000010000000100001
00000010100000000010100000100001
00000010011000000011000000100001
00010100010000001111111111101000
00000010010000000011100000100001
00001100000000000000010111011011
00000000000000000000000000000000
00010110011100011111111111011110
00000010100100011000000000100001
00001000000000000000010100001100
00000000000000000000000000000000
00001100000000000000010110110101
00000000000000000000000000000000
00001000000000000000010100011100
00000010000000000010000000100001
00000000000000000000000000000000
00000000000000000000000000000000
00000000000000000000000000000000
00000011111000000000000000001000
00111100000000100010000000000000
00111100000000110000000000000000
10001100011000100001101001100000
00000000000000000000000000000000
00100100010000100000000000000100
00000011111000000000000000001000
10101100011000100001101001100000
00111100000000110000000000000000
10001100011000100001101001100100
00000000000000000000000000000000
00100100010000100000000000000100
00000011111000000000000000001000
10101100011000100001101001100100
00000000000000000000000000000000
00000000000000000000000000000000
00100111101111011111111111011000
10101111101111110000000000100000
10101111101100110000000000011100
10101111101100100000000000011000
00000000111000001001100000100001
00000000110000001001000000100001
10101111101100010000000000010100
10101111101100000000000000010000
00000000101000001000100000100001
00001100000000000000010100111000
00000000100000001000000000100001
00100100000000110000000000000010
10101100010000110000000000000000
00001100000000000000010100111000
00000000000000000000000000000000
00100100000000110000000000000100
10101100010000110000000000000000
00001100000000000000010100111000
00000000000000000000000000000000
10101100010100000000000000000000
00001100000000000000010100111000
00000000000000000000000000000000
10101100010100010000000000000000
00001100000000000000010100111000
00000000000000000000000000000000
10101100010100100000000000000000
00001100000000000000010100111000
00000000000000000000000000000000
10101100010100110000000000000000
00100100000000111111111111111111
00111100000000101000011101010000
10101100010000110000000000000000
10001111101111110000000000100000
10001111101100110000000000011100
10001111101100100000000000011000
10001111101100010000000000010100
10001111101100000000000000010000
00000011111000000000000000001000
00100111101111010000000000101000
00100111101111011111111111011000
10101111101111110000000000100000
10101111101100110000000000011100
10101111101100100000000000011000
00000000111000001001100000100001
00000000110000001001000000100001
10101111101100010000000000010100
10101111101100000000000000010000
00000000101000001000100000100001
00001100000000000000010100111000
00000000100000001000000000100001
00100100000000110000000000000011
10101100010000110000000000000000
00001100000000000000010100111000
00000000000000000000000000000000
00100100000000110000000000000100
10101100010000110000000000000000
00001100000000000000010100111000
00000000000000000000000000000000
10101100010100000000000000000000
00001100000000000000010100111000
00000000000000000000000000000000
10101100010100010000000000000000
00001100000000000000010100111000
00000000000000000000000000000000
10101100010100100000000000000000
00001100000000000000010100111000
00000000000000000000000000000000
10101100010100110000000000000000
00100100000000111111111111111111
00111100000000101000011101010000
10101100010000110000000000000000
10001111101111110000000000100000
10001111101100110000000000011100
10001111101100100000000000011000
10001111101100010000000000010100
10001111101100000000000000010000
00000011111000000000000000001000
00100111101111010000000000101000
00100111101111011111111111011000
10101111101111110000000000100000
10101111101100110000000000011100
10101111101100100000000000011000
00000000111000001001100000100001
00000000110000001001000000100001
10101111101100010000000000010100
10101111101100000000000000010000
00000000101000001000100000100001
00001100000000000000010100111000
00000000100000001000000000100001
00100100000000110000000000000001
10101100010000110000000000000000
00001100000000000000010100111000
00000000000000000000000000000000
00100100000000110000000000000100
10101100010000110000000000000000
00001100000000000000010100111000
00000000000000000000000000000000
10101100010100000000000000000000
00001100000000000000010100111000
00000000000000000000000000000000
10101100010100010000000000000000
00001100000000000000010100111000
00000000000000000000000000000000
10101100010100100000000000000000
00001100000000000000010100111000
00000000000000000000000000000000
10101100010100110000000000000000
00100100000000111111111111111111
00111100000000101000011101010000
10101100010000110000000000000000
10001111101111110000000000100000
10001111101100110000000000011100
10001111101100100000000000011000
10001111101100010000000000010100
10001111101100000000000000010000
00000011111000000000000000001000
00100111101111010000000000101000
00100111101111011111111111011000
10101111101111110000000000100000
10101111101100110000000000011100
10101111101100100000000000011000
00000000111000001001100000100001
00000000110000001001000000100001
10101111101100010000000000010100
10101111101100000000000000010000
00000000101000001000100000100001
00001100000000000000010100111000
00000000100000001000000000100001
10101100010000000000000000000000
00001100000000000000010100111000
00000000000000000000000000000000
00100100000000110000000000000100
10101100010000110000000000000000
00001100000000000000010100111000
00000000000000000000000000000000
10101100010100000000000000000000
00001100000000000000010100111000
00000000000000000000000000000000
10101100010100010000000000000000
00001100000000000000010100111000
00000000000000000000000000000000
10101100010100100000000000000000
00001100000000000000010100111000
00000000000000000000000000000000
10101100010100110000000000000000
00100100000000111111111111111111
00111100000000101000011101010000
10101100010000110000000000000000
10001111101111110000000000100000
10001111101100110000000000011100
10001111101100100000000000011000
10001111101100010000000000010100
10001111101100000000000000010000
00000011111000000000000000001000
00100111101111010000000000101000
00100111101111011111111111011000
10101111101111110000000000100100
10101111101101000000000000100000
10101111101100110000000000011100
00000000111000001010000000100001
00000000110000001001100000100001
10101111101100100000000000011000
10101111101100010000000000010100
00000000101000001001000000100001
00000000100000001000100000100001
00001100000000000000010100111000
10101111101100000000000000010000
00100100000100000000000000000100
10101100010100000000000000000000
00001100000000000000010100111000
00000000000000000000000000000000
10101100010100000000000000000000
00001100000000000000010100111000
00000000000000000000000000000000
10101100010100010000000000000000
00001100000000000000010100111000
00000000000000000000000000000000
10101100010100100000000000000000
00001100000000000000010100111000
00000000000000000000000000000000
10101100010100110000000000000000
00001100000000000000010100111000
00000000000000000000000000000000
10101100010101000000000000000000
00100100000000111111111111111111
00111100000000101000011101010000
10101100010000110000000000000000
10001111101111110000000000100100
10001111101101000000000000100000
10001111101100110000000000011100
10001111101100100000000000011000
10001111101100010000000000010100
10001111101100000000000000010000
00000011111000000000000000001000
00100111101111010000000000101000
00000000000000000000000000000000
00000000000000000000101001000100
00000000000000000000101001111100
00000000000000000000101010001100
00000000000000000000101010011100
00000000000000000000101010101100
00000000000000000000101010111100
00000000000000000000101011001100
00000000000000000000101011011100
00000000000000000000101011101100
00000000000000000000101011111100
00000000000000000000101100001100
00000000000000000000101100011100
00000000000000000000101100101100
00000000000000000000101100111100
00000000000000000000101101001100
00000000000000000000101101011100
00000000000000000000101111100000
00000000000000000000110001100000
00000000000000000000110001100000
00000000000000000000110001100000
00000000000000000000110001100000
00000000000000000000110001100000
00000000000000000000110001100000
00000000000000000000110001100000
00000000000000000000110001100000
00000000000000000000110001100000
00000000000000000000110001100000
00000000000000000000110001100000
00000000000000000000110001100000
00000000000000000000110001100000
00000000000000000000110001100000
00000000000000000000110001100000
00000000000000000000110010000000
00000000000000000000110011110000
00000000000000000000110001100000
00000000000000000000110001100000
00000000000000000000110001100000
00000000000000000000110001100000
00000000000000000000110001100000
00000000000000000000110001100000
00000000000000000000110010000000
00000000000000000000110011110000
00000000000000000000110001100000
00000000000000000000110101001000
00000000000000000001000010011000
00000000000000000001000000110100
00000000000000000001000000110100
00000000000000000001000000110100
00000000000000000001000000110100
00000000000000000001000000110100
00000000000000000001000000110100
00000000000000000001000011001100
00000000000000000001000000110100
00000000000000000001000000110100
00000000000000000001000000110100
00000000000000000001000000110100
00000000000000000001000000110100
00000000000000000001000000110100
00000000000000000001000000110100
00000000000000000001000000110100
00000000000000000001000010111000
00000000000000000001000000110100
00000000000000000001000000110100
00000000000000000001000000110100
00000000000000000001000000110100
00000000000000000001000000110100
00000000000000000001000000110100
00000000000000000001000001010000
00000000000000000001000001010000
00000000000000000001000000110100
00000000000000000001000000110100
00000000000000000001000000110100
00000000000000000001000000110100
00000000000000000001000000110100
00000000000000000001000000110100
00000000000000000001000000110100
00000000000000000001000110000000
00000000000000000001000101011100
00000000000000000001000011111000
00000000000000000001000000110100
00000000000000000001000000110100
00000000000000000001000000110100
00000000000000000001000000110100
00000000000000000001000000110100
00000000000000000001000000110100
00000000000000000001000000110100
00000000000000000001000000110100
00000000000000000001000000001100
00000000000000000001001000001100
00000000000000000001001000001100
00000000000000000001001000001100
00000000000000000001001000001100
00000000000000000001001000001100
00000000000000000001000111111100
00000000000000000001000111111100
00000000000000000001001000001100
00000000000000000001000111111100
00000000000000000001000111111100
00000000000000000001000111111100
00000000000000000001000111111100
00000000000000000001000111111100
00000000000000000001000111111100
00000000000000000001000111111100
00000000000000000001000111111100
00000000000000000001001000001100
00000000000000000001000111111100
00000000000000000001000111111100
00000000000000000001000111111100
00000000000000000001000111110100
00000000000000000001000111111100
00000000000000000001000111111100
00000000000000000001001000001100
00000000000000000001001000001100
00000000000000000001000111111100
00000000000000000001000111111100
00000000000000000001000111111100
00000000000000000001000111111100
00000000000000000001000111111100
00000000000000000001000111111100
00000000000000000001000111111100
00000000000000000001001000001100
00000000000000000001001000001100
00000000000000000001001000001100
00000000000000000001001000100100
00000000000000000001000111110100
00000000000000000001000111110100
00000000000000000001001000100100
00000000000000000001000111110100
00000000000000000001000111110100
00000000000000000001000111110100
00000000000000000001000111110100
00000000000000000001001000001100
00000000000000000001000111110100
00000000000000000001000111110100
00000000000000000001001000100100
00000000000000000001000111110100
00000000000000000000010101100000
00000000000000000000010110111000
00000000000000000000011000010100
00000000000000000000011001101100
00000000000000000000011011001000
00000000000000000000011100100000
00000000000000000000011101111100
00000000000000000000100000010000
00000000000000000000100010010100
00000000000000000000100011101100
00000000000000000000000000000000
00000000000000000000000000000000
10010000000000000000000000000000
01110000000000000000000000000000
00000000000000000000000000000000
00000000000000000000000000000000
00000000000000000000000000000000
