# compile vhdl design source files
vhdl xil_defaultlib  "../../../decodeur_traces.srcs/sources_1/imports/these_05_06_2016/datapath.vhd"
vhdl xil_defaultlib  "../../../decodeur_traces.srcs/sources_1/imports/these_05_06_2016/decode_bap.vhd"
vhdl xil_defaultlib  "../../../decodeur_traces.srcs/sources_1/imports/these_05_06_2016/decode_i_sync.vhd"
vhdl xil_defaultlib  "../../../decodeur_traces.srcs/sources_1/imports/these_05_06_2016/pft_decoder_v2.vhd"
vhdl xil_defaultlib  "../../../decodeur_traces.srcs/sources_1/imports/these_05_06_2016/decodeur_traces.vhd"
vhdl xil_defaultlib  "../../../decodeur_traces.srcs/sources_1/new/text_util.vhd"
vhdl xil_defaultlib  "../../../decodeur_traces.srcs/sim_1/new/testbench_contextid.vhd"
vhdl xil_defaultlib  "../../../decodeur_traces.srcs/sim_1/imports/these_05_06_2016/testbench.vhd"
vhdl xil_defaultlib  "../../../decodeur_traces.srcs/sim_1/new/testbench_multiple_regions.vhd"

# Do not sort compile order
nosort
