# compile vhdl design source files
vhdl xil_defaultlib  "../../../../input_pack.vhd"
vhdl xil_defaultlib  "../../../../tri_state_buffer.vhd"
vhdl xil_defaultlib  "../../../../comparator.vhd"
vhdl xil_defaultlib  "../../../../TLB_out_mux.vhd"
vhdl xil_defaultlib  "../../../../TLB.vhd"
vhdl xil_defaultlib  "../../../../cache.vhd"
vhdl xil_defaultlib  "../../../../MMU_state_machine.vhd"
vhdl xil_defaultlib  "../../../../dependencies_pack.vhd"
vhdl xil_defaultlib  "../../../../dep_bus_mux.vhd"
vhdl xil_defaultlib  "../../../../pipeline_te_tm.vhd"
vhdl xil_defaultlib  "../../../../registers_sec_policy.vhd"
vhdl xil_defaultlib  "../../../../tag_check.vhd"
vhdl xil_defaultlib  "../../../../forward_unit.vhd"
vhdl xil_defaultlib  "../../../../reg_file.vhd"
vhdl xil_defaultlib  "../../../../pc_next.vhd"
vhdl xil_defaultlib  "../../../../data_mem_ctl.vhd"
vhdl xil_defaultlib  "../../../../configuration_reg_file.vhd"
vhdl xil_defaultlib  "../../../../tag_alu.vhd"
vhdl xil_defaultlib  "../../../../top.vhd"
vhdl xil_defaultlib  "../../../../pipeline_tm_twb.vhd"
vhdl xil_defaultlib  "../../../../pipeline_td_te.vhd"
vhdl xil_defaultlib  "../../../../control_dependencies.vhd"
vhdl xil_defaultlib  "../../../../io_controller.vhd"
vhdl xil_defaultlib  "../../../../../AXI_master2/myip_v2_0_M00_AXI.vhd"
vhdl xil_defaultlib  "../../../../datamemory.vhd"
vhdl xil_defaultlib  "../../../../dependencies_pu.vhd"
vhdl xil_defaultlib  "../../../../../rest_gen/reset_gen.vhd"
vhdl xil_defaultlib  "../../../../tmc.vhd"
vhdl xil_defaultlib  "../../../../../ram.vhd"
vhdl xil_defaultlib  "../../../../../AXI_master2/myip_v2_0.vhd"
vhdl xil_defaultlib  "../../../../testbench1.vhd"
