#-----------------------------------------------------------
# Webtalk v2018.2 (64-bit)
# SW Build 2258646 on Thu Jun 14 20:02:38 MDT 2018
# IP Build 2256618 on Thu Jun 14 22:10:49 MDT 2018
# Start of session at: Mon Apr 20 18:18:18 2020
# Process ID: 3373
# Current directory: /home/mounir/HardBlare/hw_vivado/IPs/Packages/PL_to_PS/PL_to_PS.sim/sim_1/behav/xsim
# Command line: wbtcv -mode batch -source /home/mounir/HardBlare/hw_vivado/IPs/Packages/PL_to_PS/PL_to_PS.sim/sim_1/behav/xsim/xsim.dir/PL_to_PS_behav/webtalk/xsim_webtalk.tcl -notrace
# Log file: /home/mounir/HardBlare/hw_vivado/IPs/Packages/PL_to_PS/PL_to_PS.sim/sim_1/behav/xsim/webtalk.log
# Journal file: /home/mounir/HardBlare/hw_vivado/IPs/Packages/PL_to_PS/PL_to_PS.sim/sim_1/behav/xsim/webtalk.jou
#-----------------------------------------------------------
source /home/mounir/HardBlare/hw_vivado/IPs/Packages/PL_to_PS/PL_to_PS.sim/sim_1/behav/xsim/xsim.dir/PL_to_PS_behav/webtalk/xsim_webtalk.tcl -notrace
INFO: [Common 17-206] Exiting Webtalk at Mon Apr 20 18:18:19 2020...
