1.297049441543132620e+00,1.370341644487905075e+00,3.176999812677738788e-01
1.674641877119778410e+00,1.706581652663544002e+00,2.555353154408338767e+00
1.326558048580279259e+00,1.050226457068760055e+00,-6.870768538877074505e+00
1.564296956714172460e+00,2.081359673744453964e+00,1.992595109688428678e+00
-5.408449871703129297e-01,-1.078162626361169441e+00,-1.014857628064385509e+00
-4.909822158557930472e-02,-1.645243278904823025e+00,-6.147521737194706404e+00
-7.655186371585211980e-01,1.417267469581581896e+00,-5.073892469010319317e-01
-1.148217389531466903e+00,-8.145451223651534178e-02,-8.315332332803357929e-01
5.719059324976414338e-01,-1.621644906497438754e+00,2.837681020270419907e+00
-5.527825660951024567e-02,-9.987534555926935731e-01,4.454338713335236122e+00
-2.662139552847619939e-01,-1.789737053473614337e+00,5.379636076086244501e+00
4.858430468972936289e-01,2.633731985027720768e-01,5.248327199297429857e+00
-1.640635677720838626e+00,-1.004007184282699638e+00,2.627882755195862785e-01
1.578586554804406461e+00,3.039921690581870450e-03,6.353345407073675233e+00
-1.207537560543259669e+00,-7.453837513255821001e-01,1.442971346982954373e+00
-6.375657351901669045e-01,8.400596155609392213e-01,7.414261675622032755e+00
1.091240603331873338e+00,5.893574784140698242e-02,-5.284230704637654874e+00
7.520757145414886935e-01,1.850303962155970261e-01,4.231824675043922568e+00
-7.935074666934083254e-01,-1.179198301278707062e+00,4.424778595661665648e+00
4.644886428382029031e-01,-1.543691090090852036e+00,5.336865951769226513e+00
-1.370174203255929424e-01,8.504039856837484201e-01,2.404469902444130724e-01
1.581181206709805664e+00,-9.232449681967791477e-01,-4.137957074231554344e+00
6.341070077008330585e-01,1.682236647507512117e+00,-4.128207849548608976e+00
1.861246765799950964e-02,-2.115030920841580730e+00,6.523215252662600605e+00
-5.875905180408409478e-01,-2.575293666371309964e-01,2.504131637480051964e+00
1.353467570863848835e-01,-1.181659783608771441e+00,-6.681447262009719168e+00
-4.111295698244148422e-01,1.743212865290650893e+00,2.535718110202626718e+00
9.040227902860098474e-01,-4.154928474513246428e-01,-2.127567328455964635e+00
-2.518041801311532435e-01,-1.160352421845072479e+00,1.815206302754845069e+00
3.309760188555306293e-01,-1.529504823237817446e+00,-2.706885982157577253e+00
1.597520810840280525e+00,1.900811542456549930e+00,-8.457545319116990257e-01
1.368877140273579318e+00,1.685018708937535692e-02,-3.808414246749547871e+00
-6.950037290721651217e-01,-1.923407125424768882e+00,-4.851120989734337030e+00
1.147891491378060014e+00,2.022018740081750643e+00,-4.057356874738990093e+00
-7.662336321179825660e-01,1.007745158740983360e+00,4.668052696364988208e-02
5.302927249809386012e-02,1.914758684652832166e+00,3.568473320604127252e+00
1.532693323598331769e+00,1.833347577196574818e+00,-1.418199556569078368e+00
5.280118347132622958e-01,1.477383210107073186e+00,3.523411153709329113e+00
-5.283131920592580855e-01,1.182375042952503730e+00,-7.312296583853076015e+00
2.113014958700643042e-01,-1.983391939742612076e+00,-6.061804070558207691e+00
-1.386559050730324705e+00,-7.991271451736923215e-01,2.429719953187079895e+00
6.965697924767360050e-01,8.444615297559461276e-01,-5.949204568066265963e+00
1.080563988335167203e+00,3.737247114913566648e-02,-7.712699892003929136e-01
9.187832987680253360e-01,9.002323269897369862e-01,5.273791535016094656e-01
-1.384762828627739140e-02,-6.632417451050443002e-01,-7.225945113409074416e+00
-9.519550702059823566e-01,-1.445274191598499236e+00,6.089215892456955714e+00
1.113471167640616155e+00,-2.085943856750027692e-02,1.286710376878517081e-01
-5.776456051961502691e-01,9.338506036464622184e-01,-6.952669582354296551e+00
-7.917475055326045341e-01,-1.512380963054771321e+00,3.181588173665659269e-01
1.665045247726458122e+00,-1.687144713653261352e+00,-1.412212774040559005e+00
-2.759284086266582392e-01,1.257724337733006958e+00,-1.491967901862379264e+00
-9.676276951474473975e-01,1.961537694592316861e+00,-6.725668245155222991e-01
1.552867467753011876e-01,1.800799524530860563e+00,-2.533988991417349013e+00
1.396058669706754518e-01,-1.217734616935580494e+00,-3.477373428538358624e+00
-1.432370214748204695e+00,7.454973339797095200e-01,3.389441727819766825e+00
1.563398494449802723e+00,1.901496506019443089e+00,-4.765675299724907887e+00
5.758495272541637178e-01,-3.502407614636640076e-01,-2.169189642257006057e+00
1.116613922986626761e-01,-1.867218146060916961e+00,4.302301663614285232e+00
9.082529599871764781e-01,-1.720805296528154837e+00,1.089527445354441682e+00
7.923965706941733522e-01,1.060838714706482389e+00,5.767047243856264771e-01
1.526661239250018287e+00,-8.872926304468524705e-01,7.129979765572413086e+00
-8.614015438410116410e-01,4.225803911490522147e-01,-1.410253631428665777e+00
-5.061422858040751649e-01,-1.846443322157873546e+00,1.970670750321437126e-01
-2.192543472352543876e-01,1.250189297209329364e+00,-2.032558049480197582e-01
-8.058963688424075622e-01,-1.461667275653790732e-01,3.074344402663760079e+00
-6.311927508508663465e-02,-2.053054627172943292e+00,1.924201533152052335e+00
-2.078644567398026943e-01,1.099695152331750858e+00,7.039568338529438307e+00
2.531813105832090294e-01,3.638665453290896856e-01,-1.004405747235925794e+00
9.091430667138835631e-01,-1.188119766372780273e+00,-1.026839609049612356e+00
-8.717083503156540791e-01,-3.637973437561012879e-01,-3.579467334524076172e+00
8.899849308134784032e-01,6.425295111435422868e-01,-3.213385359892087401e+00
3.427199140619805462e-01,-1.493266427263242546e+00,-3.984286469866356040e+00
-8.715985998890333208e-01,1.379577041013697603e+00,2.683292804257531472e+00
1.308761051035462586e+00,-4.028960044200462498e-01,8.077695979391421588e-01
-4.203916729571233191e-02,-1.982387352846102679e+00,-5.598029797755268433e-01
1.330675726894134936e-01,-3.192087553858935500e-01,1.431068727745278935e+00
-8.969700697102879206e-01,1.658201609868904747e+00,-3.308537829699664812e-01
-4.496829712303569426e-01,1.401770680975266803e+00,2.214919264827383216e+00
-1.457111862907520816e-01,1.930130678746160733e+00,2.705700066419440830e+00
1.567790656736007371e+00,-1.337206057904510637e+00,6.991037866217139296e+00
-1.247703623548944485e+00,-1.094809347391826337e+00,-6.354299231174982410e-01
-9.501924282079218242e-01,1.625183087260257064e+00,-5.565613596076168790e-01
-1.073012096966267981e+00,2.662865795454361084e-01,-2.986511748337301597e-01
-1.070040782069495267e+00,-1.650838650295609611e+00,-1.882500518868467587e+00
-8.120119392960090110e-01,1.078966172132294510e+00,-5.821229169238349321e+00
1.728229283651998127e+00,1.311833621366190972e+00,6.446453431491152131e+00
-1.255699075644975071e+00,1.841975215806042065e-01,5.708808019208186479e+00
7.140291350362031331e-01,-1.485472348479107696e+00,-5.553815632294042182e+00
-1.527098737251929794e+00,9.877203529650775415e-01,5.032668336237760442e+00
-2.499040530511957847e-01,1.257078663784061412e+00,-7.352294252224409021e+00
-4.156444096252427389e-01,-1.371504203983012982e+00,-3.550394045495508522e-01
-1.524604882620947954e+00,3.174846670330428999e-01,1.775216718761130963e+00
1.587917570781023802e+00,-1.666160603598576539e+00,-4.180946368496172738e+00
1.384150107332918545e+00,-2.159612201628444694e-01,8.811639035026832545e-01
-6.763168446065881412e-02,6.779459770027815857e-01,4.600934639703208262e+00
6.407224010923107116e-01,4.319632520301781575e-01,3.060657255291326706e+00
-1.574792526857701436e+00,6.254070197868593084e-01,4.444219399585650265e+00
8.474401968068820956e-01,-1.904698256027152148e+00,-6.885970745205444388e+00
-1.754627550943936853e+00,1.316703385452460573e+00,7.459699970002917624e+00
-5.816305833105488432e-01,1.081838041978975706e+00,7.162397860397220484e-01
-1.407003916160505685e+00,-1.545106199598779373e+00,-6.293750216472183467e+00
1.341967329040389512e+00,1.501430775428620912e+00,-2.018585981346197045e-01
-1.638150401936667722e+00,1.929541983947804518e+00,6.149437497260249685e+00
1.458950895967096262e+00,-5.801330106386715091e-01,4.167153963970223529e+00
-1.526869270831288761e+00,-3.323048818218277134e-01,1.098362347760446056e+00
1.315984897882005455e-01,5.251646438248851467e-01,6.869869076854715928e+00
-3.698527512604194989e-01,-3.944813774434157150e-01,3.076991775772864202e+00
-1.424202515776407552e+00,1.430533620936102590e+00,4.873869550552230479e+00
-1.435797274109382737e+00,-1.257045575878743104e+00,-3.675593079058896873e+00
5.809002830270868500e-01,-1.439542700705151113e+00,-6.200461332376585588e+00
-9.464969538260747939e-02,-6.692014674885635728e-01,-2.642308957133477243e+00
1.260240231386367871e+00,1.517726424544830088e+00,-1.835842428562830975e+00
6.954789771825131695e-02,-1.214464873540723744e+00,4.647435775578257378e+00
-9.285825328021637404e-01,5.544836236828278864e-01,4.345477135059718776e+00
1.631360583774332795e-03,2.649905809148198621e-01,3.128560090766713486e+00
-2.950490563645553621e-01,2.094755922252261371e+00,6.151814974458748253e+00
-3.696147025197318303e-01,-1.236821963391714574e+00,-6.725875118892025384e+00
-5.658404923090256666e-01,9.164272089748966010e-01,5.060929832392490724e+00
-3.090284272009946598e-01,-7.753212103544147027e-01,3.361590358511584498e+00
-1.199047814519289101e+00,1.755425642897533223e+00,4.291169219181817596e+00
-1.459154811129657947e+00,-2.096624261785250187e+00,-6.415836702565864691e+00
-1.739042184835849936e+00,1.535524098412834881e+00,-1.342847322060229054e+00
-5.210267210311654296e-01,1.183848207307589995e+00,1.554549955727182464e+00
-1.226530574974887378e+00,1.240007332429772458e+00,-3.167643167625352696e+00
-1.032943718859815840e+00,1.313348092876041040e+00,-4.601420211399544158e+00
3.317978191476900207e-02,4.983982160083337831e-01,-1.925315531309914618e-01
-1.160715572972412346e+00,-1.150038379225546414e+00,-2.074912160016917362e+00
-1.040501680387522665e+00,2.549408558059229613e-01,-9.073667235670104247e-01
4.870601823696052435e-01,1.576408314966232460e+00,-7.097949057954452634e+00
2.255330932187846749e-01,4.672333009123370573e-01,5.864400718492355224e-01
1.284587934317421354e+00,1.330685027774713536e+00,6.772453522749586341e+00
1.239252233359966482e+00,-6.481451239816815590e-01,2.417008128775385956e+00
-1.387515616457732026e+00,1.088135398813297794e+00,5.625940255842220239e+00
-9.970370773054336722e-01,-1.416865959759358695e+00,-5.295527454562614977e+00
1.551112050163161449e+00,-7.676451372341441814e-01,6.555867011429501900e+00
1.560109845109103777e+00,1.773746953405299198e+00,4.679779567749495328e+00
-1.209378462030656909e+00,-5.809877554929654409e-01,2.621793774562378943e+00
-8.218528960868853872e-02,1.746184093465423359e+00,4.132341244100693700e+00
1.604320402294626025e+00,5.732908059193229100e-01,-2.051495484417784176e+00
-3.724401956204848041e-02,-1.703394052203796472e+00,-1.372942866226581238e+00
1.035078333496200820e+00,2.120809081741179547e-01,-1.284140246900911109e-01
7.265017358330658759e-01,-1.902168632906271029e+00,5.467110591673321807e+00
-1.317793146628629009e+00,1.766377027387370902e+00,3.882394187634798044e+00
1.479653098144431578e+00,1.663854432860837118e+00,-1.430529239451703738e+00
-1.945580735319472065e-01,1.083108313905320141e+00,6.081823236064682447e+00
1.480408873954221605e+00,-6.555095577554299613e-01,1.080681526286664251e+00
1.267481582433546361e+00,1.300179350387069555e+00,2.858246147430204331e+00
-6.800072430339381135e-01,-6.789522405252392812e-01,4.790581183903521278e+00
6.315680197035802301e-01,1.122959098131159905e-01,-1.661097597695139427e+00
6.967556800398622130e-03,-2.058241892024561981e+00,-3.765471484725996021e+00
4.384441314939686585e-01,4.345824882176754222e-01,3.575341498926203343e+00
3.992928082252036326e-01,-2.093135132689433853e+00,4.022386016925876717e+00
-7.198972336234910063e-01,6.624080356918349288e-01,6.358577479513099817e+00
-1.068392878754649944e+00,6.249772811738418810e-02,-2.768291250634780987e+00
-1.387077666174577617e+00,9.662575363284142682e-02,-1.089428060499679773e+00
1.009922186476783335e+00,2.826919150140354553e-01,6.563384962795238309e+00
-9.460757912709553130e-01,8.436613448493801570e-01,-1.022557870099046973e+00
-7.188852545575077357e-01,-4.216541487778171504e-01,-1.924417760296387669e+00
7.584627438218327633e-01,-6.076173295305407063e-01,-1.681060283720531956e+00
1.341734139544618731e+00,-6.820499850560619581e-01,3.791305831309653485e+00
1.564324321472863488e+00,-3.586405583952416709e-01,2.168169741310562060e+00
1.107020511749085667e+00,1.720863222904688961e+00,3.310683384168635612e-01
-1.255893497098878875e+00,-2.119503699693615850e+00,-4.638671864977303549e+00
-1.855662822873682671e-01,-1.791121711192530164e+00,-5.107730331939794866e-01
-8.941539854025373213e-01,3.432870755094623583e-01,5.501945788183475017e+00
1.551792451038837228e+00,2.030841238063922916e-01,6.225311228435415956e+00
-4.813950566952227561e-01,-4.209193528660446493e-01,7.036012063284632134e+00
1.139118765158041224e+00,-2.035710527015949456e+00,2.620169796081803781e-01
1.663588037335841374e+00,-6.359736649495133509e-01,-1.114144105593809719e+00
7.980740537335826446e-01,-6.316762165527198825e-01,6.131869648757845681e+00
1.525354377926686489e+00,1.843692693875962796e+00,-1.857305062683451524e+00
-7.757710690584228574e-01,2.078231777993058138e+00,2.900659856601752296e+00
-4.441237812488585401e-01,-6.226072997414944243e-01,-6.964889769049907642e+00
-1.072881400490575565e+00,1.286862053378991178e+00,-3.139860497214507440e+00
4.621425242100207775e-01,7.973845104253753924e-01,-3.418875337361662936e+00
-8.336622683000978196e-01,2.110580366354644966e+00,4.396784461753483697e+00
1.283782547830305099e+00,2.784062152329118689e-01,4.360119277003935423e+00
1.033978163282130769e+00,-1.421945570012425719e+00,-1.774385406289365363e+00
8.912756793292331281e-01,-2.620262316845396455e-01,4.532787404144832166e+00
3.611135549754465046e-01,2.026775243997207987e+00,7.315155084253675000e-01
-1.364562497292734822e+00,-1.601693666357618673e+00,6.494287760950332000e+00
-7.724777932028444871e-01,-9.027505184196698007e-01,2.098509037439207248e+00
1.759291542553894416e+00,1.259030906548550099e+00,3.485259568465552960e-01
-1.142602208335470770e+00,1.340864263784523391e+00,1.160840873513672378e+00
-7.912210509285592108e-01,5.489565010697532443e-01,-4.253374961364169593e+00
3.180089974464923586e-01,1.169506419165505573e+00,8.127490050011747513e-01
-1.595296277106581506e-01,-8.879271366324434922e-01,-3.652439898645710947e+00
-4.084478283490144968e-02,1.926743395346145249e+00,5.619085896985346551e+00
1.085519095526006339e+00,-6.444417365612502557e-01,4.845844117947621044e+00
-5.209533331420808100e-01,-6.568341841278688698e-01,-5.731486783100915972e+00
-3.104232576263801224e-01,6.085707225042007451e-01,-1.950445830918809520e+00
8.154722232023434714e-01,-5.262669617100690367e-01,-5.770120394061946989e+00
-1.341485179629631208e-01,-1.884446196189022871e+00,-4.300638568866375522e+00
-1.716696175007694780e+00,1.307401077323408156e+00,5.253397003393606823e+00
1.328266590044227424e+00,-1.523297155259032643e+00,3.565834025520493000e+00
5.474823053031929732e-03,-1.501472643037583321e+00,5.998251258531295704e+00
1.193417167326060291e+00,1.533866222556274916e+00,2.051811552380002013e+00
6.683440464072547549e-01,-6.085916046276305114e-01,-5.160743703049780251e+00
1.065040097436940503e+00,2.027808673918251259e+00,1.764507055696887150e+00
1.727031759174441738e+00,-1.776822081648274931e+00,5.138900229738631253e+00
-1.581008423379182570e+00,-1.759481481167072259e+00,-2.680060088125827633e+00
-1.068245406603744563e+00,-5.380096017514797158e-01,4.637195605935772846e+00
1.056230806990846371e+00,-7.693226916493696166e-01,-5.068568580560841141e+00
-8.501914157564020025e-01,-9.886052961182396626e-01,-5.500253921922610090e+00
9.190055337474132280e-01,1.068232787831991715e+00,-4.572806096959160627e+00
6.419949432206193407e-01,1.433732356769640948e+00,2.957706602764901049e+00
-1.672847923369616963e+00,-1.046516719623376224e+00,4.825221816178460799e+00
-1.890421604322534144e-02,9.838664805757124654e-02,-2.550878320283767486e+00
1.318460526971406033e+00,-8.521827946123730069e-01,-2.518961757035294013e+00
-1.634581712369903794e+00,-1.094395565537124027e+00,-1.353828815513651307e+00
-1.544356733194048203e+00,2.043351971487849639e+00,-6.394745546182595497e+00
6.439624702133306400e-02,6.620480593995448082e-01,3.074720745233088692e+00
1.742933191371606405e+00,1.315617159999492802e+00,-4.539295395227879837e+00
9.728735117471400962e-01,-1.475016144127359707e+00,2.108290921001044538e+00
1.379959326627663962e+00,-5.375154839431366405e-01,-1.108259351870693799e+00
1.660942774796878574e+00,-3.372380536341079704e-02,4.111589297033390267e+00
1.513926157438245212e+00,5.930010750621073079e-01,3.625867831392994844e-01
7.513615937815272261e-01,-5.017933416625337539e-01,4.056713292295457407e-01
6.456393641245306014e-01,5.637356756552138748e-01,-2.972295995685908743e+00
8.433684163315815496e-01,8.234121274337109497e-01,6.787187443585226632e+00
1.089641779396402388e+00,1.642815083540301480e+00,3.605647167322638680e+00
-1.060989680556107206e+00,-5.891756867585773438e-01,5.025287697468439063e-01
-1.319282811674737044e+00,-1.756572532585609636e+00,-4.119154164908922944e+00
-5.133502055719398882e-01,-7.714909159149787587e-01,3.646563733380796535e+00
4.437900082753616360e-01,-7.287270135902870205e-01,-4.691735521043591817e+00
1.527053360365263401e+00,8.774246976789426000e-01,4.163749006312432499e+00
9.735284732000262231e-01,5.001012212077644570e-01,1.274363215646589609e+00
-1.263326875332180910e+00,-9.958697165743195523e-01,3.837251039088073412e+00
-4.482322022762019742e-01,1.619362757811964926e+00,2.433483400185577850e+00
-1.063321824251952208e+00,-1.861006504369241421e+00,-3.405665209844229935e+00
1.370098037893682008e+00,1.186163077615054906e+00,-7.176928539249106009e+00
-4.364609515495492253e-01,-1.392563595047413116e+00,3.662815322153926800e+00
1.744570688801990066e+00,1.783194952002036704e+00,1.460752339650719378e-01
5.717918753501680662e-01,8.468819565138545613e-01,-4.566919533609969051e+00
-8.522583439242008563e-01,1.826960694854885325e+00,6.037274285838757137e+00
-8.965321951929317024e-02,2.047814855446350890e+00,3.890541974607538478e+00
-1.594241773848996235e+00,-3.316685944437987033e-01,6.958630787371125948e+00
-1.033535547023801016e+00,-2.066026317675417001e+00,-2.957323416165975161e+00
-1.532411683842088701e+00,7.599060033924804891e-01,-7.075541006873732996e+00
-7.747997026803234988e-01,-2.116515322326133930e+00,-6.902194624017353064e+00
9.343051033933593708e-01,1.858553623582208658e-01,1.638001717815541269e+00
1.294597646509287880e+00,-2.168728415129591802e+00,1.200562179261568829e+00
1.353311881885641998e+00,-1.661760171682339582e+00,5.063538103472442486e-01
-1.093388299560273724e+00,-1.289111096303668269e+00,-3.026142633652372460e+00
7.016527045051135225e-02,-1.297808238532151215e+00,-4.556201304955131093e+00
-1.327902811973232122e+00,-4.514273050243458041e-01,-4.099377670531586304e+00
-7.177142568609149453e-01,1.579636723621896444e+00,5.100581842541185296e-01
7.366139352370524307e-01,1.541728097833409805e+00,6.714020023513425528e+00
1.623555093544944317e+00,2.169817033668341111e+00,2.560803824240760918e+00
1.296390013423645016e-01,-9.148328646112420248e-01,-2.169346542909439179e+00
1.554172619069413841e-01,2.090475824440627406e+00,7.480405893637751547e-01
-1.381392312971281289e-01,-8.383961940310409311e-01,-1.344688502357679560e+00
-1.762387142247136662e+00,-5.495854581344827849e-01,7.288946527985121548e+00
-5.957562987714832836e-01,1.806961782863998778e+00,2.471155084820317427e+00
1.512438805178884405e+00,9.828604043377628940e-01,5.497476702905801815e+00
-4.802784297159179427e-01,-1.800645847552224010e+00,6.954802546383133333e+00
-8.277247189939817007e-01,8.551794340478569012e-02,2.499608739534048496e+00
-9.318707956468569309e-01,-9.806275893066460636e-01,-3.579762746487169522e-02
6.316118429430539472e-01,-8.901300278665722487e-01,-3.035818939426922825e+00
7.476814271115936883e-01,-1.397520953977138713e+00,-7.123263971501720526e+00
9.137404754277844710e-01,-1.898854887548335979e+00,2.025968316564929594e+00
-8.141283842346068722e-01,4.706697931438417193e-01,-5.537102344363989737e+00
-1.668712982159506808e+00,1.604081931441910136e+00,3.077760263569135901e-01
9.620688599011217867e-01,-5.911697660638850493e-01,4.375139593595802623e-01
1.690710529793522543e+00,5.921966779224074884e-02,3.753883850071220607e+00
1.157591900830204690e+00,-9.512734006314973456e-01,-4.763090764121353793e+00
-2.067792942881618856e-01,-4.833744454195594287e-01,-1.800397555812569550e-01
-1.663681535608537265e+00,1.095507409242955532e+00,1.589484505009293613e+00
-1.895435775176599336e-01,-1.402642236473454540e+00,3.266503595230066281e+00
1.400220720977943145e+00,-9.114055273647059252e-01,2.196421471895018129e+00
-1.156279875515831668e+00,-8.589683151260794070e-01,1.443699065284643979e+00
-1.140096412725905006e+00,-3.080160270302783054e-01,-3.157450602891161751e+00
-1.752117714744904298e+00,-1.258455707688070691e+00,6.308706285978560757e+00
-7.155157202233033420e-01,9.421212738638500284e-01,1.940085947295541402e+00
1.650137784407258223e+00,-6.515381713276391373e-01,-5.325691943755647806e+00
1.413798918751821621e+00,1.914791352321167039e+00,-5.898183508573442424e+00
6.627538782453590294e-01,-6.435089097817934256e-01,-3.733115167269497991e+00
1.598009733768706919e+00,3.345487122581740635e-01,6.136816284801078325e+00
1.017286999185339269e+00,1.103299018880333104e+00,4.619418378919114332e+00
1.136283931652872337e+00,7.528764182125646798e-01,1.751079535314540081e+00
6.036308962970262648e-01,1.800721401236700547e+00,-3.639279178267153192e+00
3.411166762382609186e-01,-1.223496907631830055e+00,-8.792749467280129849e-01
2.606793106091243040e-01,1.972033511922166582e+00,-5.001536875744478472e+00
-1.184652288203746906e-02,1.336054008807158855e+00,2.536634154183733614e+00
-4.645885530467535052e-01,9.511852372627545016e-01,2.399262244962088175e-01
-5.982481514367565811e-01,5.616953798585377911e-02,5.193424314926412322e+00
-1.369208322929878818e+00,-1.701779574680321483e+00,-3.392102889312069713e+00
-1.548410836749853248e+00,-2.720734192861611334e-01,4.908971599623843218e+00
-5.781866279671741271e-01,-1.313629224836653453e+00,3.258156718469269464e+00
1.601738600081110242e+00,5.549197087411363860e-01,6.284113226672136676e-01
-1.323711815617210741e+00,1.760325648513523245e+00,2.792880172884522949e+00
1.832786396077259461e-01,-4.692506204156443594e-01,4.086378819936255624e+00
4.138702104831009088e-01,1.618639602884941020e+00,1.546213413663974023e+00
-9.548080822199810358e-01,-1.996042154338331986e+00,-3.388670476827890354e+00
-9.785055782371729904e-01,-1.168720409107013580e+00,-2.574588472986771848e-02
-6.413389504897228921e-01,-4.990718657828836502e-01,-9.208282925547308650e-01
1.686133031306078056e+00,-1.643353581900824256e+00,-4.584825490103459522e+00
7.761102731463664917e-02,8.265001702743464129e-01,3.093459243025666439e+00
1.253998613655919137e+00,-1.146743083655183959e-01,-2.952191131878840302e+00
-4.591885003473095139e-02,-1.567641134202482078e-01,7.452668575671379969e+00
8.730348773215270697e-01,-6.564925939282739709e-01,5.625126882986810628e+00
5.838027762681239352e-01,2.053456694596981436e+00,-2.068681692484000578e+00
-2.823523841912696231e-01,1.597509260818011256e+00,3.002275467575504564e+00
-6.365026892188163643e-01,1.830691358648698142e+00,-6.443179682667561359e+00
-2.290727665537568569e-01,5.795952315575889635e-01,7.056676547532969579e-01
1.400945065477401386e-01,1.998749996619416436e+00,1.765656033268284020e+00
1.256558482032946067e+00,1.274570036508257065e+00,-5.587569856552947911e+00
1.103861299320490819e+00,2.126782701059818592e+00,-4.211103268840892255e+00
-3.515063785318854883e-01,-5.902101359058886665e-01,1.944088446499534939e+00
-1.232939904625879102e+00,1.532243485793840510e+00,-7.210314454391001604e+00
2.076789802041281163e-01,-9.336589217134056984e-01,6.669887812300276053e+00
-7.731589710409104699e-01,1.366460378837833112e+00,5.278957194212891224e+00
-9.858660860038506168e-01,1.849676463540435023e+00,-1.582884926520652158e+00
1.403859565737763049e+00,2.016003892048304103e+00,6.480234490841242589e+00
8.429475459904534063e-02,-3.472730251912921062e-01,-6.205708735956264377e+00
-6.324127973724340546e-01,1.488128592207349499e-02,-4.402840146891914053e+00
-4.169045378872138219e-01,-1.830460961290945487e+00,6.665968635148761479e+00
-9.864962475076534121e-01,-1.407327182009537214e+00,-4.809286739554554657e+00
1.714490955718266374e+00,-2.357831518006530125e-01,-2.433817083280204407e+00
-1.538577704375844624e+00,8.304227171059177515e-01,-7.450328617329563308e+00
-6.734584909223233495e-01,-7.141192439033716699e-01,4.536035739187742166e+00
-1.567634451151787234e+00,1.407995777497236922e+00,-7.045910081232355182e+00
7.576010635942433957e-01,6.683742242884180840e-01,-7.330797859034388964e+00
1.548460179915167600e-02,-1.446803045688058287e+00,3.335306017232301912e+00
-7.089787519457295684e-01,-5.483979646169034883e-01,-6.633376484394925221e+00
-1.568975351057043888e+00,1.400122416696794048e-01,-2.366713433945832890e-01
-8.128933853508570895e-01,1.738196223971474552e+00,1.513263643468512498e+00
-1.762714302891958074e+00,2.158242748230792429e+00,-6.149789624120080234e+00
1.031831388830381613e+00,-2.951898277326949760e-01,4.758439068499352942e+00
-1.387965737686444712e+00,-1.101149406734921676e+00,9.268102181551149954e-01
6.055849990689261553e-01,5.434632270472485871e-01,9.301256509438626807e-01
1.945984200266281938e-02,8.239324244396235564e-01,-1.198030425553001876e+00
1.370924908272044718e+00,-7.750594406675936909e-02,-4.488282464878420974e+00
1.008296441478029326e+00,1.581971332281682852e+00,-6.085597303801893787e+00
1.379070429834470257e-01,7.514455428612052401e-01,-5.864268801713915735e+00
-1.262472492725398521e+00,-1.379845225260400765e+00,-2.422490811204377259e+00
9.999708714277977251e-01,-7.930535720496130203e-01,-7.447026107107410198e+00
9.060105202610975184e-01,8.331947911405288565e-01,5.731983089175786361e+00
1.567816366167187336e+00,-3.821014027955267345e-01,4.005300699875784076e+00
1.356159083016623690e-01,1.051194144245925166e+00,-3.820373980139671666e+00
-1.035156294457301396e+00,4.453443567824311167e-01,-2.882675374876375152e+00
8.566328587608982303e-01,7.759389175465312150e-01,1.906064699230817894e+00
-1.181130364999507076e+00,3.358302136759272472e-01,-4.621318081561474500e+00
1.041081360116057120e+00,5.987258739621883485e-01,7.382133085304273479e+00
-4.107865783391757564e-01,-2.132478392140902734e+00,-7.556974463165699873e-01
1.637130281921956421e+00,-9.301132977317518868e-01,-6.725333029091745907e+00
6.725290900552014506e-01,1.559093132991453245e+00,9.783538656880530482e-01
1.577612955298158592e+00,4.956377529558753103e-01,-2.316759734365136936e+00
1.186964286801933888e+00,-9.675964181418998944e-01,-1.756565808364642045e+00
1.328305586273639705e+00,2.032544409602116353e+00,-5.766106439117367977e+00
-1.187698878171525863e-01,-8.281747782526602819e-01,-2.157590120958021274e+00
-1.196139787124222309e+00,-1.035422881884524138e+00,-6.488722242870484713e+00
-6.572495788783816462e-01,1.232899142123292879e+00,-1.887528005318538149e+00
-1.579767115286829560e+00,6.621715331256128323e-02,-2.521150133512701785e-01
1.495648268935514391e+00,-1.336798982474213249e+00,-5.330855090872534952e+00
-1.679076305155437154e+00,-1.281605583433538698e+00,5.008731304860170042e-01
3.105439746738061224e-01,-1.532115525748376506e-01,5.848449448175376375e+00
1.180762571891090573e+00,1.602858891206849545e+00,5.234671976972130381e+00
-5.881421460403737367e-01,1.669647641163314322e+00,6.424744485951324080e+00
-1.226399505250976851e-01,-1.304479075940478960e+00,7.393766043796125231e+00
-1.754520932205010375e-01,-2.244219731628194214e-01,2.403931124160791910e-01
-1.259281201276234441e+00,-2.044071824730899767e+00,7.049773990740638041e+00
-4.979598496045156697e-01,1.918512077651354453e+00,-2.442983252451722542e+00
1.752085125579196490e+00,-1.286351330612021115e-01,-6.743212307926985893e+00
1.250725971333537245e+00,1.701809803148076838e+00,-2.061371521064945256e-01
-6.033409968943355128e-01,7.427815779088584591e-01,-3.373910961878400450e+00
1.643650819944549202e+00,1.335601675667954513e+00,1.921718048601013251e+00
-5.780332309492794973e-01,-2.084097349790285936e+00,-6.769401089014563055e+00
-9.715442552814780308e-01,-1.082550647995142779e+00,-1.976200610057824214e+00
-1.697330549894299878e+00,5.480703660270078714e-01,6.448740785931551756e+00
-1.419170520623171505e+00,1.149175169379748951e+00,2.388661776941088277e+00
1.445599980888305769e-01,1.523829775399098363e+00,-5.765973908514552271e+00
-3.467519662197662278e-01,-1.821428854442221690e+00,-5.666433897885418958e+00
-9.487234729002842482e-01,-1.128961152815268987e+00,-5.269544371772002300e+00
-4.248998191034232264e-01,5.311189045978750300e-01,2.321433070784552299e+00
-6.350268975177544295e-01,-5.462444815803340070e-01,-1.019468495145688713e+00
3.170854322935419134e-01,-6.750801960264938284e-01,-1.928675938851368343e+00
7.062574453560084287e-01,2.066957390369174696e+00,7.222085650195735340e+00
-6.103490951389807240e-01,-1.410683163750135805e+00,7.484189127179972090e+00
-1.394047566536427585e+00,-1.079281573319084808e+00,6.739970627414150428e+00
-1.031540048109348628e+00,1.493133743930364243e+00,-3.115196292639141440e+00
1.046031339506137137e+00,2.015563584007094455e+00,6.184067983080627329e+00
1.655908905074601645e+00,1.942376805591867317e+00,-6.613805360815216083e+00
2.917167513844280968e-01,-1.226469009156048395e+00,-7.133877882055468689e+00
-6.289421241318586819e-01,1.338134521935697485e+00,6.241248971104752741e+00
-1.254255582212244757e-01,-1.042659963841218840e+00,-5.091835792248808445e+00
-1.146712955963146152e+00,-9.045011564897791345e-01,3.141649266794543038e+00
-1.197737988657125996e+00,1.232331406153921449e-01,-5.423252803319125626e+00
1.038504073648479409e+00,-2.692400001799932774e-01,3.252132595138892412e-01
-6.381256017266905278e-01,-1.467033641423006296e+00,-3.367506307405017552e+00
6.787579035744433220e-01,1.833701408686726708e+00,4.887681524960623136e+00
3.901282763499880346e-01,1.568272671893936820e+00,-2.403483349060559604e+00
9.152015601511460652e-01,1.380360358237605833e+00,-5.778941564519145757e+00
1.681940641028242478e+00,-1.897730515780354565e+00,-4.098068370423419537e+00
1.429738074544010473e+00,6.031918146327699404e-01,-1.655372610714532122e+00
-1.535255664848758750e+00,-2.107113497724694362e+00,3.448094853746493271e+00
-1.390582608162050926e+00,-1.625428944048044499e+00,6.749585548095808463e+00
1.751441524275394013e+00,-1.619198101421413183e+00,-2.720317841315424090e+00
-9.045574942422466291e-01,8.183755479959287094e-01,-1.385254520056959038e+00
4.080297408035460371e-02,2.016959830180691249e+00,7.294912906648534090e+00
-2.945499938573468146e-01,-1.667406899874778636e+00,5.017550635436839102e+00
-1.558634308232284660e+00,-2.010007855009809496e+00,-2.560358077838158053e+00
-9.416330538619619439e-01,2.084431681770722022e+00,-4.741878463229852514e+00
1.159299188262444158e+00,1.409767499329440898e+00,2.389220520440213491e+00
1.428733277742332053e+00,1.632199146878595908e+00,-4.220122069219290672e+00
5.813740588351286043e-01,-7.411666416854512107e-02,-1.265825158511848514e-01
-3.265923297915007684e-01,-1.965107006186810334e-01,-5.784562963731782581e+00
1.330657119356952744e+00,-5.259307217291242509e-02,5.678854979972118855e+00
1.389663121450582128e+00,8.484741897919119147e-01,2.632862510226269492e+00
-3.078521570240375649e-01,5.922651540645889057e-01,-3.700283644321205045e-01
1.452848905870279594e+00,1.562630122339909278e+00,6.358462800899195244e+00
-1.337109872093255269e+00,-1.395107416314105730e+00,2.842902125662996937e+00
-2.290138761871802764e-01,8.446980153481220555e-03,-5.517144140981743661e+00
-1.743257001960852426e+00,-6.587727704329404688e-01,-3.265696560517802105e+00
1.735575781732054956e+00,-2.021645089300842635e+00,4.113924678956692560e+00
-1.674561005558770521e+00,-1.025985049684597694e+00,5.581418771786351485e+00
1.566764280594688419e+00,4.088432430506672155e-01,-2.472898480761821283e+00
-1.744930068382446242e+00,4.980600973792230768e-01,-4.080261802012059569e+00
1.726452307516601614e-01,-9.367385132947105841e-01,2.127003823775977409e+00
-1.102440581173246947e+00,1.837444232297181124e+00,4.019247382048577677e+00
1.908565090088809590e-01,-1.465910216021328427e+00,4.861200473003775002e+00
1.151779933119769339e+00,6.530833147594794497e-02,-6.737906603904084690e-01
-2.710958308113664561e-01,1.553956247104787636e+00,4.536159773917951554e+00
-4.687015336921938058e-01,1.689033223769045300e-01,5.010451196526126694e+00
-2.823136502854379781e-01,6.654718201019420576e-01,-8.637172427780601680e-01
-2.446936895822853231e-01,9.918055788542425866e-01,-6.301336137316946306e+00
1.014925352804068037e+00,1.447825127089120034e+00,1.387314392159970211e+00
-1.709240810218602746e+00,6.469056538683410906e-01,3.644598289811574077e+00
1.803526645759148117e-01,7.348929584383028235e-01,3.275547087372533639e+00
-5.622378705439978752e-01,-9.458993519350709089e-01,-6.027628896791427771e+00
1.482688821521100930e+00,1.193045304237450033e+00,-6.942961960095932916e+00
1.636454454396875313e+00,-1.305817889632101547e-01,-6.076246065334213853e+00
-8.266438807569049807e-01,-1.074445109984153657e+00,-1.971955815575602955e+00
-4.991921734262310117e-01,-1.070183008321324625e+00,5.387041474279106623e+00
7.810279140762208527e-01,-1.431379770400273532e+00,-3.426894063251092248e+00
-1.511475236074413475e+00,-1.302657098034348371e+00,2.886840086841234054e+00
1.186123518902103324e+00,1.805320528564916760e+00,5.930509581003445163e+00
1.649078786698420451e+00,1.067239182063768332e-01,-5.963954948900349606e-01
-1.738624603596646168e+00,2.199132410316066988e-01,-5.559285516502082913e+00
-1.159397346179637189e+00,-1.243852618080644401e+00,4.529367017448070243e+00
-1.383267324745790061e+00,-8.969968318587584477e-02,4.304906598367171711e+00
-3.846410335933658775e-01,-5.125799246884654714e-01,2.187441490568486913e+00
-1.144647269776731369e+00,-1.293766029167095155e+00,-2.776452870326896694e+00
-4.278738997397804056e-01,4.738937688496314138e-03,1.995053256990235724e-01
1.248181367333513148e+00,1.969780910400409368e-02,-1.397163056296641059e+00
-1.554715447911846127e+00,5.124199934726800798e-01,-4.946500838826604962e+00
-1.611069381033050973e+00,-1.041632406015968071e+00,4.574164143573149488e+00
8.368269190974135796e-01,-1.151522193893357304e-01,4.542648796659683796e+00
-3.227723469336667428e-01,-1.137593212424920841e+00,7.517089532836092047e-01
-1.491163960871398020e+00,-9.780938625733026637e-01,4.499381107879360187e+00
-5.722965853971366812e-01,-2.075532839389741646e+00,-7.119378646185009707e+00
1.109525679114247154e-01,1.092717514525571865e+00,-1.845286747576796671e+00
-1.073704849679385953e+00,1.734443401206474000e+00,5.920397469034433868e+00
-8.513802564001482498e-01,-7.410958619267147274e-01,-1.086263038958167115e+00
-1.516245800340389360e+00,-1.914475055696030159e+00,-6.236828847718132174e+00
-8.283382033712138881e-01,1.996245538710279988e+00,-6.923402074090855507e+00
1.584144574431455954e+00,1.480120081282052080e+00,1.776670380218943635e+00
3.164249395068297055e-01,-2.705626526764364215e-01,-4.320074639862492738e+00
4.011159767373158047e-01,1.820099044056902926e+00,-7.113810193517826619e-01
6.145991447693726073e-01,1.114165141694800631e-01,-4.439175858913333883e+00
-3.244027307225525458e-01,-1.356772748298522124e+00,-4.989587131411306054e+00
1.057192008769229918e+00,2.167115822483141052e+00,-3.364762530119510764e+00
1.358539154654226255e+00,-1.116720491830268891e+00,2.283670404445844682e+00
1.716247980123589478e+00,9.474269347103203565e-01,1.465690196266177026e+00
-1.249663370183107247e-02,-3.326827455815226653e-01,5.574584571787950082e+00
1.315678756425129325e+00,1.837390980812742214e+00,-2.819486249509452591e+00
-4.644899271115714434e-01,8.987274666403486378e-01,5.398956175721073336e+00
-6.852924394168817823e-01,8.592239912999364293e-01,6.315658335021774761e+00
-1.453456724560965085e+00,1.369229802692618847e+00,2.056269961431313575e+00
-5.210757115971187403e-01,4.647747115745453073e-01,-1.054317915347857237e+00
1.385263800055266614e+00,-6.953431384714621188e-01,4.109853890445853253e+00
1.623240739458247539e+00,1.466225881454160884e+00,1.300019929633917215e+00
4.104966586249481075e-01,-2.452474499183454615e-01,-3.613781254652354669e+00
1.362832497411401445e+00,8.331254682467728045e-01,4.402302759283195144e+00
3.773037747997878277e-01,3.325434323315503704e-01,-6.949821134924142108e+00
-2.661252458574179247e-01,-4.771425691486013143e-01,6.999378163696256649e+00
1.560792731661333921e+00,-1.268226102644414155e-01,-6.610936006969555301e+00
1.754189622241216995e+00,5.298560451556846296e-01,6.014713717557905071e+00
-7.071008656470052500e-01,-2.014116419374792244e+00,6.839016211486532271e+00
3.120929832210306287e-01,1.983191689870946739e+00,-7.640851515558786389e-01
-1.610950028072400730e+00,1.569048936000706274e+00,-6.303143331485921763e+00
1.218727666981237689e+00,-9.517533085104812329e-01,5.419777345195978313e+00
3.868961868523315140e-01,-1.419381538366683237e+00,-5.182852508822755055e-02
1.634975326433325549e-01,1.931602435895126035e+00,7.172149048609522737e+00
-3.311049142394706379e-02,1.897239653441907592e+00,-1.936322578028332408e+00
-8.219507820566710476e-01,1.756799159915021669e+00,1.571512857467222801e+00
2.669628861986086399e-01,-9.000367215528790599e-01,5.215519416935473274e+00
-3.710426730045670585e-01,-1.076559714529881306e+00,6.535930069965345979e+00
1.436713697815614754e+00,2.047776289422218454e-01,-8.327304604639245156e-01
5.196827226879214834e-01,9.498737629362121737e-01,3.721104952185399384e+00
-5.725451050395624630e-01,1.568921946695874592e+00,-6.910967551019036037e+00
-1.540545100689905134e-02,-8.083021279428617145e-01,-3.809340666191849412e+00
3.780541384329021426e-01,-7.278298799096591942e-01,-6.260441680780516549e+00
-9.726212224040575727e-01,7.234415313177851026e-01,2.404891068520209174e+00
1.454303838630800261e+00,1.863921503274750258e-01,-2.012689543924199853e-01
-7.931953547973368268e-01,1.856954323491954106e+00,6.680720147126885777e+00
8.437176780633999229e-01,5.847014351013259947e-01,-8.651646022407657455e-01
1.659141225375981410e+00,1.205061261008226303e+00,-1.343483666936927889e+00
1.554364619438255879e+00,1.466527273171093437e+00,-4.414415337229087299e-01
1.043819276915372907e+00,1.516143425508811760e+00,-6.335815276363709003e+00
