Linked: (/home/nbenhabi/panda_ws/devel/.private/qpOASES/include/qpOASES.hpp, /home/nbenhabi/panda_ws/devel/include/qpOASES.hpp)
Linked: (/home/nbenhabi/panda_ws/devel/.private/qpOASES/include/qpOASES/Indexlist.ipp, /home/nbenhabi/panda_ws/devel/include/qpOASES/Indexlist.ipp)
Linked: (/home/nbenhabi/panda_ws/devel/.private/qpOASES/include/qpOASES/SQProblemSchur.ipp, /home/nbenhabi/panda_ws/devel/include/qpOASES/SQProblemSchur.ipp)
Linked: (/home/nbenhabi/panda_ws/devel/.private/qpOASES/include/qpOASES/Indexlist.hpp, /home/nbenhabi/panda_ws/devel/include/qpOASES/Indexlist.hpp)
Linked: (/home/nbenhabi/panda_ws/devel/.private/qpOASES/include/qpOASES/Matrices.hpp, /home/nbenhabi/panda_ws/devel/include/qpOASES/Matrices.hpp)
Linked: (/home/nbenhabi/panda_ws/devel/.private/qpOASES/include/qpOASES/UnitTesting.hpp, /home/nbenhabi/panda_ws/devel/include/qpOASES/UnitTesting.hpp)
Linked: (/home/nbenhabi/panda_ws/devel/.private/qpOASES/include/qpOASES/Types.hpp, /home/nbenhabi/panda_ws/devel/include/qpOASES/Types.hpp)
Linked: (/home/nbenhabi/panda_ws/devel/.private/qpOASES/include/qpOASES/SQProblem.ipp, /home/nbenhabi/panda_ws/devel/include/qpOASES/SQProblem.ipp)
Linked: (/home/nbenhabi/panda_ws/devel/.private/qpOASES/include/qpOASES/Constraints.ipp, /home/nbenhabi/panda_ws/devel/include/qpOASES/Constraints.ipp)
Linked: (/home/nbenhabi/panda_ws/devel/.private/qpOASES/include/qpOASES/Options.hpp, /home/nbenhabi/panda_ws/devel/include/qpOASES/Options.hpp)
Linked: (/home/nbenhabi/panda_ws/devel/.private/qpOASES/include/qpOASES/SQProblemSchur.hpp, /home/nbenhabi/panda_ws/devel/include/qpOASES/SQProblemSchur.hpp)
Linked: (/home/nbenhabi/panda_ws/devel/.private/qpOASES/include/qpOASES/QProblemB.ipp, /home/nbenhabi/panda_ws/devel/include/qpOASES/QProblemB.ipp)
Linked: (/home/nbenhabi/panda_ws/devel/.private/qpOASES/include/qpOASES/ConstraintProduct.hpp, /home/nbenhabi/panda_ws/devel/include/qpOASES/ConstraintProduct.hpp)
Linked: (/home/nbenhabi/panda_ws/devel/.private/qpOASES/include/qpOASES/SubjectTo.ipp, /home/nbenhabi/panda_ws/devel/include/qpOASES/SubjectTo.ipp)
Linked: (/home/nbenhabi/panda_ws/devel/.private/qpOASES/include/qpOASES/Utils.ipp, /home/nbenhabi/panda_ws/devel/include/qpOASES/Utils.ipp)
Linked: (/home/nbenhabi/panda_ws/devel/.private/qpOASES/include/qpOASES/Constraints.hpp, /home/nbenhabi/panda_ws/devel/include/qpOASES/Constraints.hpp)
Linked: (/home/nbenhabi/panda_ws/devel/.private/qpOASES/include/qpOASES/QProblem.hpp, /home/nbenhabi/panda_ws/devel/include/qpOASES/QProblem.hpp)
Linked: (/home/nbenhabi/panda_ws/devel/.private/qpOASES/include/qpOASES/Flipper.hpp, /home/nbenhabi/panda_ws/devel/include/qpOASES/Flipper.hpp)
Linked: (/home/nbenhabi/panda_ws/devel/.private/qpOASES/include/qpOASES/QProblemB.hpp, /home/nbenhabi/panda_ws/devel/include/qpOASES/QProblemB.hpp)
Linked: (/home/nbenhabi/panda_ws/devel/.private/qpOASES/include/qpOASES/Constants.hpp, /home/nbenhabi/panda_ws/devel/include/qpOASES/Constants.hpp)
Linked: (/home/nbenhabi/panda_ws/devel/.private/qpOASES/include/qpOASES/Bounds.hpp, /home/nbenhabi/panda_ws/devel/include/qpOASES/Bounds.hpp)
Linked: (/home/nbenhabi/panda_ws/devel/.private/qpOASES/include/qpOASES/SparseSolver.hpp, /home/nbenhabi/panda_ws/devel/include/qpOASES/SparseSolver.hpp)
Linked: (/home/nbenhabi/panda_ws/devel/.private/qpOASES/include/qpOASES/Bounds.ipp, /home/nbenhabi/panda_ws/devel/include/qpOASES/Bounds.ipp)
Linked: (/home/nbenhabi/panda_ws/devel/.private/qpOASES/include/qpOASES/MessageHandling.hpp, /home/nbenhabi/panda_ws/devel/include/qpOASES/MessageHandling.hpp)
Linked: (/home/nbenhabi/panda_ws/devel/.private/qpOASES/include/qpOASES/QProblem.ipp, /home/nbenhabi/panda_ws/devel/include/qpOASES/QProblem.ipp)
Linked: (/home/nbenhabi/panda_ws/devel/.private/qpOASES/include/qpOASES/SQProblem.hpp, /home/nbenhabi/panda_ws/devel/include/qpOASES/SQProblem.hpp)
Linked: (/home/nbenhabi/panda_ws/devel/.private/qpOASES/include/qpOASES/MessageHandling.ipp, /home/nbenhabi/panda_ws/devel/include/qpOASES/MessageHandling.ipp)
Linked: (/home/nbenhabi/panda_ws/devel/.private/qpOASES/include/qpOASES/Utils.hpp, /home/nbenhabi/panda_ws/devel/include/qpOASES/Utils.hpp)
Linked: (/home/nbenhabi/panda_ws/devel/.private/qpOASES/include/qpOASES/SubjectTo.hpp, /home/nbenhabi/panda_ws/devel/include/qpOASES/SubjectTo.hpp)
Linked: (/home/nbenhabi/panda_ws/devel/.private/qpOASES/include/qpOASES/extras/SolutionAnalysis.ipp, /home/nbenhabi/panda_ws/devel/include/qpOASES/extras/SolutionAnalysis.ipp)
Linked: (/home/nbenhabi/panda_ws/devel/.private/qpOASES/include/qpOASES/extras/SolutionAnalysis.hpp, /home/nbenhabi/panda_ws/devel/include/qpOASES/extras/SolutionAnalysis.hpp)
Linked: (/home/nbenhabi/panda_ws/devel/.private/qpOASES/include/qpOASES/extras/OQPinterface.hpp, /home/nbenhabi/panda_ws/devel/include/qpOASES/extras/OQPinterface.hpp)
Linked: (/home/nbenhabi/panda_ws/devel/.private/qpOASES/lib/libqpOASES.a, /home/nbenhabi/panda_ws/devel/lib/libqpOASES.a)
Linked: (/home/nbenhabi/panda_ws/devel/.private/qpOASES/lib/pkgconfig/qpOASES.pc, /home/nbenhabi/panda_ws/devel/lib/pkgconfig/qpOASES.pc)
Linked: (/home/nbenhabi/panda_ws/devel/.private/qpOASES/share/qpOASES/cmake/qpOASESConfig.cmake, /home/nbenhabi/panda_ws/devel/share/qpOASES/cmake/qpOASESConfig.cmake)
Linked: (/home/nbenhabi/panda_ws/devel/.private/qpOASES/share/qpOASES/cmake/qpOASESConfig-version.cmake, /home/nbenhabi/panda_ws/devel/share/qpOASES/cmake/qpOASESConfig-version.cmake)
