[01m[K/home/nbenhabi/panda_ws/src/franka_ros/franka_example_controllers/src/dual_arm_cartesian_impedance_example_controller.cpp:[m[K In member function ‘[01m[Kvirtual void franka_example_controllers::DualArmCartesianImpedanceExampleController::update(const ros::Time&, const ros::Duration&)[m[K’:
[01m[K/home/nbenhabi/panda_ws/src/franka_ros/franka_example_controllers/src/dual_arm_cartesian_impedance_example_controller.cpp:1836:131:[m[K [01;31m[Kerror: [m[Kexpected primary-expression before ‘[01m[K)[m[K’ token
                                                                 if ((actif==0)&&((chang==3)||(chang==6)||(chang==8)||(chang==11)||[01;31m[K)[m[K(chang==1))
                                                                                                                                   [01;31m[K^[m[K
make[2]: *** [CMakeFiles/franka_example_controllers.dir/src/dual_arm_cartesian_impedance_example_controller.cpp.o] Error 1
make[1]: *** [CMakeFiles/franka_example_controllers.dir/all] Error 2
make: *** [all] Error 2
