In file included from [01m[K/home/nbenhabi/panda_ws/src/franka_ros/franka_example_controllers/src/force_example_controller.cpp:3:0[m[K:
[01m[K/home/nbenhabi/panda_ws/src/franka_ros/franka_example_controllers/include/franka_example_controllers/force_example_controller.h:80:20:[m[K [01;31m[Kerror: [m[Kredeclaration of ‘[01m[Kdouble franka_example_controllers::ForceExampleController::kpos1_[m[K’
   double kpos1_{0.0[01;31m[K}[m[K;
                    [01;31m[K^[m[K
In file included from [01m[K/home/nbenhabi/panda_ws/src/franka_ros/franka_example_controllers/src/force_example_controller.cpp:3:0[m[K:
[01m[K/home/nbenhabi/panda_ws/src/franka_ros/franka_example_controllers/include/franka_example_controllers/force_example_controller.h:62:101:[m[K [01;36m[Knote: [m[Kprevious declaration ‘[01m[Kdouble franka_example_controllers::ForceExampleController::kpos1_[m[K’
   double s1{0.18}, s2{0.0}, s3{-0.2}, s4{-0.4}, s5{0.2}, dec{0},s2_init{0.0},s3_init{0.0},kpos1_{0.0[01;36m[K}[m[K,kpos2_{0.0},kvel1_{0.0},kvel2_{0.0};
                                                                                                     [01;36m[K^[m[K
In file included from [01m[K/home/nbenhabi/panda_ws/src/franka_ros/franka_example_controllers/src/force_example_controller.cpp:3:0[m[K:
[01m[K/home/nbenhabi/panda_ws/src/franka_ros/franka_example_controllers/include/franka_example_controllers/force_example_controller.h:81:20:[m[K [01;31m[Kerror: [m[Kredeclaration of ‘[01m[Kdouble franka_example_controllers::ForceExampleController::kpos2_[m[K’
   double kpos2_{0.0[01;31m[K}[m[K;
                    [01;31m[K^[m[K
In file included from [01m[K/home/nbenhabi/panda_ws/src/franka_ros/franka_example_controllers/src/force_example_controller.cpp:3:0[m[K:
[01m[K/home/nbenhabi/panda_ws/src/franka_ros/franka_example_controllers/include/franka_example_controllers/force_example_controller.h:62:113:[m[K [01;36m[Knote: [m[Kprevious declaration ‘[01m[Kdouble franka_example_controllers::ForceExampleController::kpos2_[m[K’
   double s1{0.18}, s2{0.0}, s3{-0.2}, s4{-0.4}, s5{0.2}, dec{0},s2_init{0.0},s3_init{0.0},kpos1_{0.0},kpos2_{0.0[01;36m[K}[m[K,kvel1_{0.0},kvel2_{0.0};
                                                                                                                 [01;36m[K^[m[K
In file included from [01m[K/home/nbenhabi/panda_ws/src/franka_ros/franka_example_controllers/src/force_example_controller.cpp:3:0[m[K:
[01m[K/home/nbenhabi/panda_ws/src/franka_ros/franka_example_controllers/include/franka_example_controllers/force_example_controller.h:82:20:[m[K [01;31m[Kerror: [m[Kredeclaration of ‘[01m[Kdouble franka_example_controllers::ForceExampleController::kvel1_[m[K’
   double kvel1_{0.0[01;31m[K}[m[K;
                    [01;31m[K^[m[K
In file included from [01m[K/home/nbenhabi/panda_ws/src/franka_ros/franka_example_controllers/src/force_example_controller.cpp:3:0[m[K:
[01m[K/home/nbenhabi/panda_ws/src/franka_ros/franka_example_controllers/include/franka_example_controllers/force_example_controller.h:62:125:[m[K [01;36m[Knote: [m[Kprevious declaration ‘[01m[Kdouble franka_example_controllers::ForceExampleController::kvel1_[m[K’
   double s1{0.18}, s2{0.0}, s3{-0.2}, s4{-0.4}, s5{0.2}, dec{0},s2_init{0.0},s3_init{0.0},kpos1_{0.0},kpos2_{0.0},kvel1_{0.0[01;36m[K}[m[K,kvel2_{0.0};
                                                                                                                             [01;36m[K^[m[K
In file included from [01m[K/home/nbenhabi/panda_ws/src/franka_ros/franka_example_controllers/src/force_example_controller.cpp:3:0[m[K:
[01m[K/home/nbenhabi/panda_ws/src/franka_ros/franka_example_controllers/include/franka_example_controllers/force_example_controller.h:83:20:[m[K [01;31m[Kerror: [m[Kredeclaration of ‘[01m[Kdouble franka_example_controllers::ForceExampleController::kvel2_[m[K’
   double kvel2_{0.0[01;31m[K}[m[K;
                    [01;31m[K^[m[K
[01m[K/home/nbenhabi/panda_ws/src/franka_ros/franka_example_controllers/include/franka_example_controllers/force_example_controller.h:62:137:[m[K [01;36m[Knote: [m[Kprevious declaration ‘[01m[Kdouble franka_example_controllers::ForceExampleController::kvel2_[m[K’
   double s1{0.18}, s2{0.0}, s3{-0.2}, s4{-0.4}, s5{0.2}, dec{0},s2_init{0.0},s3_init{0.0},kpos1_{0.0},kpos2_{0.0},kvel1_{0.0},kvel2_{0.0[01;36m[K}[m[K;
                                                                                                                                         [01;36m[K^[m[K
In file included from [01m[K/home/nbenhabi/panda_ws/src/franka_ros/franka_example_controllers/src/cartesian_impedance_example_controller.cpp:4:0[m[K:
[01m[K/home/nbenhabi/panda_ws/src/franka_ros/franka_example_controllers/include/franka_example_controllers/force_example_controller.h:80:20:[m[K [01;31m[Kerror: [m[Kredeclaration of ‘[01m[Kdouble franka_example_controllers::ForceExampleController::kpos1_[m[K’
   double kpos1_{0.0[01;31m[K}[m[K;
                    [01;31m[K^[m[K
In file included from [01m[K/home/nbenhabi/panda_ws/src/franka_ros/franka_example_controllers/src/cartesian_impedance_example_controller.cpp:4:0[m[K:
[01m[K/home/nbenhabi/panda_ws/src/franka_ros/franka_example_controllers/include/franka_example_controllers/force_example_controller.h:62:101:[m[K [01;36m[Knote: [m[Kprevious declaration ‘[01m[Kdouble franka_example_controllers::ForceExampleController::kpos1_[m[K’
   double s1{0.18}, s2{0.0}, s3{-0.2}, s4{-0.4}, s5{0.2}, dec{0},s2_init{0.0},s3_init{0.0},kpos1_{0.0[01;36m[K}[m[K,kpos2_{0.0},kvel1_{0.0},kvel2_{0.0};
                                                                                                     [01;36m[K^[m[K
In file included from [01m[K/home/nbenhabi/panda_ws/src/franka_ros/franka_example_controllers/src/cartesian_impedance_example_controller.cpp:4:0[m[K:
[01m[K/home/nbenhabi/panda_ws/src/franka_ros/franka_example_controllers/include/franka_example_controllers/force_example_controller.h:81:20:[m[K [01;31m[Kerror: [m[Kredeclaration of ‘[01m[Kdouble franka_example_controllers::ForceExampleController::kpos2_[m[K’
   double kpos2_{0.0[01;31m[K}[m[K;
                    [01;31m[K^[m[K
In file included from [01m[K/home/nbenhabi/panda_ws/src/franka_ros/franka_example_controllers/src/cartesian_impedance_example_controller.cpp:4:0[m[K:
[01m[K/home/nbenhabi/panda_ws/src/franka_ros/franka_example_controllers/include/franka_example_controllers/force_example_controller.h:62:113:[m[K [01;36m[Knote: [m[Kprevious declaration ‘[01m[Kdouble franka_example_controllers::ForceExampleController::kpos2_[m[K’
   double s1{0.18}, s2{0.0}, s3{-0.2}, s4{-0.4}, s5{0.2}, dec{0},s2_init{0.0},s3_init{0.0},kpos1_{0.0},kpos2_{0.0[01;36m[K}[m[K,kvel1_{0.0},kvel2_{0.0};
                                                                                                                 [01;36m[K^[m[K
In file included from [01m[K/home/nbenhabi/panda_ws/src/franka_ros/franka_example_controllers/src/cartesian_impedance_example_controller.cpp:4:0[m[K:
[01m[K/home/nbenhabi/panda_ws/src/franka_ros/franka_example_controllers/include/franka_example_controllers/force_example_controller.h:82:20:[m[K [01;31m[Kerror: [m[Kredeclaration of ‘[01m[Kdouble franka_example_controllers::ForceExampleController::kvel1_[m[K’
   double kvel1_{0.0[01;31m[K}[m[K;
                    [01;31m[K^[m[K
In file included from [01m[K/home/nbenhabi/panda_ws/src/franka_ros/franka_example_controllers/src/cartesian_impedance_example_controller.cpp:4:0[m[K:
[01m[K/home/nbenhabi/panda_ws/src/franka_ros/franka_example_controllers/include/franka_example_controllers/force_example_controller.h:62:125:[m[K [01;36m[Knote: [m[Kprevious declaration ‘[01m[Kdouble franka_example_controllers::ForceExampleController::kvel1_[m[K’
   double s1{0.18}, s2{0.0}, s3{-0.2}, s4{-0.4}, s5{0.2}, dec{0},s2_init{0.0},s3_init{0.0},kpos1_{0.0},kpos2_{0.0},kvel1_{0.0[01;36m[K}[m[K,kvel2_{0.0};
                                                                                                                             [01;36m[K^[m[K
In file included from [01m[K/home/nbenhabi/panda_ws/src/franka_ros/franka_example_controllers/src/cartesian_impedance_example_controller.cpp:4:0[m[K:
[01m[K/home/nbenhabi/panda_ws/src/franka_ros/franka_example_controllers/include/franka_example_controllers/force_example_controller.h:83:20:[m[K [01;31m[Kerror: [m[Kredeclaration of ‘[01m[Kdouble franka_example_controllers::ForceExampleController::kvel2_[m[K’
   double kvel2_{0.0[01;31m[K}[m[K;
                    [01;31m[K^[m[K
[01m[K/home/nbenhabi/panda_ws/src/franka_ros/franka_example_controllers/include/franka_example_controllers/force_example_controller.h:62:137:[m[K [01;36m[Knote: [m[Kprevious declaration ‘[01m[Kdouble franka_example_controllers::ForceExampleController::kvel2_[m[K’
   double s1{0.18}, s2{0.0}, s3{-0.2}, s4{-0.4}, s5{0.2}, dec{0},s2_init{0.0},s3_init{0.0},kpos1_{0.0},kpos2_{0.0},kvel1_{0.0},kvel2_{0.0[01;36m[K}[m[K;
                                                                                                                                         [01;36m[K^[m[K
In file included from [01m[K/home/nbenhabi/panda_ws/src/franka_ros/franka_example_controllers/src/dual_arm_cartesian_impedance_example_controller.cpp:3:0[m[K:
[01m[K/home/nbenhabi/panda_ws/src/franka_ros/franka_example_controllers/include/franka_example_controllers/dual_arm_cartesian_impedance_example_controller.h:86:88:[m[K [01;31m[Kerror: [m[Kredeclaration of ‘[01m[Kdouble franka_example_controllers::DualArmCartesianImpedanceExampleController::filter_gain_[m[K’
         fx_node{0.0}, fy_node{0.0}, changing_{0},filter_gain_{0.01}, filter_gain_{0.01}[01;31m[K,[m[Kfilter_gain_vel_{0.001} ;
                                                                                        [01;31m[K^[m[K
[01m[K/home/nbenhabi/panda_ws/src/franka_ros/franka_example_controllers/include/franka_example_controllers/dual_arm_cartesian_impedance_example_controller.h:86:67:[m[K [01;36m[Knote: [m[Kprevious declaration ‘[01m[Kdouble franka_example_controllers::DualArmCartesianImpedanceExampleController::filter_gain_[m[K’
         fx_node{0.0}, fy_node{0.0}, changing_{0},filter_gain_{0.01[01;36m[K}[m[K, filter_gain_{0.01},filter_gain_vel_{0.001} ;
                                                                   [01;36m[K^[m[K
[01m[K/home/nbenhabi/panda_ws/src/franka_ros/franka_example_controllers/include/franka_example_controllers/dual_arm_cartesian_impedance_example_controller.h:100:10:[m[K [01;31m[Kerror: [m[Kinvalid use of ‘[01m[K::[m[K’
   Eigen::[01;31m[KVectorXd[m[K Kp_resp(7), Kp_act(7);
          [01;31m[K^~~~~~~~[m[K
[01m[K/home/nbenhabi/panda_ws/src/franka_ros/franka_example_controllers/include/franka_example_controllers/dual_arm_cartesian_impedance_example_controller.h:100:10:[m[K [01;31m[Kerror: [m[Kexpected ‘[01m[K;[m[K’ at end of member declaration
[01m[K/home/nbenhabi/panda_ws/src/franka_ros/franka_example_controllers/include/franka_example_controllers/dual_arm_cartesian_impedance_example_controller.h:100:27:[m[K [01;31m[Kerror: [m[Kexpected identifier before numeric constant
   Eigen::VectorXd Kp_resp([01;31m[K7[m[K), Kp_act(7);
                           [01;31m[K^[m[K
[01m[K/home/nbenhabi/panda_ws/src/franka_ros/franka_example_controllers/include/franka_example_controllers/dual_arm_cartesian_impedance_example_controller.h:100:27:[m[K [01;31m[Kerror: [m[Kexpected ‘[01m[K,[m[K’ or ‘[01m[K...[m[K’ before numeric constant
[01m[K/home/nbenhabi/panda_ws/src/franka_ros/franka_example_controllers/include/franka_example_controllers/dual_arm_cartesian_impedance_example_controller.h:100:28:[m[K [01;31m[Kerror: [m[KISO C++ forbids declaration of ‘[01m[KKp_resp[m[K’ with no type [[01;31m[K-fpermissive[m[K]
   Eigen::VectorXd Kp_resp(7[01;31m[K)[m[K, Kp_act(7);
                            [01;31m[K^[m[K
[01m[K/home/nbenhabi/panda_ws/src/franka_ros/franka_example_controllers/include/franka_example_controllers/dual_arm_cartesian_impedance_example_controller.h:100:38:[m[K [01;31m[Kerror: [m[Kexpected identifier before numeric constant
   Eigen::VectorXd Kp_resp(7), Kp_act([01;31m[K7[m[K);
                                      [01;31m[K^[m[K
[01m[K/home/nbenhabi/panda_ws/src/franka_ros/franka_example_controllers/include/franka_example_controllers/dual_arm_cartesian_impedance_example_controller.h:100:38:[m[K [01;31m[Kerror: [m[Kexpected ‘[01m[K,[m[K’ or ‘[01m[K...[m[K’ before numeric constant
[01m[K/home/nbenhabi/panda_ws/src/franka_ros/franka_example_controllers/include/franka_example_controllers/dual_arm_cartesian_impedance_example_controller.h:100:39:[m[K [01;31m[Kerror: [m[KISO C++ forbids declaration of ‘[01m[KKp_act[m[K’ with no type [[01;31m[K-fpermissive[m[K]
   Eigen::VectorXd Kp_resp(7), Kp_act(7[01;31m[K)[m[K;
                                       [01;31m[K^[m[K
[01m[K/home/nbenhabi/panda_ws/src/franka_ros/franka_example_controllers/src/dual_arm_cartesian_impedance_example_controller.cpp:[m[K In member function ‘[01m[Kvoid franka_example_controllers::DualArmCartesianImpedanceExampleController::startingArm(franka_example_controllers::FrankaDataContainer&)[m[K’:
[01m[K/home/nbenhabi/panda_ws/src/franka_ros/franka_example_controllers/src/dual_arm_cartesian_impedance_example_controller.cpp:247:3:[m[K [01;31m[Kerror: [m[Kinvalid use of member function ‘[01m[Kint franka_example_controllers::DualArmCartesianImpedanceExampleController::Kp_resp(int)[m[K’ (did you forget the ‘[01m[K()[m[K’ ?)
   [01;31m[KKp_resp[m[K << 0 , 0 , 0 , 0 , 0 , 0 , 0;
   [01;31m[K^~~~~~~[m[K
[01m[K/home/nbenhabi/panda_ws/src/franka_ros/franka_example_controllers/src/dual_arm_cartesian_impedance_example_controller.cpp:248:3:[m[K [01;31m[Kerror: [m[Kinvalid use of member function ‘[01m[Kint franka_example_controllers::DualArmCartesianImpedanceExampleController::Kp_act(int)[m[K’ (did you forget the ‘[01m[K()[m[K’ ?)
   [01;31m[KKp_act[m[K << 0 , 0 , 0 , 0 , 0 , 0 , 0;
   [01;31m[K^~~~~~[m[K
[01m[K/home/nbenhabi/panda_ws/src/franka_ros/franka_example_controllers/src/dual_arm_cartesian_impedance_example_controller.cpp:[m[K In member function ‘[01m[Kvirtual void franka_example_controllers::DualArmCartesianImpedanceExampleController::update(const ros::Time&, const ros::Duration&)[m[K’:
[01m[K/home/nbenhabi/panda_ws/src/franka_ros/franka_example_controllers/src/dual_arm_cartesian_impedance_example_controller.cpp:1557:128:[m[K [01;31m[Kerror: [m[Kinvalid use of member function ‘[01m[Kint franka_example_controllers::DualArmCartesianImpedanceExampleController::Kp_resp(int)[m[K’ (did you forget the ‘[01m[K()[m[K’ ?)
                                                                 Kp_resp = filter_gain_ * Kp_resp_target + (1 - filter_gain_) * [01;31m[KKp_resp[m[K;
                                                                                                                                [01;31m[K^~~~~~~[m[K
[01m[K/home/nbenhabi/panda_ws/src/franka_ros/franka_example_controllers/src/dual_arm_cartesian_impedance_example_controller.cpp:1560:98:[m[K [01;31m[Kerror: [m[K‘[01m[Kkpos1_[m[K’ was not declared in this scope
                                                                 desired_force_torque_right(0) = -[01;31m[Kkpos1_[m[K * error_right(0) -kvel1_ * v_right(0);
                                                                                                  [01;31m[K^~~~~~[m[K
[01m[K/home/nbenhabi/panda_ws/src/franka_ros/franka_example_controllers/src/dual_arm_cartesian_impedance_example_controller.cpp:1560:98:[m[K [01;36m[Knote: [m[Ksuggested alternative: ‘[01m[Kres1_[m[K’
                                                                 desired_force_torque_right(0) = -[01;36m[Kkpos1_[m[K * error_right(0) -kvel1_ * v_right(0);
                                                                                                  [01;36m[K^~~~~~[m[K
                                                                                                  [32m[Kres1_[m[K
[01m[K/home/nbenhabi/panda_ws/src/franka_ros/franka_example_controllers/src/dual_arm_cartesian_impedance_example_controller.cpp:1560:123:[m[K [01;31m[Kerror: [m[K‘[01m[Kkvel1_[m[K’ was not declared in this scope
                                                                 desired_force_torque_right(0) = -kpos1_ * error_right(0) -[01;31m[Kkvel1_[m[K * v_right(0);
                                                                                                                           [01;31m[K^~~~~~[m[K
[01m[K/home/nbenhabi/panda_ws/src/franka_ros/franka_example_controllers/src/dual_arm_cartesian_impedance_example_controller.cpp:1560:123:[m[K [01;36m[Knote: [m[Ksuggested alternative: ‘[01m[Kres1_[m[K’
                                                                 desired_force_torque_right(0) = -kpos1_ * error_right(0) -[01;36m[Kkvel1_[m[K * v_right(0);
                                                                                                                           [01;36m[K^~~~~~[m[K
                                                                                                                           [32m[Kres1_[m[K
[01m[K/home/nbenhabi/panda_ws/src/franka_ros/franka_example_controllers/src/dual_arm_cartesian_impedance_example_controller.cpp:1563:98:[m[K [01;31m[Kerror: [m[K‘[01m[Kkpos2_[m[K’ was not declared in this scope
                                                                 desired_force_torque_right(3) = -[01;31m[Kkpos2_[m[K * error_right(3) -kvel2_ * v_right(3);
                                                                                                  [01;31m[K^~~~~~[m[K
[01m[K/home/nbenhabi/panda_ws/src/franka_ros/franka_example_controllers/src/dual_arm_cartesian_impedance_example_controller.cpp:1563:98:[m[K [01;36m[Knote: [m[Ksuggested alternative: ‘[01m[Kres2_[m[K’
                                                                 desired_force_torque_right(3) = -[01;36m[Kkpos2_[m[K * error_right(3) -kvel2_ * v_right(3);
                                                                                                  [01;36m[K^~~~~~[m[K
                                                                                                  [32m[Kres2_[m[K
[01m[K/home/nbenhabi/panda_ws/src/franka_ros/franka_example_controllers/src/dual_arm_cartesian_impedance_example_controller.cpp:1563:123:[m[K [01;31m[Kerror: [m[K‘[01m[Kkvel2_[m[K’ was not declared in this scope
                                                                 desired_force_torque_right(3) = -kpos2_ * error_right(3) -[01;31m[Kkvel2_[m[K * v_right(3);
                                                                                                                           [01;31m[K^~~~~~[m[K
[01m[K/home/nbenhabi/panda_ws/src/franka_ros/franka_example_controllers/src/dual_arm_cartesian_impedance_example_controller.cpp:1563:123:[m[K [01;36m[Knote: [m[Ksuggested alternative: ‘[01m[Kres2_[m[K’
                                                                 desired_force_torque_right(3) = -kpos2_ * error_right(3) -[01;36m[Kkvel2_[m[K * v_right(3);
                                                                                                                           [01;36m[K^~~~~~[m[K
                                                                                                                           [32m[Kres2_[m[K
[01m[K/home/nbenhabi/panda_ws/src/franka_ros/franka_example_controllers/src/dual_arm_cartesian_impedance_example_controller.cpp:1574:98:[m[K [01;31m[Kerror: [m[K‘[01m[Kkpos1_[m[K’ was not declared in this scope
                                                                 desired_force_torque_right(1) = -[01;31m[Kkpos1_[m[K * error_right(1) -kvel1_ * v_right(1);
                                                                                                  [01;31m[K^~~~~~[m[K
[01m[K/home/nbenhabi/panda_ws/src/franka_ros/franka_example_controllers/src/dual_arm_cartesian_impedance_example_controller.cpp:1574:98:[m[K [01;36m[Knote: [m[Ksuggested alternative: ‘[01m[Kres1_[m[K’
                                                                 desired_force_torque_right(1) = -[01;36m[Kkpos1_[m[K * error_right(1) -kvel1_ * v_right(1);
                                                                                                  [01;36m[K^~~~~~[m[K
                                                                                                  [32m[Kres1_[m[K
[01m[K/home/nbenhabi/panda_ws/src/franka_ros/franka_example_controllers/src/dual_arm_cartesian_impedance_example_controller.cpp:1574:123:[m[K [01;31m[Kerror: [m[K‘[01m[Kkvel1_[m[K’ was not declared in this scope
                                                                 desired_force_torque_right(1) = -kpos1_ * error_right(1) -[01;31m[Kkvel1_[m[K * v_right(1);
                                                                                                                           [01;31m[K^~~~~~[m[K
[01m[K/home/nbenhabi/panda_ws/src/franka_ros/franka_example_controllers/src/dual_arm_cartesian_impedance_example_controller.cpp:1574:123:[m[K [01;36m[Knote: [m[Ksuggested alternative: ‘[01m[Kres1_[m[K’
                                                                 desired_force_torque_right(1) = -kpos1_ * error_right(1) -[01;36m[Kkvel1_[m[K * v_right(1);
                                                                                                                           [01;36m[K^~~~~~[m[K
                                                                                                                           [32m[Kres1_[m[K
[01m[K/home/nbenhabi/panda_ws/src/franka_ros/franka_example_controllers/src/dual_arm_cartesian_impedance_example_controller.cpp:1576:98:[m[K [01;31m[Kerror: [m[K‘[01m[Kkpos2_[m[K’ was not declared in this scope
                                                                 desired_force_torque_right(3) = -[01;31m[Kkpos2_[m[K * error_right(3) -kvel2_ * v_right(3);
                                                                                                  [01;31m[K^~~~~~[m[K
[01m[K/home/nbenhabi/panda_ws/src/franka_ros/franka_example_controllers/src/dual_arm_cartesian_impedance_example_controller.cpp:1576:98:[m[K [01;36m[Knote: [m[Ksuggested alternative: ‘[01m[Kres2_[m[K’
                                                                 desired_force_torque_right(3) = -[01;36m[Kkpos2_[m[K * error_right(3) -kvel2_ * v_right(3);
                                                                                                  [01;36m[K^~~~~~[m[K
                                                                                                  [32m[Kres2_[m[K
[01m[K/home/nbenhabi/panda_ws/src/franka_ros/franka_example_controllers/src/dual_arm_cartesian_impedance_example_controller.cpp:1576:123:[m[K [01;31m[Kerror: [m[K‘[01m[Kkvel2_[m[K’ was not declared in this scope
                                                                 desired_force_torque_right(3) = -kpos2_ * error_right(3) -[01;31m[Kkvel2_[m[K * v_right(3);
                                                                                                                           [01;31m[K^~~~~~[m[K
[01m[K/home/nbenhabi/panda_ws/src/franka_ros/franka_example_controllers/src/dual_arm_cartesian_impedance_example_controller.cpp:1576:123:[m[K [01;36m[Knote: [m[Ksuggested alternative: ‘[01m[Kres2_[m[K’
                                                                 desired_force_torque_right(3) = -kpos2_ * error_right(3) -[01;36m[Kkvel2_[m[K * v_right(3);
                                                                                                                           [01;36m[K^~~~~~[m[K
                                                                                                                           [32m[Kres2_[m[K
[01m[K/home/nbenhabi/panda_ws/src/franka_ros/franka_example_controllers/src/dual_arm_cartesian_impedance_example_controller.cpp:1587:98:[m[K [01;31m[Kerror: [m[K‘[01m[Kkpos1_[m[K’ was not declared in this scope
                                                                 desired_force_torque_right(2) = -[01;31m[Kkpos1_[m[K * error_right(2) -kvel1_ * v_right(2) ;
                                                                                                  [01;31m[K^~~~~~[m[K
[01m[K/home/nbenhabi/panda_ws/src/franka_ros/franka_example_controllers/src/dual_arm_cartesian_impedance_example_controller.cpp:1587:98:[m[K [01;36m[Knote: [m[Ksuggested alternative: ‘[01m[Kres1_[m[K’
                                                                 desired_force_torque_right(2) = -[01;36m[Kkpos1_[m[K * error_right(2) -kvel1_ * v_right(2) ;
                                                                                                  [01;36m[K^~~~~~[m[K
                                                                                                  [32m[Kres1_[m[K
[01m[K/home/nbenhabi/panda_ws/src/franka_ros/franka_example_controllers/src/dual_arm_cartesian_impedance_example_controller.cpp:1587:123:[m[K [01;31m[Kerror: [m[K‘[01m[Kkvel1_[m[K’ was not declared in this scope
                                                                 desired_force_torque_right(2) = -kpos1_ * error_right(2) -[01;31m[Kkvel1_[m[K * v_right(2) ;
                                                                                                                           [01;31m[K^~~~~~[m[K
[01m[K/home/nbenhabi/panda_ws/src/franka_ros/franka_example_controllers/src/dual_arm_cartesian_impedance_example_controller.cpp:1587:123:[m[K [01;36m[Knote: [m[Ksuggested alternative: ‘[01m[Kres1_[m[K’
                                                                 desired_force_torque_right(2) = -kpos1_ * error_right(2) -[01;36m[Kkvel1_[m[K * v_right(2) ;
                                                                                                                           [01;36m[K^~~~~~[m[K
                                                                                                                           [32m[Kres1_[m[K
make[2]: *** [CMakeFiles/franka_example_controllers.dir/src/force_example_controller.cpp.o] Error 1
make[2]: *** Waiting for unfinished jobs....
make[2]: *** [CMakeFiles/franka_example_controllers.dir/src/cartesian_impedance_example_controller.cpp.o] Error 1
make[2]: *** [CMakeFiles/franka_example_controllers.dir/src/dual_arm_cartesian_impedance_example_controller.cpp.o] Error 1
make[1]: *** [CMakeFiles/franka_example_controllers.dir/all] Error 2
make: *** [all] Error 2
