[  0%] Built target std_msgs_generate_messages_py
[  0%] Built target _skeleton_streamer_generate_messages_check_deps_SetNoisySkeletonDispersion
[  0%] Built target std_msgs_generate_messages_lisp
[  0%] Built target std_msgs_generate_messages_nodejs
[  0%] Built target std_msgs_generate_messages_cpp
[  0%] Built target std_msgs_generate_messages_eus
[ 20%] Built target skeleton_streamer_generate_messages_py
[ 30%] Built target skeleton_streamer_generate_messages_lisp
[ 40%] Built target skeleton_streamer_generate_messages_nodejs
[ 50%] Built target skeleton_streamer_generate_messages_cpp
[ 70%] Built target skeleton_streamer_generate_messages_eus
[ 70%] Built target skeleton_streamer_gencpp
[ 70%] Built target skeleton_streamer_generate_messages
[100%] Built target NoisySkeleton_node
