[01m[K/home/nbenhabi/panda_ws/src/franka_ros/franka_example_controllers/src/force_example_controller.cpp:[m[K In member function ‘[01m[Kvirtual void franka_example_controllers::ForceExampleController::update(const ros::Time&, const ros::Duration&)[m[K’:
[01m[K/home/nbenhabi/panda_ws/src/franka_ros/franka_example_controllers/src/force_example_controller.cpp:1008:12:[m[K [01;31m[Kerror: [m[K‘[01m[Kpi[m[K’ was not declared in this scope
   alpha << [01;31m[Kpi[m[K/2 , pi/2 , pi/2 , pi/2 , pi/2 , pi/2 , pi/2;
            [01;31m[K^~[m[K
[01m[K/home/nbenhabi/panda_ws/src/franka_ros/franka_example_controllers/src/force_example_controller.cpp:1022:5:[m[K [01;31m[Kerror: [m[K‘[01m[Ktau_0[m[K’ was not declared in this scope
     [01;31m[Ktau_0[m[K(i)=Kp(i)*((sin(alpha(i)*ros::Time::now())*qj_max(i)/cte)+qj_o(i)-q_j(i));
     [01;31m[K^~~~~[m[K
[01m[K/home/nbenhabi/panda_ws/src/franka_ros/franka_example_controllers/src/force_example_controller.cpp:1022:5:[m[K [01;36m[Knote: [m[Ksuggested alternative: ‘[01m[Ktau_o[m[K’
     [01;36m[Ktau_0[m[K(i)=Kp(i)*((sin(alpha(i)*ros::Time::now())*qj_max(i)/cte)+qj_o(i)-q_j(i));
     [01;36m[K^~~~~[m[K
     [32m[Ktau_o[m[K
[01m[K/home/nbenhabi/panda_ws/src/franka_ros/franka_example_controllers/src/force_example_controller.cpp:1022:14:[m[K [01;31m[Kerror: [m[K‘[01m[KKp[m[K’ was not declared in this scope
     tau_0(i)=[01;31m[KKp[m[K(i)*((sin(alpha(i)*ros::Time::now())*qj_max(i)/cte)+qj_o(i)-q_j(i));
              [01;31m[K^~[m[K
[01m[K/home/nbenhabi/panda_ws/src/franka_ros/franka_example_controllers/src/force_example_controller.cpp:1022:14:[m[K [01;36m[Knote: [m[Ksuggested alternative: ‘[01m[KK_p[m[K’
     tau_0(i)=[01;36m[KKp[m[K(i)*((sin(alpha(i)*ros::Time::now())*qj_max(i)/cte)+qj_o(i)-q_j(i));
              [01;36m[K^~[m[K
              [32m[KK_p[m[K
[01m[K/home/nbenhabi/panda_ws/src/franka_ros/franka_example_controllers/src/force_example_controller.cpp:1022:34:[m[K [01;31m[Kerror: [m[Kno match for ‘[01m[Koperator*[m[K’ (operand types are ‘[01m[KEigen::DenseCoeffsBase<Eigen::Matrix<double, 7, 1>, 1>::Scalar {aka double}[m[K’ and ‘[01m[Kros::Time[m[K’)
     tau_0(i)=Kp(i)*((sin([01;31m[Kalpha(i)*ros::Time::now()[m[K)*qj_max(i)/cte)+qj_o(i)-q_j(i));
                          [01;31m[K~~~~~~~~^~~~~~~~~~~~~~~~~[m[K
[01m[K/home/nbenhabi/panda_ws/src/franka_ros/franka_example_controllers/src/force_example_controller.cpp:1022:81:[m[K [01;31m[Kerror: [m[Kno match for call to ‘[01m[K(std::array<double, 7>) (int&)[m[K’
     tau_0(i)=Kp(i)*((sin(alpha(i)*ros::Time::now())*qj_max(i)/cte)+qj_o(i)-q_j(i[01;31m[K)[m[K);
                                                                                 [01;31m[K^[m[K
make[2]: *** [CMakeFiles/franka_example_controllers.dir/src/force_example_controller.cpp.o] Error 1
make[1]: *** [CMakeFiles/franka_example_controllers.dir/all] Error 2
make: *** [all] Error 2
