Linked: (/home/nbenhabi/panda_ws/devel/.private/franka_hw/lib/libfranka_control_services.so, /home/nbenhabi/panda_ws/devel/lib/libfranka_control_services.so)
Linked: (/home/nbenhabi/panda_ws/devel/.private/franka_hw/lib/libfranka_hw.so, /home/nbenhabi/panda_ws/devel/lib/libfranka_hw.so)
Linked: (/home/nbenhabi/panda_ws/devel/.private/franka_hw/lib/pkgconfig/franka_hw.pc, /home/nbenhabi/panda_ws/devel/lib/pkgconfig/franka_hw.pc)
Linked: (/home/nbenhabi/panda_ws/devel/.private/franka_hw/share/franka_hw/cmake/franka_hwConfig-version.cmake, /home/nbenhabi/panda_ws/devel/share/franka_hw/cmake/franka_hwConfig-version.cmake)
Linked: (/home/nbenhabi/panda_ws/devel/.private/franka_hw/share/franka_hw/cmake/franka_hwConfig.cmake, /home/nbenhabi/panda_ws/devel/share/franka_hw/cmake/franka_hwConfig.cmake)
