[01m[K/home/nbenhabi/panda_ws/src/franka_ros/franka_example_controllers/src/dual_arm_cartesian_impedance_example_controller.cpp:[m[K In member function ‘[01m[Kvirtual void franka_example_controllers::DualArmCartesianImpedanceExampleController::update(const ros::Time&, const ros::Duration&)[m[K’:
[01m[K/home/nbenhabi/panda_ws/src/franka_ros/franka_example_controllers/src/dual_arm_cartesian_impedance_example_controller.cpp:384:132:[m[K [01;31m[Kerror: [m[Kredeclaration of ‘[01m[KEigen::AngleAxisd error_quaternion_angle_axis_left[m[K’
                                                           Eigen::AngleAxisd error_quaternion_angle_axis_left(error_quaternion_right[01;31m[K)[m[K;
                                                                                                                                    [01;31m[K^[m[K
[01m[K/home/nbenhabi/panda_ws/src/franka_ros/franka_example_controllers/src/dual_arm_cartesian_impedance_example_controller.cpp:368:77:[m[K [01;36m[Knote: [m[K‘[01m[KEigen::AngleAxisd error_quaternion_angle_axis_left[m[K’ previously declared here
                                                           Eigen::AngleAxisd [01;36m[Kerror_quaternion_angle_axis_left[m[K(error_quaternion_left);
                                                                             [01;36m[K^~~~~~~~~~~~~~~~~~~~~~~~~~~~~~~~[m[K
[01m[K/home/nbenhabi/panda_ws/src/franka_ros/franka_example_controllers/src/dual_arm_cartesian_impedance_example_controller.cpp:386:82:[m[K [01;31m[Kerror: [m[K‘[01m[Kerror_quaternion_angle_axis_right[m[K’ was not declared in this scope
                                                           error_right.tail(3) << [01;31m[Kerror_quaternion_angle_axis_right[m[K.axis() * error_quaternion_angle_axis_right.angle();
                                                                                  [01;31m[K^~~~~~~~~~~~~~~~~~~~~~~~~~~~~~~~~[m[K
[01m[K/home/nbenhabi/panda_ws/src/franka_ros/franka_example_controllers/src/dual_arm_cartesian_impedance_example_controller.cpp:386:82:[m[K [01;36m[Knote: [m[Ksuggested alternative: ‘[01m[Kerror_quaternion_angle_axis_left[m[K’
                                                           error_right.tail(3) << [01;36m[Kerror_quaternion_angle_axis_right[m[K.axis() * error_quaternion_angle_axis_right.angle();
                                                                                  [01;36m[K^~~~~~~~~~~~~~~~~~~~~~~~~~~~~~~~~[m[K
                                                                                  [32m[Kerror_quaternion_angle_axis_left[m[K
[01m[K/home/nbenhabi/panda_ws/src/franka_ros/franka_example_controllers/src/dual_arm_cartesian_impedance_example_controller.cpp:410:59:[m[K [01;31m[Kerror: [m[Kexpected ‘[01m[K;[m[K’ before ‘[01m[Kdouble[m[K’
                                                           [01;31m[Kdouble[m[K kpos1_{100};
                                                           [01;31m[K^~~~~~[m[K
[01m[K/home/nbenhabi/panda_ws/src/franka_ros/franka_example_controllers/src/dual_arm_cartesian_impedance_example_controller.cpp:416:92:[m[K [01;31m[Kerror: [m[K‘[01m[Kkpos1_[m[K’ was not declared in this scope
                                                           desired_force_torque_right(0) = -[01;31m[Kkpos1_[m[K * error_right(0) ;
                                                                                            [01;31m[K^~~~~~[m[K
[01m[K/home/nbenhabi/panda_ws/src/franka_ros/franka_example_controllers/src/dual_arm_cartesian_impedance_example_controller.cpp:416:92:[m[K [01;36m[Knote: [m[Ksuggested alternative: ‘[01m[Kkpos2_[m[K’
                                                           desired_force_torque_right(0) = -[01;36m[Kkpos1_[m[K * error_right(0) ;
                                                                                            [01;36m[K^~~~~~[m[K
                                                                                            [32m[Kkpos2_[m[K
[01m[K/home/nbenhabi/panda_ws/src/franka_ros/franka_example_controllers/src/dual_arm_cartesian_impedance_example_controller.cpp:425:77:[m[K [01;31m[Kerror: [m[K‘[01m[Kjacobian[m[K’ was not declared in this scope
                                                           tau_task_right << [01;31m[Kjacobian[m[K.transpose() * desired_force_torque_right;
                                                                             [01;31m[K^~~~~~~~[m[K
make[2]: *** [CMakeFiles/franka_example_controllers.dir/src/dual_arm_cartesian_impedance_example_controller.cpp.o] Error 1
make[1]: *** [CMakeFiles/franka_example_controllers.dir/all] Error 2
make: *** [all] Error 2
