[01m[K/home/nbenhabi/panda_ws/src/franka_ros/franka_example_controllers/src/dual_arm_cartesian_impedance_example_controller.cpp:371:3:[m[K [01;31m[Kerror: [m[K‘[01m[Karm_data[m[K’ does not name a type; did you mean ‘[01m[Krandom_data[m[K’?
   [01;31m[Karm_data[m[K.cartesian_stiffness_ = arm_data.filter_params_ * arm_data.cartesian_stiffness_target_ +
   [01;31m[K^~~~~~~~[m[K
   [32m[Krandom_data[m[K
[01m[K/home/nbenhabi/panda_ws/src/franka_ros/franka_example_controllers/src/dual_arm_cartesian_impedance_example_controller.cpp:373:3:[m[K [01;31m[Kerror: [m[K‘[01m[Karm_data[m[K’ does not name a type; did you mean ‘[01m[Krandom_data[m[K’?
   [01;31m[Karm_data[m[K.cartesian_damping_ = arm_data.filter_params_ * arm_data.cartesian_damping_target_ +
   [01;31m[K^~~~~~~~[m[K
   [32m[Krandom_data[m[K
[01m[K/home/nbenhabi/panda_ws/src/franka_ros/franka_example_controllers/src/dual_arm_cartesian_impedance_example_controller.cpp:375:3:[m[K [01;31m[Kerror: [m[K‘[01m[Karm_data[m[K’ does not name a type; did you mean ‘[01m[Krandom_data[m[K’?
   [01;31m[Karm_data[m[K.nullspace_stiffness_ = arm_data.filter_params_ * arm_data.nullspace_stiffness_target_ +
   [01;31m[K^~~~~~~~[m[K
   [32m[Krandom_data[m[K
[01m[K/home/nbenhabi/panda_ws/src/franka_ros/franka_example_controllers/src/dual_arm_cartesian_impedance_example_controller.cpp:377:3:[m[K [01;31m[Kerror: [m[K‘[01m[Karm_data[m[K’ does not name a type; did you mean ‘[01m[Krandom_data[m[K’?
   [01;31m[Karm_data[m[K.position_d_ = arm_data.filter_params_ * arm_data.position_d_target_ +
   [01;31m[K^~~~~~~~[m[K
   [32m[Krandom_data[m[K
[01m[K/home/nbenhabi/panda_ws/src/franka_ros/franka_example_controllers/src/dual_arm_cartesian_impedance_example_controller.cpp:379:3:[m[K [01;31m[Kerror: [m[K‘[01m[Karm_data[m[K’ does not name a type; did you mean ‘[01m[Krandom_data[m[K’?
   [01;31m[Karm_data[m[K.orientation_d_ =
   [01;31m[K^~~~~~~~[m[K
   [32m[Krandom_data[m[K
[01m[K/home/nbenhabi/panda_ws/src/franka_ros/franka_example_controllers/src/dual_arm_cartesian_impedance_example_controller.cpp:383:29:[m[K [01;31m[Kerror: [m[K‘[01m[KDualArmCartesianImpedanceExampleController[m[K’ has not been declared
 Eigen::Matrix<double, 7, 1> [01;31m[KDualArmCartesianImpedanceExampleController[m[K::saturateTorqueRate(
                             [01;31m[K^~~~~~~~~~~~~~~~~~~~~~~~~~~~~~~~~~~~~~~~~~[m[K
[01m[K/home/nbenhabi/panda_ws/src/franka_ros/franka_example_controllers/src/dual_arm_cartesian_impedance_example_controller.cpp:384:11:[m[K [01;31m[Kerror: [m[K‘[01m[KFrankaDataContainer[m[K’ does not name a type
     const [01;31m[KFrankaDataContainer[m[K& arm_data,
           [01;31m[K^~~~~~~~~~~~~~~~~~~[m[K
[01m[K/home/nbenhabi/panda_ws/src/franka_ros/franka_example_controllers/src/dual_arm_cartesian_impedance_example_controller.cpp:[m[K In function ‘[01m[KEigen::Matrix<double, 7, 1> saturateTorqueRate(const int&, const Eigen::Matrix<double, 7, 1>&, const Eigen::Matrix<double, 7, 1>&)[m[K’:
[01m[K/home/nbenhabi/panda_ws/src/franka_ros/franka_example_controllers/src/dual_arm_cartesian_impedance_example_controller.cpp:390:78:[m[K [01;31m[Kerror: [m[Krequest for member ‘[01m[Kdelta_tau_max_[m[K’ in ‘[01m[Karm_data[m[K’, which is of non-class type ‘[01m[Kconst int[m[K’
     tau_d_saturated[i] = tau_J_d[i] + std::max(std::min(difference, arm_data.[01;31m[Kdelta_tau_max_[m[K),
                                                                              [01;31m[K^~~~~~~~~~~~~~[m[K
[01m[K/home/nbenhabi/panda_ws/src/franka_ros/franka_example_controllers/src/dual_arm_cartesian_impedance_example_controller.cpp:391:58:[m[K [01;31m[Kerror: [m[Krequest for member ‘[01m[Kdelta_tau_max_[m[K’ in ‘[01m[Karm_data[m[K’, which is of non-class type ‘[01m[Kconst int[m[K’
                                                -arm_data.[01;31m[Kdelta_tau_max_[m[K);
                                                          [01;31m[K^~~~~~~~~~~~~~[m[K
[01m[K/home/nbenhabi/panda_ws/src/franka_ros/franka_example_controllers/src/dual_arm_cartesian_impedance_example_controller.cpp:[m[K At global scope:
[01m[K/home/nbenhabi/panda_ws/src/franka_ros/franka_example_controllers/src/dual_arm_cartesian_impedance_example_controller.cpp:396:6:[m[K [01;31m[Kerror: [m[K‘[01m[KDualArmCartesianImpedanceExampleController[m[K’ has not been declared
 void [01;31m[KDualArmCartesianImpedanceExampleController[m[K::complianceParamCallback(
      [01;31m[K^~~~~~~~~~~~~~~~~~~~~~~~~~~~~~~~~~~~~~~~~~[m[K
[01m[K/home/nbenhabi/panda_ws/src/franka_ros/franka_example_controllers/src/dual_arm_cartesian_impedance_example_controller.cpp:[m[K In function ‘[01m[Kvoid complianceParamCallback(franka_combined_example_controllers::dual_arm_compliance_paramConfig&, uint32_t)[m[K’:
[01m[K/home/nbenhabi/panda_ws/src/franka_ros/franka_example_controllers/src/dual_arm_cartesian_impedance_example_controller.cpp:399:25:[m[K [01;31m[Kerror: [m[K‘[01m[Karms_data_[m[K’ was not declared in this scope
   auto& left_arm_data = [01;31m[Karms_data_[m[K.at(left_arm_id_);
                         [01;31m[K^~~~~~~~~~[m[K
[01m[K/home/nbenhabi/panda_ws/src/franka_ros/franka_example_controllers/src/dual_arm_cartesian_impedance_example_controller.cpp:399:39:[m[K [01;31m[Kerror: [m[K‘[01m[Kleft_arm_id_[m[K’ was not declared in this scope
   auto& left_arm_data = arms_data_.at([01;31m[Kleft_arm_id_[m[K);
                                       [01;31m[K^~~~~~~~~~~~[m[K
[01m[K/home/nbenhabi/panda_ws/src/franka_ros/franka_example_controllers/src/dual_arm_cartesian_impedance_example_controller.cpp:399:39:[m[K [01;36m[Knote: [m[Ksuggested alternative: ‘[01m[Kleft_arm_data[m[K’
   auto& left_arm_data = arms_data_.at([01;36m[Kleft_arm_id_[m[K);
                                       [01;36m[K^~~~~~~~~~~~[m[K
                                       [32m[Kleft_arm_data[m[K
[01m[K/home/nbenhabi/panda_ws/src/franka_ros/franka_example_controllers/src/dual_arm_cartesian_impedance_example_controller.cpp:413:40:[m[K [01;31m[Kerror: [m[K‘[01m[Kright_arm_id_[m[K’ was not declared in this scope
   auto& right_arm_data = arms_data_.at([01;31m[Kright_arm_id_[m[K);
                                        [01;31m[K^~~~~~~~~~~~~[m[K
[01m[K/home/nbenhabi/panda_ws/src/franka_ros/franka_example_controllers/src/dual_arm_cartesian_impedance_example_controller.cpp:413:40:[m[K [01;36m[Knote: [m[Ksuggested alternative: ‘[01m[Kright_arm_data[m[K’
   auto& right_arm_data = arms_data_.at([01;36m[Kright_arm_id_[m[K);
                                        [01;36m[K^~~~~~~~~~~~~[m[K
                                        [32m[Kright_arm_data[m[K
[01m[K/home/nbenhabi/panda_ws/src/franka_ros/franka_example_controllers/src/dual_arm_cartesian_impedance_example_controller.cpp:[m[K At global scope:
[01m[K/home/nbenhabi/panda_ws/src/franka_ros/franka_example_controllers/src/dual_arm_cartesian_impedance_example_controller.cpp:428:6:[m[K [01;31m[Kerror: [m[K‘[01m[KDualArmCartesianImpedanceExampleController[m[K’ has not been declared
 void [01;31m[KDualArmCartesianImpedanceExampleController[m[K::targetPoseCallback(
      [01;31m[K^~~~~~~~~~~~~~~~~~~~~~~~~~~~~~~~~~~~~~~~~~[m[K
[01m[K/home/nbenhabi/panda_ws/src/franka_ros/franka_example_controllers/src/dual_arm_cartesian_impedance_example_controller.cpp:[m[K In function ‘[01m[Kvoid targetPoseCallback(const ConstPtr&)[m[K’:
[01m[K/home/nbenhabi/panda_ws/src/franka_ros/franka_example_controllers/src/dual_arm_cartesian_impedance_example_controller.cpp:431:33:[m[K [01;31m[Kerror: [m[K‘[01m[Kleft_arm_id_[m[K’ was not declared in this scope
     if (msg->header.frame_id != [01;31m[Kleft_arm_id_[m[K + "_link0") {  // NOLINT
                                 [01;31m[K^~~~~~~~~~~~[m[K
[01m[K/home/nbenhabi/panda_ws/src/franka_ros/franka_example_controllers/src/dual_arm_cartesian_impedance_example_controller.cpp:440:27:[m[K [01;31m[Kerror: [m[K‘[01m[Karms_data_[m[K’ was not declared in this scope
     auto& left_arm_data = [01;31m[Karms_data_[m[K.at(left_arm_id_);
                           [01;31m[K^~~~~~~~~~[m[K
[01m[K/home/nbenhabi/panda_ws/src/franka_ros/franka_example_controllers/src/dual_arm_cartesian_impedance_example_controller.cpp:440:41:[m[K [01;31m[Kerror: [m[K‘[01m[Kleft_arm_id_[m[K’ was not declared in this scope
     auto& left_arm_data = arms_data_.at([01;31m[Kleft_arm_id_[m[K);
                                         [01;31m[K^~~~~~~~~~~~[m[K
[01m[K/home/nbenhabi/panda_ws/src/franka_ros/franka_example_controllers/src/dual_arm_cartesian_impedance_example_controller.cpp:440:41:[m[K [01;36m[Knote: [m[Ksuggested alternative: ‘[01m[Kleft_arm_data[m[K’
     auto& left_arm_data = arms_data_.at([01;36m[Kleft_arm_id_[m[K);
                                         [01;36m[K^~~~~~~~~~~~[m[K
                                         [32m[Kleft_arm_data[m[K
[01m[K/home/nbenhabi/panda_ws/src/franka_ros/franka_example_controllers/src/dual_arm_cartesian_impedance_example_controller.cpp:444:18:[m[K [01;31m[Kerror: [m[K‘[01m[KEEl_T_C_[m[K’ was not declared in this scope
         Ol_T_C * [01;31m[KEEl_T_C_[m[K.inverse();  // NOLINT (readability-identifier-naming)
                  [01;31m[K^~~~~~~~[m[K
[01m[K/home/nbenhabi/panda_ws/src/franka_ros/franka_example_controllers/src/dual_arm_cartesian_impedance_example_controller.cpp:444:18:[m[K [01;36m[Knote: [m[Ksuggested alternative: ‘[01m[KOl_T_C[m[K’
         Ol_T_C * [01;36m[KEEl_T_C_[m[K.inverse();  // NOLINT (readability-identifier-naming)
                  [01;36m[K^~~~~~~~[m[K
                  [32m[KOl_T_C[m[K
[01m[K/home/nbenhabi/panda_ws/src/franka_ros/franka_example_controllers/src/dual_arm_cartesian_impedance_example_controller.cpp:456:34:[m[K [01;31m[Kerror: [m[K‘[01m[KOl_T_Or_[m[K’ was not declared in this scope
     Eigen::Affine3d Or_T_EEr_d = [01;31m[KOl_T_Or_[m[K.inverse()     // NOLINT (readability-identifier-naming)
                                  [01;31m[K^~~~~~~~[m[K
[01m[K/home/nbenhabi/panda_ws/src/franka_ros/franka_example_controllers/src/dual_arm_cartesian_impedance_example_controller.cpp:456:34:[m[K [01;36m[Knote: [m[Ksuggested alternative: ‘[01m[KOl_T_C[m[K’
     Eigen::Affine3d Or_T_EEr_d = [01;36m[KOl_T_Or_[m[K.inverse()     // NOLINT (readability-identifier-naming)
                                  [01;36m[K^~~~~~~~[m[K
                                  [32m[KOl_T_C[m[K
[01m[K/home/nbenhabi/panda_ws/src/franka_ros/franka_example_controllers/src/dual_arm_cartesian_impedance_example_controller.cpp:458:34:[m[K [01;31m[Kerror: [m[K‘[01m[KEEr_T_EEl_[m[K’ was not declared in this scope
                                  [01;31m[KEEr_T_EEl_[m[K.inverse();  // NOLINT (readability-identifier-naming)
                                  [01;31m[K^~~~~~~~~~[m[K
[01m[K/home/nbenhabi/panda_ws/src/franka_ros/franka_example_controllers/src/dual_arm_cartesian_impedance_example_controller.cpp:458:34:[m[K [01;36m[Knote: [m[Ksuggested alternative: ‘[01m[KOr_T_EEr_d[m[K’
                                  [01;36m[KEEr_T_EEl_[m[K.inverse();  // NOLINT (readability-identifier-naming)
                                  [01;36m[K^~~~~~~~~~[m[K
                                  [32m[KOr_T_EEr_d[m[K
[01m[K/home/nbenhabi/panda_ws/src/franka_ros/franka_example_controllers/src/dual_arm_cartesian_impedance_example_controller.cpp:459:42:[m[K [01;31m[Kerror: [m[K‘[01m[Kright_arm_id_[m[K’ was not declared in this scope
     auto& right_arm_data = arms_data_.at([01;31m[Kright_arm_id_[m[K);
                                          [01;31m[K^~~~~~~~~~~~~[m[K
[01m[K/home/nbenhabi/panda_ws/src/franka_ros/franka_example_controllers/src/dual_arm_cartesian_impedance_example_controller.cpp:459:42:[m[K [01;36m[Knote: [m[Ksuggested alternative: ‘[01m[Kright_arm_data[m[K’
     auto& right_arm_data = arms_data_.at([01;36m[Kright_arm_id_[m[K);
                                          [01;36m[K^~~~~~~~~~~~~[m[K
                                          [32m[Kright_arm_data[m[K
[01m[K/home/nbenhabi/panda_ws/src/franka_ros/franka_example_controllers/src/dual_arm_cartesian_impedance_example_controller.cpp:[m[K At global scope:
[01m[K/home/nbenhabi/panda_ws/src/franka_ros/franka_example_controllers/src/dual_arm_cartesian_impedance_example_controller.cpp:476:6:[m[K [01;31m[Kerror: [m[K‘[01m[KDualArmCartesianImpedanceExampleController[m[K’ has not been declared
 void [01;31m[KDualArmCartesianImpedanceExampleController[m[K::publishCenteringPose() {
      [01;31m[K^~~~~~~~~~~~~~~~~~~~~~~~~~~~~~~~~~~~~~~~~~[m[K
[01m[K/home/nbenhabi/panda_ws/src/franka_ros/franka_example_controllers/src/dual_arm_cartesian_impedance_example_controller.cpp:[m[K In function ‘[01m[Kvoid publishCenteringPose()[m[K’:
[01m[K/home/nbenhabi/panda_ws/src/franka_ros/franka_example_controllers/src/dual_arm_cartesian_impedance_example_controller.cpp:477:7:[m[K [01;31m[Kerror: [m[K‘[01m[Kcenter_frame_pub_[m[K’ was not declared in this scope
   if ([01;31m[Kcenter_frame_pub_[m[K.trylock()) {
       [01;31m[K^~~~~~~~~~~~~~~~~[m[K
[01m[K/home/nbenhabi/panda_ws/src/franka_ros/franka_example_controllers/src/dual_arm_cartesian_impedance_example_controller.cpp:479:9:[m[K [01;31m[Kerror: [m[K‘[01m[Karms_data_[m[K’ was not declared in this scope
         [01;31m[Karms_data_[m[K.at(left_arm_id_).state_handle_->getRobotState();
         [01;31m[K^~~~~~~~~~[m[K
[01m[K/home/nbenhabi/panda_ws/src/franka_ros/franka_example_controllers/src/dual_arm_cartesian_impedance_example_controller.cpp:479:23:[m[K [01;31m[Kerror: [m[K‘[01m[Kleft_arm_id_[m[K’ was not declared in this scope
         arms_data_.at([01;31m[Kleft_arm_id_[m[K).state_handle_->getRobotState();
                       [01;31m[K^~~~~~~~~~~~[m[K
[01m[K/home/nbenhabi/panda_ws/src/franka_ros/franka_example_controllers/src/dual_arm_cartesian_impedance_example_controller.cpp:482:41:[m[K [01;31m[Kerror: [m[K‘[01m[KEEl_T_C_[m[K’ was not declared in this scope
     Eigen::Affine3d Ol_T_C = Ol_T_EEl * [01;31m[KEEl_T_C_[m[K;   // NOLINT (readability-identifier-naming)
                                         [01;31m[K^~~~~~~~[m[K
[01m[K/home/nbenhabi/panda_ws/src/franka_ros/franka_example_controllers/src/dual_arm_cartesian_impedance_example_controller.cpp:482:41:[m[K [01;36m[Knote: [m[Ksuggested alternative: ‘[01m[KOl_T_C[m[K’
     Eigen::Affine3d Ol_T_C = Ol_T_EEl * [01;36m[KEEl_T_C_[m[K;   // NOLINT (readability-identifier-naming)
                                         [01;36m[K^~~~~~~~[m[K
                                         [32m[KOl_T_C[m[K
[01m[K/home/nbenhabi/panda_ws/src/franka_ros/franka_example_controllers/src/dual_arm_cartesian_impedance_example_controller.cpp:[m[K At global scope:
[01m[K/home/nbenhabi/panda_ws/src/franka_ros/franka_example_controllers/src/dual_arm_cartesian_impedance_example_controller.cpp:489:1:[m[K [01;31m[Kerror: [m[Kexpected declaration before ‘[01m[K}[m[K’ token
 [01;31m[K}[m[K  // namespace franka_example_controllers
 [01;31m[K^[m[K
make[2]: *** [CMakeFiles/franka_example_controllers.dir/src/dual_arm_cartesian_impedance_example_controller.cpp.o] Error 1
make[1]: *** [CMakeFiles/franka_example_controllers.dir/all] Error 2
make: *** [all] Error 2
