In file included from [01m[K/home/nbenhabi/panda_ws/src/franka_ros/franka_example_controllers/src/woobot_qp_controller.cpp:2:0[m[K:
[01m[K/home/nbenhabi/panda_ws/src/franka_ros/franka_example_controllers/include/franka_example_controllers/woobot_qp_controller.h:96:27:[m[K [01;31m[Kerror: [m[Kexpected identifier before numeric constant
 Eigen::MatrixXd::Identity([01;31m[K3[m[K, 3) R;
                           [01;31m[K^[m[K
[01m[K/home/nbenhabi/panda_ws/src/franka_ros/franka_example_controllers/include/franka_example_controllers/woobot_qp_controller.h:96:27:[m[K [01;31m[Kerror: [m[Kexpected ‘[01m[K,[m[K’ or ‘[01m[K...[m[K’ before numeric constant
[01m[K/home/nbenhabi/panda_ws/src/franka_ros/franka_example_controllers/include/franka_example_controllers/woobot_qp_controller.h:96:31:[m[K [01;31m[Kerror: [m[KISO C++ forbids declaration of ‘[01m[KIdentity[m[K’ with no type [[01;31m[K-fpermissive[m[K]
 Eigen::MatrixXd::Identity(3, 3[01;31m[K)[m[K R;
                               [01;31m[K^[m[K
[01m[K/home/nbenhabi/panda_ws/src/franka_ros/franka_example_controllers/include/franka_example_controllers/woobot_qp_controller.h:96:31:[m[K [01;31m[Kerror: [m[Kcannot declare member function ‘[01m[KEigen::Matrix<double, -1, -1>::Identity[m[K’ within ‘[01m[Kfranka_example_controllers::WoobotQpController[m[K’
[01m[K/home/nbenhabi/panda_ws/src/franka_ros/franka_example_controllers/include/franka_example_controllers/woobot_qp_controller.h:96:31:[m[K [01;31m[Kerror: [m[Kexpected ‘[01m[K;[m[K’ at end of member declaration
[01m[K/home/nbenhabi/panda_ws/src/franka_ros/franka_example_controllers/include/franka_example_controllers/woobot_qp_controller.h:96:33:[m[K [01;31m[Kerror: [m[K‘[01m[KR[m[K’ does not name a type; did you mean ‘[01m[KRR[m[K’?
 Eigen::MatrixXd::Identity(3, 3) [01;31m[KR[m[K;
                                 [01;31m[K^[m[K
                                 [32m[KRR[m[K
make[2]: *** [CMakeFiles/franka_example_controllers.dir/src/woobot_qp_controller.cpp.o] Error 1
make[1]: *** [CMakeFiles/franka_example_controllers.dir/all] Error 2
make: *** [all] Error 2
