[01m[K/home/nbenhabi/panda_ws/src/franka_ros/franka_example_controllers/src/elbow_example_controller.cpp:[m[K In member function ‘[01m[Kvirtual void franka_example_controllers::ElbowExampleController::update(const ros::Time&, const ros::Duration&)[m[K’:
[01m[K/home/nbenhabi/panda_ws/src/franka_ros/franka_example_controllers/src/elbow_example_controller.cpp:1344:13:[m[K [01;31m[Kerror: [m[Kcase label ‘[01m[K27[m[K’ not within a switch statement
             [01;31m[Kcase[m[K 27:
             [01;31m[K^~~~[m[K
[01m[K/home/nbenhabi/panda_ws/src/franka_ros/franka_example_controllers/src/elbow_example_controller.cpp:1357:17:[m[K [01;31m[Kerror: [m[Kbreak statement not within loop or switch
                 [01;31m[Kbreak[m[K;
                 [01;31m[K^~~~~[m[K
[01m[K/home/nbenhabi/panda_ws/src/franka_ros/franka_example_controllers/src/elbow_example_controller.cpp:1360:13:[m[K [01;31m[Kerror: [m[Kcase label ‘[01m[K28[m[K’ not within a switch statement
             [01;31m[Kcase[m[K 28:
             [01;31m[K^~~~[m[K
[01m[K/home/nbenhabi/panda_ws/src/franka_ros/franka_example_controllers/src/elbow_example_controller.cpp:1373:17:[m[K [01;31m[Kerror: [m[Kbreak statement not within loop or switch
                 [01;31m[Kbreak[m[K;
                 [01;31m[K^~~~~[m[K
[01m[K/home/nbenhabi/panda_ws/src/franka_ros/franka_example_controllers/src/elbow_example_controller.cpp:1376:13:[m[K [01;31m[Kerror: [m[Kcase label ‘[01m[K29[m[K’ not within a switch statement
             [01;31m[Kcase[m[K 29:
             [01;31m[K^~~~[m[K
[01m[K/home/nbenhabi/panda_ws/src/franka_ros/franka_example_controllers/src/elbow_example_controller.cpp:1390:17:[m[K [01;31m[Kerror: [m[Kbreak statement not within loop or switch
                 [01;31m[Kbreak[m[K;
                 [01;31m[K^~~~~[m[K
[01m[K/home/nbenhabi/panda_ws/src/franka_ros/franka_example_controllers/src/elbow_example_controller.cpp:1393:13:[m[K [01;31m[Kerror: [m[Kcase label ‘[01m[K30[m[K’ not within a switch statement
             [01;31m[Kcase[m[K 30:
             [01;31m[K^~~~[m[K
[01m[K/home/nbenhabi/panda_ws/src/franka_ros/franka_example_controllers/src/elbow_example_controller.cpp:1407:17:[m[K [01;31m[Kerror: [m[Kbreak statement not within loop or switch
                 [01;31m[Kbreak[m[K;
                 [01;31m[K^~~~~[m[K
[01m[K/home/nbenhabi/panda_ws/src/franka_ros/franka_example_controllers/src/elbow_example_controller.cpp:1411:13:[m[K [01;31m[Kerror: [m[Kcase label ‘[01m[K31[m[K’ not within a switch statement
             [01;31m[Kcase[m[K 31:
             [01;31m[K^~~~[m[K
[01m[K/home/nbenhabi/panda_ws/src/franka_ros/franka_example_controllers/src/elbow_example_controller.cpp:1416:17:[m[K [01;31m[Kerror: [m[Kbreak statement not within loop or switch
                 [01;31m[Kbreak[m[K;
                 [01;31m[K^~~~~[m[K
[01m[K/home/nbenhabi/panda_ws/src/franka_ros/franka_example_controllers/src/elbow_example_controller.cpp:1419:13:[m[K [01;31m[Kerror: [m[Kcase label ‘[01m[K32[m[K’ not within a switch statement
             [01;31m[Kcase[m[K 32:
             [01;31m[K^~~~[m[K
[01m[K/home/nbenhabi/panda_ws/src/franka_ros/franka_example_controllers/src/elbow_example_controller.cpp:1424:17:[m[K [01;31m[Kerror: [m[Kbreak statement not within loop or switch
                 [01;31m[Kbreak[m[K;
                 [01;31m[K^~~~~[m[K
[01m[K/home/nbenhabi/panda_ws/src/franka_ros/franka_example_controllers/src/elbow_example_controller.cpp:1427:13:[m[K [01;31m[Kerror: [m[Kcase label ‘[01m[K33[m[K’ not within a switch statement
             [01;31m[Kcase[m[K 33:
             [01;31m[K^~~~[m[K
[01m[K/home/nbenhabi/panda_ws/src/franka_ros/franka_example_controllers/src/elbow_example_controller.cpp:1432:17:[m[K [01;31m[Kerror: [m[Kbreak statement not within loop or switch
                 [01;31m[Kbreak[m[K;
                 [01;31m[K^~~~~[m[K
[01m[K/home/nbenhabi/panda_ws/src/franka_ros/franka_example_controllers/src/elbow_example_controller.cpp:1435:13:[m[K [01;31m[Kerror: [m[Kcase label ‘[01m[K34[m[K’ not within a switch statement
             [01;31m[Kcase[m[K 34:
             [01;31m[K^~~~[m[K
[01m[K/home/nbenhabi/panda_ws/src/franka_ros/franka_example_controllers/src/elbow_example_controller.cpp:1440:17:[m[K [01;31m[Kerror: [m[Kbreak statement not within loop or switch
                 [01;31m[Kbreak[m[K;
                 [01;31m[K^~~~~[m[K
[01m[K/home/nbenhabi/panda_ws/src/franka_ros/franka_example_controllers/src/elbow_example_controller.cpp:1443:13:[m[K [01;31m[Kerror: [m[Kcase label ‘[01m[K35[m[K’ not within a switch statement
             [01;31m[Kcase[m[K 35:
             [01;31m[K^~~~[m[K
[01m[K/home/nbenhabi/panda_ws/src/franka_ros/franka_example_controllers/src/elbow_example_controller.cpp:1448:17:[m[K [01;31m[Kerror: [m[Kbreak statement not within loop or switch
                 [01;31m[Kbreak[m[K;
                 [01;31m[K^~~~~[m[K
[01m[K/home/nbenhabi/panda_ws/src/franka_ros/franka_example_controllers/src/elbow_example_controller.cpp:1451:13:[m[K [01;31m[Kerror: [m[Kcase label ‘[01m[K36[m[K’ not within a switch statement
             [01;31m[Kcase[m[K 36:
             [01;31m[K^~~~[m[K
[01m[K/home/nbenhabi/panda_ws/src/franka_ros/franka_example_controllers/src/elbow_example_controller.cpp:1456:17:[m[K [01;31m[Kerror: [m[Kbreak statement not within loop or switch
                 [01;31m[Kbreak[m[K;
                 [01;31m[K^~~~~[m[K
[01m[K/home/nbenhabi/panda_ws/src/franka_ros/franka_example_controllers/src/elbow_example_controller.cpp:1459:13:[m[K [01;31m[Kerror: [m[Kcase label ‘[01m[K37[m[K’ not within a switch statement
             [01;31m[Kcase[m[K 37:
             [01;31m[K^~~~[m[K
[01m[K/home/nbenhabi/panda_ws/src/franka_ros/franka_example_controllers/src/elbow_example_controller.cpp:1464:17:[m[K [01;31m[Kerror: [m[Kbreak statement not within loop or switch
                 [01;31m[Kbreak[m[K;
                 [01;31m[K^~~~~[m[K
[01m[K/home/nbenhabi/panda_ws/src/franka_ros/franka_example_controllers/src/elbow_example_controller.cpp:1467:13:[m[K [01;31m[Kerror: [m[Kcase label ‘[01m[K38[m[K’ not within a switch statement
             [01;31m[Kcase[m[K 38:
             [01;31m[K^~~~[m[K
[01m[K/home/nbenhabi/panda_ws/src/franka_ros/franka_example_controllers/src/elbow_example_controller.cpp:1472:17:[m[K [01;31m[Kerror: [m[Kbreak statement not within loop or switch
                 [01;31m[Kbreak[m[K;
                 [01;31m[K^~~~~[m[K
[01m[K/home/nbenhabi/panda_ws/src/franka_ros/franka_example_controllers/src/elbow_example_controller.cpp:1475:13:[m[K [01;31m[Kerror: [m[Kcase label ‘[01m[K39[m[K’ not within a switch statement
             [01;31m[Kcase[m[K 39:
             [01;31m[K^~~~[m[K
[01m[K/home/nbenhabi/panda_ws/src/franka_ros/franka_example_controllers/src/elbow_example_controller.cpp:1480:17:[m[K [01;31m[Kerror: [m[Kbreak statement not within loop or switch
                 [01;31m[Kbreak[m[K;
                 [01;31m[K^~~~~[m[K
[01m[K/home/nbenhabi/panda_ws/src/franka_ros/franka_example_controllers/src/elbow_example_controller.cpp:1483:13:[m[K [01;31m[Kerror: [m[Kcase label ‘[01m[K40[m[K’ not within a switch statement
             [01;31m[Kcase[m[K 40:
             [01;31m[K^~~~[m[K
[01m[K/home/nbenhabi/panda_ws/src/franka_ros/franka_example_controllers/src/elbow_example_controller.cpp:1488:17:[m[K [01;31m[Kerror: [m[Kbreak statement not within loop or switch
                 [01;31m[Kbreak[m[K;
                 [01;31m[K^~~~~[m[K
[01m[K/home/nbenhabi/panda_ws/src/franka_ros/franka_example_controllers/src/elbow_example_controller.cpp:1491:13:[m[K [01;31m[Kerror: [m[Kcase label ‘[01m[K41[m[K’ not within a switch statement
             [01;31m[Kcase[m[K 41:
             [01;31m[K^~~~[m[K
[01m[K/home/nbenhabi/panda_ws/src/franka_ros/franka_example_controllers/src/elbow_example_controller.cpp:1496:17:[m[K [01;31m[Kerror: [m[Kbreak statement not within loop or switch
                 [01;31m[Kbreak[m[K;
                 [01;31m[K^~~~~[m[K
[01m[K/home/nbenhabi/panda_ws/src/franka_ros/franka_example_controllers/src/elbow_example_controller.cpp:1499:13:[m[K [01;31m[Kerror: [m[Kcase label ‘[01m[K42[m[K’ not within a switch statement
             [01;31m[Kcase[m[K 42:
             [01;31m[K^~~~[m[K
[01m[K/home/nbenhabi/panda_ws/src/franka_ros/franka_example_controllers/src/elbow_example_controller.cpp:1504:17:[m[K [01;31m[Kerror: [m[Kbreak statement not within loop or switch
                 [01;31m[Kbreak[m[K;
                 [01;31m[K^~~~~[m[K
[01m[K/home/nbenhabi/panda_ws/src/franka_ros/franka_example_controllers/src/elbow_example_controller.cpp:1507:13:[m[K [01;31m[Kerror: [m[Kcase label ‘[01m[K43[m[K’ not within a switch statement
             [01;31m[Kcase[m[K 43:
             [01;31m[K^~~~[m[K
[01m[K/home/nbenhabi/panda_ws/src/franka_ros/franka_example_controllers/src/elbow_example_controller.cpp:1512:17:[m[K [01;31m[Kerror: [m[Kbreak statement not within loop or switch
                 [01;31m[Kbreak[m[K;
                 [01;31m[K^~~~~[m[K
[01m[K/home/nbenhabi/panda_ws/src/franka_ros/franka_example_controllers/src/elbow_example_controller.cpp:1515:13:[m[K [01;31m[Kerror: [m[Kcase label ‘[01m[K44[m[K’ not within a switch statement
             [01;31m[Kcase[m[K 44:
             [01;31m[K^~~~[m[K
[01m[K/home/nbenhabi/panda_ws/src/franka_ros/franka_example_controllers/src/elbow_example_controller.cpp:1520:17:[m[K [01;31m[Kerror: [m[Kbreak statement not within loop or switch
                 [01;31m[Kbreak[m[K;
                 [01;31m[K^~~~~[m[K
[01m[K/home/nbenhabi/panda_ws/src/franka_ros/franka_example_controllers/src/elbow_example_controller.cpp:1523:13:[m[K [01;31m[Kerror: [m[Kcase label ‘[01m[K45[m[K’ not within a switch statement
             [01;31m[Kcase[m[K 45:
             [01;31m[K^~~~[m[K
[01m[K/home/nbenhabi/panda_ws/src/franka_ros/franka_example_controllers/src/elbow_example_controller.cpp:1528:17:[m[K [01;31m[Kerror: [m[Kbreak statement not within loop or switch
                 [01;31m[Kbreak[m[K;
                 [01;31m[K^~~~~[m[K
[01m[K/home/nbenhabi/panda_ws/src/franka_ros/franka_example_controllers/src/elbow_example_controller.cpp:1532:13:[m[K [01;31m[Kerror: [m[Kcase label ‘[01m[K46[m[K’ not within a switch statement
             [01;31m[Kcase[m[K 46:
             [01;31m[K^~~~[m[K
[01m[K/home/nbenhabi/panda_ws/src/franka_ros/franka_example_controllers/src/elbow_example_controller.cpp:1537:17:[m[K [01;31m[Kerror: [m[Kbreak statement not within loop or switch
                 [01;31m[Kbreak[m[K;
                 [01;31m[K^~~~~[m[K
[01m[K/home/nbenhabi/panda_ws/src/franka_ros/franka_example_controllers/src/elbow_example_controller.cpp:1541:13:[m[K [01;31m[Kerror: [m[Kcase label ‘[01m[K47[m[K’ not within a switch statement
             [01;31m[Kcase[m[K 47:
             [01;31m[K^~~~[m[K
[01m[K/home/nbenhabi/panda_ws/src/franka_ros/franka_example_controllers/src/elbow_example_controller.cpp:1546:17:[m[K [01;31m[Kerror: [m[Kbreak statement not within loop or switch
                 [01;31m[Kbreak[m[K;
                 [01;31m[K^~~~~[m[K
[01m[K/home/nbenhabi/panda_ws/src/franka_ros/franka_example_controllers/src/elbow_example_controller.cpp:1549:13:[m[K [01;31m[Kerror: [m[Kcase label ‘[01m[K48[m[K’ not within a switch statement
             [01;31m[Kcase[m[K 48:
             [01;31m[K^~~~[m[K
[01m[K/home/nbenhabi/panda_ws/src/franka_ros/franka_example_controllers/src/elbow_example_controller.cpp:1554:17:[m[K [01;31m[Kerror: [m[Kbreak statement not within loop or switch
                 [01;31m[Kbreak[m[K;
                 [01;31m[K^~~~~[m[K
[01m[K/home/nbenhabi/panda_ws/src/franka_ros/franka_example_controllers/src/elbow_example_controller.cpp:1557:13:[m[K [01;31m[Kerror: [m[Kcase label ‘[01m[K49[m[K’ not within a switch statement
             [01;31m[Kcase[m[K 49:
             [01;31m[K^~~~[m[K
[01m[K/home/nbenhabi/panda_ws/src/franka_ros/franka_example_controllers/src/elbow_example_controller.cpp:1562:17:[m[K [01;31m[Kerror: [m[Kbreak statement not within loop or switch
                 [01;31m[Kbreak[m[K;
                 [01;31m[K^~~~~[m[K
[01m[K/home/nbenhabi/panda_ws/src/franka_ros/franka_example_controllers/src/elbow_example_controller.cpp:1565:13:[m[K [01;31m[Kerror: [m[Kcase label ‘[01m[K50[m[K’ not within a switch statement
             [01;31m[Kcase[m[K 50:
             [01;31m[K^~~~[m[K
[01m[K/home/nbenhabi/panda_ws/src/franka_ros/franka_example_controllers/src/elbow_example_controller.cpp:1570:17:[m[K [01;31m[Kerror: [m[Kbreak statement not within loop or switch
                 [01;31m[Kbreak[m[K;
                 [01;31m[K^~~~~[m[K
[01m[K/home/nbenhabi/panda_ws/src/franka_ros/franka_example_controllers/src/elbow_example_controller.cpp:1573:8:[m[K [01;31m[Kerror: [m[Kcase label not within a switch statement
        [01;31m[Kdefault[m[K:
        [01;31m[K^~~~~~~[m[K
[01m[K/home/nbenhabi/panda_ws/src/franka_ros/franka_example_controllers/src/elbow_example_controller.cpp:1577:12:[m[K [01;31m[Kerror: [m[Kbreak statement not within loop or switch
            [01;31m[Kbreak[m[K;
            [01;31m[K^~~~~[m[K
[01m[K/home/nbenhabi/panda_ws/src/franka_ros/franka_example_controllers/src/elbow_example_controller.cpp:[m[K At global scope:
[01m[K/home/nbenhabi/panda_ws/src/franka_ros/franka_example_controllers/src/elbow_example_controller.cpp:1584:5:[m[K [01;31m[Kerror: [m[Kexpected unqualified-id before ‘[01m[Kelse[m[K’
     [01;31m[Kelse[m[K
     [01;31m[K^~~~[m[K
[01m[K/home/nbenhabi/panda_ws/src/franka_ros/franka_example_controllers/src/elbow_example_controller.cpp:1590:5:[m[K [01;31m[Kerror: [m[Kexpected unqualified-id before ‘[01m[Kif[m[K’
     [01;31m[Kif[m[K ((phase>phase_max))
     [01;31m[K^~[m[K
[01m[K/home/nbenhabi/panda_ws/src/franka_ros/franka_example_controllers/src/elbow_example_controller.cpp:1598:5:[m[K [01;31m[Kerror: [m[K‘[01m[Ktau_reg[m[K’ does not name a type
     [01;31m[Ktau_reg[m[K.setZero();
     [01;31m[K^~~~~~~[m[K
[01m[K/home/nbenhabi/panda_ws/src/franka_ros/franka_example_controllers/src/elbow_example_controller.cpp:1600:12:[m[K [01;31m[Kerror: [m[Kexpected constructor, destructor, or type conversion before ‘[01m[K([m[K’ token
     tau_reg[01;31m[K([m[K1) = kp_reg * (  q_reg - q_measured(1)) -  (kd_reg * dq_measured(1)) ;
            [01;31m[K^[m[K
[01m[K/home/nbenhabi/panda_ws/src/franka_ros/franka_example_controllers/src/elbow_example_controller.cpp:1604:3:[m[K [01;31m[Kerror: [m[K‘[01m[Ktau_task[m[K’ does not name a type; did you mean ‘[01m[Kfd_mask[m[K’?
   [01;31m[Ktau_task[m[K << jacobian.transpose() * desired_force_torque ;
   [01;31m[K^~~~~~~~[m[K
   [32m[Kfd_mask[m[K
[01m[K/home/nbenhabi/panda_ws/src/franka_ros/franka_example_controllers/src/elbow_example_controller.cpp:1605:3:[m[K [01;31m[Kerror: [m[K‘[01m[Ktau_nullspace[m[K’ does not name a type
   [01;31m[Ktau_nullspace[m[K << (Eigen::MatrixXd::Identity(7, 7) -
   [01;31m[K^~~~~~~~~~~~~[m[K
[01m[K/home/nbenhabi/panda_ws/src/franka_ros/franka_example_controllers/src/elbow_example_controller.cpp:1611:3:[m[K [01;31m[Kerror: [m[K‘[01m[Ktau_cmd[m[K’ does not name a type
   [01;31m[Ktau_cmd[m[K =  tau_task + tau_nullspace  ;
   [01;31m[K^~~~~~~[m[K
[01m[K/home/nbenhabi/panda_ws/src/franka_ros/franka_example_controllers/src/elbow_example_controller.cpp:1615:3:[m[K [01;31m[Kerror: [m[Kexpected unqualified-id before ‘[01m[Kfor[m[K’
   [01;31m[Kfor[m[K (size_t i = 0; i < 7; ++i)
   [01;31m[K^~~[m[K
[01m[K/home/nbenhabi/panda_ws/src/franka_ros/franka_example_controllers/src/elbow_example_controller.cpp:1615:22:[m[K [01;31m[Kerror: [m[K‘[01m[Ki[m[K’ does not name a type
   for (size_t i = 0; [01;31m[Ki[m[K < 7; ++i)
                      [01;31m[K^[m[K
[01m[K/home/nbenhabi/panda_ws/src/franka_ros/franka_example_controllers/src/elbow_example_controller.cpp:1615:29:[m[K [01;31m[Kerror: [m[Kexpected unqualified-id before ‘[01m[K++[m[K’ token
   for (size_t i = 0; i < 7; [01;31m[K++[m[Ki)
                             [01;31m[K^~[m[K
[01m[K/home/nbenhabi/panda_ws/src/franka_ros/franka_example_controllers/src/elbow_example_controller.cpp:1627:1:[m[K [01;31m[Kerror: [m[Kexpected unqualified-id before ‘[01m[Kif[m[K’
 [01;31m[Kif[m[K (pose_publisher_.trylock()) {
 [01;31m[K^~[m[K
[01m[K/home/nbenhabi/panda_ws/src/franka_ros/franka_example_controllers/src/elbow_example_controller.cpp:1638:1:[m[K [01;31m[Kerror: [m[Kexpected unqualified-id before ‘[01m[Kif[m[K’
 [01;31m[Kif[m[K (twist_publisher_.trylock()) {
 [01;31m[K^~[m[K
[01m[K/home/nbenhabi/panda_ws/src/franka_ros/franka_example_controllers/src/elbow_example_controller.cpp:1660:5:[m[K [01;31m[Kerror: [m[Kexpected unqualified-id before ‘[01m[Kif[m[K’
     [01;31m[Kif[m[K ( (phase==1)&& (start_1==1) && start_record_publisher_.trylock()) {
     [01;31m[K^~[m[K
[01m[K/home/nbenhabi/panda_ws/src/franka_ros/franka_example_controllers/src/elbow_example_controller.cpp:1672:5:[m[K [01;31m[Kerror: [m[Kexpected unqualified-id before ‘[01m[Kif[m[K’
     [01;31m[Kif[m[K ( (phase==1) && (stop_1==1) &&  stop_record_publisher_.trylock()) {
     [01;31m[K^~[m[K
[01m[K/home/nbenhabi/panda_ws/src/franka_ros/franka_example_controllers/src/elbow_example_controller.cpp:1683:5:[m[K [01;31m[Kerror: [m[Kexpected unqualified-id before ‘[01m[Kif[m[K’
     [01;31m[Kif[m[K ( (phase==2)&& (start_2==1) && start_record_publisher_.trylock()) {
     [01;31m[K^~[m[K
[01m[K/home/nbenhabi/panda_ws/src/franka_ros/franka_example_controllers/src/elbow_example_controller.cpp:1694:5:[m[K [01;31m[Kerror: [m[Kexpected unqualified-id before ‘[01m[Kif[m[K’
     [01;31m[Kif[m[K ( (phase==2) && (stop_2==1) && stop_record_publisher_.trylock()) {
     [01;31m[K^~[m[K
[01m[K/home/nbenhabi/panda_ws/src/franka_ros/franka_example_controllers/src/elbow_example_controller.cpp:1705:5:[m[K [01;31m[Kerror: [m[Kexpected unqualified-id before ‘[01m[Kif[m[K’
     [01;31m[Kif[m[K ( (phase==3)&& (start_3==1) && start_record_publisher_.trylock()) {
     [01;31m[K^~[m[K
[01m[K/home/nbenhabi/panda_ws/src/franka_ros/franka_example_controllers/src/elbow_example_controller.cpp:1716:5:[m[K [01;31m[Kerror: [m[Kexpected unqualified-id before ‘[01m[Kif[m[K’
     [01;31m[Kif[m[K ( (phase==3) && (stop_3==1) && stop_record_publisher_.trylock()) {
     [01;31m[K^~[m[K
[01m[K/home/nbenhabi/panda_ws/src/franka_ros/franka_example_controllers/src/elbow_example_controller.cpp:1726:5:[m[K [01;31m[Kerror: [m[Kexpected unqualified-id before ‘[01m[Kif[m[K’
     [01;31m[Kif[m[K ( (phase==4)&& (start_4==1) && start_record_publisher_.trylock()) {
     [01;31m[K^~[m[K
[01m[K/home/nbenhabi/panda_ws/src/franka_ros/franka_example_controllers/src/elbow_example_controller.cpp:1737:5:[m[K [01;31m[Kerror: [m[Kexpected unqualified-id before ‘[01m[Kif[m[K’
     [01;31m[Kif[m[K ( (phase==4) && (stop_4==1) && stop_record_publisher_.trylock()) {
     [01;31m[K^~[m[K
[01m[K/home/nbenhabi/panda_ws/src/franka_ros/franka_example_controllers/src/elbow_example_controller.cpp:1746:5:[m[K [01;31m[Kerror: [m[Kexpected unqualified-id before ‘[01m[Kif[m[K’
     [01;31m[Kif[m[K ( (phase==5)&& (start_5==1) && start_record_publisher_.trylock()) {
     [01;31m[K^~[m[K
[01m[K/home/nbenhabi/panda_ws/src/franka_ros/franka_example_controllers/src/elbow_example_controller.cpp:1757:5:[m[K [01;31m[Kerror: [m[Kexpected unqualified-id before ‘[01m[Kif[m[K’
     [01;31m[Kif[m[K ( (phase==5) && (stop_5==1) && rate_trigger_() && stop_record_publisher_.trylock()) {
     [01;31m[K^~[m[K
[01m[K/home/nbenhabi/panda_ws/src/franka_ros/franka_example_controllers/src/elbow_example_controller.cpp:1770:7:[m[K [01;31m[Kerror: [m[Kexpected unqualified-id before ‘[01m[Kif[m[K’
       [01;31m[Kif[m[K ( (phase==6)&& (start_6==1) && start_record_publisher_.trylock()) {
       [01;31m[K^~[m[K
[01m[K/home/nbenhabi/panda_ws/src/franka_ros/franka_example_controllers/src/elbow_example_controller.cpp:1782:7:[m[K [01;31m[Kerror: [m[Kexpected unqualified-id before ‘[01m[Kif[m[K’
       [01;31m[Kif[m[K ( (phase==6) && (stop_6==1) &&  stop_record_publisher_.trylock()) {
       [01;31m[K^~[m[K
[01m[K/home/nbenhabi/panda_ws/src/franka_ros/franka_example_controllers/src/elbow_example_controller.cpp:1793:7:[m[K [01;31m[Kerror: [m[Kexpected unqualified-id before ‘[01m[Kif[m[K’
       [01;31m[Kif[m[K ( (phase==7)&& (start_7==1) && start_record_publisher_.trylock()) {
       [01;31m[K^~[m[K
[01m[K/home/nbenhabi/panda_ws/src/franka_ros/franka_example_controllers/src/elbow_example_controller.cpp:1804:7:[m[K [01;31m[Kerror: [m[Kexpected unqualified-id before ‘[01m[Kif[m[K’
       [01;31m[Kif[m[K ( (phase==7) && (stop_7==1) && stop_record_publisher_.trylock()) {
       [01;31m[K^~[m[K
[01m[K/home/nbenhabi/panda_ws/src/franka_ros/franka_example_controllers/src/elbow_example_controller.cpp:1815:7:[m[K [01;31m[Kerror: [m[Kexpected unqualified-id before ‘[01m[Kif[m[K’
       [01;31m[Kif[m[K ( (phase==8)&& (start_8==1) && start_record_publisher_.trylock()) {
       [01;31m[K^~[m[K
[01m[K/home/nbenhabi/panda_ws/src/franka_ros/franka_example_controllers/src/elbow_example_controller.cpp:1826:7:[m[K [01;31m[Kerror: [m[Kexpected unqualified-id before ‘[01m[Kif[m[K’
       [01;31m[Kif[m[K ( (phase==8) && (stop_8==1) && stop_record_publisher_.trylock()) {
       [01;31m[K^~[m[K
[01m[K/home/nbenhabi/panda_ws/src/franka_ros/franka_example_controllers/src/elbow_example_controller.cpp:1836:7:[m[K [01;31m[Kerror: [m[Kexpected unqualified-id before ‘[01m[Kif[m[K’
       [01;31m[Kif[m[K ( (phase==9)&& (start_9==1) && start_record_publisher_.trylock()) {
       [01;31m[K^~[m[K
[01m[K/home/nbenhabi/panda_ws/src/franka_ros/franka_example_controllers/src/elbow_example_controller.cpp:1847:7:[m[K [01;31m[Kerror: [m[Kexpected unqualified-id before ‘[01m[Kif[m[K’
       [01;31m[Kif[m[K ( (phase==9) && (stop_9==1) && stop_record_publisher_.trylock()) {
       [01;31m[K^~[m[K
[01m[K/home/nbenhabi/panda_ws/src/franka_ros/franka_example_controllers/src/elbow_example_controller.cpp:1856:7:[m[K [01;31m[Kerror: [m[Kexpected unqualified-id before ‘[01m[Kif[m[K’
       [01;31m[Kif[m[K ( (phase==10)&& (start_10==1) && start_record_publisher_.trylock()) {
       [01;31m[K^~[m[K
[01m[K/home/nbenhabi/panda_ws/src/franka_ros/franka_example_controllers/src/elbow_example_controller.cpp:1867:7:[m[K [01;31m[Kerror: [m[Kexpected unqualified-id before ‘[01m[Kif[m[K’
       [01;31m[Kif[m[K ( (phase==10) && (stop_10==1) && rate_trigger_() && stop_record_publisher_.trylock()) {
       [01;31m[K^~[m[K
[01m[K/home/nbenhabi/panda_ws/src/franka_ros/franka_example_controllers/src/elbow_example_controller.cpp:1878:9:[m[K [01;31m[Kerror: [m[Kexpected unqualified-id before ‘[01m[Kif[m[K’
         [01;31m[Kif[m[K ( (phase==11)&& (start_11==1) && start_record_publisher_.trylock()) {
         [01;31m[K^~[m[K
[01m[K/home/nbenhabi/panda_ws/src/franka_ros/franka_example_controllers/src/elbow_example_controller.cpp:1890:9:[m[K [01;31m[Kerror: [m[Kexpected unqualified-id before ‘[01m[Kif[m[K’
         [01;31m[Kif[m[K ( (phase==11) && (stop_11==1) &&  stop_record_publisher_.trylock()) {
         [01;31m[K^~[m[K
[01m[K/home/nbenhabi/panda_ws/src/franka_ros/franka_example_controllers/src/elbow_example_controller.cpp:1901:9:[m[K [01;31m[Kerror: [m[Kexpected unqualified-id before ‘[01m[Kif[m[K’
         [01;31m[Kif[m[K ( (phase==12)&& (start_12==1) && start_record_publisher_.trylock()) {
         [01;31m[K^~[m[K
[01m[K/home/nbenhabi/panda_ws/src/franka_ros/franka_example_controllers/src/elbow_example_controller.cpp:1912:9:[m[K [01;31m[Kerror: [m[Kexpected unqualified-id before ‘[01m[Kif[m[K’
         [01;31m[Kif[m[K ( (phase==12) && (stop_12==1) && stop_record_publisher_.trylock()) {
         [01;31m[K^~[m[K
[01m[K/home/nbenhabi/panda_ws/src/franka_ros/franka_example_controllers/src/elbow_example_controller.cpp:1923:9:[m[K [01;31m[Kerror: [m[Kexpected unqualified-id before ‘[01m[Kif[m[K’
         [01;31m[Kif[m[K ( (phase==13)&& (start_13==1) && start_record_publisher_.trylock()) {
         [01;31m[K^~[m[K
[01m[K/home/nbenhabi/panda_ws/src/franka_ros/franka_example_controllers/src/elbow_example_controller.cpp:1934:9:[m[K [01;31m[Kerror: [m[Kexpected unqualified-id before ‘[01m[Kif[m[K’
         [01;31m[Kif[m[K ( (phase==13) && (stop_13==1) && stop_record_publisher_.trylock()) {
         [01;31m[K^~[m[K
[01m[K/home/nbenhabi/panda_ws/src/franka_ros/franka_example_controllers/src/elbow_example_controller.cpp:1944:9:[m[K [01;31m[Kerror: [m[Kexpected unqualified-id before ‘[01m[Kif[m[K’
         [01;31m[Kif[m[K ( (phase==14)&& (start_14==1) && start_record_publisher_.trylock()) {
         [01;31m[K^~[m[K
[01m[K/home/nbenhabi/panda_ws/src/franka_ros/franka_example_controllers/src/elbow_example_controller.cpp:1955:9:[m[K [01;31m[Kerror: [m[Kexpected unqualified-id before ‘[01m[Kif[m[K’
         [01;31m[Kif[m[K ( (phase==14) && (stop_14==1) && stop_record_publisher_.trylock()) {
         [01;31m[K^~[m[K
[01m[K/home/nbenhabi/panda_ws/src/franka_ros/franka_example_controllers/src/elbow_example_controller.cpp:1964:9:[m[K [01;31m[Kerror: [m[Kexpected unqualified-id before ‘[01m[Kif[m[K’
         [01;31m[Kif[m[K ( (phase==15)&& (start_15==1) && start_record_publisher_.trylock()) {
         [01;31m[K^~[m[K
[01m[K/home/nbenhabi/panda_ws/src/franka_ros/franka_example_controllers/src/elbow_example_controller.cpp:1975:9:[m[K [01;31m[Kerror: [m[Kexpected unqualified-id before ‘[01m[Kif[m[K’
         [01;31m[Kif[m[K ( (phase==15) && (stop_15==1) && rate_trigger_() && stop_record_publisher_.trylock()) {
         [01;31m[K^~[m[K
[01m[K/home/nbenhabi/panda_ws/src/franka_ros/franka_example_controllers/src/elbow_example_controller.cpp:1987:11:[m[K [01;31m[Kerror: [m[Kexpected unqualified-id before ‘[01m[Kif[m[K’
           [01;31m[Kif[m[K ( (phase==16)&& (start_16==1) && start_record_publisher_.trylock()) {
           [01;31m[K^~[m[K
[01m[K/home/nbenhabi/panda_ws/src/franka_ros/franka_example_controllers/src/elbow_example_controller.cpp:1999:11:[m[K [01;31m[Kerror: [m[Kexpected unqualified-id before ‘[01m[Kif[m[K’
           [01;31m[Kif[m[K ( (phase==16) && (stop_16==1) &&  stop_record_publisher_.trylock()) {
           [01;31m[K^~[m[K
[01m[K/home/nbenhabi/panda_ws/src/franka_ros/franka_example_controllers/src/elbow_example_controller.cpp:2010:11:[m[K [01;31m[Kerror: [m[Kexpected unqualified-id before ‘[01m[Kif[m[K’
           [01;31m[Kif[m[K ( (phase==17)&& (start_17==1) && start_record_publisher_.trylock()) {
           [01;31m[K^~[m[K
[01m[K/home/nbenhabi/panda_ws/src/franka_ros/franka_example_controllers/src/elbow_example_controller.cpp:2021:11:[m[K [01;31m[Kerror: [m[Kexpected unqualified-id before ‘[01m[Kif[m[K’
           [01;31m[Kif[m[K ( (phase==17) && (stop_17==1) && stop_record_publisher_.trylock()) {
           [01;31m[K^~[m[K
[01m[K/home/nbenhabi/panda_ws/src/franka_ros/franka_example_controllers/src/elbow_example_controller.cpp:2032:11:[m[K [01;31m[Kerror: [m[Kexpected unqualified-id before ‘[01m[Kif[m[K’
           [01;31m[Kif[m[K ( (phase==18)&& (start_18==1) && start_record_publisher_.trylock()) {
           [01;31m[K^~[m[K
[01m[K/home/nbenhabi/panda_ws/src/franka_ros/franka_example_controllers/src/elbow_example_controller.cpp:2043:11:[m[K [01;31m[Kerror: [m[Kexpected unqualified-id before ‘[01m[Kif[m[K’
           [01;31m[Kif[m[K ( (phase==18) && (stop_18==1) && stop_record_publisher_.trylock()) {
           [01;31m[K^~[m[K
[01m[K/home/nbenhabi/panda_ws/src/franka_ros/franka_example_controllers/src/elbow_example_controller.cpp:2053:11:[m[K [01;31m[Kerror: [m[Kexpected unqualified-id before ‘[01m[Kif[m[K’
           [01;31m[Kif[m[K ( (phase==19)&& (start_19==1) && start_record_publisher_.trylock()) {
           [01;31m[K^~[m[K
[01m[K/home/nbenhabi/panda_ws/src/franka_ros/franka_example_controllers/src/elbow_example_controller.cpp:2064:11:[m[K [01;31m[Kerror: [m[Kexpected unqualified-id before ‘[01m[Kif[m[K’
           [01;31m[Kif[m[K ( (phase==19) && (stop_19==1) && stop_record_publisher_.trylock()) {
           [01;31m[K^~[m[K
[01m[K/home/nbenhabi/panda_ws/src/franka_ros/franka_example_controllers/src/elbow_example_controller.cpp:2073:11:[m[K [01;31m[Kerror: [m[Kexpected unqualified-id before ‘[01m[Kif[m[K’
           [01;31m[Kif[m[K ( (phase==20)&& (start_20==1) && start_record_publisher_.trylock()) {
           [01;31m[K^~[m[K
[01m[K/home/nbenhabi/panda_ws/src/franka_ros/franka_example_controllers/src/elbow_example_controller.cpp:2084:11:[m[K [01;31m[Kerror: [m[Kexpected unqualified-id before ‘[01m[Kif[m[K’
           [01;31m[Kif[m[K ( (phase==20) && (stop_20==1) && rate_trigger_() && stop_record_publisher_.trylock()) {
           [01;31m[K^~[m[K
[01m[K/home/nbenhabi/panda_ws/src/franka_ros/franka_example_controllers/src/elbow_example_controller.cpp:2097:13:[m[K [01;31m[Kerror: [m[Kexpected unqualified-id before ‘[01m[Kif[m[K’
             [01;31m[Kif[m[K ( (phase==21)&& (start_21==1) && start_record_publisher_.trylock()) {
             [01;31m[K^~[m[K
[01m[K/home/nbenhabi/panda_ws/src/franka_ros/franka_example_controllers/src/elbow_example_controller.cpp:2109:13:[m[K [01;31m[Kerror: [m[Kexpected unqualified-id before ‘[01m[Kif[m[K’
             [01;31m[Kif[m[K ( (phase==21) && (stop_21==1) &&  stop_record_publisher_.trylock()) {
             [01;31m[K^~[m[K
[01m[K/home/nbenhabi/panda_ws/src/franka_ros/franka_example_controllers/src/elbow_example_controller.cpp:2120:13:[m[K [01;31m[Kerror: [m[Kexpected unqualified-id before ‘[01m[Kif[m[K’
             [01;31m[Kif[m[K ( (phase==22)&& (start_22==1) && start_record_publisher_.trylock()) {
             [01;31m[K^~[m[K
[01m[K/home/nbenhabi/panda_ws/src/franka_ros/franka_example_controllers/src/elbow_example_controller.cpp:2131:13:[m[K [01;31m[Kerror: [m[Kexpected unqualified-id before ‘[01m[Kif[m[K’
             [01;31m[Kif[m[K ( (phase==22) && (stop_22==1) && stop_record_publisher_.trylock()) {
             [01;31m[K^~[m[K
[01m[K/home/nbenhabi/panda_ws/src/franka_ros/franka_example_controllers/src/elbow_example_controller.cpp:2142:13:[m[K [01;31m[Kerror: [m[Kexpected unqualified-id before ‘[01m[Kif[m[K’
             [01;31m[Kif[m[K ( (phase==23)&& (start_23==1) && start_record_publisher_.trylock()) {
             [01;31m[K^~[m[K
[01m[K/home/nbenhabi/panda_ws/src/franka_ros/franka_example_controllers/src/elbow_example_controller.cpp:2153:13:[m[K [01;31m[Kerror: [m[Kexpected unqualified-id before ‘[01m[Kif[m[K’
             [01;31m[Kif[m[K ( (phase==23) && (stop_23==1) && stop_record_publisher_.trylock()) {
             [01;31m[K^~[m[K
[01m[K/home/nbenhabi/panda_ws/src/franka_ros/franka_example_controllers/src/elbow_example_controller.cpp:2163:13:[m[K [01;31m[Kerror: [m[Kexpected unqualified-id before ‘[01m[Kif[m[K’
             [01;31m[Kif[m[K ( (phase==24)&& (start_24==1) && start_record_publisher_.trylock()) {
             [01;31m[K^~[m[K
[01m[K/home/nbenhabi/panda_ws/src/franka_ros/franka_example_controllers/src/elbow_example_controller.cpp:2174:13:[m[K [01;31m[Kerror: [m[Kexpected unqualified-id before ‘[01m[Kif[m[K’
             [01;31m[Kif[m[K ( (phase==24) && (stop_24==1) && stop_record_publisher_.trylock()) {
             [01;31m[K^~[m[K
[01m[K/home/nbenhabi/panda_ws/src/franka_ros/franka_example_controllers/src/elbow_example_controller.cpp:2183:13:[m[K [01;31m[Kerror: [m[Kexpected unqualified-id before ‘[01m[Kif[m[K’
             [01;31m[Kif[m[K ( (phase==25)&& (start_25==1) && start_record_publisher_.trylock()) {
             [01;31m[K^~[m[K
[01m[K/home/nbenhabi/panda_ws/src/franka_ros/franka_example_controllers/src/elbow_example_controller.cpp:2194:13:[m[K [01;31m[Kerror: [m[Kexpected unqualified-id before ‘[01m[Kif[m[K’
             [01;31m[Kif[m[K ( (phase==25) && (stop_25==1) && rate_trigger_() && stop_record_publisher_.trylock()) {
             [01;31m[K^~[m[K
[01m[K/home/nbenhabi/panda_ws/src/franka_ros/franka_example_controllers/src/elbow_example_controller.cpp:2206:15:[m[K [01;31m[Kerror: [m[Kexpected unqualified-id before ‘[01m[Kif[m[K’
               [01;31m[Kif[m[K ( (phase==26)&& (start_26==1) && start_record_publisher_.trylock()) {
               [01;31m[K^~[m[K
[01m[K/home/nbenhabi/panda_ws/src/franka_ros/franka_example_controllers/src/elbow_example_controller.cpp:2218:15:[m[K [01;31m[Kerror: [m[Kexpected unqualified-id before ‘[01m[Kif[m[K’
               [01;31m[Kif[m[K ( (phase==26) && (stop_26==1) &&  stop_record_publisher_.trylock()) {
               [01;31m[K^~[m[K
[01m[K/home/nbenhabi/panda_ws/src/franka_ros/franka_example_controllers/src/elbow_example_controller.cpp:2229:15:[m[K [01;31m[Kerror: [m[Kexpected unqualified-id before ‘[01m[Kif[m[K’
               [01;31m[Kif[m[K ( (phase==27)&& (start_27==1) && start_record_publisher_.trylock()) {
               [01;31m[K^~[m[K
[01m[K/home/nbenhabi/panda_ws/src/franka_ros/franka_example_controllers/src/elbow_example_controller.cpp:2240:15:[m[K [01;31m[Kerror: [m[Kexpected unqualified-id before ‘[01m[Kif[m[K’
               [01;31m[Kif[m[K ( (phase==27) && (stop_27==1) && stop_record_publisher_.trylock()) {
               [01;31m[K^~[m[K
[01m[K/home/nbenhabi/panda_ws/src/franka_ros/franka_example_controllers/src/elbow_example_controller.cpp:2251:15:[m[K [01;31m[Kerror: [m[Kexpected unqualified-id before ‘[01m[Kif[m[K’
               [01;31m[Kif[m[K ( (phase==28)&& (start_28==1) && start_record_publisher_.trylock()) {
               [01;31m[K^~[m[K
[01m[K/home/nbenhabi/panda_ws/src/franka_ros/franka_example_controllers/src/elbow_example_controller.cpp:2262:15:[m[K [01;31m[Kerror: [m[Kexpected unqualified-id before ‘[01m[Kif[m[K’
               [01;31m[Kif[m[K ( (phase==28) && (stop_28==1) && stop_record_publisher_.trylock()) {
               [01;31m[K^~[m[K
[01m[K/home/nbenhabi/panda_ws/src/franka_ros/franka_example_controllers/src/elbow_example_controller.cpp:2272:15:[m[K [01;31m[Kerror: [m[Kexpected unqualified-id before ‘[01m[Kif[m[K’
               [01;31m[Kif[m[K ( (phase==29)&& (start_29==1) && start_record_publisher_.trylock()) {
               [01;31m[K^~[m[K
[01m[K/home/nbenhabi/panda_ws/src/franka_ros/franka_example_controllers/src/elbow_example_controller.cpp:2283:15:[m[K [01;31m[Kerror: [m[Kexpected unqualified-id before ‘[01m[Kif[m[K’
               [01;31m[Kif[m[K ( (phase==29) && (stop_29==1) && stop_record_publisher_.trylock()) {
               [01;31m[K^~[m[K
[01m[K/home/nbenhabi/panda_ws/src/franka_ros/franka_example_controllers/src/elbow_example_controller.cpp:2292:15:[m[K [01;31m[Kerror: [m[Kexpected unqualified-id before ‘[01m[Kif[m[K’
               [01;31m[Kif[m[K ( (phase==30)&& (start_30==1) && start_record_publisher_.trylock()) {
               [01;31m[K^~[m[K
[01m[K/home/nbenhabi/panda_ws/src/franka_ros/franka_example_controllers/src/elbow_example_controller.cpp:2303:15:[m[K [01;31m[Kerror: [m[Kexpected unqualified-id before ‘[01m[Kif[m[K’
               [01;31m[Kif[m[K ( (phase==30) && (stop_30==1) && rate_trigger_() && stop_record_publisher_.trylock()) {
               [01;31m[K^~[m[K
[01m[K/home/nbenhabi/panda_ws/src/franka_ros/franka_example_controllers/src/elbow_example_controller.cpp:2315:17:[m[K [01;31m[Kerror: [m[Kexpected unqualified-id before ‘[01m[Kif[m[K’
                 [01;31m[Kif[m[K ( (phase==31)&& (start_31==1) && start_record_publisher_.trylock()) {
                 [01;31m[K^~[m[K
[01m[K/home/nbenhabi/panda_ws/src/franka_ros/franka_example_controllers/src/elbow_example_controller.cpp:2327:17:[m[K [01;31m[Kerror: [m[Kexpected unqualified-id before ‘[01m[Kif[m[K’
                 [01;31m[Kif[m[K ( (phase==31) && (stop_31==1) &&  stop_record_publisher_.trylock()) {
                 [01;31m[K^~[m[K
[01m[K/home/nbenhabi/panda_ws/src/franka_ros/franka_example_controllers/src/elbow_example_controller.cpp:2338:17:[m[K [01;31m[Kerror: [m[Kexpected unqualified-id before ‘[01m[Kif[m[K’
                 [01;31m[Kif[m[K ( (phase==32)&& (start_32==1) && start_record_publisher_.trylock()) {
                 [01;31m[K^~[m[K
[01m[K/home/nbenhabi/panda_ws/src/franka_ros/franka_example_controllers/src/elbow_example_controller.cpp:2349:17:[m[K [01;31m[Kerror: [m[Kexpected unqualified-id before ‘[01m[Kif[m[K’
                 [01;31m[Kif[m[K ( (phase==32) && (stop_32==1) && stop_record_publisher_.trylock()) {
                 [01;31m[K^~[m[K
[01m[K/home/nbenhabi/panda_ws/src/franka_ros/franka_example_controllers/src/elbow_example_controller.cpp:2360:17:[m[K [01;31m[Kerror: [m[Kexpected unqualified-id before ‘[01m[Kif[m[K’
                 [01;31m[Kif[m[K ( (phase==33)&& (start_33==1) && start_record_publisher_.trylock()) {
                 [01;31m[K^~[m[K
[01m[K/home/nbenhabi/panda_ws/src/franka_ros/franka_example_controllers/src/elbow_example_controller.cpp:2371:17:[m[K [01;31m[Kerror: [m[Kexpected unqualified-id before ‘[01m[Kif[m[K’
                 [01;31m[Kif[m[K ( (phase==33) && (stop_33==1) && stop_record_publisher_.trylock()) {
                 [01;31m[K^~[m[K
[01m[K/home/nbenhabi/panda_ws/src/franka_ros/franka_example_controllers/src/elbow_example_controller.cpp:2381:17:[m[K [01;31m[Kerror: [m[Kexpected unqualified-id before ‘[01m[Kif[m[K’
                 [01;31m[Kif[m[K ( (phase==34)&& (start_34==1) && start_record_publisher_.trylock()) {
                 [01;31m[K^~[m[K
[01m[K/home/nbenhabi/panda_ws/src/franka_ros/franka_example_controllers/src/elbow_example_controller.cpp:2392:17:[m[K [01;31m[Kerror: [m[Kexpected unqualified-id before ‘[01m[Kif[m[K’
                 [01;31m[Kif[m[K ( (phase==34) && (stop_34==1) && stop_record_publisher_.trylock()) {
                 [01;31m[K^~[m[K
[01m[K/home/nbenhabi/panda_ws/src/franka_ros/franka_example_controllers/src/elbow_example_controller.cpp:2401:17:[m[K [01;31m[Kerror: [m[Kexpected unqualified-id before ‘[01m[Kif[m[K’
                 [01;31m[Kif[m[K ( (phase==35)&& (start_35==1) && start_record_publisher_.trylock()) {
                 [01;31m[K^~[m[K
[01m[K/home/nbenhabi/panda_ws/src/franka_ros/franka_example_controllers/src/elbow_example_controller.cpp:2412:17:[m[K [01;31m[Kerror: [m[Kexpected unqualified-id before ‘[01m[Kif[m[K’
                 [01;31m[Kif[m[K ( (phase==35) && (stop_35==1) && rate_trigger_() && stop_record_publisher_.trylock()) {
                 [01;31m[K^~[m[K
[01m[K/home/nbenhabi/panda_ws/src/franka_ros/franka_example_controllers/src/elbow_example_controller.cpp:2424:19:[m[K [01;31m[Kerror: [m[Kexpected unqualified-id before ‘[01m[Kif[m[K’
                   [01;31m[Kif[m[K ( (phase==36)&& (start_36==1) && start_record_publisher_.trylock()) {
                   [01;31m[K^~[m[K
[01m[K/home/nbenhabi/panda_ws/src/franka_ros/franka_example_controllers/src/elbow_example_controller.cpp:2436:19:[m[K [01;31m[Kerror: [m[Kexpected unqualified-id before ‘[01m[Kif[m[K’
                   [01;31m[Kif[m[K ( (phase==36) && (stop_36==1) &&  stop_record_publisher_.trylock()) {
                   [01;31m[K^~[m[K
[01m[K/home/nbenhabi/panda_ws/src/franka_ros/franka_example_controllers/src/elbow_example_controller.cpp:2447:19:[m[K [01;31m[Kerror: [m[Kexpected unqualified-id before ‘[01m[Kif[m[K’
                   [01;31m[Kif[m[K ( (phase==37)&& (start_37==1) && start_record_publisher_.trylock()) {
                   [01;31m[K^~[m[K
[01m[K/home/nbenhabi/panda_ws/src/franka_ros/franka_example_controllers/src/elbow_example_controller.cpp:2458:19:[m[K [01;31m[Kerror: [m[Kexpected unqualified-id before ‘[01m[Kif[m[K’
                   [01;31m[Kif[m[K ( (phase==37) && (stop_37==1) && stop_record_publisher_.trylock()) {
                   [01;31m[K^~[m[K
[01m[K/home/nbenhabi/panda_ws/src/franka_ros/franka_example_controllers/src/elbow_example_controller.cpp:2469:19:[m[K [01;31m[Kerror: [m[Kexpected unqualified-id before ‘[01m[Kif[m[K’
                   [01;31m[Kif[m[K ( (phase==38)&& (start_38==1) && start_record_publisher_.trylock()) {
                   [01;31m[K^~[m[K
[01m[K/home/nbenhabi/panda_ws/src/franka_ros/franka_example_controllers/src/elbow_example_controller.cpp:2480:19:[m[K [01;31m[Kerror: [m[Kexpected unqualified-id before ‘[01m[Kif[m[K’
                   [01;31m[Kif[m[K ( (phase==38) && (stop_38==1) && stop_record_publisher_.trylock()) {
                   [01;31m[K^~[m[K
[01m[K/home/nbenhabi/panda_ws/src/franka_ros/franka_example_controllers/src/elbow_example_controller.cpp:2490:19:[m[K [01;31m[Kerror: [m[Kexpected unqualified-id before ‘[01m[Kif[m[K’
                   [01;31m[Kif[m[K ( (phase==39)&& (start_39==1) && start_record_publisher_.trylock()) {
                   [01;31m[K^~[m[K
[01m[K/home/nbenhabi/panda_ws/src/franka_ros/franka_example_controllers/src/elbow_example_controller.cpp:2501:19:[m[K [01;31m[Kerror: [m[Kexpected unqualified-id before ‘[01m[Kif[m[K’
                   [01;31m[Kif[m[K ( (phase==39) && (stop_39==1) && stop_record_publisher_.trylock()) {
                   [01;31m[K^~[m[K
[01m[K/home/nbenhabi/panda_ws/src/franka_ros/franka_example_controllers/src/elbow_example_controller.cpp:2510:19:[m[K [01;31m[Kerror: [m[Kexpected unqualified-id before ‘[01m[Kif[m[K’
                   [01;31m[Kif[m[K ( (phase==40)&& (start_40==1) && start_record_publisher_.trylock()) {
                   [01;31m[K^~[m[K
[01m[K/home/nbenhabi/panda_ws/src/franka_ros/franka_example_controllers/src/elbow_example_controller.cpp:2521:19:[m[K [01;31m[Kerror: [m[Kexpected unqualified-id before ‘[01m[Kif[m[K’
                   [01;31m[Kif[m[K ( (phase==40) && (stop_40==1) && rate_trigger_() && stop_record_publisher_.trylock()) {
                   [01;31m[K^~[m[K
[01m[K/home/nbenhabi/panda_ws/src/franka_ros/franka_example_controllers/src/elbow_example_controller.cpp:2534:21:[m[K [01;31m[Kerror: [m[Kexpected unqualified-id before ‘[01m[Kif[m[K’
                     [01;31m[Kif[m[K ( (phase==41)&& (start_41==1) && start_record_publisher_.trylock()) {
                     [01;31m[K^~[m[K
[01m[K/home/nbenhabi/panda_ws/src/franka_ros/franka_example_controllers/src/elbow_example_controller.cpp:2546:21:[m[K [01;31m[Kerror: [m[Kexpected unqualified-id before ‘[01m[Kif[m[K’
                     [01;31m[Kif[m[K ( (phase==41) && (stop_41==1) &&  stop_record_publisher_.trylock()) {
                     [01;31m[K^~[m[K
[01m[K/home/nbenhabi/panda_ws/src/franka_ros/franka_example_controllers/src/elbow_example_controller.cpp:2557:21:[m[K [01;31m[Kerror: [m[Kexpected unqualified-id before ‘[01m[Kif[m[K’
                     [01;31m[Kif[m[K ( (phase==42)&& (start_42==1) && start_record_publisher_.trylock()) {
                     [01;31m[K^~[m[K
[01m[K/home/nbenhabi/panda_ws/src/franka_ros/franka_example_controllers/src/elbow_example_controller.cpp:2568:21:[m[K [01;31m[Kerror: [m[Kexpected unqualified-id before ‘[01m[Kif[m[K’
                     [01;31m[Kif[m[K ( (phase==42) && (stop_42==1) && stop_record_publisher_.trylock()) {
                     [01;31m[K^~[m[K
[01m[K/home/nbenhabi/panda_ws/src/franka_ros/franka_example_controllers/src/elbow_example_controller.cpp:2579:21:[m[K [01;31m[Kerror: [m[Kexpected unqualified-id before ‘[01m[Kif[m[K’
                     [01;31m[Kif[m[K ( (phase==43)&& (start_43==1) && start_record_publisher_.trylock()) {
                     [01;31m[K^~[m[K
[01m[K/home/nbenhabi/panda_ws/src/franka_ros/franka_example_controllers/src/elbow_example_controller.cpp:2590:21:[m[K [01;31m[Kerror: [m[Kexpected unqualified-id before ‘[01m[Kif[m[K’
                     [01;31m[Kif[m[K ( (phase==43) && (stop_43==1) && stop_record_publisher_.trylock()) {
                     [01;31m[K^~[m[K
[01m[K/home/nbenhabi/panda_ws/src/franka_ros/franka_example_controllers/src/elbow_example_controller.cpp:2600:21:[m[K [01;31m[Kerror: [m[Kexpected unqualified-id before ‘[01m[Kif[m[K’
                     [01;31m[Kif[m[K ( (phase==44)&& (start_44==1) && start_record_publisher_.trylock()) {
                     [01;31m[K^~[m[K
[01m[K/home/nbenhabi/panda_ws/src/franka_ros/franka_example_controllers/src/elbow_example_controller.cpp:2611:21:[m[K [01;31m[Kerror: [m[Kexpected unqualified-id before ‘[01m[Kif[m[K’
                     [01;31m[Kif[m[K ( (phase==44) && (stop_44==1) && stop_record_publisher_.trylock()) {
                     [01;31m[K^~[m[K
[01m[K/home/nbenhabi/panda_ws/src/franka_ros/franka_example_controllers/src/elbow_example_controller.cpp:2620:21:[m[K [01;31m[Kerror: [m[Kexpected unqualified-id before ‘[01m[Kif[m[K’
                     [01;31m[Kif[m[K ( (phase==45)&& (start_45==1) && start_record_publisher_.trylock()) {
                     [01;31m[K^~[m[K
[01m[K/home/nbenhabi/panda_ws/src/franka_ros/franka_example_controllers/src/elbow_example_controller.cpp:2631:21:[m[K [01;31m[Kerror: [m[Kexpected unqualified-id before ‘[01m[Kif[m[K’
                     [01;31m[Kif[m[K ( (phase==45) && (stop_45==1) && rate_trigger_() && stop_record_publisher_.trylock()) {
                     [01;31m[K^~[m[K
[01m[K/home/nbenhabi/panda_ws/src/franka_ros/franka_example_controllers/src/elbow_example_controller.cpp:2643:23:[m[K [01;31m[Kerror: [m[Kexpected unqualified-id before ‘[01m[Kif[m[K’
                       [01;31m[Kif[m[K ( (phase==46)&& (start_46==1) && start_record_publisher_.trylock()) {
                       [01;31m[K^~[m[K
[01m[K/home/nbenhabi/panda_ws/src/franka_ros/franka_example_controllers/src/elbow_example_controller.cpp:2655:23:[m[K [01;31m[Kerror: [m[Kexpected unqualified-id before ‘[01m[Kif[m[K’
                       [01;31m[Kif[m[K ( (phase==46) && (stop_46==1) &&  stop_record_publisher_.trylock()) {
                       [01;31m[K^~[m[K
[01m[K/home/nbenhabi/panda_ws/src/franka_ros/franka_example_controllers/src/elbow_example_controller.cpp:2666:23:[m[K [01;31m[Kerror: [m[Kexpected unqualified-id before ‘[01m[Kif[m[K’
                       [01;31m[Kif[m[K ( (phase==47)&& (start_47==1) && start_record_publisher_.trylock()) {
                       [01;31m[K^~[m[K
[01m[K/home/nbenhabi/panda_ws/src/franka_ros/franka_example_controllers/src/elbow_example_controller.cpp:2677:23:[m[K [01;31m[Kerror: [m[Kexpected unqualified-id before ‘[01m[Kif[m[K’
                       [01;31m[Kif[m[K ( (phase==47) && (stop_47==1) && stop_record_publisher_.trylock()) {
                       [01;31m[K^~[m[K
[01m[K/home/nbenhabi/panda_ws/src/franka_ros/franka_example_controllers/src/elbow_example_controller.cpp:2688:23:[m[K [01;31m[Kerror: [m[Kexpected unqualified-id before ‘[01m[Kif[m[K’
                       [01;31m[Kif[m[K ( (phase==48)&& (start_48==1) && start_record_publisher_.trylock()) {
                       [01;31m[K^~[m[K
[01m[K/home/nbenhabi/panda_ws/src/franka_ros/franka_example_controllers/src/elbow_example_controller.cpp:2699:23:[m[K [01;31m[Kerror: [m[Kexpected unqualified-id before ‘[01m[Kif[m[K’
                       [01;31m[Kif[m[K ( (phase==48) && (stop_48==1) && stop_record_publisher_.trylock()) {
                       [01;31m[K^~[m[K
[01m[K/home/nbenhabi/panda_ws/src/franka_ros/franka_example_controllers/src/elbow_example_controller.cpp:2709:23:[m[K [01;31m[Kerror: [m[Kexpected unqualified-id before ‘[01m[Kif[m[K’
                       [01;31m[Kif[m[K ( (phase==49)&& (start_49==1) && start_record_publisher_.trylock()) {
                       [01;31m[K^~[m[K
[01m[K/home/nbenhabi/panda_ws/src/franka_ros/franka_example_controllers/src/elbow_example_controller.cpp:2720:23:[m[K [01;31m[Kerror: [m[Kexpected unqualified-id before ‘[01m[Kif[m[K’
                       [01;31m[Kif[m[K ( (phase==49) && (stop_49==1) && stop_record_publisher_.trylock()) {
                       [01;31m[K^~[m[K
[01m[K/home/nbenhabi/panda_ws/src/franka_ros/franka_example_controllers/src/elbow_example_controller.cpp:2729:23:[m[K [01;31m[Kerror: [m[Kexpected unqualified-id before ‘[01m[Kif[m[K’
                       [01;31m[Kif[m[K ( (phase==50)&& (start_50==1) && start_record_publisher_.trylock()) {
                       [01;31m[K^~[m[K
[01m[K/home/nbenhabi/panda_ws/src/franka_ros/franka_example_controllers/src/elbow_example_controller.cpp:2740:23:[m[K [01;31m[Kerror: [m[Kexpected unqualified-id before ‘[01m[Kif[m[K’
                       [01;31m[Kif[m[K ( (phase==50) && (stop_50==1) && rate_trigger_() && stop_record_publisher_.trylock()) {
                       [01;31m[K^~[m[K
[01m[K/home/nbenhabi/panda_ws/src/franka_ros/franka_example_controllers/src/elbow_example_controller.cpp:2758:1:[m[K [01;31m[Kerror: [m[Kexpected declaration before ‘[01m[K}[m[K’ token
 [01;31m[K}[m[K  // namespace franka_example_controllers
 [01;31m[K^[m[K
make[2]: *** [CMakeFiles/franka_example_controllers.dir/src/elbow_example_controller.cpp.o] Error 1
make[1]: *** [CMakeFiles/franka_example_controllers.dir/all] Error 2
make: *** [all] Error 2
