[01m[K/home/nbenhabi/panda_ws/src/franka_ros/franka_example_controllers/src/force_example_controller.cpp:[m[K In member function ‘[01m[Kvirtual void franka_example_controllers::ForceExampleController::update(const ros::Time&, const ros::Duration&)[m[K’:
[01m[K/home/nbenhabi/panda_ws/src/franka_ros/franka_example_controllers/src/force_example_controller.cpp:1011:14:[m[K [01;31m[Kerror: [m[Kno match for ‘[01m[Koperator<<[m[K’ (operand types are ‘[01m[KEigen::CommaInitializer<Eigen::Matrix<double, 7, 1> >[m[K’ and ‘[01m[Kdouble[m[K’)
   [01;31m[KKp <<   Kp << 1.0 * kp_[m[K, 1.0* kp_, 1.0* kp_, 1.0* kp_, 1.0* kp_, 1.0* kp_, 1.0* kp_;
   [01;31m[K~~~~~~~~~~~^~~~~~~~~~~~[m[K
In file included from [01m[K/home/nbenhabi/panda_ws/src/franka_ros/franka_example_controllers/include/franka_example_controllers/force_example_controller.h:25:0[m[K,
                 from [01m[K/home/nbenhabi/panda_ws/src/franka_ros/franka_example_controllers/src/force_example_controller.cpp:3[m[K:
[01m[K/home/nbenhabi/panda_ws/devel/.private/franka_example_controllers/include/franka_example_controllers/JointTorqueComparison.h:133:15:[m[K [01;36m[Knote: [m[Kcandidate: template<class ContainerAllocator> std::ostream& franka_example_controllers::operator<<(std::ostream&, const franka_example_controllers::JointTorqueComparison_<ContainerAllocator>&)
 std::ostream& [01;36m[Koperator[m[K<<(std::ostream& s, const ::franka_example_controllers::JointTorqueComparison_<ContainerAllocator> & v)
               [01;36m[K^~~~~~~~[m[K
[01m[K/home/nbenhabi/panda_ws/devel/.private/franka_example_controllers/include/franka_example_controllers/JointTorqueComparison.h:133:15:[m[K [01;36m[Knote: [m[K  template argument deduction/substitution failed:
[01m[K/home/nbenhabi/panda_ws/src/franka_ros/franka_example_controllers/src/force_example_controller.cpp:1011:23:[m[K [01;36m[Knote: [m[K  mismatched types ‘[01m[Kconst franka_example_controllers::JointTorqueComparison_<ContainerAllocator>[m[K’ and ‘[01m[Kdouble[m[K’
   Kp <<   Kp << 1.0 * [01;36m[Kkp_[m[K, 1.0* kp_, 1.0* kp_, 1.0* kp_, 1.0* kp_, 1.0* kp_, 1.0* kp_;
                       [01;36m[K^~~[m[K
In file included from [01m[K/usr/include/eigen3/Eigen/Core:413:0[m[K,
                 from [01m[K/home/nbenhabi/panda_ws/src/franka_ros/franka_example_controllers/include/franka_example_controllers/force_example_controller.h:23[m[K,
                 from [01m[K/home/nbenhabi/panda_ws/src/franka_ros/franka_example_controllers/src/force_example_controller.cpp:3[m[K:
[01m[K/usr/include/eigen3/Eigen/src/Core/IO.h:216:16:[m[K [01;36m[Knote: [m[Kcandidate: template<class Derived> std::ostream& Eigen::operator<<(std::ostream&, const Eigen::DenseBase<Derived>&)
 std::ostream & [01;36m[Koperator[m[K <<
                [01;36m[K^~~~~~~~[m[K
[01m[K/usr/include/eigen3/Eigen/src/Core/IO.h:216:16:[m[K [01;36m[Knote: [m[K  template argument deduction/substitution failed:
[01m[K/home/nbenhabi/panda_ws/src/franka_ros/franka_example_controllers/src/force_example_controller.cpp:1011:23:[m[K [01;36m[Knote: [m[K  mismatched types ‘[01m[Kconst Eigen::DenseBase<Derived>[m[K’ and ‘[01m[Kdouble[m[K’
   Kp <<   Kp << 1.0 * [01;36m[Kkp_[m[K, 1.0* kp_, 1.0* kp_, 1.0* kp_, 1.0* kp_, 1.0* kp_, 1.0* kp_;
                       [01;36m[K^~~[m[K
make[2]: *** [CMakeFiles/franka_example_controllers.dir/src/force_example_controller.cpp.o] Error 1
make[2]: *** Waiting for unfinished jobs....
make[1]: *** [CMakeFiles/franka_example_controllers.dir/all] Error 2
make: *** [all] Error 2
