[01m[K/home/nbenhabi/panda_ws/src/franka_ros/franka_example_controllers/src/dual_arm_cartesian_impedance_example_controller.cpp:[m[K In member function ‘[01m[Kvoid franka_example_controllers::DualArmCartesianImpedanceExampleController::startingArm(franka_example_controllers::FrankaDataContainer&)[m[K’:
[01m[K/home/nbenhabi/panda_ws/src/franka_ros/franka_example_controllers/src/dual_arm_cartesian_impedance_example_controller.cpp:314:10:[m[K [01;31m[Kerror: [m[K‘[01m[Ktau_d_saturated[m[K’ was not declared in this scope
   return [01;31m[Ktau_d_saturated[m[K;
          [01;31m[K^~~~~~~~~~~~~~~[m[K
[01m[K/home/nbenhabi/panda_ws/src/franka_ros/franka_example_controllers/src/dual_arm_cartesian_impedance_example_controller.cpp:314:10:[m[K [01;31m[Kerror: [m[Kreturn-statement with a value, in function returning 'void' [[01;31m[K-fpermissive[m[K]
make[2]: *** [CMakeFiles/franka_example_controllers.dir/src/dual_arm_cartesian_impedance_example_controller.cpp.o] Error 1
make[1]: *** [CMakeFiles/franka_example_controllers.dir/all] Error 2
make: *** [all] Error 2
