[  0%] Built target sensor_msgs_generate_messages_py
[  0%] Built target _franka_gripper_generate_messages_check_deps_HomingFeedback
[  0%] Built target _franka_gripper_generate_messages_check_deps_GraspResult
[  0%] Built target _franka_gripper_generate_messages_check_deps_HomingResult
[  0%] Built target _franka_gripper_generate_messages_check_deps_StopAction
[  0%] Built target actionlib_msgs_generate_messages_py
[  0%] Built target _franka_gripper_generate_messages_check_deps_GraspActionResult
[  0%] Built target _franka_gripper_generate_messages_check_deps_HomingActionGoal
[  0%] Built target _franka_gripper_generate_messages_check_deps_MoveActionGoal
[  0%] Built target _franka_gripper_generate_messages_check_deps_HomingActionFeedback
[  0%] Built target _franka_gripper_generate_messages_check_deps_MoveResult
[  0%] Built target _franka_gripper_generate_messages_check_deps_GraspActionFeedback
[  0%] Built target _franka_gripper_generate_messages_check_deps_HomingActionResult
[  0%] Built target _franka_gripper_generate_messages_check_deps_MoveFeedback
[  0%] Built target _franka_gripper_generate_messages_check_deps_StopActionResult
[  0%] Built target _franka_gripper_generate_messages_check_deps_GraspAction
[  0%] Built target _franka_gripper_generate_messages_check_deps_GraspEpsilon
[  0%] Built target _franka_gripper_generate_messages_check_deps_StopGoal
[  0%] Built target _franka_gripper_generate_messages_check_deps_MoveActionResult
[  0%] Built target _franka_gripper_generate_messages_check_deps_GraspGoal
[  0%] Built target _franka_gripper_generate_messages_check_deps_GraspActionGoal
[  0%] Built target _franka_gripper_generate_messages_check_deps_MoveActionFeedback
[  0%] Built target _franka_gripper_generate_messages_check_deps_MoveGoal
[  0%] Built target _franka_gripper_generate_messages_check_deps_HomingGoal
[  0%] Built target _franka_gripper_generate_messages_check_deps_MoveAction
[  0%] Built target _franka_gripper_generate_messages_check_deps_StopResult
[  0%] Built target _franka_gripper_generate_messages_check_deps_HomingAction
[  0%] Built target _franka_gripper_generate_messages_check_deps_StopActionFeedback
[  0%] Built target _franka_gripper_generate_messages_check_deps_StopFeedback
[  0%] Built target _franka_gripper_generate_messages_check_deps_GraspFeedback
[  0%] Built target actionlib_msgs_generate_messages_nodejs
[  0%] Built target _franka_gripper_generate_messages_check_deps_StopActionGoal
[  0%] Built target trajectory_msgs_generate_messages_cpp
[  0%] Built target actionlib_msgs_generate_messages_cpp
[  0%] Built target geometry_msgs_generate_messages_py
[  0%] Built target actionlib_msgs_generate_messages_eus
[  0%] Built target actionlib_msgs_generate_messages_lisp
[  0%] Built target control_msgs_generate_messages_lisp
[  0%] Built target control_msgs_generate_messages_cpp
[  0%] Built target std_msgs_generate_messages_nodejs
[  0%] Built target control_msgs_generate_messages_eus
[ 19%] Built target franka_gripper_generate_messages_lisp
[ 19%] Built target sensor_msgs_generate_messages_lisp
[ 19%] Built target geometry_msgs_generate_messages_nodejs
[ 19%] Built target std_msgs_generate_messages_cpp
[ 19%] Built target geometry_msgs_generate_messages_lisp
[ 19%] Built target actionlib_generate_messages_cpp
[ 19%] Built target sensor_msgs_generate_messages_nodejs
[ 19%] Built target roscpp_generate_messages_cpp
[ 19%] Built target control_msgs_generate_messages_nodejs
[ 19%] Built target roscpp_generate_messages_lisp
[ 19%] Built target geometry_msgs_generate_messages_eus
[ 19%] Built target std_msgs_generate_messages_py
[ 19%] Built target roscpp_generate_messages_py
[ 19%] Built target rosgraph_msgs_generate_messages_cpp
[ 19%] Built target rosgraph_msgs_generate_messages_eus
[ 19%] Built target rosgraph_msgs_generate_messages_lisp
[ 19%] Built target control_msgs_generate_messages_py
[ 19%] Built target roscpp_generate_messages_eus
[ 19%] Built target rosgraph_msgs_generate_messages_py
[ 19%] Built target trajectory_msgs_generate_messages_py
[ 19%] Built target std_msgs_generate_messages_eus
[ 19%] Built target rosgraph_msgs_generate_messages_nodejs
[ 19%] Built target trajectory_msgs_generate_messages_lisp
[ 19%] Built target trajectory_msgs_generate_messages_nodejs
[ 19%] Built target geometry_msgs_generate_messages_cpp
[ 19%] Built target actionlib_generate_messages_lisp
[ 19%] Built target trajectory_msgs_generate_messages_eus
[ 19%] Built target actionlib_generate_messages_nodejs
[ 19%] Built target actionlib_generate_messages_py
[ 19%] Built target sensor_msgs_generate_messages_cpp
[ 19%] Built target sensor_msgs_generate_messages_eus
[ 19%] Built target actionlib_generate_messages_eus
[ 19%] Built target std_msgs_generate_messages_lisp
[ 19%] Built target roscpp_generate_messages_nodejs
[ 38%] Built target franka_gripper_generate_messages_py
[ 58%] Built target franka_gripper_generate_messages_nodejs
[ 77%] Built target franka_gripper_generate_messages_cpp
[ 96%] Built target franka_gripper_generate_messages_eus
[ 96%] Built target franka_gripper_generate_messages
[ 97%] Built target franka_gripper
[100%] Built target franka_gripper_node
