[01m[K/home/nbenhabi/panda_ws/src/franka_ros/franka_example_controllers/src/force_example_controller.cpp:[m[K In member function ‘[01m[Kvirtual void franka_example_controllers::ForceExampleController::update(const ros::Time&, const ros::Duration&)[m[K’:
[01m[K/home/nbenhabi/panda_ws/src/franka_ros/franka_example_controllers/src/force_example_controller.cpp:1022:35:[m[K [01;31m[Kerror: [m[Kno match for ‘[01m[Koperator*[m[K’ (operand types are ‘[01m[KEigen::DenseCoeffsBase<Eigen::Matrix<double, 7, 1>, 1>::Scalar {aka double}[m[K’ and ‘[01m[Kros::Time[m[K’)
     tau_o(i)=K_p(i)*((sin([01;31m[Kalpha(i)*ros::Time::now()[m[K)*qj_max(i)/cte)+qj_o(i)-q_j[i]);
                           [01;31m[K~~~~~~~~^~~~~~~~~~~~~~~~~[m[K
make[2]: *** [CMakeFiles/franka_example_controllers.dir/src/force_example_controller.cpp.o] Error 1
make[1]: *** [CMakeFiles/franka_example_controllers.dir/all] Error 2
make: *** [all] Error 2
