In file included from [01m[K/home/nbenhabi/panda_ws/src/franka_ros/franka_example_controllers/src/dual_arm_cartesian_impedance_example_controller.cpp:3:0[m[K:
[01m[K/home/nbenhabi/panda_ws/src/franka_ros/franka_example_controllers/include/franka_example_controllers/dual_arm_cartesian_impedance_example_controller.h:100:27:[m[K [01;31m[Kerror: [m[Kexpected identifier before numeric constant
   Eigen::VectorXd Kp_resp([01;31m[K7[m[K), Kp_act(7);
                           [01;31m[K^[m[K
[01m[K/home/nbenhabi/panda_ws/src/franka_ros/franka_example_controllers/include/franka_example_controllers/dual_arm_cartesian_impedance_example_controller.h:100:27:[m[K [01;31m[Kerror: [m[Kexpected ‘[01m[K,[m[K’ or ‘[01m[K...[m[K’ before numeric constant
[01m[K/home/nbenhabi/panda_ws/src/franka_ros/franka_example_controllers/include/franka_example_controllers/dual_arm_cartesian_impedance_example_controller.h:100:38:[m[K [01;31m[Kerror: [m[Kexpected identifier before numeric constant
   Eigen::VectorXd Kp_resp(7), Kp_act([01;31m[K7[m[K);
                                      [01;31m[K^[m[K
[01m[K/home/nbenhabi/panda_ws/src/franka_ros/franka_example_controllers/include/franka_example_controllers/dual_arm_cartesian_impedance_example_controller.h:100:38:[m[K [01;31m[Kerror: [m[Kexpected ‘[01m[K,[m[K’ or ‘[01m[K...[m[K’ before numeric constant
[01m[K/home/nbenhabi/panda_ws/src/franka_ros/franka_example_controllers/src/dual_arm_cartesian_impedance_example_controller.cpp:[m[K In member function ‘[01m[Kvoid franka_example_controllers::DualArmCartesianImpedanceExampleController::startingArm(franka_example_controllers::FrankaDataContainer&)[m[K’:
[01m[K/home/nbenhabi/panda_ws/src/franka_ros/franka_example_controllers/src/dual_arm_cartesian_impedance_example_controller.cpp:247:3:[m[K [01;31m[Kerror: [m[Kinvalid use of member function ‘[01m[KEigen::VectorXd franka_example_controllers::DualArmCartesianImpedanceExampleController::Kp_resp(int)[m[K’ (did you forget the ‘[01m[K()[m[K’ ?)
   [01;31m[KKp_resp[m[K << 0 , 0 , 0 , 0 , 0 , 0 , 0;
   [01;31m[K^~~~~~~[m[K
[01m[K/home/nbenhabi/panda_ws/src/franka_ros/franka_example_controllers/src/dual_arm_cartesian_impedance_example_controller.cpp:248:3:[m[K [01;31m[Kerror: [m[Kinvalid use of member function ‘[01m[KEigen::VectorXd franka_example_controllers::DualArmCartesianImpedanceExampleController::Kp_act(int)[m[K’ (did you forget the ‘[01m[K()[m[K’ ?)
   [01;31m[KKp_act[m[K << 0 , 0 , 0 , 0 , 0 , 0 , 0;
   [01;31m[K^~~~~~[m[K
[01m[K/home/nbenhabi/panda_ws/src/franka_ros/franka_example_controllers/src/dual_arm_cartesian_impedance_example_controller.cpp:[m[K In member function ‘[01m[Kvirtual void franka_example_controllers::DualArmCartesianImpedanceExampleController::update(const ros::Time&, const ros::Duration&)[m[K’:
[01m[K/home/nbenhabi/panda_ws/src/franka_ros/franka_example_controllers/src/dual_arm_cartesian_impedance_example_controller.cpp:1557:129:[m[K [01;31m[Kerror: [m[Kinvalid use of member function ‘[01m[KEigen::VectorXd franka_example_controllers::DualArmCartesianImpedanceExampleController::Kp_resp(int)[m[K’ (did you forget the ‘[01m[K()[m[K’ ?)
                                                                 Kp_resp << filter_gain_ * Kp_resp_target + (1 - filter_gain_) * [01;31m[KKp_resp[m[K;
                                                                                                                                 [01;31m[K^~~~~~~[m[K
[01m[K/home/nbenhabi/panda_ws/src/franka_ros/franka_example_controllers/src/dual_arm_cartesian_impedance_example_controller.cpp:1558:186:[m[K [01;31m[Kerror: [m[Kno match for ‘[01m[Koperator-[m[K’ (operand types are ‘[01m[KEigen::internal::enable_if<true, const Eigen::CwiseBinaryOp<Eigen::internal::scalar_product_op<double, double>, const Eigen::Matrix<double, -1, 1>, const Eigen::CwiseNullaryOp<Eigen::internal::scalar_constant_op<double>, const Eigen::Matrix<double, -1, 1> > > >::type {aka const Eigen::CwiseBinaryOp<Eigen::internal::scalar_product_op<double, double>, const Eigen::Matrix<double, -1, 1>, const Eigen::CwiseNullaryOp<Eigen::internal::scalar_constant_op<double>, const Eigen::Matrix<double, -1, 1> > >}[m[K’ and ‘[01m[Kdouble[m[K’)
                                                                 tau_sig_right(i) = [01;31m[KKp_resp(i) * (( sin(alpha1 * elapsed_time_.toSec()) * q_right_max(i)) + q_init_right(i) - q_right[i]) -  (kd_resp * dq_right(i))[m[K ;
                                                                                    [01;31m[K~~~~~~~~~~~~~~~~~~~~~~~~~~~~~~~~~~~~~~~~~~~~~~~~~~~~~~~~~~~~~~~~~~~~~~~~~~~~~~~~~~~~~~~~~~~~~~~~~~~~~~^~~~~~~~~~~~~~~~~~~~~~~~~~[m[K
In file included from [01m[K/usr/include/eigen3/Eigen/src/Core/MatrixBase.h:125:0[m[K,
                 from [01m[K/usr/include/eigen3/Eigen/Core:416[m[K,
                 from [01m[K/usr/include/eigen3/Eigen/Dense:1[m[K,
                 from [01m[K/home/nbenhabi/panda_ws/src/franka_ros/franka_example_controllers/include/franka_example_controllers/dual_arm_cartesian_impedance_example_controller.h:17[m[K,
                 from [01m[K/home/nbenhabi/panda_ws/src/franka_ros/franka_example_controllers/src/dual_arm_cartesian_impedance_example_controller.cpp:3[m[K:
[01m[K/usr/include/eigen3/Eigen/src/plugins/CommonCwiseUnaryOps.h:45:1:[m[K [01;36m[Knote: [m[Kcandidate: const NegativeReturnType Eigen::MatrixBase<Derived>::operator-() const [with Derived = Eigen::CwiseBinaryOp<Eigen::internal::scalar_product_op<double, double>, const Eigen::Matrix<double, -1, 1>, const Eigen::CwiseNullaryOp<Eigen::internal::scalar_constant_op<double>, const Eigen::Matrix<double, -1, 1> > >; Eigen::MatrixBase<Derived>::NegativeReturnType = Eigen::CwiseUnaryOp<Eigen::internal::scalar_opposite_op<double>, const Eigen::CwiseBinaryOp<Eigen::internal::scalar_product_op<double, double>, const Eigen::Matrix<double, -1, 1>, const Eigen::CwiseNullaryOp<Eigen::internal::scalar_constant_op<double>, const Eigen::Matrix<double, -1, 1> > > >; typename Eigen::internal::traits<T>::Scalar = double]
 [01;36m[Koperator[m[K-() const { return NegativeReturnType(derived()); }
 [01;36m[K^~~~~~~~[m[K
[01m[K/usr/include/eigen3/Eigen/src/plugins/CommonCwiseUnaryOps.h:45:1:[m[K [01;36m[Knote: [m[K  candidate expects 0 arguments, 1 provided
In file included from [01m[K/usr/include/eigen3/Eigen/Core:72:0[m[K,
                 from [01m[K/usr/include/eigen3/Eigen/Dense:1[m[K,
                 from [01m[K/home/nbenhabi/panda_ws/src/franka_ros/franka_example_controllers/include/franka_example_controllers/dual_arm_cartesian_impedance_example_controller.h:17[m[K,
                 from [01m[K/home/nbenhabi/panda_ws/src/franka_ros/franka_example_controllers/src/dual_arm_cartesian_impedance_example_controller.cpp:3[m[K:
[01m[K/usr/include/eigen3/Eigen/src/plugins/CommonCwiseBinaryOps.h:19:1:[m[K [01;36m[Knote: [m[Kcandidate: template<class OtherDerived> const Eigen::CwiseBinaryOp<Eigen::internal::scalar_difference_op<typename Eigen::internal::traits<T>::Scalar, typename Eigen::internal::traits<OtherDerived>::Scalar>, const Derived, const OtherDerived> Eigen::MatrixBase<Derived>::operator-(const Eigen::MatrixBase<OtherDerived>&) const [with OtherDerived = OtherDerived; Derived = Eigen::CwiseBinaryOp<Eigen::internal::scalar_product_op<double, double>, const Eigen::Matrix<double, -1, 1>, const Eigen::CwiseNullaryOp<Eigen::internal::scalar_constant_op<double>, const Eigen::Matrix<double, -1, 1> > >]
 [01;36m[KE[m[KIGEN_MAKE_CWISE_BINARY_OP(operator-,difference)
 [01;36m[K^[m[K
[01m[K/usr/include/eigen3/Eigen/src/plugins/CommonCwiseBinaryOps.h:19:1:[m[K [01;36m[Knote: [m[K  template argument deduction/substitution failed:
[01m[K/home/nbenhabi/panda_ws/src/franka_ros/franka_example_controllers/src/dual_arm_cartesian_impedance_example_controller.cpp:1558:211:[m[K [01;36m[Knote: [m[K  mismatched types ‘[01m[Kconst Eigen::MatrixBase<Derived>[m[K’ and ‘[01m[Kdouble[m[K’
                                                                 tau_sig_right(i) = Kp_resp(i) * (( sin(alpha1 * elapsed_time_.toSec()) * q_right_max(i)) + q_init_right(i) - q_right[i]) -  (kd_resp * dq_right(i)[01;36m[K)[m[K ;
                                                                                                                                                                                                                   [01;36m[K^[m[K
[01m[K/home/nbenhabi/panda_ws/src/franka_ros/franka_example_controllers/src/dual_arm_cartesian_impedance_example_controller.cpp:1571:185:[m[K [01;31m[Kerror: [m[Kno match for ‘[01m[Koperator-[m[K’ (operand types are ‘[01m[KEigen::internal::enable_if<true, const Eigen::CwiseBinaryOp<Eigen::internal::scalar_product_op<double, double>, const Eigen::Matrix<double, -1, 1>, const Eigen::CwiseNullaryOp<Eigen::internal::scalar_constant_op<double>, const Eigen::Matrix<double, -1, 1> > > >::type {aka const Eigen::CwiseBinaryOp<Eigen::internal::scalar_product_op<double, double>, const Eigen::Matrix<double, -1, 1>, const Eigen::CwiseNullaryOp<Eigen::internal::scalar_constant_op<double>, const Eigen::Matrix<double, -1, 1> > >}[m[K’ and ‘[01m[Kdouble[m[K’)
                                                                 tau_sig_right(i) = [01;31m[KKp_act(i) * (( sin(alpha2 * elapsed_time_.toSec()) * q_right_max(i)) + q_init_right(i) - q_right[i]) -  (kd_resp * dq_right(i))[m[K ;
                                                                                    [01;31m[K~~~~~~~~~~~~~~~~~~~~~~~~~~~~~~~~~~~~~~~~~~~~~~~~~~~~~~~~~~~~~~~~~~~~~~~~~~~~~~~~~~~~~~~~~~~~~~~~~~~~~^~~~~~~~~~~~~~~~~~~~~~~~~~[m[K
In file included from [01m[K/usr/include/eigen3/Eigen/src/Core/MatrixBase.h:125:0[m[K,
                 from [01m[K/usr/include/eigen3/Eigen/Core:416[m[K,
                 from [01m[K/usr/include/eigen3/Eigen/Dense:1[m[K,
                 from [01m[K/home/nbenhabi/panda_ws/src/franka_ros/franka_example_controllers/include/franka_example_controllers/dual_arm_cartesian_impedance_example_controller.h:17[m[K,
                 from [01m[K/home/nbenhabi/panda_ws/src/franka_ros/franka_example_controllers/src/dual_arm_cartesian_impedance_example_controller.cpp:3[m[K:
[01m[K/usr/include/eigen3/Eigen/src/plugins/CommonCwiseUnaryOps.h:45:1:[m[K [01;36m[Knote: [m[Kcandidate: const NegativeReturnType Eigen::MatrixBase<Derived>::operator-() const [with Derived = Eigen::CwiseBinaryOp<Eigen::internal::scalar_product_op<double, double>, const Eigen::Matrix<double, -1, 1>, const Eigen::CwiseNullaryOp<Eigen::internal::scalar_constant_op<double>, const Eigen::Matrix<double, -1, 1> > >; Eigen::MatrixBase<Derived>::NegativeReturnType = Eigen::CwiseUnaryOp<Eigen::internal::scalar_opposite_op<double>, const Eigen::CwiseBinaryOp<Eigen::internal::scalar_product_op<double, double>, const Eigen::Matrix<double, -1, 1>, const Eigen::CwiseNullaryOp<Eigen::internal::scalar_constant_op<double>, const Eigen::Matrix<double, -1, 1> > > >; typename Eigen::internal::traits<T>::Scalar = double]
 [01;36m[Koperator[m[K-() const { return NegativeReturnType(derived()); }
 [01;36m[K^~~~~~~~[m[K
[01m[K/usr/include/eigen3/Eigen/src/plugins/CommonCwiseUnaryOps.h:45:1:[m[K [01;36m[Knote: [m[K  candidate expects 0 arguments, 1 provided
In file included from [01m[K/usr/include/eigen3/Eigen/Core:72:0[m[K,
                 from [01m[K/usr/include/eigen3/Eigen/Dense:1[m[K,
                 from [01m[K/home/nbenhabi/panda_ws/src/franka_ros/franka_example_controllers/include/franka_example_controllers/dual_arm_cartesian_impedance_example_controller.h:17[m[K,
                 from [01m[K/home/nbenhabi/panda_ws/src/franka_ros/franka_example_controllers/src/dual_arm_cartesian_impedance_example_controller.cpp:3[m[K:
[01m[K/usr/include/eigen3/Eigen/src/plugins/CommonCwiseBinaryOps.h:19:1:[m[K [01;36m[Knote: [m[Kcandidate: template<class OtherDerived> const Eigen::CwiseBinaryOp<Eigen::internal::scalar_difference_op<typename Eigen::internal::traits<T>::Scalar, typename Eigen::internal::traits<OtherDerived>::Scalar>, const Derived, const OtherDerived> Eigen::MatrixBase<Derived>::operator-(const Eigen::MatrixBase<OtherDerived>&) const [with OtherDerived = OtherDerived; Derived = Eigen::CwiseBinaryOp<Eigen::internal::scalar_product_op<double, double>, const Eigen::Matrix<double, -1, 1>, const Eigen::CwiseNullaryOp<Eigen::internal::scalar_constant_op<double>, const Eigen::Matrix<double, -1, 1> > >]
 [01;36m[KE[m[KIGEN_MAKE_CWISE_BINARY_OP(operator-,difference)
 [01;36m[K^[m[K
[01m[K/usr/include/eigen3/Eigen/src/plugins/CommonCwiseBinaryOps.h:19:1:[m[K [01;36m[Knote: [m[K  template argument deduction/substitution failed:
[01m[K/home/nbenhabi/panda_ws/src/franka_ros/franka_example_controllers/src/dual_arm_cartesian_impedance_example_controller.cpp:1571:210:[m[K [01;36m[Knote: [m[K  mismatched types ‘[01m[Kconst Eigen::MatrixBase<Derived>[m[K’ and ‘[01m[Kdouble[m[K’
                                                                 tau_sig_right(i) = Kp_act(i) * (( sin(alpha2 * elapsed_time_.toSec()) * q_right_max(i)) + q_init_right(i) - q_right[i]) -  (kd_resp * dq_right(i)[01;36m[K)[m[K ;
                                                                                                                                                                                                                  [01;36m[K^[m[K
make[2]: *** [CMakeFiles/franka_example_controllers.dir/src/dual_arm_cartesian_impedance_example_controller.cpp.o] Error 1
make[1]: *** [CMakeFiles/franka_example_controllers.dir/all] Error 2
make: *** [all] Error 2
