In file included from [01m[K/opt/ros/melodic/include/class_loader/class_loader_core.hpp:47:0[m[K,
                 from [01m[K/opt/ros/melodic/include/class_loader/class_loader.hpp:46[m[K,
                 from [01m[K/opt/ros/melodic/include/pluginlib/class_list_macros.hpp:40[m[K,
                 from [01m[K/opt/ros/melodic/include/pluginlib/class_list_macros.h:35[m[K,
                 from [01m[K/home/nbenhabi/panda_ws/src/franka_ros/franka_example_controllers/src/woobot_qp_controller.cpp:8[m[K:
/opt/ros/melodic/include/class_loader/meta_object.hpp: In instantiation of ‘[01m[KB* class_loader::impl::MetaObject<C, B>::create() const [with C = franka_example_controllers::WoobotQpController; B = controller_interface::ControllerBase][m[K’:
[01m[K/home/nbenhabi/panda_ws/src/franka_ros/franka_example_controllers/src/woobot_qp_controller.cpp:24:1:[m[K   required from here
[01m[K/opt/ros/melodic/include/class_loader/meta_object.hpp:196:12:[m[K [01;31m[Kerror: [m[Kinvalid new-expression of abstract class type ‘[01m[Kfranka_example_controllers::WoobotQpController[m[K’
     return [01;31m[Knew C[m[K;
            [01;31m[K^~~~~[m[K
In file included from [01m[K/home/nbenhabi/panda_ws/src/franka_ros/franka_example_controllers/src/woobot_qp_controller.cpp:2:0[m[K:
[01m[K/home/nbenhabi/panda_ws/src/franka_ros/franka_example_controllers/include/franka_example_controllers/woobot_qp_controller.h:27:9:[m[K [01;36m[Knote: [m[K  because the following virtual functions are pure within ‘[01m[Kfranka_example_controllers::WoobotQpController[m[K’:
   class [01;36m[KWoobotQpController[m[K : public controller_interface::MultiInterfaceController<
         [01;36m[K^~~~~~~~~~~~~~~~~~[m[K
In file included from [01m[K/home/nbenhabi/panda_ws/src/ros_control/controller_interface/include/controller_interface/multi_interface_controller.h:33:0[m[K,
                 from [01m[K/home/nbenhabi/panda_ws/src/franka_ros/franka_example_controllers/include/franka_example_controllers/woobot_qp_controller.h:11[m[K,
                 from [01m[K/home/nbenhabi/panda_ws/src/franka_ros/franka_example_controllers/src/woobot_qp_controller.cpp:2[m[K:
[01m[K/home/nbenhabi/panda_ws/src/ros_control/controller_interface/include/controller_interface/controller_base.h:73:16:[m[K [01;36m[Knote: [m[K	virtual void controller_interface::ControllerBase::update(const ros::Time&, const ros::Duration&)
   virtual void [01;36m[Kupdate[m[K(const ros::Time& time, const ros::Duration& period) = 0;
                [01;36m[K^~~~~~[m[K
make[2]: *** [CMakeFiles/franka_example_controllers.dir/src/woobot_qp_controller.cpp.o] Error 1
make[1]: *** [CMakeFiles/franka_example_controllers.dir/all] Error 2
make: *** [all] Error 2
