[01m[K/home/nbenhabi/panda_ws/src/franka_ros/franka_example_controllers/src/force_example_controller.cpp:[m[K In member function ‘[01m[Kvirtual void franka_example_controllers::ForceExampleController::starting(const ros::Time&)[m[K’:
[01m[K/home/nbenhabi/panda_ws/src/franka_ros/franka_example_controllers/src/force_example_controller.cpp:161:3:[m[K [01;31m[Kerror: [m[K‘[01m[Korientation_d_[m[K’ was not declared in this scope
   [01;31m[Korientation_d_[m[K = Eigen::Quaterniond(p_initial_transform.linear());
   [01;31m[K^~~~~~~~~~~~~~[m[K
[01m[K/home/nbenhabi/panda_ws/src/franka_ros/franka_example_controllers/src/force_example_controller.cpp:161:3:[m[K [01;36m[Knote: [m[Ksuggested alternative: ‘[01m[Kp_orientation_d_[m[K’
   [01;36m[Korientation_d_[m[K = Eigen::Quaterniond(p_initial_transform.linear());
   [01;36m[K^~~~~~~~~~~~~~[m[K
   [32m[Kp_orientation_d_[m[K
[01m[K/home/nbenhabi/panda_ws/src/franka_ros/franka_example_controllers/src/force_example_controller.cpp:163:3:[m[K [01;31m[Kerror: [m[K‘[01m[Korientation_d_target_[m[K’ was not declared in this scope
   [01;31m[Korientation_d_target_[m[K = Eigen::Quaterniond(p_initial_transform.linear());
   [01;31m[K^~~~~~~~~~~~~~~~~~~~~[m[K
[01m[K/home/nbenhabi/panda_ws/src/franka_ros/franka_example_controllers/src/force_example_controller.cpp:163:3:[m[K [01;36m[Knote: [m[Ksuggested alternative: ‘[01m[Kp_orientation_d_target_[m[K’
   [01;36m[Korientation_d_target_[m[K = Eigen::Quaterniond(p_initial_transform.linear());
   [01;36m[K^~~~~~~~~~~~~~~~~~~~~[m[K
   [32m[Kp_orientation_d_target_[m[K
[01m[K/home/nbenhabi/panda_ws/src/franka_ros/franka_example_controllers/src/force_example_controller.cpp:[m[K In member function ‘[01m[Kvirtual void franka_example_controllers::ForceExampleController::update(const ros::Time&, const ros::Duration&)[m[K’:
[01m[K/home/nbenhabi/panda_ws/src/franka_ros/franka_example_controllers/src/force_example_controller.cpp:1051:3:[m[K [01;31m[Kerror: [m[K‘[01m[Kp[m[K’ was not declared in this scope
   [01;31m[Kp[m[K-error.head(3) << position - position_d_;
   [01;31m[K^[m[K
[01m[K/home/nbenhabi/panda_ws/src/franka_ros/franka_example_controllers/src/force_example_controller.cpp:1051:3:[m[K [01;36m[Knote: [m[Ksuggested alternative: ‘[01m[KKp[m[K’
   [01;36m[Kp[m[K-error.head(3) << position - position_d_;
   [01;36m[K^[m[K
   [32m[KKp[m[K
[01m[K/home/nbenhabi/panda_ws/src/franka_ros/franka_example_controllers/src/force_example_controller.cpp:1051:5:[m[K [01;31m[Kerror: [m[K‘[01m[Kerror[m[K’ was not declared in this scope
   p-[01;31m[Kerror[m[K.head(3) << position - position_d_;
     [01;31m[K^~~~~[m[K
[01m[K/home/nbenhabi/panda_ws/src/franka_ros/franka_example_controllers/src/force_example_controller.cpp:1051:5:[m[K [01;36m[Knote: [m[Ksuggested alternative: ‘[01m[Kperror[m[K’
   p-[01;36m[Kerror[m[K.head(3) << position - position_d_;
     [01;36m[K^~~~~[m[K
     [32m[Kperror[m[K
make[2]: *** [CMakeFiles/franka_example_controllers.dir/src/force_example_controller.cpp.o] Error 1
make[1]: *** [CMakeFiles/franka_example_controllers.dir/all] Error 2
make: *** [all] Error 2
