[01m[K/home/nbenhabi/panda_ws/src/franka_ros/franka_example_controllers/src/woobot_qp_controller.cpp:[m[K In member function ‘[01m[Kvirtual bool franka_example_controllers::WoobotQpController::init(hardware_interface::RobotHW*, ros::NodeHandle&)[m[K’:
[01m[K/home/nbenhabi/panda_ws/src/franka_ros/franka_example_controllers/src/woobot_qp_controller.cpp:21:5:[m[K [01;31m[Kerror: [m[K‘[01m[Kqp_reference[m[K’ was not declared in this scope
     [01;31m[Kqp_reference[m[K = qp_solver.configureQP(number_of_variables, number_of_constraints);
     [01;31m[K^~~~~~~~~~~~[m[K
[01m[K/home/nbenhabi/panda_ws/src/franka_ros/franka_example_controllers/src/woobot_qp_controller.cpp:24:5:[m[K [01;31m[Kerror: [m[K‘[01m[Kqp_est_hwrenches[m[K’ was not declared in this scope
     [01;31m[Kqp_est_hwrenches[m[K = qp_solver.configureQP(number_of_variables, number_of_constraints);
     [01;31m[K^~~~~~~~~~~~~~~~[m[K
[01m[K/home/nbenhabi/panda_ws/src/franka_ros/franka_example_controllers/src/woobot_qp_controller.cpp:27:5:[m[K [01;31m[Kerror: [m[K‘[01m[Kqp_rwrenches[m[K’ was not declared in this scope
     [01;31m[Kqp_rwrenches[m[K = qp_solver.configureQP(number_of_variables, number_of_constraints);
     [01;31m[K^~~~~~~~~~~~[m[K
make[2]: *** [CMakeFiles/franka_example_controllers.dir/src/woobot_qp_controller.cpp.o] Error 1
make[1]: *** [CMakeFiles/franka_example_controllers.dir/all] Error 2
make: *** [all] Error 2
