<?xml version="1.0" encoding="utf-8"?>
<robot xmlns:xacro="http://www.ros.org/wiki/xacro" name="ati">
<xacro:property name="M_PI" value="3.1415926535897931" />
  <xacro:macro name="gte">
    <link name="GTE">
      <visual>
        <geometry>
          <mesh filename="package://setup_description/meshes/GTE/robot_to_gte.stl"/>
        </geometry>
        <material name="abs_color">
		      <color rgba="${250/255} ${250/255} ${250/255} 1.0"/>
      	</material>
      </visual>
      <collision>
        <geometry>
          <mesh filename="package://setup_description/meshes/GTE/robot_to_gte.stl"/>
        </geometry>
      </collision>
      <inertial>
        <origin xyz="-0.00012083 0.00012097 0.05541352" rpy="0 0 0"/>
        <mass value="1.206"/>
        <inertia ixx="2.10137079e-3" ixy="-4.26873743e-6" ixz="-4.06796078e-6" iyy="2.10137927e-3" iyz="4.07253213e-6" izz="1.32911320e-3"/>
      </inertial>
    </link>
    <joint name="robot_to_gte" type="fixed">
      <parent link="panda_link8"/>
      <child link="GTE"/>
      <origin xyz="0 0 0" rpy="0 0 0"/>
    </joint>

    <link name="GTE_tip"/>
    
    <joint name="gte_to_gte_tip" type = "fixed">
      <parent link="GTE"/>
      <child link="GTE_tip"/>
      <origin xyz="0 0 0.115" rpy="0 0 0"/>
    </joint>
  </xacro:macro>
</robot>