Dyad,Trial,s1Shoulder X,s1Shoulder Y,s1Shoulder Z,s1Elbow X,s1Elbow Y,s1Elbow Z,s1Hand1 X,s1Hand1 Y,s1Hand1 Z,s1Hand2 X,s1Hand2 Y,s1Hand2 Z,s1Hand3 X,s1Hand3 Y,s1Hand3 Z,s1Hand4 X,s1Hand4 Y,s1Hand4 Z
2,1,0.008500206273954425,0.40211033084557685,0.16963481610204056,0.02735353094312723,-0.28085174046604455,0.020798882434457835,-0.03592737209260882,-0.2535284881282778,0.024186751129997863,0.000638840532265603,-0.06338986707207019,-0.039204180381374874,-0.008518618500422782,-0.07814434672799712,0.0258058857025886,0.006314659887204255,-0.25076941353577226,0.032626947510816524
2,2,0.009037803188235327,0.4020295811598847,0.16989513257362146,0.02399812651366233,-0.2797457317155939,0.019641270945609177,-0.02818642532855422,-0.2636767576775039,0.030086057173917845,-0.002517436357383343,-0.05789050926266598,-0.040267814634425345,-0.005232930882164311,-0.06695657217322341,0.026232454078862724,-0.005140879446198843,-0.24864902949938236,0.02509487240557775
2,3,0.00935695786212054,0.4011921136268235,0.1698942506751007,0.020456977946159527,-0.2857281334222864,0.0224237077572291,-0.023505745772229213,-0.2633874517038488,0.025767883034184973,-0.006999028784074879,-0.055566188518648474,-0.03882441418087937,-0.002518759343437711,-0.06920247429724102,0.026723578324513345,-0.01745413491717082,-0.23488549897231742,0.02283855043497691
2,4,0.008200250155317557,0.40273622243325596,0.16929850302429567,0.022531682875820608,-0.28298292688694504,0.02037467099942114,-0.022099369457617868,-0.2612959078332526,0.0316151514170783,-0.004859185384524036,-0.05791487021833108,-0.0407216181351799,-0.0037411762225549317,-0.06703827800208202,0.02620974227454033,-0.012246897276476484,-0.24814348339945025,0.0238104443334985
2,5,0.009844514038573116,0.400988979818269,0.1705680889955338,0.028424989521896718,-0.28166089527849286,0.01869490588386523,-0.022976914143629255,-0.2563125766238353,0.031183863920272312,-0.004259687055938911,-0.0566069278563644,-0.03913189853955082,-0.00405279218876517,-0.07061401377333429,0.02674677961108284,-0.010320213325823249,-0.253609906376118,0.029259091370078025
2,10,0.009836565544504738,0.4009286332702036,0.17013233817301826,0.028813662753474092,-0.28355214111091576,0.018966542406775255,-0.025228397920761265,-0.2559928163055735,0.030951105820052827,-0.0032277478617977647,-0.057305180559102054,-0.0391696026561441,-0.005222803406930938,-0.07159397214595754,0.02665024270940081,-0.0076998910953136775,-0.25305136225250185,0.02925807828032813
2,6,0.01068528484184006,0.39949143420899746,0.17121712878372342,0.030634693934474544,-0.2827827925074654,0.01790199887712285,-0.024528960288171052,-0.25572728221654506,0.030805922990695317,-0.0033362097264927025,-0.057050382830596935,-0.03902549560156932,-0.004623718601885499,-0.07079866894276617,0.02667529818332881,-0.007565638267882868,-0.2525212848490262,0.028958886720500638
2,7,0.009477822219025822,0.40022309577437787,0.16995766975958088,0.02870154728403318,-0.28430057140731274,0.019037383926189796,-0.026776890708305252,-0.2565936886359124,0.03082570931171733,-0.002503909666355452,-0.058687422650992506,-0.0393443455161324,-0.005071022151962031,-0.07231964796460326,0.02658908461475387,-0.006072247729796115,-0.253667782153706,0.028851559944520884
2,8,0.009664108939338556,0.4010352966562948,0.17045835557527442,0.02969397173381906,-0.28393934281529465,0.018462822171532806,-0.027495459223046595,-0.25569949283074905,0.03128510663408131,-0.0026559071943057753,-0.05782085173253887,-0.039332406322180484,-0.005391838145965659,-0.07126891142547981,0.026547830689749852,-0.005341803653586056,-0.2538402753783317,0.027814936708895004
2,9,0.009445215867515233,0.4010625207175227,0.17008341628502152,0.029495702626438497,-0.28356594362977733,0.01888959208110022,-0.029700498989408346,-0.25590436847890885,0.029162485136022022,-0.0009964655127379304,-0.06003330296367305,-0.039634132545323005,-0.0068015340733598075,-0.07272122517090195,0.026169260646176876,-0.001406724369980305,-0.25337825485361554,0.0283425772123318
2,11,0.009537319131434963,0.40103795157784966,0.17033695888510764,0.028011958980447657,-0.28075335825081493,0.020073648527631924,-0.0324793353779043,-0.2550444723660535,0.026018405202334904,-0.0002456420807046677,-0.05828813063388496,-0.03751347470917019,-0.007164734685769076,-0.07355779388972103,0.0252558644939781,0.0032493509092176506,-0.2529511919470789,0.03228357570879006
2,12,0.008623072458696979,0.4009804407242369,0.17087288481083238,0.02690921995344807,-0.2824597150756798,0.019164950043651888,-0.028978534320170717,-0.2557264939644931,0.02822721934875749,-0.0013617049779882876,-0.059845097219976176,-0.03799839338965635,-0.004505010891886237,-0.07403750193174401,0.026105493452138896,-0.00028391434163732576,-0.25368471268520404,0.029915834307946573
2,13,0.008480655612962518,0.40167217863443994,0.16977097972289967,0.024196648789050937,-0.28214773128433834,0.022486918215395266,-0.035624714033022926,-0.2531842120708727,0.020723497127049698,0.002771739804145506,-0.06537652890364733,-0.03843784722653026,-0.010169866864464423,-0.0806147840261715,0.023821309871753446,0.008093449143019064,-0.2494880278467056,0.036044616232088815
2,14,0.009188154188205844,0.40146317095694944,0.16989919084160143,0.02727568601766585,-0.28355258784984394,0.020288754090326752,-0.03365309787730171,-0.2554738026581633,0.025019676761284117,0.0005701194976116793,-0.06101888797199432,-0.0380984269966281,-0.008465768442331104,-0.07514408579300945,0.02531619825454742,0.005131180209690132,-0.2527227434977796,0.03262114728304292
2,15,0.010537234834345321,0.40015653176531796,0.1706607216456807,0.028134518728521338,-0.2859332523802789,0.01940776608548958,-0.027399751227193007,-0.2547596816414397,0.02936193093040979,-0.002803600171272385,-0.057042536122703,-0.037477319647153166,-0.005109248109712226,-0.07043897852232292,0.026283206328364284,-0.002697143132783783,-0.2528089814385294,0.02932249791281232
