<?xml version="1.0" ?>
<sdf version="1.5">
  <world name="panda_world">
   
   <physics type="ode">
      <gravity>0.000000 0.000000 -9.810000</gravity>
      <ode>
        <solver>
          <type>quick</type>
          <iters>100</iters>
          <precon_iters>0</precon_iters>
          <sor>1.000000</sor>
        </solver>
        <constraints>
          <cfm>0.000000</cfm>
          <erp>0.500000</erp>
          <contact_max_correcting_vel>1000.000000</contact_max_correcting_vel>
          <contact_surface_layer>0.00000</contact_surface_layer>
        </constraints>
      </ode>
  </physics>

  </world>
</sdf>
