<?xml version="1.0" encoding="UTF-8"?>
<!--This does not replace URDF, and is not an extension of URDF.
    This is a format for representing semantic information about the robot structure.
    A URDF file must exist for this robot as well, where the joints and the links that are referenced are defined
-->
<robot xmlns:xacro="http://www.ros.org/wiki/xacro" name="$(arg arm_id)">
    <xacro:include filename="$(find panda_moveit_config)/config/arm.xacro" />
    <!-- old group name with old end-effector link -->

    <xacro:arg name="hand" default="false" />
    <xacro:arg name="arm_id" default="panda" />

    <!--Add the hand if people request it-->
    <xacro:if value="$(arg hand)">
        <xacro:include filename="$(find panda_moveit_config)/config/hand.xacro" />
        <xacro:hand arm_id="$(arg arm_id)"/>
        <xacro:arm name="$(arg arm_id)_arm" tip_link="$(arg arm_id)_gripper_center" arm_id="$(arg arm_id)"/>
        <!-- <xacro:arm name="manipulator" tip_link="panda_gripper_center" /> -->
        <!--END EFFECTOR: Purpose: Represent information about an end effector.-->
        <!-- <end_effector name="hand_tcp" parent_link="panda_gripper_center" group="hand" parent_group="manipulator" /> -->
        <!-- old end-effector -->
        <!-- <end_effector name="hand" parent_link="panda_link8" group="hand" parent_group="panda_arm" /> -->
    </xacro:if>
    <xacro:unless value="$(arg hand)">
        <xacro:arm name="$(arg arm_id)_arm" tip_link="$(arg arm_id)_link8" arm_id="$(arg arm_id)"/>
    </xacro:unless>

</robot>
