version 3

// File extracted from MOBL_ARMS_fixed_33.osim

// SEGMENT DEFINITION

// Information about ground segment
    // Segment
    segment ground
        RTinMatrix    1
        RT
            1    0    0    0
            0    1    0    0
            0    0    1    0
            0    0    0    1
        mass 0.00001
        inertia
            1    0    0
            0    1    0
            0    0    1
        com     0 0 0
    meshfile Geometry/thorax.vtp
    endsegment

    // Markers
    //marker    C7
        //parent      ground
        //position     -0.05613 0.05528 -0.00151
    //endmarker

// Information about clavicle segment
    // Segment
    segment clavicle_translation
        parent ground 
        RTinMatrix    1
        RT
            1.0    0.0    0.0    0.006325
            0.0    1.0    0.0    0.00693
            0.0    0.0    1.0    0.025465
            0.0    0.0    0.0    1.0
    endsegment
    // Segment
    segment clavicle_rotation1
        parent clavicle_translation 
        RTinMatrix    1
        RT
            -0.0022437752455313916    -0.9998804305886293    0.015299999952465261    0.0
            -0.14508261003244358    0.015463651764634915    0.9892986969264016    0.0
            -0.9894170009348039    0.0    -0.14509995954919683    0.0
            0.0    0.0    0.0    1.0
        //rotations z
    endsegment
    // Segment
    segment clavicle_rotation2
        parent clavicle_rotation1 
        RTinMatrix    1
        RT
            0.0    -0.10499695040301221    -0.9944725438171068    0.0
            -1.0    0.0    0.0    0.0
            0.0    0.9944725438171068    -0.10499695040301221    0.0
            0.0    0.0    0.0    1.0
        //rotations z
    endsegment
    // Segment
    segment clavicle_rotation3
        parent clavicle_rotation2 
        RTinMatrix    1
        RT
            0.5705876259479394    0.8146410793993847    -0.10387335014381478    0.0
            -0.8014686519651674    0.5799654401384665    0.1459043802020076    0.0
            0.17910265501167627    1.3877787807814457e-17    0.9838303913621333    0.0
            0.0    0.0    0.0    1.0
    endsegment
    // Segment
    segment clavicle
        parent clavicle_rotation3 
        RTinMatrix    1
        RT
            0.5582478181550604    -0.8023044843953658    0.2113454230500411    0.0
            0.8235047305301042    0.5668250480701289    -0.023437655062659844    0.0
            -0.10099174381925752    0.1871279754589957    0.9771303845858866    0.0
            0.0    0.0    0.0    1.0
        mass 0.156
        inertia
            0.00024259    -1.898e-005    -6.994e-005
            -1.898e-005    0.00025526    5.371e-005
            -6.994e-005    5.371e-005    4.442e-005
        com     -0.011096 0.0063723 0.054168
        meshfile Geometry/clavicle.vtp
    endsegment

    // Markers
    //marker    R.Clavicle
        //parent      clavicle
        //position     0.01835 -0.00464 -0.00046
    //endmarker

// Information about clavphant segment
    // Segment
    segment clavphant_translation
        parent clavicle 
        RTinMatrix    1
        RT
            1.0    0.0    0.0    -0.01433
            0.0    1.0    0.0    0.02007
            0.0    0.0    1.0    0.135535
            0.0    0.0    0.0    1.0
    endsegment
    // Segment
    segment clavphant_rotation1
        parent clavphant_translation 
        RTinMatrix    1
        RT
            0.0    -0.10499695040301221    -0.9944725438171068    0.0
            -1.0    0.0    0.0    0.0
            0.0    0.9944725438171068    -0.10499695040301221    0.0
            0.0    0.0    0.0    1.0
        //rotations z
    endsegment
    // Segment
    segment clavphant_rotation2
        parent clavphant_rotation1 
        RTinMatrix    1
        RT
            -0.0022437752455313916    -0.9998804305886293    0.015299999952465261    0.0
            -0.14508261003244358    0.015463651764634915    0.9892986969264016    0.0
            -0.9894170009348039    0.0    -0.14509995954919683    0.0
            0.0    0.0    0.0    1.0
        //rotations z
    endsegment
    // Segment
    segment clavphant_rotation3
        parent clavphant_rotation2 
        RTinMatrix    1
        RT
            -0.5705876259479394    0.8146410793993847    0.10387335014381478    0.0
            0.8014686519651674    0.5799654401384665    -0.1459043802020076    0.0
            -0.17910265501167627    1.3877787807814457e-17    -0.9838303913621333    0.0
            0.0    0.0    0.0    1.0
    endsegment
    // Segment
    segment clavphant
        parent clavphant_rotation3 
        RTinMatrix    1
        RT
            -0.5786619138198351    0.8028328210528761    -0.14356131419935567    0.0
            0.8130324581707188    0.5817239655001228    -0.023988537339531255    0.0
            0.06425427188323013    -0.13060126110835274    -0.9893506451919177    0.0
            0.0    0.0    0.0    1.0
        mass 0.0001
        inertia
            1    0    0
            0    1    0
            0    0    1
        com     0 0 0
    endsegment

    // Markers
// Information about scapula segment
    // Segment
    segment scapula_translation
        parent clavphant 
        RTinMatrix    1
        RT
            1.0    0.0    0.0    0.0
            0.0    1.0    0.0    0.0
            0.0    0.0    1.0    0.0
            0.0    0.0    0.0    1.0
    endsegment
    // Segment
    segment scapula_rotation1
        parent scapula_translation 
        RTinMatrix    1
        RT
            -0.04569348318363905    -0.9865258680955934    0.15709493044901915    0.0
            -0.27552767863071376    0.1636053531466366    0.9472685927075458    0.0
            -0.960206542314161    -6.938893903907228e-18    -0.27929088079828773    0.0
            0.0    0.0    0.0    1.0
        //rotations z
    endsegment
    // Segment
    segment scapula_rotation2
        parent scapula_rotation1 
        RTinMatrix    1
        RT
            0.5446112618986801    0.36709104511949187    -0.7540840390872933    0.0
            -0.21492704548647004    0.930185016323677    0.2975940196398067    0.0
            0.8106817738987254    2.7755575615628914e-17    0.585487029291355    0.0
            0.0    0.0    0.0    1.0
        //rotations z
    endsegment
    // Segment
    segment scapula_rotation3
        parent scapula_rotation2 
        RTinMatrix    1
        RT
            0.7482689398887277    -0.18284553551086688    0.637699853960736    0.0
            0.1391637050294663    0.9831416531424881    0.11859997073662111    0.0
            -0.6486347637925919    -1.3877787807814457e-17    0.7610998247271697    0.0
            0.0    0.0    0.0    1.0
        //rotations z
    endsegment
    // Segment
    segment scapula
        parent scapula_rotation3 
        RTinMatrix    1
        RT
            0.213712006541339    -0.08295965164674793    -0.9733678001961666    0.0
            -0.9761772871549724    -0.056367716849222066    -0.20952466332144357    0.0
            -0.03748442747105856    0.9949574748178216    -0.09302978555984516    0.0
            0.0    0.0    0.0    1.0
        mass 0.70396
        inertia
            0.0012429    0.0004494    0.00040922
            0.0004494    0.0011504    0.0002411
            0.00040922    0.0002411    0.0013651
        com     -0.054694 -0.035032 -0.043734
        meshfile Geometry/scapula.vtp
    endsegment

    // Markers
    //marker    R.Shoulder
        //parent    scapula
        //position     0.0014 -0.00147 0.01369
    //endmarker

// Information about scapphant segment
    // Segment
    segment scapphant_translation
        parent scapula 
        RTinMatrix    1
        RT
            1.0    0.0    0.0    -0.00955
            0.0    1.0    0.0    -0.034
            0.0    0.0    1.0    0.009
            0.0    0.0    0.0    1.0
    endsegment
    // Segment
    segment scapphant_rotation1
        parent scapphant_translation 
        RTinMatrix    1
        RT
            0.7482689398887277    -0.18284553551086688    0.637699853960736    0.0
            0.1391637050294663    0.9831416531424881    0.11859997073662111    0.0
            -0.6486347637925919    -1.3877787807814457e-17    0.7610998247271697    0.0
            0.0    0.0    0.0    1.0
        //rotations z
    endsegment
    // Segment
    segment scapphant_rotation2
        parent scapphant_rotation1 
        RTinMatrix    1
        RT
            0.5446112618986801    0.36709104511949187    -0.7540840390872933    0.0
            -0.21492704548647004    0.930185016323677    0.2975940196398067    0.0
            0.8106817738987254    2.7755575615628914e-17    0.585487029291355    0.0
            0.0    0.0    0.0    1.0
        //rotations z
    endsegment
    // Segment
    segment scapphant_rotation3
        parent scapphant_rotation2 
        RTinMatrix    1
        RT
            -0.04569348318363905    -0.9865258680955934    0.15709493044901915    0.0
            -0.27552767863071376    0.1636053531466366    0.9472685927075458    0.0
            -0.960206542314161    -6.938893903907228e-18    -0.27929088079828773    0.0
            0.0    0.0    0.0    1.0
        //rotations z
    endsegment
    // Segment
    segment scapphant
        parent scapphant_rotation3 
        RTinMatrix    1
        RT
            0.16268516400432023    -0.5110925978770767    -0.843989273514864    0.0
            -0.9336860608156715    0.19681193427798901    -0.2991578218336783    0.0
            0.31900450976655736    0.836689559466961    -0.44518165261787374    0.0
            0.0    0.0    0.0    1.0
        mass 0.0001
        inertia
            1    0    0
            0    1    0
            0    0    1
        com     0 0 0
    endsegment

    // Markers
// Information about humphant segment
    // Segment
    segment humphant_translation
        parent scapphant 
        RTinMatrix    1
        RT
            1.0    0.0    0.0    0.0
            0.0    1.0    0.0    0.0
            0.0    0.0    1.0    0.0
            0.0    0.0    0.0    1.0
    endsegment
    // Segment
    segment humphant_rotation1
        parent humphant_translation 
        RTinMatrix    1
        RT
            0.000203703237168121    -0.9999884591857904    0.004800000022941426    0.0
            0.04239952087200908    0.004804320475267076    0.9990891847751108    0.0
            -0.9991007152108415    0.0    0.04240001020264932    0.0
            0.0    0.0    0.0    1.0
        rotations z
        ranges -1.65806279 2.26892803
    endsegment
    // Segment
    segment humphant_rotation2
        parent humphant_rotation1 
        RTinMatrix    1
        RT
            1    0    0    0
            0    1    0    0
            0    0    1    0
            0    0    0    1
    endsegment
    // Segment
    segment humphant_rotation3
        parent humphant_rotation2 
        RTinMatrix    1
        RT
            0.0    0.11248898908622659    0.9936529712803956    0.0
            1.0    0.0    0.0    0.0
            0.0    0.9936529712803956    -0.11248898908622659    0.0
            0.0    0.0    0.0    1.0
    endsegment
    // Segment
    segment humphant
        parent humphant_rotation3 
        RTinMatrix    1
        RT
            -0.99998845918579    0.004804320475267074    -5.421073426028749e-20    0.0
            0.004792448656164347    0.9975174162665293    -0.07025693332921198    0.0
            -0.0003375368233230067    -0.07025612250699743    -0.9975289285625629    0.0
            0.0    0.0    0.0    1.0
        mass 0.0001
        inertia
            1    0    0
            0    1    0
            0    0    1
        com     0 0 0
    endsegment

    // Markers
// Information about humphant1 segment
    // Segment
    segment humphant1_translation
        parent humphant 
        RTinMatrix    1
        RT
            1.0    0.0    0.0    0.0
            0.0    1.0    0.0    0.0
            0.0    0.0    1.0    0.0
            0.0    0.0    0.0    1.0
    endsegment
    // Segment
    segment humphant1_rotation1
        parent humphant1_translation 
        RTinMatrix    1
        RT
            0.0588978633886716    0.0023039997213905733    -0.9982613551938856    0.0
            -0.00013570102101712587    0.9999973457891194    0.0022999999889266845    0.0
            0.9982640047970688    -2.710505431213761e-20    0.058898019716436364    0.0
            0.0    0.0    0.0    1.0
        rotations z
        ranges 0 3.14159265
    endsegment
    // Segment
    segment humphant1_rotation2
        parent humphant1_rotation1 
        RTinMatrix    1
        RT
            0.000203703237168121    -0.9999884591857904    0.004800000022941426    0.0
            0.04239952087200908    0.004804320475267076    0.9990891847751108    0.0
            -0.9991007152108415    0.0    0.04240001020264932    0.0
            0.0    0.0    0.0    1.0
        //rotations z
    endsegment
    // Segment
    segment humphant1_rotation3
        parent humphant1_rotation2 
        RTinMatrix    1
        RT
            -0.8073611066206169    0.5871259244016231    -0.05874685022937391    0.0
            0.5855777695654807    0.80949561388283    0.04260900016636455    0.0
            0.07257216620061538    6.938893903907228e-18    -0.9973631638941507    0.0
            0.0    0.0    0.0    1.0
    endsegment
    // Segment
    segment humphant1
        parent humphant1_rotation3 
        RTinMatrix    1
        RT
            -0.8426877029971432    0.043029311985304845    -0.5366804575606139    0.0
            0.5379743937248018    0.027543514491619066    -0.8425110720375619    0.0
            -0.021470605809588386    -0.9986940638251139    -0.0463592489871007    0.0
            0.0    0.0    0.0    1.0
        mass 0.0001
        inertia
            1    0    0
            0    1    0
            0    0    1
        com     0 0 0
    endsegment

    // Markers
// Information about humerus segment
    // Segment
    segment humerus_translation
        parent humphant1 
        RTinMatrix    1
        RT
            1.0    0.0    0.0    0.0
            0.0    1.0    0.0    0.0
            0.0    0.0    1.0    0.0
            0.0    0.0    0.0    1.0
    endsegment
    // Segment
    segment humerus_rotation1
        parent humerus_translation 
        RTinMatrix    1
        RT
            0.000203703237168121    -0.9999884591857904    0.004800000022941426    0.0
            0.04239952087200908    0.004804320475267076    0.9990891847751108    0.0
            -0.9991007152108415    0.0    0.04240001020264932    0.0
            0.0    0.0    0.0    1.0
        rotations z
        ranges -1.57079633 2.0943951
    endsegment
    // Segment
    segment humerus_rotation2
        parent humerus_rotation1 
        RTinMatrix    1
        RT
            1    0    0    0
            0    1    0    0
            0    0    1    0
            0    0    0    1
    endsegment
    // Segment
    segment humerus_rotation3
        parent humerus_rotation2 
        RTinMatrix    1
        RT
            0.0    0.11248898908622659    0.9936529712803956    0.0
            1.0    0.0    0.0    0.0
            0.0    0.9936529712803956    -0.11248898908622659    0.0
            0.0    0.0    0.0    1.0
    endsegment
    // Segment
    segment humerus
        parent humerus_rotation3 
        RTinMatrix    1
        RT
            -0.99998845918579    0.004804320475267074    -5.421073426028749e-20    0.0
            0.004792448656164347    0.9975174162665293    -0.07025693332921198    0.0
            -0.0003375368233230067    -0.07025612250699743    -0.9975289285625629    0.0
            0.0    0.0    0.0    1.0
        mass 1.99757
        inertia
            0.01227763    -0.00034741    -0.0002325
            -0.00034741    0.00255133    0.0012293
            -0.0002325    0.0012293    0.01257888
        com     0.018064 -0.140141 -0.012746
        meshfile Geometry/humerus.vtp
    endsegment

	// Markers
	marker	SHOULDER_R
		parent	humerus
		position	0.0 0 0.04
	endmarker
	// Markers
	marker	ELBOW_R
		parent	humerus
		position	0.0 -0.258125 0.04
	endmarker
    
// Information about ulna segment
    // Segment
    segment ulna_translation
        parent humerus 
        RTinMatrix    1
        RT
            1.0    0.0    0.0    0.0061
            0.0    1.0    0.0    -0.2904
            0.0    0.0    1.0    -0.0123
            0.0    0.0    0.0    1.0
    endsegment
    // Segment
    segment ulna_rotation1
        parent ulna_translation 
        RTinMatrix    1
        RT
            0.801979522152563    -0.5953053712684071    0.04940000998917986    0.0
            0.5941792022021661    0.8034995425879125    0.036600009991983457    0.0
            -0.06148106796684942    3.469446951953614e-18    0.9981082497813831    0.0
            0.0    0.0    0.0    1.0
        rotations z
        ranges 0 2.26892803
    endsegment
    // Segment
    segment ulna_rotation2
        parent ulna_rotation1 
        RTinMatrix    1
        RT
            1    0    0    0
            0    1    0    0
            0    0    1    0
            0    0    0    1
    endsegment
    // Segment
    segment ulna_rotation3
        parent ulna_rotation2 
        RTinMatrix    1
        RT
            0.0    0.049433130424779516    0.998777435476196    0.0
            1.0    0.0    0.0    0.0
            0.0    0.998777435476196    -0.049433130424779516    0.0
            0.0    0.0    0.0    1.0
    endsegment
    // Segment
    segment ulna
        parent ulna_rotation3 
        RTinMatrix    1
        RT
            -0.5953053712684067    0.8034995425879121    -1.7271681030603774e-17    0.0
            0.08898397360606146    0.06592740211634747    0.9938487963928239    0.0
            0.7985570533031809    0.5916435267212893    -0.11074551868375901    0.0
            0.0    0.0    0.0    1.0
        mass 1.1053
        inertia
            0.00541309    0.00031686    -7.615e-005
            0.00031686    0.00115318    0.00109169
            -7.615e-005    0.00109169    0.00494361
        com     0.00971783 -0.0959509 0.024286
        meshfile Geometry/ulna.vtp
    endsegment


// Information about radius segment
    // Segment
    segment radius_translation
        parent ulna 
        RTinMatrix    1
        RT
            1.0    0.0    0.0    0.0004
            0.0    1.0    0.0    -0.011503
            0.0    0.0    1.0    0.019999
            0.0    0.0    0.0    1.0
    endsegment
    // Segment
    segment radius_rotation1
        parent radius_translation 
        RTinMatrix    1
        RT
            -0.0020684848732437666    0.9998505997350339    -0.017160990059506154    0.0
            0.1196500819899576    0.017285202037966095    0.9926656434420924    0.0
            0.9928139701122892    0.0    -0.11966796041495159    0.0
            0.0    0.0    0.0    1.0
        //rotations z
        ranges -1.57079633 1.57079633
    endsegment
    // Segment
    segment radius_rotation2
        parent radius_rotation1 
        RTinMatrix    1
        RT
            1    0    0    0
            0    1    0    0
            0    0    1    0
            0    0    0    1
    endsegment
    // Segment
    segment radius_rotation3
        parent radius_rotation2 
        RTinMatrix    1
        RT
            0.0    0.14195284912173947    -0.9898734205069963    0.0
            -0.9999999999999999    0.0    0.0    0.0
            0.0    0.9898734205069962    0.1419528491217395    0.0
            0.0    0.0    0.0    1.0
    endsegment
    // Segment
    segment radius
        parent radius_rotation3 
        RTinMatrix    1
        RT
            -0.9998505997350338    -0.0172852020379661    3.2530925303425065e-19    0.0
            -0.017280835250612085    0.9995980059299264    0.022476638404261062    0.0
            -0.0003885132359519594    0.022473280388527864    -0.9997473684516724    0.0
            0.0    0.0    0.0    1.0
        mass 0.23359
        inertia
            0.00043855    3.014e-005    -4.24e-006
            3.014e-005    8.859e-005    6.418e-005
            -4.24e-006    6.418e-005    0.00040258
        com     0.0336341 -0.181559 0.0156
        meshfile Geometry/radius.vtp
    endsegment

	marker FOREARM_R
	    parent radius
	    position 0 -0.2 0.05
	endmarker

// Information about proximal_row segment
    // Segment
    segment proximal_row_translation
        parent radius 
        RTinMatrix    1
        RT
            1.0    0.0    0.0    0.018
            0.0    1.0    0.0    -0.242
            0.0    0.0    1.0    0.025
            0.0    0.0    0.0    1.0
    endsegment
    // Segment
    segment proximal_row_rotation1
        parent proximal_row_translation 
        RTinMatrix    1
        RT
            -0.5499570208842333    -0.16334452573686425    -0.8190640030497848    0.0
            -0.09105542614390544    0.9865690882608267    -0.13561100050494757    0.0
            0.8302145412782715    0.0    -0.5574440020756427    0.0
            0.0    0.0    0.0    1.0
        //rotations z
        ranges -0.17453293 0.43633231
    endsegment
    // Segment
    segment proximal_row_rotation2
        parent proximal_row_rotation1 
        RTinMatrix    1
        RT
            1    0    0    0
            0    1    0    0
            0    0    1    0
            0    0    0    1
    endsegment
    // Segment
    segment proximal_row_rotation3
        parent proximal_row_rotation2 
        RTinMatrix    1
        RT
            0.14224160054227528    0.2549808573694126    0.9564267297866217    0.0
            -0.0375086938348676    0.9669461010703543    -0.2522069299437327    0.0
            -0.989121036558203    0.0    0.14710395996718117    0.0
            0.0    0.0    0.0    1.0
        //rotations z
        ranges -1.22173048 1.22173048
    endsegment
    // Segment
    segment proximal_row
        parent proximal_row_rotation3 
        RTinMatrix    1
        RT
            0.7380535086295451    0.08417890595686091    0.6694706343011051    0.0
            -0.29817386499383663    0.9307417427040299    0.21168881553568716    0.0
            -0.6052845319634851    -0.3558563195731824    0.7120371585707966    0.0
            0.0    0.0    0.0    1.0
        mass 0.0001
        inertia
            1e-005    0    0
            0    1e-005    0
            0    0    1e-005
        com     0 0 0
    endsegment

    // Markers
// Information about hand segment
    // Segment
    segment hand_translation
        parent proximal_row 
        RTinMatrix    1
        RT
            1.0    0.0    0.0    0.003992
            0.0    1.0    0.0    -0.015054
            0.0    0.0    1.0    0.002327
            0.0    0.0    0.0    1.0
    endsegment
    // Segment
    segment hand_rotation1
        parent hand_translation 
        RTinMatrix    1
        RT
            -0.24614288988410662    0.3618959325472701    0.8991357026418441    0.0
            0.09555496973990722    0.9322185012140352    -0.34905288102558857    0.0
            -0.9645117549918746    1.3877787807814457e-17    -0.2640399107758031    0.0
            0.0    0.0    0.0    1.0
        //rotations z
    endsegment
    // Segment
    segment hand_rotation2
        parent hand_rotation1 
        RTinMatrix    1
        RT
            -0.07509663608662369    -0.010730293005574463    0.9971185265857253    0.0
            -0.0008058553030405648    0.9999424287487828    0.010699989963361724    0.0
            -0.9971759352520014    1.0842021724855044e-19    -0.0751009597428437    0.0
            0.0    0.0    0.0    1.0
        //rotations z
    endsegment
    // Segment
    segment hand_rotation3
        parent hand_rotation2 
        RTinMatrix    1
        RT
            0.12839810193701862    0.9891748991852263    0.07104186259430727    0.0
            -0.8655242317163406    0.14674133303843692    -0.4788891160696187    0.0
            -0.4841298707276893    6.938893903907228e-18    0.874996153288225    0.0
            0.0    0.0    0.0    1.0
    endsegment
    // Segment
    segment hand
        parent hand_rotation3 
        RTinMatrix    1
        RT
            -0.2786446351268994    -0.8258983235917817    0.49015214617838954    0.0
            -0.8154052049169609    0.4730946442074615    0.33361026575413427    0.0
            -0.5074165144231372    -0.30671390041942914    -0.80526707630461    0.0
            0.0    0.0    0.0    1.0
        mass 0.5819
        inertia
            0.00011    9e-007    -2e-007
            9e-007    6e-005    1.2e-005
            -2e-007    1.2e-005    0.00015
        com     -0.00301314 -0.0424993 -0.00112205
    endsegment

	marker HAND_R
	    parent hand
	    position 0 -0.10 0
	endmarker

// MUSCLE DEFINIION

// humerus > clavicle
musclegroup humerus_to_clavicle
    OriginParent        humerus
    InsertionParent        clavicle
endmusclegroup

    muscle    DELT1
        Type    hillthelen
        statetype    buchanan
        musclegroup    humerus_to_clavicle
        OriginPosition     0.00896 -0.11883 0.00585
        InsertionPosition     -0.014 0.01106 0.08021
        optimalLength    0.0976
        maximalForce    1218.9
        tendonSlackLength    0.093
        pennationAngle    0.38397244
        maxVelocity    10
    endmuscle

        viapoint    DELT1-P2
            parent      humerus
            muscle    DELT1
            musclegroup    humerus_to_clavicle
            position     0.01623 -0.11033 0.00412
        endviapoint
        viapoint    DELT1-P3
            parent      scapula
            muscle    DELT1
            musclegroup    humerus_to_clavicle
            position     0.04347 -0.03202 0.00499
        endviapoint

    muscle    PECM1
        Type    hillthelen
        statetype    buchanan
        musclegroup    humerus_to_clavicle
        OriginPosition     0.01169 -0.04191 0.0078
        InsertionPosition     0.00321 -0.00013 0.05113
        optimalLength    0.1442
        maximalForce    444.3
        tendonSlackLength    0.0028
        pennationAngle    0.29670597
        maxVelocity    10
    endmuscle

        viapoint    default2
            parent      humerus
            muscle    PECM1
            musclegroup    humerus_to_clavicle
            position     0.01615 -0.04045 -0.00577
        endviapoint
        viapoint    default2_1
            parent      ground
            muscle    PECM1
            musclegroup    humerus_to_clavicle
            position     0.00958 -0.01509 0.12664
        endviapoint

// humerus > scapula
musclegroup humerus_to_scapula
    OriginParent        humerus
    InsertionParent        scapula
endmusclegroup

    muscle    DELT2
        Type    hillthelen
        statetype    buchanan
        musclegroup    humerus_to_scapula
        OriginPosition     0.00461 -0.13611 0.0056
        InsertionPosition     -0.01078 -0.00034 0.0062
        optimalLength    0.1078
        maximalForce    1103.5
        tendonSlackLength    0.1095
        pennationAngle    0.26179939
        maxVelocity    10
    endmuscle

        viapoint    default3
            parent      humerus
            muscle    DELT2
            musclegroup    humerus_to_scapula
            position     0.03804 -0.0619 0.02
        endviapoint
        viapoint    DELT2-P3
            parent      scapula
            muscle    DELT2
            musclegroup    humerus_to_scapula
            position     5e-005 0.00294 0.02233
        endviapoint

    muscle    SUPSP
        Type    hillthelen
        statetype    buchanan
        musclegroup    humerus_to_scapula
        OriginPosition     0.00256 0.01063 0.02593
        InsertionPosition     -0.044 -0.01512 -0.05855
        optimalLength    0.0682
        maximalForce    499.2
        tendonSlackLength    0.0395
        pennationAngle    0.12217305
        maxVelocity    10
    endmuscle

        viapoint    SUPSP-P2
            parent      scapula
            muscle    SUPSP
            musclegroup    humerus_to_scapula
            position     -0.01918 0.00127 -0.01271
        endviapoint

    muscle    INFSP
        Type    hillthelen
        statetype    buchanan
        musclegroup    humerus_to_scapula
        OriginPosition     -0.00887 0.00484 0.02448
        InsertionPosition     -0.07382 -0.05476 -0.04781
        optimalLength    0.0755
        maximalForce    1075.8
        tendonSlackLength    0.0308
        pennationAngle    0.3316126
        maxVelocity    10
    endmuscle

    muscle    SUBSC
        Type    hillthelen
        statetype    buchanan
        musclegroup    humerus_to_scapula
        OriginPosition     0.01403 0.0084 -0.01331
        InsertionPosition     -0.07246 -0.03943 -0.06475
        optimalLength    0.0873
        maximalForce    1306.9
        tendonSlackLength    0.033
        pennationAngle    0.34906585
        maxVelocity    10
    endmuscle

        viapoint    SUBSC-P2
            parent      scapula
            muscle    SUBSC
            musclegroup    humerus_to_scapula
            position     -0.01831 -0.05223 -0.02457
        endviapoint

    muscle    TMIN
        Type    hillthelen
        statetype    buchanan
        musclegroup    humerus_to_scapula
        OriginPosition     -0.00127 -0.01259 0.022
        InsertionPosition     -0.09643 -0.08121 -0.05298
        optimalLength    0.0741
        maximalForce    269.5
        tendonSlackLength    0.0713
        pennationAngle    0.41887902
        maxVelocity    10
    endmuscle

        viapoint    TMIN-P2
            parent      scapula
            muscle    TMIN
            musclegroup    humerus_to_scapula
            position     -0.09473 -0.07991 -0.04737
        endviapoint

    muscle    TMAJ
        Type    hillthelen
        statetype    buchanan
        musclegroup    humerus_to_scapula
        OriginPosition     0.00998 -0.05419 -0.00568
        InsertionPosition     -0.10489 -0.10895 -0.07117
        optimalLength    0.1624
        maximalForce    144
        tendonSlackLength    0.02
        pennationAngle    0.27925268
        maxVelocity    10
    endmuscle

        viapoint    default4
            parent      humerus
            muscle    TMAJ
            musclegroup    humerus_to_scapula
            position     0.0089999999999999993 -0.053999999999999999 -0.0089999999999999993
        endviapoint
        viapoint    TMAJ-P2
            parent      scapula
            muscle    TMAJ
            musclegroup    humerus_to_scapula
            position     -0.10264 -0.10319 -0.05829
        endviapoint

// scapula > humerus
musclegroup scapula_to_humerus
    OriginParent        scapula
    InsertionParent        humerus
endmusclegroup

    muscle    DELT3
        Type    hillthelen
        statetype    buchanan
        musclegroup    scapula_to_humerus
        OriginPosition     -0.05573 0.00122 -0.02512
        InsertionPosition     0.00206 -0.07602 0.01045
        optimalLength    0.1367
        maximalForce    201.6
        tendonSlackLength    0.038
        pennationAngle    0.31415927
        maxVelocity    10
    endmuscle

        viapoint    DELT3-P2
            parent      scapula
            muscle    DELT3
            musclegroup    scapula_to_humerus
            position     -0.07247 -0.03285 0.01233
        endviapoint

    muscle    CORB
        Type    hillthelen
        statetype    buchanan
        musclegroup    scapula_to_humerus
        OriginPosition     0.0125 -0.04127 -0.02652
        InsertionPosition     0.00743 -0.15048 -0.00782
        optimalLength    0.0932
        maximalForce    208.2
        tendonSlackLength    0.097
        pennationAngle    0.4712389
        maxVelocity    10
    endmuscle

        viapoint    CORB-P2
            parent      scapula
            muscle    CORB
            musclegroup    scapula_to_humerus
            position     0.00483 -0.06958 -0.01563
        endviapoint

// humerus > ground
musclegroup humerus_to_ground
    OriginParent        humerus
    InsertionParent        ground
endmusclegroup

    muscle    PECM2
        Type    hillthelen
        statetype    buchanan
        musclegroup    humerus_to_ground
        OriginPosition     0.01274 -0.04289 0.00785
        InsertionPosition     0.02769 -0.04498 0.02271
        optimalLength    0.1385
        maximalForce    658.3
        tendonSlackLength    0.089
        pennationAngle    0.4537856
        maxVelocity    10
    endmuscle

        viapoint    default6
            parent      humerus
            muscle    PECM2
            musclegroup    humerus_to_ground
            position     0.01453 -0.04568 -0.00687
        endviapoint
        viapoint    default6_1
            parent      ground
            muscle    PECM2
            musclegroup    humerus_to_ground
            position     0.02018 -0.04165 0.1269
        endviapoint
        viapoint    PECM2-P4
            parent      ground
            muscle    PECM2
            musclegroup    humerus_to_ground
            position     0.03091 -0.03922 0.09705
        endviapoint

    muscle    PECM3
        Type    hillthelen
        statetype    buchanan
        musclegroup    humerus_to_ground
        OriginPosition     0.01269 -0.04375 0.0075
        InsertionPosition     0.05724 -0.11654 0.03787
        optimalLength    0.1385
        maximalForce    498.1
        tendonSlackLength    0.132
        pennationAngle    0.43633231
        maxVelocity    10
    endmuscle

        viapoint    default9
            parent      humerus
            muscle    PECM3
            musclegroup    humerus_to_ground
            position     0.01243 -0.05157 -0.01807
        endviapoint
        viapoint    default9_1
            parent      ground
            muscle    PECM3
            musclegroup    humerus_to_ground
            position     0.02984 -0.070778 0.1151
        endviapoint
        viapoint    PECM3-P4
            parent      ground
            muscle    PECM3
            musclegroup    humerus_to_ground
            position     0.0525 -0.08417 0.08935
        endviapoint

    muscle    LAT1
        Type    hillthelen
        statetype    buchanan
        musclegroup    humerus_to_ground
        OriginPosition     0.0105 -0.03415 -0.00653
        InsertionPosition     -0.09578 -0.11724 0.00882
        optimalLength    0.254
        maximalForce    290.5
        tendonSlackLength    0.12
        pennationAngle    0.43633231
        maxVelocity    10
    endmuscle

        viapoint    default13
            parent      humerus
            muscle    LAT1
            musclegroup    humerus_to_ground
            position     0.01 -0.035000000000000003 -0.0089999999999999993
        endviapoint
        viapoint    default13_1
            parent      scapula
            muscle    LAT1
            musclegroup    humerus_to_ground
            position    -0.07947 -0.08581 -0.02188
        endviapoint
        viapoint    default13_2
            parent      scapula
            muscle    LAT1
            musclegroup    humerus_to_ground
            position    -0.11215 -0.09779 -0.05322
        endviapoint
        viapoint    LAT1-P4
            parent      ground
            muscle    LAT1
            musclegroup    humerus_to_ground
            position     -0.11828 -0.10118 0.03316
        endviapoint

    muscle    LAT2
        Type    hillthelen
        statetype    buchanan
        musclegroup    humerus_to_ground
        OriginPosition     0.00968 -0.04071 -0.00611
        InsertionPosition     -0.07186 -0.18818 0.00815
        optimalLength    0.2324
        maximalForce    317.5
        tendonSlackLength    0.1765
        pennationAngle    0.33161256
        maxVelocity    10
    endmuscle

        viapoint    default17
            parent      humerus
            muscle    LAT2
            musclegroup    humerus_to_ground
            position     0.0079994899999999997 -0.043386099999999997 -0.010097099999999999
        endviapoint
        viapoint    default17_1
            parent      scapula
            muscle    LAT2
            musclegroup    humerus_to_ground
            position     -0.0764 -0.1022 -0.01808
        endviapoint
        viapoint    default17_2
            parent      scapula
            muscle    LAT2
            musclegroup    humerus_to_ground
            position     -0.10054 -0.13969 -0.05258
        endviapoint
        viapoint    LAT2-P4
            parent      ground
            muscle    LAT2
            musclegroup    humerus_to_ground
            position     -0.10992 -0.16908 0.02878
        endviapoint

    muscle    LAT3
        Type    hillthelen
        statetype    buchanan
        musclegroup    humerus_to_ground
        OriginPosition     0.01208 -0.03922 -0.00416
        InsertionPosition     -0.07117 -0.24858 0.00907
        optimalLength    0.2789
        maximalForce    189
        tendonSlackLength    0.1403
        pennationAngle    0.36651914
        maxVelocity    10
    endmuscle

        viapoint    default21
            parent      humerus
            muscle    LAT3
            musclegroup    humerus_to_ground
            position     0.01 -0.041000000000000002 -0.0089999999999999993
        endviapoint
        viapoint    default21_1
            parent      scapula
            muscle    LAT3
            musclegroup    humerus_to_ground
            position     -0.05678 -0.13303 -0.0213
        endviapoint
        viapoint    default21_2
            parent      scapula
            muscle    LAT3
            musclegroup    humerus_to_ground
            position     -0.09449 -0.17553 -0.04406
        endviapoint
        viapoint    LAT3-P4
            parent      ground
            muscle    LAT3
            musclegroup    humerus_to_ground
            position     -0.11157 -0.19387 0.05532
        endviapoint

// scapula > ulna
musclegroup scapula_to_ulna
    OriginParent        scapula
    InsertionParent        ulna
endmusclegroup

    muscle    TRIlong
        Type    hillthelen
        statetype    buchanan
        musclegroup    scapula_to_ulna
        OriginPosition     -0.04565 -0.04073 -0.01377
        InsertionPosition     -0.0219 0.01046 -0.00078
        optimalLength    0.134
        maximalForce    771.8
        tendonSlackLength    0.143
        pennationAngle    0.20943951
        maxVelocity    10
    endmuscle

        viapoint    TRIlong-P2
            parent      humerus
            muscle    TRIlong
            musclegroup    scapula_to_ulna
            position     -0.02714 -0.11441 -0.00664
        endviapoint
        viapoint    TRIlong-P3
            parent      humerus
            muscle    TRIlong
            musclegroup    scapula_to_ulna
            position     -0.03184 -0.22637 -0.01217
        endviapoint
        viapoint    TRIlong-P4
            parent      humerus
            muscle    TRIlong
            musclegroup    scapula_to_ulna
            position     -0.01743 -0.26757 -0.01208
        endviapoint

// humerus > ulna
musclegroup humerus_to_ulna
    OriginParent        humerus
    InsertionParent        ulna
endmusclegroup

    muscle    TRIlat
        Type    hillthelen
        statetype    buchanan
        musclegroup    humerus_to_ulna
        OriginPosition     -0.00599 -0.12646 0.00428
        InsertionPosition     -0.0219 0.01046 -0.00078
        optimalLength    0.1138
        maximalForce    717.5
        tendonSlackLength    0.098
        pennationAngle    0.15707963
        maxVelocity    10
    endmuscle

        viapoint    TRIlat-P2
            parent      humerus
            muscle    TRIlat
            musclegroup    humerus_to_ulna
            position     -0.02344 -0.14528 0.00928
        endviapoint
        viapoint    TRIlat-P3
            parent      humerus
            muscle    TRIlat
            musclegroup    humerus_to_ulna
            position     -0.03184 -0.22637 -0.01217
        endviapoint
        viapoint    TRIlat-P4
            parent      humerus
            muscle    TRIlat
