"Normals:0","Normals:1","Normals:2","vtkOriginalPointIds","Points:0","Points:1","Points:2"
-0.94812,-0.26062,-0.18207,3,0.012734,0.38289,0.056014
-0.74,0.63933,-0.20893,4,0.014488,0.38961,0.052621
-0.99472,-0.10186,0.012428,5,0.013844,0.38099,0.050149
-0.68158,-0.71038,0.17549,6,0.014584,0.37883,0.048505
-0.24724,-0.93645,0.24888,7,0.01452,0.3809,0.05776
-0.38821,-0.91839,0.076501,8,0.0084583,0.38554,0.071369
-0.92053,-0.16728,-0.35305,9,0.0074879,0.38791,0.070106
-0.47282,0.75404,-0.45592,10,0.0050684,0.39506,0.078005
-0.54135,0.8144,-0.20905,11,0.01664,0.38753,0.037851
-0.44157,0.8785,-0.18233,12,0.017471,0.38822,0.038112
-0.40933,0.88924,-0.20422,13,0.015664,0.38682,0.037204
-0.49894,0.85377,-0.1488,14,0.014468,0.38619,0.036331
-0.92263,0.37129,0.1044,15,0.013348,0.38383,0.038181
0.091292,0.98779,-0.12621,16,0.019969,0.39077,0.050291
-0.76055,-0.50296,0.4106,17,0.012783,0.37567,0.037419
0.25278,-0.90341,0.34633,18,0.019287,0.37264,0.029635
0.68916,-0.67731,0.25751,19,0.022189,0.37821,0.045836
0.67785,-0.61849,0.39748,20,0.017059,0.38912,0.075642
-0.78855,-0.54375,-0.28726,21,0.00082999,0.38984,0.083611
-0.010644,-0.96025,0.27895,22,0.004709,0.38987,0.088679
0.19093,-0.92677,0.3235,23,0.007883,0.38856,0.08455
-0.88125,0.11623,-0.45813,24,-0.0074143,0.39976,0.094144
-0.044674,0.82447,-0.56413,25,-0.0046867,0.40263,0.093737
0.44989,0.88548,-0.11629,26,0.00067155,0.40075,0.099386
0.10326,0.97458,-0.1988,27,0.0049467,0.39741,0.089056
0.65751,0.75148,0.054396,28,0.017063,0.39296,0.073975
-0.52607,0.82057,-0.22342,29,0.017316,0.38738,0.035389
-0.38103,0.89954,-0.21363,30,0.017998,0.38821,0.03682
-0.4597,0.86538,-0.19948,31,0.016438,0.38675,0.03527
-0.35888,0.91448,-0.18688,32,0.015432,0.38636,0.035568
-0.34176,0.92277,-0.17803,33,0.015366,0.38609,0.034227
-0.42085,0.90088,-0.10631,34,0.013614,0.38518,0.03158
-0.2232,0.94995,-0.21858,35,0.01455,0.38553,0.032796
-0.88179,0.22207,0.41608,36,0.0082139,0.37544,0.02812
-0.28047,0.95958,0.023493,37,0.012974,0.38465,0.028346
-0.62782,0.77767,0.032844,38,0.012022,0.38414,0.024399
-0.8159,0.57787,0.019382,39,0.0097122,0.38246,0.014505
0.9825,0.17586,0.061361,40,0.025418,0.38544,0.038594
0.2715,0.94803,-0.16588,41,0.022155,0.38887,0.037277
-0.73064,-0.21172,0.64911,42,0.008788,0.37342,0.0288
-0.34509,-0.73675,0.58147,43,0.010066,0.3719,0.029091
0.77566,-0.61497,0.14202,44,0.023015,0.37274,0.020846
0.88368,-0.44703,0.13886,45,0.024562,0.37834,0.028962
-0.043024,-0.9461,0.321,46,0.013516,0.36971,0.026224
0.41546,-0.90227,0.11535,47,0.018912,0.36923,0.021448
0.44892,-0.77265,0.44888,48,0.009199,0.38966,0.085515
0.85159,-0.27971,0.44336,49,0.0094647,0.39464,0.091915
-0.50939,-0.85982,0.035077,50,-0.0030276,0.39193,0.091472
0.23016,-0.88052,0.41438,51,0.0068474,0.38917,0.086478
-0.038216,-0.95957,0.27886,52,0.00039942,0.39227,0.097549
-0.1554,-0.95426,0.25544,53,-0.0010753,0.39277,0.098823
0.3006,-0.81523,0.49501,54,0.0043638,0.39264,0.09547
0.16444,-0.91206,0.37563,55,0.0013405,0.39255,0.09827
0.33668,-0.84538,0.41471,56,0.0075935,0.39014,0.087884
-0.99186,-0.088663,-0.091416,57,-0.0093762,0.3974,0.10357
0.070554,0.97958,-0.18828,58,-0.0060261,0.40406,0.095427
-0.73314,0.6797,-0.022531,59,-0.0073582,0.40337,0.10132
0.48304,0.87428,-0.047937,60,-0.0015139,0.40217,0.10163
0.51246,0.85433,-0.08667,61,0.00064743,0.40101,0.10197
0.51022,0.85911,-0.040065,62,-0.0014502,0.40213,0.10018
0.47993,0.87547,-0.056674,63,0.002138,0.39993,0.10025
0.48269,0.87578,0.0033334,64,0.0063504,0.39771,0.095568
0.22505,0.96765,-0.11407,65,0.0059711,0.39753,0.090647
0.14697,0.98221,-0.11687,66,0.0084893,0.39688,0.088392
0.5634,0.81665,0.12512,67,0.01098,0.39625,0.086139
0.24572,0.96452,-0.096573,68,0.011809,0.39634,0.082704
-0.47456,0.82068,-0.31824,69,0.0177,0.3872,0.034056
-0.38889,0.88273,-0.26373,70,0.016552,0.3864,0.033589
-0.26098,0.91681,-0.30225,71,0.019319,0.38751,0.032478
-0.2113,0.94743,-0.24025,72,0.016274,0.38434,0.027748
-0.95265,0.28605,0.10311,73,0.0063174,0.37408,0.02533
-0.85153,-0.16723,0.49692,74,0.0064367,0.37269,0.026492
-0.19389,0.97968,0.051421,75,0.014259,0.38505,0.02081
0.068899,0.98181,0.17692,76,0.01592,0.38522,0.022488
-0.50068,0.86556,0.011287,77,0.012512,0.38434,0.022591
-0.35377,0.93447,0.04018,78,0.013244,0.38477,0.021762
-0.039734,0.98918,0.14121,79,0.016513,0.38387,0.024787
-0.94559,0.29458,-0.13817,80,0.0081385,0.37875,0.017744
-0.35299,0.93546,-0.01771,81,0.013362,0.38538,0.014968
-0.84002,0.35796,-0.40771,82,0.0098246,0.38249,0.013286
-0.96067,0.20084,-0.19176,83,0.0090403,0.3805,0.015413
0.30068,0.93189,-0.20292,84,0.023411,0.38558,0.026419
0.88672,-0.025298,-0.46162,85,0.025096,0.37696,0.017302
0.87333,0.39215,-0.28897,86,0.025359,0.38052,0.01923
0.80851,-0.38561,-0.44453,87,0.0246,0.37546,0.017208
-0.59769,-0.41157,0.68802,88,0.0078711,0.37226,0.027734
-0.50484,-0.78465,0.35981,89,0.0072343,0.37171,0.026569
0.67113,-0.73878,-0.061541,90,0.021693,0.37116,0.019364
0.80957,-0.58529,-0.045153,91,0.023,0.37276,0.01907
-0.023566,-0.98815,-0.15165,92,0.016891,0.36893,0.020514
-0.23722,-0.93839,-0.2513,93,0.013912,0.36908,0.021758
-0.30146,-0.94733,0.10815,94,0.010365,0.36979,0.024242
0.057171,-0.85938,-0.50814,95,0.018493,0.36921,0.019772
0.30659,-0.79796,-0.51891,96,0.020052,0.37022,0.01872
0.39245,-0.69073,0.60735,97,0.0065447,0.39281,0.094822
0.9486,-0.02935,0.31512,98,0.0074359,0.39601,0.097316
-0.025546,-0.9823,0.18558,99,-0.0030036,0.39482,0.10474
-0.42974,-0.89446,0.12355,100,-0.0076469,0.39538,0.10453
-0.11872,-0.95047,0.28724,101,-0.0022677,0.3942,0.10288
0.030918,-0.93741,0.34685,102,-0.0014832,0.3936,0.10131
0.27136,-0.53111,0.80267,103,0.0056979,0.39293,0.095098
0.19189,-0.75474,0.62733,104,0.0060689,0.39334,0.095228
0.30301,-0.86931,0.3905,105,0.001571,0.39356,0.10018
0.21436,-0.77063,0.60015,106,0.0052222,0.39249,0.094949
0.15399,-0.9136,0.37633,107,0.00031799,0.3941,0.10184
-0.72787,-0.66578,0.16418,108,-0.0095932,0.3987,0.11386
-0.99969,-0.006099,-0.023943,109,-0.010984,0.40078,0.11301
-0.66858,-0.7328,0.12652,110,-0.009162,0.3977,0.11057
-0.60461,0.73546,-0.30585,111,-0.0083133,0.40407,0.11374
-0.49842,0.85894,-0.11747,112,-0.0071543,0.40335,0.10632
-0.55502,0.83116,0.033416,113,-0.0072545,0.40326,0.10333
0.34901,0.93707,-0.010045,114,-0.0039316,0.40348,0.10039
0.45916,0.88797,-0.026138,115,-0.0029438,0.40305,0.10038
0.10418,0.9917,0.075324,116,-0.0047542,0.40373,0.10143
-0.088444,0.99443,0.057409,117,-0.0059005,0.40361,0.10148
0.33295,0.94276,0.018472,118,-0.0039982,0.40346,0.10297
0.48755,0.86646,-0.10744,119,0.00067171,0.40127,0.10434
0.52235,0.84929,-0.07652,120,0.0019227,0.40027,0.10277
0.96197,-0.27317,0.0015385,121,0.0054651,0.39849,0.11273
0.18991,0.97983,-0.062158,122,0.0072827,0.39736,0.091444
-0.4914,0.79757,-0.34987,123,0.018605,0.38696,0.03249
-0.34153,0.8946,-0.28818,124,0.017276,0.38576,0.030534
-0.43455,0.8682,-0.23957,125,0.018353,0.38565,0.029144
-0.28188,0.91752,-0.28053,126,0.019816,0.38708,0.030758
-0.4028,0.88628,-0.22861,127,0.01723,0.38483,0.027896
-0.96998,0.16908,-0.17481,128,0.0072766,0.37701,0.019364
-0.86891,-0.49063,-0.065462,129,0.0063217,0.37256,0.025377
-0.89406,-0.31294,-0.32052,130,0.0067498,0.37356,0.021778
0.088501,0.9951,-0.044004,131,0.01655,0.38568,0.015903
0.16063,0.93996,0.30113,132,0.017051,0.38525,0.021689
0.071516,0.914,0.39935,133,0.017066,0.38455,0.023033
-0.4681,0.87798,-0.10011,134,0.017906,0.38478,0.025948
-0.32277,0.92691,0.19148,135,0.018,0.38472,0.022829
-0.87104,-0.19137,-0.45239,136,0.0078739,0.37626,0.017622
-0.12804,0.78879,-0.60118,137,0.013297,0.38488,0.012492
0.12158,0.88581,-0.44783,138,0.014783,0.38521,0.012942
-0.50843,0.73495,-0.4487,139,0.011942,0.38427,0.012329
-0.2833,0.33715,-0.89781,140,0.012344,0.38328,0.011448
-0.61648,0.12098,-0.77802,141,0.010945,0.38217,0.012046
-0.49977,-0.22562,-0.83626,142,0.011813,0.37819,0.011596
-0.28695,0.92826,-0.23664,143,0.019893,0.38661,0.029003
-0.26419,0.94897,-0.17223,144,0.019769,0.38573,0.025268
-0.20317,0.9545,-0.21829,145,0.019834,0.38613,0.027187
-0.18614,0.98244,0.012856,146,0.018969,0.3853,0.02214
-0.16325,0.98258,-0.08877,147,0.019583,0.38542,0.023452
0.61491,0.60004,-0.51171,148,0.022967,0.38339,0.01854
0.21644,0.97035,-0.10759,149,0.019406,0.38511,0.019535
0.63615,0.33063,-0.69714,150,0.024913,0.3803,0.018164
0.40364,0.057578,-0.9131,151,0.024168,0.37707,0.016782
0.59961,0.46212,-0.65339,152,0.024026,0.38147,0.018199
0.50511,-0.60991,-0.61063,153,0.022861,0.37277,0.017595
0.18088,-0.30131,-0.93621,154,0.02256,0.37406,0.01695
0.2346,-0.17585,-0.95605,155,0.023484,0.37556,0.016716
-0.53128,-0.84686,0.023712,156,0.0085695,0.37062,0.024903
-0.21376,-0.8115,-0.54386,157,0.016017,0.36933,0.020142
-0.35595,-0.72273,-0.59242,158,0.01446,0.36962,0.020569
-0.45847,-0.8175,-0.34856,159,0.0090075,0.3706,0.0232
-0.17591,-0.49272,-0.85222,160,0.017536,0.37089,0.01839
-0.23498,-0.63966,-0.73186,161,0.016534,0.36998,0.019133
0.036399,-0.50106,-0.86465,162,0.02011,0.37157,0.017674
0.3876,-0.83315,0.3945,163,0.0064063,0.39411,0.096689
0.13018,-0.97888,0.15764,164,-0.0016144,0.3956,0.10816
0.12437,-0.98166,0.14448,165,-0.0031626,0.39533,0.10797
-0.047897,-0.98829,0.14489,166,-0.0048003,0.39514,0.10774
0.086329,-0.96369,0.25266,167,-0.0011636,0.39516,0.10566
-0.17867,-0.96843,0.17385,168,-0.0044532,0.39567,0.11057
-0.39522,-0.89687,0.19855,169,-0.0069836,0.39723,0.11401
0.12292,-0.94055,0.31662,170,-0.0005714,0.39456,0.10366
0.21041,-0.92689,0.3108,171,0.0013191,0.39504,0.10397
-0.60153,-0.74429,0.29017,172,-0.0083767,0.39894,0.11772
-0.62052,0.73935,-0.26138,173,-0.010009,0.40516,0.11814
-0.94413,-0.0033,0.32956,174,-0.0097778,0.40533,0.12512
-0.29687,0.89599,-0.33025,175,-0.0085565,0.40553,0.11749
-0.25124,0.93783,-0.23948,176,-0.0072979,0.40468,0.11353
-0.19928,0.93213,-0.30237,177,-0.0073908,0.40539,0.11577
-0.083989,0.99539,-0.046353,178,-0.0054483,0.40361,0.1062
-0.048041,0.98445,-0.16898,179,-0.0056792,0.40391,0.1097
0.23778,0.96781,-0.082475,180,-0.0037218,0.40356,0.10579
0.41519,0.89954,-0.13582,181,-0.0012736,0.40261,0.10678
0.60176,0.79179,-0.10466,182,0.0020221,0.40049,0.10534
0.55436,0.82012,-0.14172,183,0.0011927,0.40147,0.10754
0.57546,0.79261,-0.20153,184,0.0020828,0.40153,0.11097
0.18577,-0.94988,0.25144,185,0.00063893,0.39546,0.10597
0.17346,-0.981,0.086906,186,-0.0030152,0.39572,0.11079
0.18378,-0.96294,0.19742,187,0.00014831,0.39588,0.1084
0.88833,-0.13709,-0.43827,188,0.0089987,0.39907,0.1218
0.2194,-0.96626,-0.13494,189,0.0034872,0.39705,0.12027
0.25161,-0.96645,-0.051669,190,0.0023179,0.39702,0.11716
0.59451,0.76081,-0.26024,191,0.0032405,0.40199,0.11555
-0.50382,0.8464,-0.17252,192,0.018797,0.3856,0.027451
-0.66297,-0.6403,-0.38793,193,0.007648,0.37209,0.02245
-0.67125,-0.71374,-0.19999,194,0.0074677,0.37153,0.023836
-0.55646,-0.62275,-0.55004,195,0.0079339,0.37277,0.02115
-0.015838,0.98043,0.19621,196,0.018127,0.38526,0.021374
0.47174,0.74469,-0.47213,197,0.018217,0.38494,0.014874
-0.60866,-0.61448,-0.50194,198,0.0093931,0.37563,0.016371
-0.63276,-0.51432,-0.57887,199,0.010201,0.37643,0.01423
0.30513,0.51694,-0.79979,200,0.015049,0.38376,0.01185
0.07147,-0.14366,-0.98704,201,0.013764,0.38048,0.010996
0.32112,0.16212,-0.93306,202,0.015287,0.38225,0.011086
-0.23626,-0.62703,-0.7423,203,0.011686,0.37687,0.012643
0.097467,-0.51176,-0.85358,204,0.0131,0.37838,0.011516
0.6764,0.29651,-0.67422,205,0.021835,0.38219,0.016621
0.60055,0.17012,-0.78128,206,0.020693,0.38159,0.015182
0.56287,0.30021,-0.7701,207,0.022925,0.38036,0.01709
0.11763,-0.17817,-0.97694,208,0.021936,0.37562,0.016569
0.44877,0.016045,-0.8935,209,0.021606,0.37979,0.015785
0.060833,-0.35339,-0.9335,210,0.021273,0.37265,0.01728
0.046325,-0.30015,-0.95277,211,0.02076,0.37416,0.016854
-0.36501,-0.68192,-0.63384,212,0.011015,0.37061,0.021591
-0.37897,-0.44295,-0.81251,213,0.015179,0.37046,0.019458
-0.4467,-0.71242,-0.54122,214,0.0092051,0.37133,0.021758
-0.12147,-0.36991,-0.92109,215,0.018638,0.37198,0.017678
-0.21428,-0.49935,-0.83949,216,0.016216,0.37153,0.018601
-0.019753,-0.99964,0.018128,217,0.0012371,0.39656,0.12309
-0.35757,-0.91457,0.18897,218,0.00028685,0.39702,0.12586
-0.42307,-0.87478,0.23616,219,-0.0059605,0.39767,0.11768
-0.44816,-0.85745,0.25286,220,-0.0070574,0.39839,0.11819
-0.43048,-0.8478,0.30972,221,0.0011509,0.39717,0.12817
-0.73128,-0.28475,0.61979,222,-0.00051158,0.40203,0.13573
0.12821,0.9233,-0.36204,223,-0.0060498,0.40892,0.12497
-0.63107,0.74891,0.20221,224,-0.0074448,0.4089,0.12545
-0.021544,0.93544,-0.35282,225,-0.005832,0.40716,0.12083
0.017439,0.97122,-0.23756,226,-0.0053681,0.40494,0.11377
0.14631,0.94356,-0.29712,227,-0.0044763,0.40595,0.11831
0.18407,0.97127,-0.15086,228,-0.0035359,0.4039,0.10948
0.42149,0.89041,-0.17182,229,-0.00064938,0.4029,0.11042
0.4408,0.87112,-0.21645,230,0.00030512,0.40351,0.11503
0.20998,-0.97714,-0.033271,231,0.00062976,0.39669,0.1173
0.71478,0.69558,-0.072544,232,0.010836,0.40122,0.12959
0.4505,-0.87076,-0.19703,233,0.0091319,0.39658,0.12619
0.95907,-0.21621,-0.18287,234,0.01157,0.39852,0.12816
-0.13439,-0.98016,0.14569,235,0.0054878,0.39597,0.12874
0.16405,-0.98569,-0.038851,236,0.0018225,0.39675,0.12027
0.45906,0.85482,-0.24196,237,0.0016185,0.40392,0.11936
-0.12505,-0.73439,-0.66711,238,0.011747,0.37544,0.013974
0.29208,-0.46071,-0.83812,239,0.014612,0.37852,0.011731
0.50892,-0.25635,-0.82176,240,0.016298,0.3803,0.011946
0.24376,-0.41851,-0.87489,241,0.017947,0.37535,0.016046
-0.27326,-0.94946,0.15447,242,0.0029726,0.39632,0.12754
-0.57272,-0.5796,0.5797,243,0.00054997,0.40116,0.1361
-0.55153,0.069834,0.83123,244,0.00018687,0.40314,0.13632
-0.49629,0.48692,0.71876,245,-0.0031676,0.40933,0.13173
0.45989,0.81448,-0.35372,246,0.0014008,0.40603,0.12555
0.51107,0.74974,-0.42036,247,0.0001307,0.40784,0.12736
0.39774,0.85378,-0.33596,248,-0.00039466,0.40918,0.12901
0.058715,0.99171,0.11429,249,-0.002185,0.41019,0.13105
0.34859,0.90536,-0.24251,250,-0.0015893,0.4054,0.11893
0.28404,0.93473,-0.21354,251,-0.0026543,0.40463,0.11435
0.51682,0.80217,-0.29905,252,0.003387,0.40556,0.1275
0.61146,0.75028,-0.2514,253,0.0023297,0.40729,0.13011
0.67771,0.73533,0.0014504,254,0.0036441,0.4064,0.13159
0.69031,0.62591,0.36291,255,0.0047983,0.40497,0.13324
0.77346,-0.37833,0.50855,256,0.011169,0.39773,0.13281
-0.39624,-0.72574,0.5624,257,0.0034325,0.39866,0.13618
0.059762,-0.81579,0.57525,258,0.0057002,0.39816,0.13618
0.42405,-0.53406,-0.73141,259,0.015853,0.37841,0.012447
-0.19631,0.033436,0.97997,260,0.0019387,0.40183,0.1374
-0.12788,0.50031,0.85635,261,0.00048397,0.40544,0.13564
0.44713,0.7358,0.5086,262,0.0022945,0.40813,0.13291
0.56826,0.75468,-0.32793,263,0.0018098,0.40684,0.12813
0.57185,0.79384,-0.20691,264,0.00095397,0.40893,0.13109
0.71619,0.68348,-0.14119,265,0.002433,0.40776,0.1316
0.32862,-0.009627,0.94441,266,0.0047478,0.39948,0.13729
