<?xml version="1.0"?>
<VTKFile type="PolyData" version="0.1" byte_order="LittleEndian" compressor="vtkZLibDataCompressor">
	<PolyData>
		<Piece NumberOfPoints="770" NumberOfVerts="0" NumberOfLines="0" NumberOfStrips="0" NumberOfPolys="1550">
		<PointData Normals="Normals">
		<DataArray type="Float32" Name="Normals" NumberOfComponents="3" format="ascii">
			-0.321182 -0.862290 -0.391534
			-0.883342 -0.387245 0.264099
			-0.725873 -0.489763 -0.482950
			-0.688106 -0.544092 0.480077
			0.398446 -0.904375 0.152796
			-0.915735 -0.191370 0.353281
			0.234156 -0.499015 -0.834359
			0.521423 -0.624247 -0.581751
			-0.958887 -0.052684 0.278856
			-0.965684 0.142557 0.217100
			0.331590 -0.308185 -0.891667
			-0.874973 -0.279351 -0.395455
			-0.455699 -0.374399 0.807567
			-0.818532 -0.121660 0.561431
			0.703919 -0.486754 0.517270
			0.870136 -0.381817 -0.311576
			-0.917123 0.018952 0.398154
			0.895916 -0.188320 -0.402331
			0.801764 -0.104511 -0.588431
			-0.943106 0.273308 0.189348
			-0.925196 0.282749 0.253111
			-0.928402 0.129686 0.348212
			0.862704 -0.000791 -0.505709
			0.882103 -0.055182 -0.467814
			0.266173 -0.259660 -0.928293
			-0.982490 -0.131165 -0.132321
			-0.258912 -0.279798 0.924488
			-0.764863 -0.121061 0.632716
			-0.926799 0.071057 0.368775
			0.963135 -0.123890 -0.238792
			0.714681 -0.350905 0.605059
			-0.947671 0.286339 0.141174
			0.951052 -0.112525 -0.287815
			-0.930990 0.344902 0.119586
			-0.891119 0.097978 0.443066
			-0.901534 0.158191 0.402756
			-0.882820 0.055359 0.466438
			0.902860 -0.044825 -0.427592
			0.938694 -0.122101 -0.322405
			0.857656 0.004096 -0.514208
			0.105392 -0.207216 -0.972602
			-0.959837 -0.026734 0.279281
			-0.997441 -0.021458 -0.068191
			-0.252497 -0.315399 0.914751
			-0.782867 0.012426 0.622066
			-0.923838 0.269099 0.272231
			-0.896166 0.433539 0.094502
			0.964984 -0.261965 -0.013457
			0.510838 -0.474494 0.716868
			-0.885752 0.431724 0.170466
			0.938153 -0.248232 -0.241348
			-0.856447 0.263311 0.444034
			-0.860951 0.079729 0.502401
			-0.839383 0.125771 0.528788
			-0.782822 0.198249 0.589820
			-0.889144 0.068879 0.452415
			0.872117 -0.006849 -0.489250
			0.869733 -0.101312 -0.483013
			0.906844 -0.181589 -0.380343
			0.865748 -0.076449 -0.494607
			0.017413 -0.090319 -0.995761
			-0.871607 0.147176 0.467590
			-0.994716 0.100705 -0.019979
			-0.007168 -0.380229 0.924865
			-0.671400 0.171157 0.721060
			-0.818368 0.473937 0.325051
			-0.801500 0.587731 0.110317
			-0.787671 0.569168 0.235844
			0.757755 -0.488249 0.432922
			0.440562 -0.604916 0.663311
			-0.749022 0.372558 0.547874
			0.916277 -0.396515 -0.056682
			-0.699192 0.263824 0.664476
			-0.846010 0.210990 0.489642
			-0.815083 0.249100 0.523058
			-0.749498 0.294652 0.592817
			-0.697098 0.315138 0.644005
			0.881863 -0.092530 -0.462338
			0.842316 -0.036891 -0.537720
			0.798597 -0.166661 -0.578331
			0.883109 -0.312373 -0.350060
			0.833340 -0.129192 -0.537452
			0.225124 0.009382 -0.974285
			-0.744108 0.172543 0.645393
			-0.880886 0.123741 0.456867
			-0.775577 0.114953 0.620698
			-0.882872 0.119853 0.454062
			-0.990248 0.118143 0.073826
			0.057154 -0.335808 0.940195
			-0.474302 0.204967 0.856169
			-0.703954 0.560286 0.436496
			-0.707486 0.699134 0.103318
			-0.699294 0.680655 0.218396
			-0.623928 0.440137 0.645751
			0.633211 -0.634250 0.443590
			0.464523 -0.669250 0.579933
			-0.562376 0.283919 0.776611
			0.767006 -0.595741 0.238319
			-0.613287 0.314375 0.724602
			-0.763202 0.189404 0.617777
			-0.738824 0.137215 0.659781
			-0.745689 0.073160 0.662265
			-0.755599 0.050498 0.653085
			0.842931 -0.210563 -0.495106
			0.858906 -0.119224 -0.498062
			0.755990 -0.063417 -0.651504
			0.663554 -0.253300 -0.703943
			0.829811 -0.532030 -0.168398
			0.722965 -0.146501 -0.675173
			-0.990629 0.106317 -0.085733
			-0.128706 0.077552 -0.988646
			-0.564243 -0.146038 0.812590
			-0.634952 -0.278120 0.720753
			-0.672218 -0.051222 0.738579
			0.090387 -0.304722 0.948143
			-0.275095 0.140529 0.951091
			-0.624241 0.580121 0.523242
			-0.649743 0.748430 0.132991
			-0.682625 0.697009 0.219548
			-0.601656 0.454123 0.657101
			-0.462751 0.277924 0.841796
			0.687082 -0.712290 0.143395
			0.475098 -0.723501 0.500827
			-0.522656 0.261123 0.811570
			0.724168 -0.663528 0.187912
			-0.735796 0.068178 0.673763
			-0.584142 -0.468891 0.662509
			-0.546276 -0.556859 0.625691
			-0.660708 -0.488995 0.569516
			-0.732212 -0.370336 0.571591
			0.760712 -0.217031 -0.611731
			0.809298 -0.269836 -0.521753
			0.782962 -0.196048 -0.590369
			0.562977 -0.143929 -0.813844
			0.485069 -0.280674 -0.828209
			0.745919 -0.620862 -0.241113
			0.662594 -0.242287 -0.708707
			-0.621536 -0.226491 0.749930
			-0.974243 0.102433 0.200894
			-0.894618 0.281572 -0.346953
			-0.230631 0.147892 -0.961736
			-0.442322 -0.515418 0.733959
			-0.278830 -0.806658 0.521111
			-0.104748 -0.934516 0.340157
			0.011977 -0.291283 0.956562
			-0.310049 0.121835 0.942882
			-0.616325 0.624719 0.479447
			-0.664528 0.743470 0.075198
			-0.661733 0.692376 0.287617
			-0.590653 0.444468 0.673482
			-0.498171 0.292629 0.816207
			-0.485723 0.198284 0.851326
			0.660503 -0.748521 -0.058746
			0.427546 -0.773915 0.467183
			-0.716111 0.041293 0.696764
			0.634595 -0.762201 0.127828
			-0.806823 -0.257827 0.531565
			-0.004839 -0.944475 0.328547
			-0.183988 -0.873905 0.449932
			-0.515097 -0.678184 0.524159
			-0.693299 -0.497538 0.521337
			0.679620 -0.325783 -0.657254
			0.755704 -0.274649 -0.594542
			0.750507 -0.313448 -0.581798
			0.641087 -0.244216 -0.727576
			0.376182 -0.100299 -0.921101
			0.415392 -0.231671 -0.879647
			0.643407 -0.699180 -0.311728
			0.557631 -0.396217 -0.729425
			-0.505795 -0.690149 0.517557
			-0.764169 -0.303969 0.568901
			-0.884887 0.397427 0.242954
			-0.707387 0.680007 0.192858
			-0.743414 0.668787 0.007666
			-0.852193 0.506262 -0.132158
			-0.811203 0.506969 0.291431
			-0.827927 0.560831 0.002220
			0.110594 0.065179 -0.991726
			-0.263448 -0.938888 0.221549
			0.001673 -0.987548 0.157309
			0.050910 -0.936781 0.346192
			-0.130397 -0.314267 0.940337
			-0.322528 0.070849 0.943905
			-0.585469 0.607440 0.536883
			-0.655490 0.748535 0.100143
			-0.690043 0.673817 0.264218
			-0.619350 0.464244 0.633153
			-0.512708 0.293820 0.806722
			-0.503111 0.146877 0.851650
			-0.652061 -0.085893 0.753286
			0.633832 -0.763774 -0.122093
			0.386242 -0.814473 0.432956
			-0.816650 -0.264348 0.513033
			0.573511 -0.805858 0.147234
			-0.828588 -0.343405 0.442170
			-0.008216 -0.807999 0.589126
			-0.338000 -0.667496 0.663480
			-0.556860 -0.575741 0.598690
			-0.755119 -0.373752 0.538613
			0.545681 -0.537382 -0.643003
			0.668698 -0.379052 -0.639658
			0.739730 -0.313656 -0.595331
			0.698831 -0.319671 -0.639879
			0.497284 -0.184436 -0.847757
			0.303953 -0.033708 -0.952090
			0.403957 -0.233072 -0.884588
			0.654687 -0.689103 -0.310680
			0.431417 -0.345621 -0.833322
			-0.858159 -0.277754 0.431759
			-0.495678 -0.848432 0.185649
			-0.651967 0.735014 0.186262
			-0.712850 0.672978 0.197348
			-0.636953 0.716610 0.284185
			-0.586241 0.625399 0.514973
			-0.557196 0.474160 0.681693
			-0.568286 0.352808 0.743356
			-0.736189 0.671183 -0.086831
			0.141917 0.070368 -0.987374
			-0.751449 -0.595607 0.283860
			-0.623070 -0.507328 0.595316
			-0.524625 -0.244783 0.815383
			-0.091334 -0.368055 0.925307
			-0.302452 0.020205 0.952950
			-0.533447 0.557315 0.636266
			-0.653837 0.731226 0.194437
			-0.712788 0.639563 0.287910
			-0.666332 0.451157 0.593682
			-0.552812 0.314012 0.771878
			-0.514583 0.099288 0.851672
			-0.632490 -0.165971 0.756578
			-0.700677 -0.382906 0.602026
			0.627720 -0.763933 -0.149577
			0.421539 -0.854455 0.303662
			-0.751414 -0.408973 0.517802
			0.622759 -0.768943 0.144564
			-0.761072 -0.318252 0.565231
			-0.658279 0.043948 0.751490
			-0.646835 -0.235452 0.725374
			-0.682489 -0.382604 0.622754
			-0.722804 -0.298881 0.623077
			0.365309 -0.516503 -0.774451
			0.428333 -0.632050 -0.645789
			0.633587 -0.441414 -0.635390
			0.690780 -0.350638 -0.632357
			0.599439 -0.310650 -0.737679
			0.413183 -0.176972 -0.893287
			0.250064 -0.037555 -0.967501
			0.321194 -0.205708 -0.924401
			0.659792 -0.662671 -0.354318
			0.401323 -0.217052 -0.889847
			-0.933930 0.070942 0.350344
			-0.915205 0.376182 0.144525
			-0.542023 0.825471 0.157512
			-0.649749 0.753442 0.100754
			-0.472289 0.841921 0.260983
			-0.481430 0.742162 0.466284
			-0.562074 0.585454 0.584223
			-0.427341 0.503740 0.750750
			-0.458691 0.335140 0.822973
			-0.579658 0.469629 0.665917
			-0.700517 0.696488 0.155501
			-0.102110 0.716367 -0.690211
			-0.830834 0.452083 0.324557
			-0.722588 0.580020 0.376091
			-0.562538 0.810124 0.165076
			-0.185209 -0.376112 0.907875
			-0.338074 0.070414 0.938482
			-0.490631 0.547735 0.677693
			-0.588131 0.705375 0.395662
			-0.725260 0.598635 0.340049
			-0.736818 0.414715 0.533958
			-0.691672 0.316952 0.648946
			-0.599680 0.107787 0.792948
			-0.505049 -0.246124 0.827253
			-0.484447 -0.433627 0.759789
			-0.411479 -0.580259 0.702841
			0.659188 -0.727372 -0.190789
			0.359756 -0.877744 0.316450
			-0.399954 -0.522174 0.753240
			0.599989 -0.796570 0.074086
			-0.381224 -0.465833 0.798541
			-0.619167 0.648153 0.443318
			-0.794122 0.203954 0.572515
			-0.718198 -0.340115 0.607053
			-0.508975 -0.493945 0.704956
			0.450966 -0.247095 -0.857656
			0.324548 -0.624948 -0.710006
			0.395931 -0.689770 -0.606182
			0.591928 -0.486674 -0.642471
			0.590466 -0.384537 -0.709564
			0.509390 -0.307567 -0.803694
			0.365591 -0.169040 -0.915297
			0.220904 -0.020775 -0.975074
			0.351825 -0.177068 -0.919166
			0.606887 -0.665268 -0.434864
			0.448143 0.647769 -0.616087
			-0.567725 0.806643 -0.164364
			-0.545528 0.833099 -0.091355
			-0.339176 0.940562 0.017387
			-0.116731 0.950808 -0.286946
			-0.234987 0.951740 0.197415
			-0.320852 0.822541 0.469553
			-0.337968 0.651389 0.679316
			-0.369752 0.242132 0.897026
			-0.310149 0.349264 0.884207
			-0.447584 0.255385 0.856999
			-0.206447 0.617859 0.758702
			-0.322408 0.937743 0.129192
			-0.484196 0.873891 0.043234
			-0.179400 0.946439 -0.268457
			-0.053727 0.985838 -0.158861
			-0.171300 -0.372502 0.912085
			-0.389011 0.018747 0.921042
			-0.604152 0.524469 0.599943
			-0.638843 0.632833 0.437496
			-0.726750 0.505198 0.465413
			-0.752444 0.349464 0.558303
			-0.743369 0.272351 0.610923
			-0.734521 0.194906 0.649992
			-0.614312 -0.024366 0.788687
			-0.380716 -0.317650 0.868420
			-0.299291 -0.518819 0.800782
			-0.178732 -0.592511 0.785484
			0.522338 -0.809697 -0.267494
			0.266839 -0.942366 0.201851
			0.016074 -0.423818 0.905605
			0.524639 -0.850408 -0.039500
			0.422196 -0.474734 0.772255
			0.138155 0.802370 -0.580617
			-0.707768 -0.278127 0.649392
			-0.642344 0.558933 0.524394
			-0.121788 0.900423 -0.417619
			-0.381358 -0.600157 0.703120
			0.789142 0.571649 -0.224662
			0.520852 -0.317715 -0.792320
			0.350711 -0.696048 -0.626513
			0.381529 -0.698570 -0.605340
			0.550488 -0.485879 -0.678885
			0.541065 -0.361800 -0.759177
			0.452473 -0.289847 -0.843360
			0.315718 -0.151115 -0.936742
			0.206899 -0.009701 -0.978314
			0.407608 -0.258893 -0.875689
			0.610165 -0.671017 -0.421230
			0.052047 0.851623 -0.521565
			0.107614 0.873660 -0.474486
			0.074853 0.991297 -0.108290
			0.374227 0.841757 -0.389099
			0.068963 0.982238 0.174506
			-0.145304 0.828887 0.540216
			-0.293595 0.552691 0.779958
			-0.012539 0.513881 0.857770
			0.107561 0.440921 0.891078
			0.161618 0.550111 0.819303
			0.232405 0.804876 -0.546043
			0.405663 0.770137 -0.492267
			0.514551 0.514574 -0.685894
			-0.151077 -0.368644 0.917212
			-0.498315 0.026205 0.866600
			-0.719463 0.424978 0.549333
			-0.772538 0.536868 0.339054
			-0.769763 0.439707 0.462734
			-0.752857 0.359184 0.551537
			-0.724903 0.351522 0.592409
			-0.653032 0.206320 0.728685
			-0.647958 0.106289 0.754224
			-0.567173 -0.131911 0.812966
			-0.440264 -0.408030 0.799800
			-0.335582 -0.518827 0.786259
			-0.033593 -0.178933 0.983288
			0.454232 -0.812107 -0.366272
			0.461053 -0.861432 0.212990
			0.508120 0.594999 0.622728
			0.519046 -0.824606 -0.224982
			0.693298 0.690997 0.204599
			0.877129 -0.474098 0.076655
			0.343697 -0.748817 0.566697
			0.991788 0.090801 -0.090069
			0.491485 0.386750 -0.780299
			0.452876 0.303600 -0.838290
			0.490427 0.311081 -0.814070
			-0.798615 -0.191762 0.570475
			-0.679871 0.527911 0.509004
			-0.032559 0.900521 -0.433591
			0.323263 0.075252 -0.943313
			-0.363245 -0.763146 0.534473
			0.891030 0.415724 -0.182315
			0.401887 -0.391409 -0.827820
			0.204772 -0.741896 -0.638482
			0.320800 -0.724600 -0.609952
			0.486022 -0.497852 -0.718280
			0.484824 -0.352536 -0.800415
			0.360033 -0.277466 -0.890724
			0.239715 -0.168706 -0.956073
			0.212259 -0.099234 -0.972162
			0.426067 -0.534872 -0.729644
			0.527392 -0.760462 -0.378888
			0.509633 0.680370 -0.526660
			0.571925 0.589518 -0.570413
			0.283820 0.957312 -0.054773
			0.367333 0.897239 -0.245008
			-0.017369 0.914525 0.404157
			-0.273777 0.705498 0.653696
			0.085679 0.762886 0.640831
			0.881421 0.348303 -0.319035
			0.827639 0.321378 -0.460141
			0.539548 0.548450 -0.638819
			0.507594 0.575752 -0.640982
			0.415545 0.580242 -0.700458
			0.061235 -0.503988 0.861537
			-0.503351 -0.083125 0.860074
			-0.769853 0.298976 0.563862
			-0.832397 0.475695 0.284306
			-0.839115 0.464122 0.283685
			-0.814499 0.388977 0.430452
			-0.796336 0.412403 0.442462
			-0.779424 0.275518 0.562661
			-0.715996 0.010577 0.698024
			-0.712624 -0.041028 0.700345
			-0.654760 -0.217263 0.723938
			-0.551022 -0.269734 0.789695
			-0.343291 -0.072102 0.936457
			0.106979 0.787943 0.606384
			0.485930 -0.772851 -0.408135
			0.390495 -0.877210 0.279313
			0.392073 -0.870612 -0.297175
			0.116269 0.983795 0.136485
			-0.138240 0.988843 0.055485
			0.524117 0.851509 -0.015324
			0.708384 -0.624560 -0.328811
			0.689481 0.063258 -0.721536
			0.410387 -0.888873 0.203686
			0.632567 0.261545 -0.729009
			0.745825 0.527975 -0.406186
			0.626392 0.392269 -0.673615
			0.484988 0.613179 -0.623537
			0.542248 -0.247861 -0.802828
			-0.806872 -0.238031 0.540647
			-0.641682 0.626518 0.442402
			-0.115487 0.956230 -0.268863
			0.175815 0.088370 -0.980449
			0.360208 -0.511247 -0.780306
			-0.016422 -0.954756 0.296936
			0.285325 -0.487210 -0.825358
			0.191133 -0.786638 -0.587085
			0.260625 -0.752776 -0.604485
			0.371901 -0.549359 -0.748261
			0.343815 -0.381073 -0.858239
			0.214961 -0.299917 -0.929431
			0.146486 -0.234904 -0.960917
			0.228303 -0.380268 -0.896256
			0.193784 -0.813077 -0.548956
			0.248802 -0.925690 -0.284948
			0.431583 0.879433 -0.200834
			0.391390 0.885314 -0.251065
			0.009227 0.972586 0.232360
			0.044036 0.971452 0.233114
			-0.246948 0.776352 0.579909
			-0.081157 0.781135 0.619066
			0.829408 0.419440 -0.368989
			0.372483 -0.595293 -0.711957
			0.307850 0.884896 -0.349552
			0.255889 0.889809 -0.377837
			0.195902 0.903757 -0.380586
			-0.031828 -0.693449 0.719802
			-0.362573 -0.295478 0.883874
			-0.720626 0.174417 0.671027
			-0.792368 0.416944 0.445322
			-0.872896 0.368823 0.319410
			-0.900304 0.369497 0.230053
			-0.886444 0.389971 0.249278
			-0.911389 0.254683 0.323275
			-0.888683 0.069586 0.453212
			-0.848666 -0.012251 0.528787
			-0.846649 0.085452 0.525246
			-0.780317 0.168294 0.602314
			-0.623046 0.422712 0.658124
			-0.306728 0.778770 0.547206
			-0.169117 0.964295 0.203800
			0.261504 -0.963006 -0.065074
			0.343200 -0.867534 0.359999
			-0.482549 0.818987 0.310496
			-0.419837 0.905797 0.057175
			-0.550899 0.810653 0.198371
			0.102571 0.994079 0.035861
			0.510349 -0.803066 -0.307617
			0.507397 -0.861180 -0.030284
			0.498654 0.766999 -0.403803
			0.055781 0.944835 -0.322763
			-0.448926 -0.511593 0.732624
			-0.593368 0.639411 0.488945
			-0.198163 0.953722 -0.226154
			-0.061546 0.157556 -0.985590
			0.148632 -0.648067 -0.746939
			0.314091 -0.913258 -0.259436
			0.372876 -0.899432 0.228001
			0.181030 -0.811231 -0.555997
			0.239892 -0.760639 -0.603225
			0.291518 -0.551745 -0.781406
			0.198942 -0.385026 -0.901208
			0.109630 -0.322375 -0.940242
			0.118682 -0.350484 -0.929019
			0.141264 -0.617939 -0.773432
			0.085792 -0.862839 -0.498146
			0.116088 -0.975334 -0.187744
			0.032902 0.949219 0.312891
			-0.023917 0.979121 0.201865
			-0.207166 0.851002 0.482574
			-0.133766 0.871878 0.471100
			0.089715 0.806812 0.583958
			0.916859 0.390653 -0.082216
			0.408606 -0.654186 -0.636460
			-0.061202 0.993881 0.091952
			-0.146888 0.985824 0.081092
			-0.363849 0.929893 -0.053971
			-0.017784 -0.817376 0.575830
			-0.300488 -0.313209 0.900892
			-0.052363 -0.588284 0.806957
			-0.644218 0.133721 0.753061
			-0.747010 0.290563 0.597954
			-0.722277 0.478447 0.499404
			-0.721035 0.490021 0.489886
			-0.756414 0.440001 0.483980
			-0.716313 0.489654 0.497127
			-0.661746 0.533752 0.526498
			-0.655003 0.603640 0.454521
			-0.561159 0.727563 0.394656
			-0.652630 0.704533 0.278762
			0.040841 -0.975438 0.216454
			0.331174 -0.652830 0.681276
			-0.582716 0.786487 0.204646
			-0.627896 0.761681 0.159962
			-0.555624 0.806226 0.203179
			-0.381872 0.915466 0.126871
			0.460756 -0.887086 0.027966
			-0.529789 0.848089 0.008260
			0.034410 -0.543501 0.838703
			-0.359655 0.587684 0.724759
			-0.259852 0.911992 -0.317408
			-0.207930 0.074603 -0.975295
			-0.016436 -0.754130 -0.656520
			0.138593 -0.973021 -0.184452
			0.273243 -0.951343 0.142423
			0.466124 -0.835153 0.291971
			0.185152 -0.827517 -0.530033
			0.181298 -0.752971 -0.632586
			0.123214 -0.560415 -0.818995
			0.064419 -0.423856 -0.903436
			-0.037133 -0.373086 -0.927053
			0.058925 -0.489636 -0.869934
			0.126208 -0.662556 -0.738303
			0.134280 -0.862140 -0.488553
			-0.010084 -0.979045 -0.203394
			-0.106036 0.907993 0.405346
			-0.205182 0.909216 0.362252
			0.473648 0.802771 0.362237
			0.316361 0.942687 0.106099
			0.985828 0.005902 -0.167656
			0.481685 -0.687877 -0.542960
			-0.339685 0.907247 0.248025
			-0.500329 0.858010 0.116143
			-0.475566 0.875254 0.088135
			0.270343 -0.962459 0.024228
			0.487963 -0.224521 0.843494
			0.295584 -0.595201 0.747239
			0.292817 -0.104167 0.950478
			0.276282 0.056083 0.959439
			0.298299 0.244831 0.922538
			0.196294 0.415945 0.887952
			0.052911 0.527471 0.847924
			0.241324 0.360857 0.900858
			-0.216798 0.660885 0.718491
			0.290981 0.473277 0.831468
			-0.043679 0.505784 0.861554
			-0.330500 0.343115 0.879228
			-0.237889 0.192541 0.952017
			0.484381 -0.593028 0.643189
			0.210946 0.688430 0.693950
			0.235380 0.529392 0.815071
			-0.327859 0.892262 0.310447
			-0.524937 0.846916 0.084697
			-0.357670 0.884253 0.300282
			-0.128017 0.921168 0.367507
			-0.210275 0.975234 0.068583
			0.184869 -0.536686 0.823281
			-0.239561 0.511550 0.825183
			-0.103931 0.992261 -0.067944
			0.006358 0.461695 -0.887016
			0.115696 -0.803231 -0.584324
			0.326279 -0.943422 0.059137
			0.167875 -0.938915 0.300426
			0.343659 -0.842743 0.414346
			0.151353 -0.817350 -0.555905
			0.034653 -0.721303 -0.691752
			-0.009888 -0.602994 -0.797685
			-0.040499 -0.453251 -0.890462
			0.033836 -0.415129 -0.909133
			0.130086 -0.528599 -0.838845
			0.171317 -0.693294 -0.699996
			0.355956 -0.878045 -0.319895
			-0.121739 0.987996 0.095093
			-0.391745 0.892835 0.222221
			0.814447 -0.095888 -0.572260
			-0.067454 0.626803 -0.776252
			0.356361 -0.722624 -0.592302
			-0.507289 0.846387 0.162133
			-0.490652 0.850364 0.190110
			-0.002585 0.961183 0.275899
			0.819430 -0.328410 0.469767
			0.851928 -0.436713 0.288962
			0.958812 -0.283422 -0.018747
			0.886483 -0.462521 0.014917
			0.972480 -0.047229 0.228151
			0.988344 0.103630 0.111524
			0.990988 0.091891 0.097459
			0.909394 -0.245143 0.336017
			0.869600 -0.317328 0.378284
			0.862848 -0.213292 0.458258
			0.372135 0.546937 0.749917
			0.037573 0.972267 0.230836
			0.163054 0.887474 0.431048
			0.425372 0.643762 0.636104
			0.634579 0.763011 0.122980
			0.027388 0.645789 0.763025
			0.301986 -0.626467 0.718570
			0.107865 0.987065 -0.118609
			0.561138 0.666006 -0.491488
			0.441557 -0.668871 -0.598029
			0.361788 -0.926758 0.101137
			0.232478 -0.855591 0.462513
			0.070593 -0.747713 -0.660259
			-0.056140 -0.696149 -0.715699
			-0.082248 -0.597885 -0.797351
			0.115802 -0.430205 -0.895273
			0.181996 -0.353043 -0.917735
			0.211122 -0.482254 -0.850211
			0.468515 -0.735658 -0.489185
			-0.621462 0.733629 -0.274908
			-0.585951 0.792642 0.168461
			0.025151 -0.665402 -0.746061
			-0.397248 -0.236956 -0.886593
			-0.369331 0.820833 0.435693
			-0.656211 0.637800 0.403236
			0.025579 0.835151 0.549426
			0.520761 0.485439 0.702252
			0.463697 -0.329393 -0.822487
			0.364175 -0.550045 -0.751550
			0.614684 -0.084563 -0.784228
			0.659176 0.085370 -0.747127
			0.631732 -0.207369 -0.746936
			0.733762 -0.429688 -0.526272
			0.858060 -0.300760 -0.416265
			0.870966 0.147848 0.468571
			0.468644 0.743696 0.476748
			0.532240 0.651808 0.540247
			0.877865 0.391112 0.276377
			0.956309 0.042702 -0.289222
			0.942616 -0.266443 -0.201206
			0.236673 0.476604 0.846661
			0.217144 0.847217 0.484842
			0.266939 -0.236529 0.934236
			0.603332 0.732571 0.315167
			0.972420 -0.173433 0.155950
			0.519192 -0.643379 0.562586
			0.207766 -0.905518 0.369959
			-0.124360 -0.724148 -0.678339
			-0.092161 -0.697241 -0.710888
			0.141432 -0.572884 -0.807342
			0.237927 -0.384351 -0.892000
			0.206915 -0.315753 -0.926006
			-0.873848 0.459587 -0.158651
			-0.517852 -0.023508 -0.855147
			0.053410 -0.726819 -0.684749
			-0.141621 -0.761561 -0.632431
			0.020901 -0.494944 -0.868673
			-0.212049 0.811765 0.544126
			-0.396717 0.890715 0.221905
			-0.591399 0.741885 -0.315998
			0.049593 0.679150 0.732322
			0.262332 0.109103 0.958790
			0.629900 -0.438651 0.640945
			0.227368 -0.257327 -0.939195
			0.364167 -0.120670 -0.923483
			0.549281 -0.570513 -0.610578
			0.451322 -0.439292 -0.776744
			0.748033 -0.496803 -0.440038
			0.667626 -0.706255 -0.235543
			0.422669 -0.883974 0.199851
			0.255051 -0.434427 0.863841
			0.321741 0.036667 0.946118
			0.665018 0.505346 0.549888
			0.439003 -0.822876 0.360765
			0.204102 -0.683539 -0.700797
			0.312741 -0.440377 -0.841582
			-0.365043 0.096211 -0.926006
			-0.062420 -0.456581 -0.887490
			0.306762 -0.856166 -0.415785
			0.236077 -0.823411 -0.516006
			0.289930 -0.887995 -0.356938
			-0.137650 -0.924757 -0.354792
			0.004059 -0.985031 -0.172327
			0.342722 0.935144 0.089705
			0.114541 0.961823 -0.248550
			0.465130 0.687315 -0.557900
			0.196407 0.497333 -0.845035
			0.541738 0.775378 0.324513
			0.221137 -0.698354 0.680735
			0.523483 -0.075489 0.848685
			0.400584 -0.591079 -0.700113
			0.542708 -0.753673 -0.370737
			0.410515 -0.774942 -0.480565
			0.011187 -0.871642 0.490016
			0.252303 -0.122973 -0.959802
			0.070998 -0.880365 -0.468952
			0.009868 -0.867827 0.496768
			0.512709 0.857171 -0.048866
			0.502044 0.808792 -0.306280
			0.437346 0.697003 -0.568256
			0.363438 0.288944 -0.885677
			0.158046 -0.756360 0.634776
			0.098169 -0.355543 -0.929490
			0.361204 0.753392 0.549483
			-0.223797 -0.120894 0.967109
			-0.300992 -0.870452 -0.389510
			-0.486530 -0.767404 0.417587
			-0.482885 -0.461618 0.744131
			0.439663 0.892806 -0.097946
			0.497318 0.747130 -0.440990
			0.529587 0.647072 -0.548485
			0.480375 0.406428 -0.777210
			0.141355 -0.367015 -0.919412
			-0.320381 -0.869818 -0.375196
			0.183106 0.805687 0.563330
			-0.420098 0.174071 0.890627
			-0.594502 -0.704248 0.388074
			-0.628410 -0.302649 0.716592
			0.509958 0.856802 0.076377
			0.534335 0.765900 -0.357609
			0.494681 0.628148 -0.600600
			0.401369 0.355956 -0.843919
			0.011193 -0.429283 -0.903101
			-0.317494 -0.892246 -0.321084
			-0.553696 -0.785716 0.275811
			0.324687 0.759871 0.563182
			-0.176295 0.133578 0.975232
			-0.513003 -0.458440 0.725714
			0.737862 0.631140 0.239212
			0.787972 0.602821 -0.125324
			0.725873 0.517218 -0.453424
			0.629316 0.134630 -0.765400
			0.206939 -0.678171 -0.705167
			-0.327374 -0.929504 -0.169846
			-0.400342 -0.897320 0.185858
			-0.429237 -0.592492 0.681695
			0.599485 0.508159 0.618379
			0.171536 -0.043714 0.984208
			0.926676 0.254866 0.276251
			0.982069 0.187640 0.018205
			0.947674 0.228484 -0.222954
			0.901569 -0.127010 -0.413572
			0.583269 -0.700521 -0.411178
			-0.008215 -0.998885 -0.046478
			-0.198480 -0.946997 0.252592
			-0.174621 -0.737945 0.651878
			0.413798 -0.290963 0.862619
			0.675815 0.289531 0.677825
			0.921458 -0.350443 0.167643
			0.943218 -0.324515 -0.070915
			0.597268 -0.790176 -0.137449
			0.413273 -0.845792 0.337402
		</DataArray>
	</PointData>
	<Points>
		<DataArray type="Float32" NumberOfComponents="3" format="ascii">
			-0.106425 -0.122873 -0.086975
			-0.106720 -0.119373 -0.088935
			-0.107017 -0.115874 -0.090894
			-0.106905 -0.124668 -0.076174
			-0.105456 -0.125076 -0.075251
			-0.107837 -0.118482 -0.078313
			-0.104100 -0.116375 -0.091300
			-0.105103 -0.121324 -0.088579
			-0.107723 -0.111796 -0.083491
			-0.105833 -0.103064 -0.087601
			-0.104008 -0.110001 -0.094237
			-0.105932 -0.107564 -0.095219
			-0.102043 -0.113582 -0.062474
			-0.102806 -0.110057 -0.064479
			-0.099641 -0.114932 -0.062157
			-0.102682 -0.122425 -0.076616
			-0.103577 -0.104314 -0.067895
			-0.100549 -0.118690 -0.079775
			-0.104054 -0.113188 -0.092769
			-0.101362 -0.094945 -0.072090
			-0.098294 -0.091398 -0.074619
			-0.103849 -0.097686 -0.091046
			-0.099958 -0.106700 -0.085371
			-0.100000 -0.113627 -0.083390
			-0.103767 -0.102724 -0.097404
			-0.104942 -0.099191 -0.097778
			-0.100050 -0.104704 -0.058673
			-0.100651 -0.102648 -0.058956
			-0.101565 -0.095710 -0.062998
			-0.099253 -0.111826 -0.064520
			-0.097773 -0.106027 -0.058580
			-0.099867 -0.090170 -0.066287
			-0.098183 -0.106807 -0.066417
			-0.096359 -0.086150 -0.068131
			-0.096836 -0.086112 -0.076109
			-0.094478 -0.081774 -0.068811
			-0.102031 -0.091124 -0.091987
			-0.095058 -0.096469 -0.070381
			-0.096582 -0.102579 -0.067822
			-0.099577 -0.098225 -0.087898
			-0.101659 -0.082092 -0.102955
			-0.104157 -0.093114 -0.098825
			-0.101060 -0.074421 -0.103136
			-0.096036 -0.085267 -0.050290
			-0.096806 -0.083388 -0.051080
			-0.096437 -0.081213 -0.052981
			-0.093193 -0.077479 -0.055005
			-0.096239 -0.103203 -0.058709
			-0.092155 -0.087432 -0.050558
			-0.090489 -0.074769 -0.057746
			-0.094933 -0.099125 -0.060846
			-0.089187 -0.072346 -0.058671
			-0.094199 -0.068501 -0.079765
			-0.090852 -0.063700 -0.071200
			-0.085062 -0.057494 -0.062572
			-0.099458 -0.072074 -0.094007
			-0.094809 -0.088888 -0.072663
			-0.092571 -0.091090 -0.063866
			-0.093802 -0.095982 -0.061592
			-0.097483 -0.078653 -0.092436
			-0.095237 -0.056267 -0.105782
			-0.094133 -0.052195 -0.097600
			-0.096243 -0.054780 -0.104232
			-0.089065 -0.074965 -0.040892
			-0.089780 -0.072880 -0.041404
			-0.089019 -0.071328 -0.043572
			-0.087226 -0.069150 -0.046196
			-0.084147 -0.066798 -0.050302
			-0.090062 -0.087771 -0.051375
			-0.087691 -0.076063 -0.042579
			-0.082896 -0.065018 -0.051851
			-0.088457 -0.086971 -0.052939
			-0.080288 -0.053886 -0.056303
			-0.089617 -0.048977 -0.082735
			-0.086139 -0.045984 -0.075327
			-0.081181 -0.044105 -0.066253
			-0.076942 -0.043166 -0.059482
			-0.092635 -0.073108 -0.076885
			-0.091705 -0.082102 -0.066853
			-0.087547 -0.083014 -0.056029
			-0.088067 -0.085508 -0.054092
			-0.090654 -0.054040 -0.095345
			-0.087999 -0.029233 -0.102063
			-0.081660 -0.028413 -0.089568
			-0.091480 -0.043169 -0.097943
			-0.088828 -0.034143 -0.098286
			-0.091820 -0.040188 -0.102640
			-0.089431 -0.031814 -0.102791
			-0.079767 -0.067454 -0.035009
			-0.080535 -0.065575 -0.035799
			-0.079676 -0.063165 -0.037071
			-0.077685 -0.060773 -0.040338
			-0.074937 -0.060117 -0.043351
			-0.073803 -0.058170 -0.045669
			-0.085125 -0.074825 -0.041736
			-0.078217 -0.068501 -0.035650
			-0.073472 -0.050210 -0.049364
			-0.081850 -0.075855 -0.044952
			-0.070369 -0.040931 -0.052325
			-0.076835 -0.024463 -0.083562
			-0.071919 -0.021601 -0.076332
			-0.066694 -0.020198 -0.068303
			-0.061839 -0.020519 -0.058038
			-0.086055 -0.050263 -0.080450
			-0.089917 -0.069888 -0.069052
			-0.087784 -0.074151 -0.059612
			-0.079698 -0.073590 -0.048596
			-0.079851 -0.075244 -0.046460
			-0.081378 -0.027992 -0.093056
			-0.088705 -0.026837 -0.101680
			-0.083642 -0.016805 -0.100421
			-0.079707 -0.020062 -0.090060
			-0.075754 -0.017177 -0.084897
			-0.085342 -0.024437 -0.096268
			-0.070309 -0.061277 -0.031085
			-0.071515 -0.058660 -0.030991
			-0.071178 -0.057101 -0.031534
			-0.069547 -0.055547 -0.035004
			-0.066489 -0.054705 -0.038441
			-0.065679 -0.052811 -0.040881
			-0.064955 -0.047259 -0.043104
			-0.077368 -0.068358 -0.037483
			-0.068532 -0.062380 -0.031280
			-0.062769 -0.040157 -0.044734
			-0.073800 -0.067733 -0.040636
			-0.058283 -0.024340 -0.048974
			-0.071450 -0.015849 -0.076410
			-0.067373 -0.014473 -0.068372
			-0.062677 -0.014668 -0.057730
			-0.058471 -0.018379 -0.048414
			-0.075292 -0.027155 -0.082989
			-0.083030 -0.048661 -0.073268
			-0.086300 -0.065551 -0.061544
			-0.079721 -0.063898 -0.051054
			-0.070626 -0.064376 -0.044384
			-0.071596 -0.066896 -0.042791
			-0.077178 -0.015884 -0.091385
			-0.082755 -0.017927 -0.093068
			-0.087204 -0.021784 -0.100103
			-0.083529 -0.013680 -0.098954
			-0.076032 -0.004970 -0.098530
			-0.079896 -0.015615 -0.088841
			-0.076503 -0.014683 -0.083909
			-0.074131 -0.012701 -0.074648
			-0.067148 -0.059254 -0.029598
			-0.068630 -0.056932 -0.029690
			-0.068859 -0.055233 -0.031346
			-0.066709 -0.054163 -0.033432
			-0.063774 -0.052718 -0.037300
			-0.062532 -0.050352 -0.039051
			-0.061088 -0.044931 -0.041087
			-0.059799 -0.039383 -0.042737
			-0.067977 -0.061799 -0.034048
			-0.066074 -0.061260 -0.030118
			-0.056780 -0.027645 -0.043922
			-0.065823 -0.061176 -0.036482
			-0.055829 -0.020645 -0.043226
			-0.070967 -0.011848 -0.066491
			-0.066328 -0.010296 -0.056448
			-0.062283 -0.008648 -0.046370
			-0.058139 -0.011093 -0.039991
			-0.071253 -0.015671 -0.082165
			-0.072024 -0.026642 -0.075499
			-0.078917 -0.046798 -0.066035
			-0.079023 -0.059274 -0.052801
			-0.070717 -0.058494 -0.045569
			-0.062589 -0.058512 -0.040627
			-0.062787 -0.060819 -0.039109
			-0.069465 -0.006781 -0.090183
			-0.080539 -0.012831 -0.086742
			-0.082609 -0.014007 -0.091516
			-0.082923 -0.011353 -0.090729
			-0.082224 -0.011695 -0.098655
			-0.080921 -0.009710 -0.098355
			-0.078247 -0.006419 -0.098157
			-0.074768 -0.001060 -0.095837
			-0.071607 0.002596 -0.095560
			-0.068771 0.003671 -0.094888
			-0.078282 -0.013712 -0.081607
			-0.080219 -0.012706 -0.070135
			-0.079369 -0.011904 -0.061949
			-0.064689 -0.058134 -0.028436
			-0.065963 -0.055288 -0.028277
			-0.064755 -0.052959 -0.028885
			-0.063883 -0.052203 -0.032072
			-0.060555 -0.050491 -0.035525
			-0.059193 -0.048738 -0.036855
			-0.058225 -0.043688 -0.038975
			-0.056098 -0.038437 -0.039669
			-0.054704 -0.029769 -0.039848
			-0.065300 -0.060151 -0.032639
			-0.063774 -0.060005 -0.028568
			-0.054607 -0.023661 -0.038553
			-0.063095 -0.059774 -0.035131
			-0.055440 -0.015993 -0.034888
			-0.073678 -0.008658 -0.053355
			-0.066408 -0.004334 -0.044296
			-0.060027 -0.006501 -0.037879
			-0.055806 -0.010219 -0.031700
			-0.064246 -0.008967 -0.080618
			-0.067177 -0.016997 -0.075039
			-0.068772 -0.027498 -0.067894
			-0.072503 -0.043819 -0.056714
			-0.070776 -0.053767 -0.046359
			-0.062385 -0.053054 -0.040888
			-0.058545 -0.056455 -0.038443
			-0.059897 -0.059230 -0.037258
			-0.061709 0.000718 -0.088916
			-0.082002 -0.010782 -0.085738
			-0.080060 -0.012741 -0.079306
			-0.081171 -0.010503 -0.084985
			-0.080879 -0.009770 -0.090718
			-0.079200 -0.008587 -0.090572
			-0.074543 -0.005746 -0.090869
			-0.071095 -0.002818 -0.090551
			-0.068411 0.000338 -0.089816
			-0.068858 0.006269 -0.093653
			-0.058745 0.012689 -0.090033
			-0.081877 -0.012515 -0.070408
			-0.079870 -0.011384 -0.061348
			-0.074857 -0.007208 -0.052862
			-0.062551 -0.057203 -0.026846
			-0.062811 -0.054781 -0.026126
			-0.062556 -0.052270 -0.027357
			-0.060827 -0.050291 -0.030253
			-0.057121 -0.048322 -0.033307
			-0.056253 -0.046359 -0.034918
			-0.054659 -0.042131 -0.036333
			-0.053831 -0.038116 -0.037664
			-0.052990 -0.031525 -0.037534
			-0.052964 -0.026692 -0.035514
			-0.062634 -0.058507 -0.031227
			-0.060655 -0.058782 -0.027160
			-0.054267 -0.020421 -0.032067
			-0.060632 -0.058204 -0.033626
			-0.054059 -0.014786 -0.027770
			-0.066797 -0.001440 -0.043452
			-0.061719 -0.000797 -0.035724
			-0.056290 -0.004280 -0.029282
			-0.053163 -0.010965 -0.024052
			-0.056418 -0.003355 -0.081325
			-0.061671 -0.010552 -0.075031
			-0.064184 -0.019172 -0.067751
			-0.065770 -0.029491 -0.059168
			-0.066775 -0.042496 -0.048952
			-0.062769 -0.048377 -0.041799
			-0.058825 -0.051359 -0.038795
			-0.056002 -0.054197 -0.037460
			-0.057295 -0.057205 -0.036334
			-0.053499 0.008851 -0.085519
			-0.081546 -0.012066 -0.078175
			-0.080646 -0.008956 -0.070583
			-0.079499 -0.009632 -0.085725
			-0.080393 -0.009632 -0.078173
			-0.074878 -0.007706 -0.085559
			-0.070092 -0.005475 -0.085440
			-0.067328 -0.003585 -0.084895
			-0.064783 -0.001773 -0.084261
			-0.064127 0.003845 -0.087849
			-0.064306 0.010073 -0.091516
			-0.057836 0.014418 -0.088577
			-0.054716 0.014890 -0.088392
			-0.078671 -0.006520 -0.062470
			-0.074611 -0.004112 -0.054293
			-0.064774 0.000553 -0.045077
			-0.059637 -0.056634 -0.025137
			-0.060085 -0.053370 -0.024773
			-0.059454 -0.050465 -0.026146
			-0.057383 -0.048129 -0.028041
			-0.054511 -0.045994 -0.031499
			-0.052888 -0.043374 -0.032842
			-0.052029 -0.040963 -0.034112
			-0.050970 -0.037452 -0.035345
			-0.051194 -0.031841 -0.034519
			-0.051381 -0.027086 -0.032401
			-0.051744 -0.024016 -0.030118
			-0.060563 -0.057203 -0.030136
			-0.059007 -0.057764 -0.025321
			-0.051591 -0.017978 -0.024321
			-0.058182 -0.056637 -0.032123
			-0.051142 -0.014491 -0.021839
			-0.060947 0.001372 -0.036132
			-0.056590 0.000812 -0.026493
			-0.052281 -0.007010 -0.020880
			-0.050169 -0.012246 -0.019209
			-0.048591 0.003317 -0.079920
			-0.053191 -0.007541 -0.076400
			-0.059491 -0.013889 -0.069186
			-0.061515 -0.021836 -0.060929
			-0.062143 -0.030842 -0.052386
			-0.060561 -0.040353 -0.043892
			-0.058634 -0.045766 -0.039601
			-0.055935 -0.049632 -0.037485
			-0.053384 -0.052753 -0.036339
			-0.053809 -0.055003 -0.035269
			-0.046162 0.014584 -0.080865
			-0.078254 -0.007778 -0.070788
			-0.075989 -0.004431 -0.063859
			-0.079140 -0.009367 -0.079056
			-0.075239 -0.007721 -0.071185
			-0.075337 -0.008624 -0.080336
			-0.070971 -0.007875 -0.081040
			-0.068074 -0.006596 -0.080070
			-0.056117 0.002661 -0.081577
			-0.053594 -0.002296 -0.078447
			-0.057058 0.008536 -0.084611
			-0.048891 0.014688 -0.079744
			-0.055418 0.015506 -0.086258
			-0.071821 -0.002356 -0.056337
			-0.063785 0.000171 -0.045767
			-0.059710 0.002082 -0.036672
			-0.056121 -0.055291 -0.022774
			-0.056715 -0.052924 -0.022171
			-0.055885 -0.049345 -0.023849
			-0.053501 -0.046824 -0.026161
			-0.050557 -0.043869 -0.027562
			-0.049603 -0.040905 -0.028811
			-0.048951 -0.038574 -0.029975
			-0.047704 -0.035597 -0.029952
			-0.046389 -0.032412 -0.029647
			-0.046809 -0.028351 -0.029208
			-0.046625 -0.025908 -0.028131
			-0.048128 -0.020747 -0.024734
			-0.057168 -0.055376 -0.027650
			-0.054767 -0.056999 -0.023121
			-0.047444 -0.017765 -0.022144
			-0.054904 -0.054781 -0.029867
			-0.045984 -0.015905 -0.020661
			-0.053282 0.002798 -0.031041
			-0.051904 -0.005548 -0.018898
			-0.055150 0.001612 -0.024006
			-0.051503 0.003814 -0.027000
			-0.049340 -0.011657 -0.017567
			-0.042942 0.008891 -0.075266
			-0.045069 -0.001156 -0.074611
			-0.051791 -0.010515 -0.070683
			-0.057572 -0.017347 -0.062084
			-0.058896 -0.024714 -0.054389
			-0.057149 -0.031947 -0.046258
			-0.056855 -0.039981 -0.040621
			-0.055287 -0.044600 -0.037746
			-0.052935 -0.047933 -0.035956
			-0.049023 -0.050061 -0.034235
			-0.051020 -0.053520 -0.033100
			-0.073641 -0.004481 -0.064489
			-0.069372 -0.001856 -0.056960
			-0.071937 -0.008712 -0.072419
			-0.069544 -0.009271 -0.065760
			-0.068643 -0.009708 -0.073649
			-0.064871 -0.009753 -0.075003
			-0.052109 -0.006383 -0.075674
			-0.044409 0.008546 -0.074285
			-0.041722 0.002962 -0.071117
			-0.041163 -0.001016 -0.069202
			-0.062797 -0.000209 -0.046457
			-0.057721 0.001194 -0.037504
			-0.052951 -0.003590 -0.032880
			-0.051276 -0.053557 -0.018490
			-0.051854 -0.050128 -0.018902
			-0.051312 -0.045686 -0.021161
			-0.048987 -0.043061 -0.022870
			-0.047689 -0.040492 -0.024334
			-0.046666 -0.037766 -0.025648
			-0.045779 -0.036078 -0.026164
			-0.045005 -0.033909 -0.026572
			-0.044509 -0.031590 -0.026809
			-0.043954 -0.029503 -0.027107
			-0.044223 -0.027085 -0.026383
			-0.044811 -0.023967 -0.024549
			-0.044243 -0.020957 -0.022187
			-0.051297 -0.053770 -0.025034
			-0.049487 -0.055555 -0.019373
			-0.042507 -0.020458 -0.022436
			-0.049587 -0.052860 -0.026928
			-0.041699 -0.020963 -0.024900
			-0.042486 -0.012325 -0.019716
			-0.046234 -0.013759 -0.018842
			-0.043493 -0.015366 -0.022429
			-0.048598 -0.007338 -0.029601
			-0.046163 -0.000080 -0.024240
			-0.048100 -0.000806 -0.026477
			-0.049942 -0.002090 -0.013778
			-0.049969 0.001470 -0.014163
			-0.042009 0.003147 -0.020264
			-0.040661 0.001745 -0.019707
			-0.047173 -0.008868 -0.010648
			-0.041163 0.002719 -0.071277
			-0.043708 -0.004026 -0.071409
			-0.050371 -0.014063 -0.064757
			-0.055774 -0.020511 -0.056303
			-0.055091 -0.026774 -0.047788
			-0.054020 -0.032642 -0.042550
			-0.053547 -0.039165 -0.038510
			-0.051549 -0.043612 -0.035833
			-0.048654 -0.046818 -0.034011
			-0.044122 -0.048881 -0.030899
			-0.046639 -0.051102 -0.029901
			-0.064919 -0.010155 -0.057717
			-0.059583 -0.012687 -0.048825
			-0.065919 -0.012476 -0.067438
			-0.062560 -0.013801 -0.059949
			-0.062307 -0.013282 -0.069098
			-0.049047 -0.009685 -0.069134
			-0.039188 -0.006527 -0.065507
			-0.040570 -0.000982 -0.069779
			-0.038366 -0.006868 -0.066538
			-0.055799 -0.015225 -0.044544
			-0.051072 -0.017210 -0.038402
			-0.047142 -0.018850 -0.034360
			-0.046858 -0.051106 -0.016457
			-0.048584 -0.047388 -0.015957
			-0.048294 -0.043501 -0.017310
			-0.046637 -0.040402 -0.019469
			-0.044557 -0.038206 -0.020807
			-0.043461 -0.036438 -0.021431
			-0.042528 -0.034396 -0.022215
			-0.041572 -0.032946 -0.022797
			-0.041235 -0.031389 -0.023341
			-0.041328 -0.029541 -0.023339
			-0.041020 -0.028020 -0.022731
			-0.041165 -0.026516 -0.022467
			-0.041195 -0.024597 -0.021650
			-0.039076 -0.023392 -0.021154
			-0.048037 -0.053806 -0.021163
			-0.044476 -0.053071 -0.017917
			-0.046587 -0.052056 -0.022952
			-0.037758 -0.023935 -0.021893
			-0.036342 -0.023934 -0.022613
			-0.039979 -0.023031 -0.026607
			-0.039978 -0.008734 -0.014579
			-0.042833 -0.005665 -0.022103
			-0.044699 -0.010149 -0.012637
			-0.044579 -0.007535 -0.024862
			-0.043783 -0.016886 -0.026162
			-0.045749 -0.010892 -0.027532
			-0.044795 -0.019345 -0.032208
			-0.038517 -0.004208 -0.017294
			-0.047022 -0.003265 -0.002067
			-0.046141 -0.001137 -0.002245
			-0.032665 0.003534 -0.013610
			-0.031210 0.001934 -0.014273
			-0.031256 -0.002454 -0.012817
			-0.042796 -0.009424 -0.004148
			-0.040654 -0.008249 -0.067540
			-0.047737 -0.016631 -0.060454
			-0.052598 -0.023835 -0.049531
			-0.052258 -0.028678 -0.043792
			-0.051445 -0.033193 -0.039950
			-0.049567 -0.039258 -0.036287
			-0.047473 -0.043023 -0.034130
			-0.042934 -0.045971 -0.031703
			-0.042290 -0.050354 -0.027479
			-0.044759 -0.051612 -0.024964
			-0.056664 -0.017224 -0.051176
			-0.053138 -0.020193 -0.046526
			-0.058045 -0.015765 -0.062492
			-0.052313 -0.019064 -0.053330
			-0.045932 -0.013082 -0.063201
			-0.037410 -0.010306 -0.061504
			-0.036378 -0.010121 -0.062283
			-0.038165 -0.011722 -0.062998
			-0.048476 -0.022106 -0.041763
			-0.045275 -0.022732 -0.037221
			-0.042597 -0.023614 -0.035285
			-0.042741 -0.049418 -0.013786
			-0.045508 -0.044998 -0.011820
			-0.045297 -0.040296 -0.013320
			-0.043752 -0.037170 -0.015697
			-0.042865 -0.035480 -0.016214
			-0.041703 -0.033805 -0.017441
			-0.040929 -0.032534 -0.018535
			-0.039982 -0.031078 -0.019109
			-0.039851 -0.029595 -0.019559
			-0.039815 -0.028808 -0.019477
			-0.039442 -0.027969 -0.019270
			-0.039303 -0.026624 -0.019169
			-0.038949 -0.025649 -0.019516
			-0.036605 -0.024492 -0.018571
			-0.036014 -0.024330 -0.019700
			-0.042156 -0.052262 -0.019843
			-0.040083 -0.051096 -0.015071
			-0.034667 -0.023638 -0.020018
			-0.034604 -0.023745 -0.023752
			-0.033856 -0.023085 -0.020361
			-0.037779 -0.024148 -0.028437
			-0.034622 -0.006600 -0.008223
			-0.039615 -0.008298 -0.006470
			-0.042698 -0.020847 -0.029486
			-0.040411 -0.023673 -0.031867
			-0.045221 -0.004924 0.003054
			-0.044643 -0.001465 0.002630
			-0.028122 0.003428 -0.010824
			-0.026349 0.001704 -0.012793
			-0.027230 -0.002216 -0.010854
			-0.031155 -0.005909 -0.006489
			-0.040583 -0.008110 -0.000847
			-0.045497 -0.019911 -0.053783
			-0.049182 -0.025129 -0.046325
			-0.049409 -0.029394 -0.041352
			-0.047231 -0.033798 -0.037631
			-0.045188 -0.037907 -0.035212
			-0.041478 -0.042777 -0.032329
			-0.040979 -0.048816 -0.029090
			-0.037748 -0.050910 -0.025030
			-0.040053 -0.051854 -0.022559
			-0.049075 -0.021283 -0.048730
			-0.045632 -0.022989 -0.043879
			-0.042519 -0.016596 -0.055446
			-0.042462 -0.018621 -0.050613
			-0.034993 -0.014156 -0.055553
			-0.034244 -0.013812 -0.056170
			-0.036450 -0.016146 -0.056485
			-0.041980 -0.024037 -0.039341
			-0.039309 -0.024472 -0.037065
			-0.036630 -0.024603 -0.033907
			-0.036752 -0.051878 -0.012885
			-0.042042 -0.043547 -0.008859
			-0.039594 -0.048593 -0.010744
			-0.042396 -0.039728 -0.008475
			-0.041289 -0.033472 -0.009953
			-0.040463 -0.031540 -0.010407
			-0.039821 -0.030726 -0.010910
			-0.039108 -0.029213 -0.011941
			-0.037990 -0.028026 -0.012359
			-0.037838 -0.027569 -0.012937
			-0.037143 -0.026987 -0.013507
			-0.036513 -0.026167 -0.014002
			-0.033901 -0.025035 -0.013767
			-0.038226 -0.051818 -0.016678
			-0.035201 -0.053234 -0.014416
			-0.032455 -0.023658 -0.014618
			-0.032448 -0.022363 -0.024952
			-0.032412 -0.022158 -0.021547
			-0.034177 -0.023932 -0.029950
			-0.036807 -0.006951 -0.003748
			-0.030519 -0.021547 -0.031506
			-0.040952 -0.005316 0.005663
			-0.040981 -0.000997 0.006505
			-0.020272 0.003836 -0.009934
			-0.019842 0.000535 -0.012282
			-0.020851 -0.002325 -0.010423
			-0.027608 -0.006171 -0.004067
			-0.031478 -0.005473 -0.001162
			-0.035712 -0.005455 0.002982
			-0.043246 -0.022283 -0.049551
			-0.046471 -0.026427 -0.042760
			-0.045277 -0.030679 -0.038508
			-0.043203 -0.033999 -0.036015
			-0.038567 -0.038344 -0.033246
			-0.038906 -0.046171 -0.030088
			-0.035595 -0.049526 -0.026239
			-0.031133 -0.052992 -0.021850
			-0.034222 -0.053427 -0.020045
			-0.038362 -0.020522 -0.046411
			-0.035903 -0.022378 -0.041940
			-0.035952 -0.017697 -0.050967
			-0.036002 -0.020715 -0.046507
			-0.035436 -0.017158 -0.052580
			-0.036922 -0.019322 -0.051820
			-0.033946 -0.022693 -0.039846
			-0.032203 -0.022464 -0.035886
			-0.025607 -0.019033 -0.033405
			-0.031035 -0.054217 -0.016937
			-0.037233 -0.047581 -0.009256
			-0.035222 -0.050394 -0.010926
			-0.040998 -0.043189 -0.008205
			-0.041357 -0.039369 -0.007829
			-0.040203 -0.034407 -0.008345
			-0.039137 -0.031471 -0.009374
			-0.038572 -0.030279 -0.010360
			-0.037880 -0.029251 -0.010581
			-0.037462 -0.028508 -0.010978
			-0.036554 -0.027848 -0.011647
			-0.035333 -0.026106 -0.012046
			-0.034051 -0.025281 -0.012397
			-0.034149 -0.024366 -0.011879
			-0.032668 -0.052491 -0.012770
			-0.032626 -0.023665 -0.012453
			-0.031672 -0.023586 -0.012866
			-0.030402 -0.022523 -0.014947
			-0.028929 -0.018928 -0.026596
			-0.027709 -0.019414 -0.022449
			-0.028597 -0.022264 -0.015262
			-0.023184 -0.018528 -0.027754
			-0.037795 -0.002856 0.007489
			-0.035488 -0.000093 0.008366
			-0.009105 0.003428 -0.008855
			-0.006388 0.000758 -0.011425
			-0.008429 -0.003054 -0.010022
			-0.021293 -0.006624 -0.000237
			-0.028416 -0.005350 0.002405
			-0.034450 -0.003946 0.005650
			-0.041082 -0.023715 -0.046005
			-0.042128 -0.028085 -0.040349
			-0.041397 -0.031639 -0.037193
			-0.036734 -0.035200 -0.034338
			-0.037120 -0.043237 -0.031473
			-0.033325 -0.046668 -0.027880
			-0.029108 -0.051009 -0.023478
			-0.027422 -0.052940 -0.019472
			-0.034623 -0.021628 -0.043625
			-0.030263 -0.021338 -0.041545
			-0.035901 -0.020909 -0.047712
			-0.033470 -0.022357 -0.044873
			-0.037780 -0.022314 -0.047225
			-0.027882 -0.020736 -0.038421
			-0.021218 -0.017673 -0.035463
			-0.016566 -0.018392 -0.029123
			-0.029275 -0.053689 -0.015216
			-0.026255 -0.052735 -0.018050
			-0.021461 -0.048413 -0.021928
			-0.024433 -0.051415 -0.019378
			-0.020169 -0.045097 -0.022163
			-0.018300 -0.039826 -0.022154
			-0.018304 -0.037423 -0.022138
			-0.018171 -0.035227 -0.021993
			-0.016479 -0.032943 -0.022207
			-0.014460 -0.029444 -0.021370
			-0.028731 -0.022985 -0.013587
			-0.021471 -0.019224 -0.023327
			-0.024524 -0.021538 -0.017240
			-0.024104 -0.022576 -0.015887
			-0.014262 -0.021010 -0.024948
			-0.033768 -0.000654 0.009129
			-0.032208 -0.002457 0.007259
			-0.004927 0.003091 -0.004484
			-0.001051 0.000005 -0.007416
			0.000052 -0.003469 -0.008417
			-0.019117 -0.004455 0.001772
			-0.025221 -0.004324 0.005739
			-0.037393 -0.025164 -0.042956
			-0.037853 -0.029233 -0.038979
			-0.034199 -0.033561 -0.035139
			-0.034260 -0.039146 -0.032128
			-0.031198 -0.043818 -0.028599
			-0.026290 -0.048019 -0.025100
			-0.024994 -0.051712 -0.020830
			-0.027619 -0.020478 -0.043350
			-0.024647 -0.018954 -0.040130
			-0.035632 -0.023600 -0.044222
			-0.025144 -0.022956 -0.046912
			-0.018463 -0.016404 -0.036702
			-0.021424 -0.016728 -0.041486
			-0.013740 -0.018242 -0.031100
			-0.011929 -0.021405 -0.028453
			-0.020678 -0.045051 -0.023876
			-0.022080 -0.048177 -0.022432
			-0.018969 -0.040542 -0.024173
			-0.019089 -0.037673 -0.024039
			-0.018910 -0.035980 -0.024195
			-0.017109 -0.033319 -0.024494
			-0.014220 -0.029499 -0.024057
			-0.014029 -0.026444 -0.021208
			-0.019926 -0.022053 -0.019072
			-0.019724 -0.023031 -0.018170
			-0.013635 -0.025119 -0.021810
			-0.013332 -0.027059 -0.023350
			-0.014959 -0.027454 -0.026541
			-0.022485 0.000242 0.008337
			-0.005919 0.001778 0.001811
			-0.023918 -0.001578 0.008835
			0.000030 0.000003 -0.000019
			0.000844 -0.004068 0.001040
			-0.011461 -0.003649 0.005079
			-0.021577 -0.004342 0.007294
			-0.033540 -0.027057 -0.041176
			-0.031855 -0.031389 -0.037195
			-0.031964 -0.036430 -0.033230
			-0.028452 -0.039263 -0.029127
			-0.024830 -0.044825 -0.025717
			-0.023849 -0.018429 -0.045578
			-0.022312 -0.020101 -0.047990
			-0.018488 -0.025631 -0.046656
			-0.027881 -0.029129 -0.040056
			-0.013829 -0.024560 -0.045199
			-0.013319 -0.014829 -0.035709
			-0.018181 -0.012693 -0.042622
			-0.021713 -0.013764 -0.046071
			-0.008122 -0.018569 -0.030598
			-0.007326 -0.021297 -0.028511
			-0.010851 -0.023849 -0.029312
			-0.023348 -0.040259 -0.026461
			-0.022629 -0.037859 -0.026800
			-0.019661 -0.033349 -0.026887
			-0.021530 -0.035331 -0.026190
			-0.016661 -0.030319 -0.027459
			-0.016590 -0.029216 -0.032753
			-0.013454 -0.027993 -0.034471
			-0.018492 -0.003906 0.008621
			-0.017462 -0.000251 0.009979
			-0.002964 -0.002554 0.006006
			-0.003755 -0.004449 0.005318
			-0.030037 -0.034681 -0.033988
			-0.027520 -0.037221 -0.029912
			-0.019275 -0.015831 -0.048142
			-0.009641 -0.022803 -0.044837
			-0.023601 -0.030416 -0.038137
			-0.027415 -0.032803 -0.035652
			-0.018569 -0.028677 -0.041044
			-0.008597 -0.029906 -0.040021
			-0.013133 -0.028737 -0.040697
			-0.008214 -0.014193 -0.034255
			-0.012393 -0.012836 -0.041604
			-0.012895 -0.014134 -0.044352
			-0.011490 -0.016386 -0.045643
			-0.003659 -0.019370 -0.030409
			-0.007715 -0.025026 -0.031055
			-0.003410 -0.024181 -0.028028
			-0.025321 -0.034740 -0.030145
			-0.018745 -0.030908 -0.032442
			-0.022513 -0.033266 -0.031105
			-0.009007 -0.028967 -0.035727
			-0.005070 -0.025134 -0.043769
			-0.004256 -0.031871 -0.038510
			-0.005048 -0.031810 -0.036389
			-0.003406 -0.018226 -0.034651
			-0.004925 -0.016110 -0.038148
			-0.005221 -0.017192 -0.041544
			-0.002581 -0.023081 -0.043063
			-0.003193 -0.025609 -0.030589
			-0.000560 -0.029009 -0.040874
			0.000086 -0.022120 -0.029543
			0.000326 -0.026797 -0.027699
			-0.001625 -0.033415 -0.037204
			-0.002593 -0.033082 -0.035250
			-0.000730 -0.027329 -0.029789
			0.001486 -0.022146 -0.032237
			-0.000769 -0.021277 -0.035808
			-0.001163 -0.022594 -0.038334
			0.000191 -0.025060 -0.039906
			0.001210 -0.030869 -0.039171
			0.000034 -0.035248 -0.035721
			0.003963 -0.025034 -0.027905
			0.002149 -0.028452 -0.025718
			-0.000951 -0.034471 -0.033423
			0.000230 -0.030503 -0.028971
			0.007862 -0.027335 -0.027619
			0.007990 -0.027362 -0.030526
			0.008379 -0.029361 -0.033817
			0.007957 -0.031612 -0.035878
			0.008512 -0.036722 -0.036238
			0.005170 -0.039504 -0.031774
			0.003418 -0.038491 -0.029056
			0.007263 -0.028254 -0.024593
			0.005226 -0.031745 -0.022301
			0.003190 -0.036040 -0.026349
			0.011343 -0.032148 -0.025183
			0.012482 -0.032305 -0.026630
			0.012198 -0.033512 -0.029478
			0.011753 -0.036111 -0.034410
			0.010337 -0.040907 -0.033729
			0.006922 -0.040783 -0.030268
			0.005461 -0.040378 -0.028053
			0.005016 -0.039781 -0.026623
			0.009780 -0.032300 -0.022988
			0.008019 -0.033862 -0.021722
			0.012828 -0.036563 -0.024218
			0.013251 -0.036576 -0.025854
			0.013456 -0.037118 -0.027736
			0.013687 -0.038682 -0.029751
			0.011282 -0.041681 -0.029758
			0.008741 -0.042120 -0.027394
			0.008376 -0.041902 -0.025471
			0.008435 -0.041384 -0.024306
			0.010549 -0.038973 -0.022236
			0.011889 -0.038157 -0.023093
			0.011822 -0.040938 -0.024831
			0.012304 -0.041184 -0.026527
			0.011046 -0.042071 -0.027419
			0.010588 -0.042094 -0.024641
		</DataArray>
	</Points>
			<Polys>
				<DataArray type="Int32" Name="connectivity" format="ascii">
					0 1 2 
					3 0 4 
					5 1 0 
					0 2 6 
					7 4 0 
					5 0 3 
					0 6 7 
					1 5 8 
					1 8 2 
					2 8 9 
					10 6 2 
					2 9 11 
					10 2 11 
					3 12 13 
					4 12 3 
					3 13 5 
					4 14 12 
					7 15 4 
					15 14 4 
					5 13 16 
					5 16 8 
					6 17 15 
					18 17 6 
					6 15 7 
					8 16 19 
					8 19 9 
					9 19 20 
					11 9 21 
					9 20 21 
					10 22 23 
					24 22 10 
					10 23 18 
					11 24 10 
					11 25 24 
					11 21 25 
					12 26 27 
					14 26 12 
					12 27 13 
					13 27 28 
					13 28 16 
					15 29 14 
					14 30 26 
					29 30 14 
					17 29 15 
					16 28 31 
					16 31 19 
					17 32 29 
					18 23 17 
					23 32 17 
					19 31 33 
					19 33 20 
					21 20 34 
					20 33 35 
					20 35 34 
					25 21 36 
					21 34 36 
					22 37 38 
					24 39 22 
					39 37 22 
					22 38 23 
					23 38 32 
					40 39 24 
					25 40 24 
					25 41 42 
					25 36 41 
					25 42 40 
					26 43 44 
					30 43 26 
					26 44 27 
					27 44 45 
					27 45 28 
					28 45 46 
					28 46 31 
					29 47 30 
					32 47 29 
					30 48 43 
					47 48 30 
					31 46 49 
					31 49 33 
					32 50 47 
					38 50 32 
					33 49 51 
					33 51 35 
					36 34 52 
					34 35 53 
					34 53 52 
					35 51 54 
					35 54 53 
					41 36 55 
					36 52 55 
					39 56 37 
					37 57 58 
					56 57 37 
					37 58 38 
					38 58 50 
					40 59 39 
					59 56 39 
					60 59 40 
					42 60 40 
					41 55 42 
					42 55 61 
					42 62 60 
					42 61 62 
					43 63 64 
					48 63 43 
					43 64 44 
					44 64 65 
					44 65 45 
					45 65 66 
					45 66 46 
					46 66 67 
					46 67 49 
					47 68 48 
					50 68 47 
					48 69 63 
					68 69 48 
					49 67 70 
					49 70 51 
					50 71 68 
					58 71 50 
					51 70 72 
					51 72 54 
					55 52 73 
					52 53 74 
					52 74 73 
					53 54 75 
					53 75 74 
					54 72 76 
					54 76 75 
					55 73 61 
					59 77 56 
					56 78 57 
					77 78 56 
					57 79 80 
					78 79 57 
					57 80 58 
					58 80 71 
					60 81 59 
					81 77 59 
					82 81 60 
					62 82 60 
					61 73 83 
					62 61 84 
					61 83 85 
					62 86 87 
					62 84 86 
					62 87 82 
					63 88 89 
					69 88 63 
					63 89 64 
					64 89 90 
					64 90 65 
					65 90 91 
					65 91 66 
					66 91 92 
					66 92 67 
					67 92 93 
					67 93 70 
					68 94 69 
					71 94 68 
					69 95 88 
					94 95 69 
					70 93 96 
					70 96 72 
					71 97 94 
					80 97 71 
					72 96 98 
					72 98 76 
					73 74 99 
					73 99 83 
					74 75 100 
					74 100 99 
					75 76 101 
					75 101 100 
					76 98 102 
					76 102 101 
					81 103 77 
					77 104 78 
					103 104 77 
					78 105 79 
					104 105 78 
					79 106 107 
					105 106 79 
					79 107 80 
					80 107 97 
					82 108 81 
					108 103 81 
					87 109 82 
					110 108 82 
					109 110 82 
					85 83 111 
					83 99 112 
					83 112 111 
					86 84 85 
					87 85 113 
					85 111 113 
					86 85 87 
					87 113 109 
					88 114 115 
					95 114 88 
					88 115 89 
					89 115 116 
					89 116 90 
					90 116 117 
					90 117 91 
					91 117 118 
					91 118 92 
					92 118 119 
					92 119 93 
					93 119 120 
					93 120 96 
					94 121 95 
					97 121 94 
					95 122 114 
					121 122 95 
					96 120 123 
					96 123 98 
					97 124 121 
					107 124 97 
					98 123 125 
					98 125 102 
					99 100 126 
					99 126 112 
					100 101 127 
					100 127 126 
					101 102 128 
					101 128 127 
					102 125 129 
					102 129 128 
					108 130 103 
					103 131 104 
					130 131 103 
					104 132 105 
					131 132 104 
					105 133 106 
					132 133 105 
					106 134 135 
					133 134 106 
					106 135 107 
					107 135 124 
					110 136 108 
					136 130 108 
					109 113 137 
					109 138 110 
					109 137 138 
					138 139 110 
					140 136 110 
					139 140 110 
					113 111 141 
					111 112 142 
					111 142 141 
					112 126 143 
					112 143 142 
					113 141 137 
					114 144 145 
					122 144 114 
					114 145 115 
					115 145 146 
					115 146 116 
					116 146 147 
					116 147 117 
					117 147 148 
					117 148 118 
					118 148 149 
					118 149 119 
					119 149 150 
					119 150 120 
					120 150 151 
					120 151 123 
					121 152 122 
					124 152 121 
					122 153 144 
					152 153 122 
					123 151 154 
					123 154 125 
					124 155 152 
					135 155 124 
					125 154 156 
					125 156 129 
					126 127 157 
					126 157 143 
					127 128 158 
					127 158 157 
					128 129 159 
					128 159 158 
					129 156 160 
					129 160 159 
					136 161 130 
					130 162 131 
					161 162 130 
					131 163 132 
					162 163 131 
					132 164 133 
					163 164 132 
					133 165 134 
					164 165 133 
					134 166 167 
					165 166 134 
					134 167 135 
					135 167 155 
					140 168 136 
					168 161 136 
					137 141 169 
					138 137 170 
					137 169 170 
					138 170 139 
					139 170 171 
					139 172 173 
					139 171 172 
					139 173 174 
					139 174 140 
					175 176 140 
					174 175 140 
					177 168 140 
					176 177 140 
					141 142 178 
					141 178 169 
					142 143 179 
					142 179 178 
					143 157 180 
					143 180 179 
					144 181 182 
					153 181 144 
					144 182 145 
					145 182 183 
					145 183 146 
					146 183 184 
					146 184 147 
					147 184 185 
					147 185 148 
					148 185 186 
					148 186 149 
					149 186 187 
					149 187 150 
					150 187 188 
					150 188 151 
					151 188 189 
					151 189 154 
					152 190 153 
					155 190 152 
					153 191 181 
					190 191 153 
					154 189 192 
					154 192 156 
					155 193 190 
					167 193 155 
					156 192 194 
					156 194 160 
					157 158 195 
					157 195 180 
					158 159 196 
					158 196 195 
					159 160 197 
					159 197 196 
					160 194 198 
					160 198 197 
					168 199 161 
					161 200 162 
					199 200 161 
					162 201 163 
					200 201 162 
					163 202 164 
					201 202 163 
					164 203 165 
					202 203 164 
					165 204 166 
					203 204 165 
					166 205 206 
					204 205 166 
					166 206 167 
					167 206 193 
					177 207 168 
					207 199 168 
					170 169 208 
					169 178 209 
					169 209 208 
					170 208 171 
					171 208 210 
					172 171 211 
					171 210 211 
					172 211 173 
					173 211 212 
					173 212 174 
					174 212 213 
					174 213 175 
					175 213 214 
					175 214 176 
					176 214 215 
					176 216 177 
					176 215 216 
					217 207 177 
					216 217 177 
					178 179 218 
					178 218 209 
					179 180 219 
					179 219 218 
					180 195 220 
					180 220 219 
					221 181 191 
					222 182 181 
					222 181 221 
					223 183 182 
					223 182 222 
					224 184 183 
					224 183 223 
					225 185 184 
					225 184 224 
					226 186 185 
					226 185 225 
					227 187 186 
					227 186 226 
					228 188 187 
					228 187 227 
					229 189 188 
					229 188 228 
					230 192 189 
					230 189 229 
					190 231 191 
					193 231 190 
					232 191 231 
					221 191 232 
					233 194 192 
					233 192 230 
					193 234 231 
					206 234 193 
					235 198 194 
					235 194 233 
					195 196 236 
					195 236 220 
					196 197 237 
					196 237 236 
					197 198 238 
					197 238 237 
					239 238 198 
					239 198 235 
					207 240 199 
					199 241 200 
					240 241 199 
					200 242 201 
					241 242 200 
					201 243 202 
					242 243 201 
					202 244 203 
					243 244 202 
					203 245 204 
					244 245 203 
					204 246 205 
					245 246 204 
					205 247 248 
					246 247 205 
					205 248 206 
					206 248 234 
					217 249 207 
					249 240 207 
					208 209 250 
					208 250 210 
					209 218 251 
					209 251 250 
					211 210 252 
					210 250 253 
					210 253 252 
					211 252 212 
					212 252 254 
					212 254 213 
					213 254 255 
					213 255 214 
					214 255 256 
					214 256 215 
					215 256 257 
					216 215 258 
					215 257 258 
					216 259 260 
					216 258 259 
					216 260 261 
					216 261 217 
					261 249 217 
					218 219 262 
					218 262 251 
					219 220 263 
					219 263 262 
					220 236 264 
					220 264 263 
					221 265 266 
					232 265 221 
					221 266 222 
					222 266 267 
					222 267 223 
					223 267 268 
					223 268 224 
					224 268 269 
					224 269 225 
					225 269 270 
					225 270 226 
					226 270 271 
					226 271 227 
					227 271 272 
					227 272 228 
					228 272 273 
					228 273 229 
					229 273 274 
					229 274 230 
					230 274 275 
					230 275 233 
					276 231 234 
					232 231 276 
					232 277 265 
					276 277 232 
					233 275 278 
					233 278 235 
					279 234 248 
					276 234 279 
					235 278 280 
					235 280 239 
					236 237 281 
					236 281 264 
					237 238 282 
					237 282 281 
					283 282 238 
					283 238 239 
					239 280 284 
					239 284 283 
					249 285 240 
					240 286 241 
					285 286 240 
					241 287 242 
					286 287 241 
					242 288 243 
					287 288 242 
					243 289 244 
					288 289 243 
					244 290 245 
					289 290 244 
					245 291 246 
					290 291 245 
					246 292 247 
					291 292 246 
					293 247 292 
					294 248 247 
					294 247 293 
					279 248 294 
					261 295 249 
					295 285 249 
					250 251 296 
					250 296 253 
					251 262 297 
					251 297 296 
					252 253 298 
					252 298 254 
					253 296 299 
					253 299 298 
					254 298 300 
					254 300 255 
					255 300 301 
					255 301 256 
					256 301 302 
					256 302 257 
					258 257 303 
					257 302 304 
					257 304 303 
					259 258 305 
					258 303 305 
					259 305 260 
					260 305 306 
					260 307 261 
					260 306 307 
					307 295 261 
					262 263 308 
					262 308 297 
					263 264 309 
					263 309 308 
					264 281 310 
					264 310 309 
					265 311 312 
					277 311 265 
					265 312 266 
					266 312 313 
					266 313 267 
					267 313 314 
					267 314 268 
					268 314 315 
					268 315 269 
					269 315 316 
					269 316 270 
					270 316 317 
					270 317 271 
					271 317 318 
					271 318 272 
					272 318 319 
					272 319 273 
					273 319 320 
					273 320 274 
					274 320 321 
					274 321 275 
					275 321 322 
					275 322 278 
					276 323 277 
					279 323 276 
					277 324 311 
					323 324 277 
					278 322 325 
					278 325 280 
					279 326 323 
					294 326 279 
					280 325 327 
					280 327 284 
					281 282 328 
					281 328 310 
					329 330 282 
					282 330 331 
					329 282 283 
					282 331 328 
					329 283 284 
					329 284 332 
					327 332 284 
					295 333 285 
					285 334 286 
					333 334 285 
					286 335 287 
					334 335 286 
					287 336 288 
					335 336 287 
					288 337 289 
					336 337 288 
					289 338 290 
					337 338 289 
					290 339 291 
					338 339 290 
					291 340 292 
					339 340 291 
					341 292 340 
					293 292 341 
					293 342 343 
					341 342 293 
					293 343 294 
					294 343 326 
					307 306 295 
					306 333 295 
					296 297 344 
					296 344 299 
					297 308 345 
					297 345 344 
					298 299 346 
					298 346 300 
					299 344 347 
					299 347 346 
					300 346 348 
					300 348 301 
					301 348 349 
					301 349 302 
					302 349 350 
					302 350 304 
					305 303 351 
					303 304 352 
					303 352 351 
					304 350 353 
					304 353 352 
					305 351 306 
					306 351 333 
					308 309 354 
					308 354 345 
					309 310 355 
					309 355 354 
					310 328 356 
					310 356 355 
					311 357 358 
					324 357 311 
					311 358 312 
					312 358 359 
					312 359 313 
					313 359 360 
					313 360 314 
					314 360 361 
					314 361 315 
					315 361 362 
					315 362 316 
					316 362 363 
					316 363 317 
					317 363 364 
					317 364 318 
					318 364 365 
					318 365 319 
					319 365 366 
					319 366 320 
					320 366 367 
					320 367 321 
					321 367 368 
					321 368 322 
					322 368 369 
					322 369 325 
					323 370 324 
					326 370 323 
					324 371 357 
					370 371 324 
					325 369 372 
					325 372 327 
					326 373 370 
					343 373 326 
					327 372 374 
					375 376 327 
					327 376 332 
					327 374 377 
					375 327 377 
					378 356 328 
					379 380 328 
					378 328 380 
					379 328 331 
					381 329 332 
					382 330 329 
					382 329 381 
					383 331 330 
					383 330 382 
					384 379 331 
					384 331 383 
					385 332 376 
					381 332 385 
					333 386 334 
					351 386 333 
					334 387 335 
					386 387 334 
					335 388 336 
					387 388 335 
					336 389 337 
					388 389 336 
					337 390 338 
					389 390 337 
					338 391 339 
					390 391 338 
					339 392 340 
					391 392 339 
					393 340 392 
					341 340 393 
					341 394 342 
					393 394 341 
					342 395 396 
					394 395 342 
					342 396 343 
					343 396 373 
					344 345 397 
					344 397 347 
					345 354 398 
					345 398 397 
					346 347 399 
					346 399 348 
					347 397 400 
					347 400 399 
					348 399 401 
					348 401 349 
					349 401 402 
					349 402 350 
					350 402 403 
					350 403 353 
					351 352 386 
					352 353 404 
					352 404 386 
					353 403 405 
					353 405 404 
					354 355 406 
					354 406 398 
					355 356 407 
					355 407 406 
					408 407 356 
					408 356 378 
					357 409 410 
					371 409 357 
					357 410 358 
					358 410 411 
					358 411 359 
					359 411 412 
					359 412 360 
					360 412 413 
					360 413 361 
					361 413 414 
					361 414 362 
					362 414 415 
					362 415 363 
					363 415 416 
					363 416 364 
					364 416 417 
					364 417 365 
					365 417 418 
					365 418 366 
					366 418 419 
					366 419 367 
					367 419 420 
					367 420 368 
					368 420 421 
					368 421 369 
					369 421 422 
					369 422 372 
					370 423 371 
					373 423 370 
					371 424 409 
					425 424 371 
					372 422 426 
					372 426 374 
					373 425 423 
					396 425 373 
					374 426 427 
					377 374 428 
					374 427 428 
					429 375 430 
					431 376 375 
					430 375 377 
					431 375 429 
					385 376 431 
					432 377 433 
					377 428 433 
					430 377 432 
					378 434 435 
					380 434 378 
					378 435 408 
					436 430 379 
					379 430 432 
					436 379 384 
					379 432 380 
					380 432 434 
					437 381 385 
					438 382 381 
					438 381 437 
					439 383 382 
					439 382 438 
					440 384 383 
					440 383 439 
					441 436 384 
					441 384 440 
					442 385 431 
					437 385 442 
					386 404 387 
					387 443 388 
					404 443 387 
					388 444 389 
					443 444 388 
					389 445 390 
					444 445 389 
					390 446 391 
					445 446 390 
					391 447 392 
					446 447 391 
					448 392 447 
					393 392 448 
					393 449 394 
					448 449 393 
					394 450 395 
					449 450 394 
					395 451 452 
					450 451 395 
					395 452 396 
					396 452 425 
					397 398 453 
					397 453 400 
					398 406 454 
					398 454 453 
					399 400 455 
					399 455 401 
					400 453 456 
					400 456 455 
					401 455 457 
					401 457 402 
					402 457 458 
					402 458 403 
					403 458 459 
					403 459 405 
					404 405 443 
					405 459 460 
					405 460 443 
					406 407 461 
					406 461 454 
					462 461 407 
					462 407 408 
					408 435 463 
					408 463 462 
					409 464 465 
					424 464 409 
					409 465 410 
					410 465 466 
					410 466 411 
					411 466 467 
					411 467 412 
					412 467 468 
					412 468 413 
					413 468 469 
					413 469 414 
					414 469 470 
					414 470 415 
					415 470 471 
					415 471 416 
					416 471 472 
					416 472 417 
					417 472 473 
					417 473 418 
					418 473 474 
					418 474 419 
					419 474 475 
					419 475 420 
					420 475 476 
					420 476 421 
					421 476 477 
					421 477 422 
					422 477 478 
					422 478 426 
					425 479 424 
					424 480 464 
					479 480 424 
					452 479 425 
					426 478 481 
					426 481 427 
					428 427 482 
					427 481 483 
					427 483 482 
					433 428 484 
					428 482 484 
					485 429 436 
					486 431 429 
					486 429 485 
					429 430 436 
					442 431 486 
					432 433 434 
					434 433 487 
					433 484 487 
					434 487 435 
					435 487 488 
					435 488 463 
					485 436 441 
					489 437 442 
					490 438 437 
					490 437 489 
					491 439 438 
					491 438 490 
					492 440 439 
					492 439 491 
					493 441 440 
					493 440 492 
					494 485 441 
					494 441 493 
					495 442 486 
					489 442 495 
					443 460 444 
					444 496 445 
					460 496 444 
					445 497 446 
					496 497 445 
					446 498 447 
					497 498 446 
					499 447 498 
					448 447 499 
					448 500 449 
					499 500 448 
					449 501 450 
					500 501 449 
					450 502 451 
					501 502 450 
					451 503 504 
					502 503 451 
					451 504 452 
					452 504 479 
					453 454 505 
					453 505 456 
					454 461 506 
					454 506 505 
					455 456 507 
					455 507 457 
					456 505 508 
					456 508 507 
					457 507 509 
					457 509 458 
					458 509 510 
					458 510 459 
					459 510 511 
					459 511 460 
					460 511 496 
					512 506 461 
					512 461 462 
					462 463 513 
					462 513 512 
					463 488 514 
					463 514 513 
					464 480 515 
					516 465 464 
					464 515 517 
					516 464 517 
					466 465 516 
					467 466 518 
					466 516 518 
					468 467 518 
					468 519 469 
					468 518 519 
					469 519 520 
					469 520 470 
					470 520 521 
					470 521 471 
					471 521 522 
					471 522 472 
					472 522 523 
					472 523 473 
					474 473 523 
					524 475 474 
					474 523 524 
					476 475 525 
					524 525 475 
					476 526 527 
					476 525 526 
					476 527 477 
					478 477 527 
					481 478 527 
					479 528 480 
					504 528 479 
					515 480 528 
					480 515 529 
					528 480 529 
					530 483 481 
					481 527 530 
					484 482 531 
					482 483 532 
					482 532 531 
					532 483 530 
					487 484 533 
					484 531 533 
					534 486 485 
					534 485 494 
					495 486 534 
					487 533 488 
					488 533 535 
					488 535 514 
					536 489 495 
					537 490 489 
					537 489 536 
					538 491 490 
					538 490 537 
					539 492 491 
					539 491 538 
					540 493 492 
					540 492 539 
					541 494 493 
					541 493 540 
					542 534 494 
					542 494 541 
					543 495 534 
					536 495 543 
					496 544 497 
					511 544 496 
					497 545 498 
					544 545 497 
					546 498 545 
					499 498 546 
					499 547 500 
					546 547 499 
					500 548 501 
					547 548 500 
					501 549 502 
					548 549 501 
					502 550 503 
					549 550 502 
					503 551 552 
					550 551 503 
					503 552 504 
					504 552 528 
					505 506 553 
					505 553 508 
					554 553 506 
					554 506 512 
					507 508 555 
					507 555 509 
					508 553 556 
					508 556 555 
					509 555 557 
					509 557 510 
					510 557 558 
					510 558 511 
					511 558 544 
					512 513 559 
					512 559 554 
					513 514 560 
					513 560 559 
					514 535 561 
					514 561 560 
					562 529 515 
					515 564 563 
					515 528 529 
					562 515 529 
					529 564 515 
					515 563 517 
					516 565 566 
					517 565 516 
					516 566 518 
					517 563 565 
					518 566 567 
					518 567 519 
					568 520 519 
					568 519 567 
					569 521 520 
					569 520 568 
					570 522 521 
					570 521 569 
					571 523 522 
					571 522 570 
					572 524 523 
					572 523 571 
					573 525 524 
					573 524 572 
					526 525 573 
					574 527 526 
					574 526 573 
					575 530 527 
					575 527 574 
					529 528 552 
					552 528 529 
					529 576 564 
					529 552 562 
					552 529 562 
					562 576 529 
					577 530 575 
					578 579 530 
					532 530 579 
					578 530 577 
					533 531 580 
					531 532 581 
					531 581 580 
					532 579 582 
					532 582 581 
					533 580 535 
					543 534 542 
					535 580 583 
					535 583 561 
					584 536 543 
					585 537 536 
					585 536 584 
					586 538 537 
					586 537 585 
					587 539 538 
					587 538 586 
					588 540 539 
					588 539 587 
					589 541 540 
					589 540 588 
					590 542 541 
					590 541 589 
					591 543 542 
					591 542 590 
					584 543 591 
					544 592 545 
					558 592 544 
					593 545 592 
					546 545 593 
					546 594 547 
					593 594 546 
					547 595 548 
					594 595 547 
					548 596 549 
					595 596 548 
					549 597 550 
					596 597 549 
					550 598 551 
					597 598 550 
					551 599 562 
					598 599 551 
					551 562 552 
					600 556 553 
					600 553 554 
					554 559 601 
					554 601 600 
					555 556 602 
					555 602 557 
					603 602 556 
					603 556 600 
					557 602 604 
					557 604 558 
					558 604 592 
					559 560 605 
					559 605 601 
					560 561 606 
					560 606 605 
					561 583 607 
					561 607 606 
					562 608 576 
					599 608 562 
					563 564 576 
					565 563 608 
					563 576 608 
					566 565 608 
					567 566 609 
					566 608 609 
					568 567 610 
					567 609 611 
					567 611 610 
					569 568 612 
					568 610 612 
					570 569 612 
					572 571 570 
					572 570 613 
					570 612 613 
					573 572 614 
					572 613 614 
					574 573 615 
					573 614 615 
					575 574 615 
					575 615 616 
					616 577 575 
					616 578 577 
					616 617 578 
					618 579 578 
					617 618 578 
					618 582 579 
					580 581 619 
					580 619 583 
					581 582 620 
					581 620 619 
					621 620 582 
					621 582 618 
					583 619 622 
					583 622 607 
					585 584 623 
					624 584 591 
					584 624 623 
					623 586 585 
					623 625 586 
					625 587 586 
					625 626 587 
					587 626 627 
					587 627 588 
					588 627 628 
					588 628 589 
					589 628 629 
					589 629 590 
					624 591 590 
					624 590 629 
					630 592 604 
					593 592 630 
					593 631 594 
					630 631 593 
					594 632 595 
					631 632 594 
					595 633 596 
					632 633 595 
					596 634 597 
					633 634 596 
					597 635 598 
					634 635 597 
					598 636 599 
					635 636 598 
					599 609 608 
					636 609 599 
					600 601 637 
					600 637 603 
					601 605 638 
					601 638 637 
					639 604 602 
					639 602 603 
					603 637 640 
					603 640 639 
					630 604 639 
					605 606 638 
					606 641 642 
					606 642 638 
					607 641 606 
					607 643 641 
					607 622 644 
					607 644 643 
					636 611 609 
					645 612 610 
					646 610 611 
					645 610 646 
					646 611 636 
					647 613 612 
					647 612 645 
					648 614 613 
					648 613 647 
					649 615 614 
					649 614 648 
					650 616 615 
					650 615 649 
					651 617 616 
					651 616 650 
					652 617 651 
					617 652 618 
					652 621 618 
					619 620 653 
					619 653 622 
					654 653 620 
					654 620 621 
					652 654 621 
					622 653 655 
					622 655 656 
					644 622 657 
					622 656 657 
					658 623 624 
					659 625 623 
					659 623 658 
					660 624 629 
					658 624 660 
					661 626 625 
					661 625 659 
					662 627 626 
					662 626 661 
					663 628 627 
					663 627 662 
					664 629 628 
					664 628 663 
					660 629 664 
					630 665 631 
					639 665 630 
					631 666 632 
					665 666 631 
					632 667 633 
					666 667 632 
					633 668 634 
					667 668 633 
					634 669 635 
					668 669 634 
					635 646 636 
					669 646 635 
					637 670 671 
					637 671 640 
					638 670 637 
					638 642 670 
					639 640 665 
					640 672 673 
					674 672 640 
					640 673 665 
					674 640 671 
					641 675 676 
					641 676 642 
					643 675 641 
					642 676 677 
					642 677 670 
					643 678 675 
					644 678 643 
					644 679 678 
					680 679 644 
					644 657 680 
					681 647 645 
					669 645 646 
					681 645 669 
					682 648 647 
					682 647 681 
					682 649 648 
					683 650 649 
					682 684 649 
					683 649 684 
					683 651 650 
					657 656 651 
					683 685 651 
					657 651 685 
					652 651 656 
					652 655 653 
					656 655 652 
					652 653 654 
					686 657 685 
					687 680 657 
					687 657 686 
					660 688 658 
					658 688 689 
					690 661 658 
					690 658 689 
					663 659 658 
					663 658 660 
					663 661 659 
					664 688 660 
					663 660 664 
					663 662 661 
					661 690 662 
					690 691 662 
					662 691 663 
					663 691 664 
					691 688 664 
					665 673 666 
					666 692 667 
					673 692 666 
					667 693 668 
					692 693 667 
					668 681 669 
					693 681 668 
					670 677 694 
					670 694 671 
					671 694 695 
					671 695 674 
					672 696 697 
					672 698 696 
					672 697 673 
					674 698 672 
					673 697 692 
					674 695 699 
					674 700 698 
					674 699 700 
					675 701 702 
					675 702 676 
					678 701 675 
					676 702 703 
					676 703 677 
					677 703 704 
					677 704 694 
					678 705 701 
					679 705 678 
					680 706 679 
					679 707 705 
					706 707 679 
					687 706 680 
					693 682 681 
					708 684 682 
					708 682 693 
					709 685 683 
					710 683 684 
					709 683 710 
					710 684 708 
					686 685 709 
					698 686 709 
					687 686 698 
					687 711 706 
					700 711 687 
					687 698 700 
					691 689 688 
					691 690 689 
					692 708 693 
					697 708 692 
					694 704 712 
					694 712 695 
					695 712 713 
					695 713 699 
					696 709 710 
					698 709 696 
					696 710 697 
					697 710 708 
					700 699 711 
					699 713 714 
					699 714 711 
					703 702 701 
					701 715 716 
					703 701 705 
					701 716 702 
					705 715 701 
					702 716 717 
					702 717 703 
					703 717 718 
					703 718 704 
					703 705 707 
					703 707 719 
					703 719 714 
					703 714 713 
					703 713 712 
					703 712 704 
					704 718 720 
					704 720 712 
					705 721 715 
					707 721 705 
					706 719 707 
					711 719 706 
					707 722 721 
					719 722 707 
					711 714 719 
					712 720 723 
					712 723 713 
					713 723 724 
					713 724 714 
					714 724 725 
					714 725 719 
					715 726 727 
					715 727 716 
					721 726 715 
					716 727 728 
					716 728 717 
					717 728 729 
					717 729 718 
					718 729 730 
					718 730 720 
					719 725 722 
					720 730 731 
					720 731 723 
					721 732 726 
					722 732 721 
					722 733 732 
					725 733 722 
					723 731 734 
					723 734 724 
					724 734 735 
					724 735 725 
					725 735 733 
					726 736 737 
					726 737 727 
					732 736 726 
					727 737 738 
					727 738 728 
					728 738 739 
					728 739 729 
					729 739 740 
					729 740 730 
					730 740 741 
					730 741 731 
					731 741 742 
					731 742 734 
					732 743 736 
					733 743 732 
					733 744 743 
					735 744 733 
					734 742 745 
					734 745 735 
					735 745 744 
					736 746 747 
					736 747 737 
					743 746 736 
					737 747 748 
					737 748 738 
					738 748 749 
					738 749 739 
					739 749 750 
					739 750 740 
					740 750 751 
					740 751 741 
					741 751 752 
					741 752 742 
					742 752 753 
					742 753 745 
					743 754 746 
					744 754 743 
					744 755 754 
					745 755 744 
					745 753 755 
					746 756 757 
					746 757 747 
					754 756 746 
					747 757 758 
					747 758 748 
					748 758 759 
					748 759 749 
					749 759 760 
					749 760 750 
					750 760 761 
					750 761 751 
					751 761 762 
					751 762 752 
					752 762 763 
					752 763 753 
					753 763 764 
					753 764 755 
					754 765 756 
					755 765 754 
					755 764 765 
					757 756 766 
					766 756 764 
					757 766 767 
					757 767 758 
					767 759 758 
					768 760 759 
					768 759 767 
					768 761 760 
					769 762 761 
					769 761 768 
					769 763 762 
					764 763 769 
					764 769 766 
					768 767 766 
					768 766 769 
				</DataArray>
				<DataArray type="Int32" Name="offsets" format="ascii">
					3 6 9 12 15 18 21 24 27 30 33 36 39 42 45 48 51 54 57 60 63 66 69 72 75 78 81 84 87 90 93 96 99 102 105 108 111 114 117 120 123 126 129 132 135 138 141 144 147 150 153 156 159 162 165 168 171 174 177 180 183 186 189 192 195 198 201 204 207 210 213 216 219 222 225 228 231 234 237 240 243 246 249 252 255 258 261 264 267 270 273 276 279 282 285 288 291 294 297 300 303 306 309 312 315 318 321 324 327 330 333 336 339 342 345 348 351 354 357 360 363 366 369 372 375 378 381 384 387 390 393 396 399 402 405 408 411 414 417 420 423 426 429 432 435 438 441 444 447 450 453 456 459 462 465 468 471 474 477 480 483 486 489 492 495 498 501 504 507 510 513 516 519 522 525 528 531 534 537 540 543 546 549 552 555 558 561 564 567 570 573 576 579 582 585 588 591 594 597 600 603 606 609 612 615 618 621 624 627 630 633 636 639 642 645 648 651 654 657 660 663 666 669 672 675 678 681 684 687 690 693 696 699 702 705 708 711 714 717 720 723 726 729 732 735 738 741 744 747 750 753 756 759 762 765 768 771 774 777 780 783 786 789 792 795 798 801 804 807 810 813 816 819 822 825 828 831 834 837 840 843 846 849 852 855 858 861 864 867 870 873 876 879 882 885 888 891 894 897 900 903 906 909 912 915 918 921 924 927 930 933 936 939 942 945 948 951 954 957 960 963 966 969 972 975 978 981 984 987 990 993 996 999 1002 1005 1008 1011 1014 1017 1020 1023 1026 1029 1032 1035 1038 1041 1044 1047 1050 1053 1056 1059 1062 1065 1068 1071 1074 1077 1080 1083 1086 1089 1092 1095 1098 1101 1104 1107 1110 1113 1116 1119 1122 1125 1128 1131 1134 1137 1140 1143 1146 1149 1152 1155 1158 1161 1164 1167 1170 1173 1176 1179 1182 1185 1188 1191 1194 1197 1200 1203 1206 1209 1212 1215 1218 1221 1224 1227 1230 1233 1236 1239 1242 1245 1248 1251 1254 1257 1260 1263 1266 1269 1272 1275 1278 1281 1284 1287 1290 1293 1296 1299 1302 1305 1308 1311 1314 1317 1320 1323 1326 1329 1332 1335 1338 1341 1344 1347 1350 1353 1356 1359 1362 1365 1368 1371 1374 1377 1380 1383 1386 1389 1392 1395 1398 1401 1404 1407 1410 1413 1416 1419 1422 1425 1428 1431 1434 1437 1440 1443 1446 1449 1452 1455 1458 1461 1464 1467 1470 1473 1476 1479 1482 1485 1488 1491 1494 1497 1500 1503 1506 1509 1512 1515 1518 1521 1524 1527 1530 1533 1536 1539 1542 1545 1548 1551 1554 1557 1560 1563 1566 1569 1572 1575 1578 1581 1584 1587 1590 1593 1596 1599 1602 1605 1608 1611 1614 1617 1620 1623 1626 1629 1632 1635 1638 1641 1644 1647 1650 1653 1656 1659 1662 1665 1668 1671 1674 1677 1680 1683 1686 1689 1692 1695 1698 1701 1704 1707 1710 1713 1716 1719 1722 1725 1728 1731 1734 1737 1740 1743 1746 1749 1752 1755 1758 1761 1764 1767 1770 1773 1776 1779 1782 1785 1788 1791 1794 1797 1800 1803 1806 1809 1812 1815 1818 1821 1824 1827 1830 1833 1836 1839 1842 1845 1848 1851 1854 1857 1860 1863 1866 1869 1872 1875 1878 1881 1884 1887 1890 1893 1896 1899 1902 1905 1908 1911 1914 1917 1920 1923 1926 1929 1932 1935 1938 1941 1944 1947 1950 1953 1956 1959 1962 1965 1968 1971 1974 1977 1980 1983 1986 1989 1992 1995 1998 2001 2004 2007 2010 2013 2016 2019 2022 2025 2028 2031 2034 2037 2040 2043 2046 2049 2052 2055 2058 2061 2064 2067 2070 2073 2076 2079 2082 2085 2088 2091 2094 2097 2100 2103 2106 2109 2112 2115 2118 2121 2124 2127 2130 2133 2136 2139 2142 2145 2148 2151 2154 2157 2160 2163 2166 2169 2172 2175 2178 2181 2184 2187 2190 2193 2196 2199 2202 2205 2208 2211 2214 2217 2220 2223 2226 2229 2232 2235 2238 2241 2244 2247 2250 2253 2256 2259 2262 2265 2268 2271 2274 2277 2280 2283 2286 2289 2292 2295 2298 2301 2304 2307 2310 2313 2316 2319 2322 2325 2328 2331 2334 2337 2340 2343 2346 2349 2352 2355 2358 2361 2364 2367 2370 2373 2376 2379 2382 2385 2388 2391 2394 2397 2400 2403 2406 2409 2412 2415 2418 2421 2424 2427 2430 2433 2436 2439 2442 2445 2448 2451 2454 2457 2460 2463 2466 2469 2472 2475 2478 2481 2484 2487 2490 2493 2496 2499 2502 2505 2508 2511 2514 2517 2520 2523 2526 2529 2532 2535 2538 2541 2544 2547 2550 2553 2556 2559 2562 2565 2568 2571 2574 2577 2580 2583 2586 2589 2592 2595 2598 2601 2604 2607 2610 2613 2616 2619 2622 2625 2628 2631 2634 2637 2640 2643 2646 2649 2652 2655 2658 2661 2664 2667 2670 2673 2676 2679 2682 2685 2688 2691 2694 2697 2700 2703 2706 2709 2712 2715 2718 2721 2724 2727 2730 2733 2736 2739 2742 2745 2748 2751 2754 2757 2760 2763 2766 2769 2772 2775 2778 2781 2784 2787 2790 2793 2796 2799 2802 2805 2808 2811 2814 2817 2820 2823 2826 2829 2832 2835 2838 2841 2844 2847 2850 2853 2856 2859 2862 2865 2868 2871 2874 2877 2880 2883 2886 2889 2892 2895 2898 2901 2904 2907 2910 2913 2916 2919 2922 2925 2928 2931 2934 2937 2940 2943 2946 2949 2952 2955 2958 2961 2964 2967 2970 2973 2976 2979 2982 2985 2988 2991 2994 2997 3000 3003 3006 3009 3012 3015 3018 3021 3024 3027 3030 3033 3036 3039 3042 3045 3048 3051 3054 3057 3060 3063 3066 3069 3072 3075 3078 3081 3084 3087 3090 3093 3096 3099 3102 3105 3108 3111 3114 3117 3120 3123 3126 3129 3132 3135 3138 3141 3144 3147 3150 3153 3156 3159 3162 3165 3168 3171 3174 3177 3180 3183 3186 3189 3192 3195 3198 3201 3204 3207 3210 3213 3216 3219 3222 3225 3228 3231 3234 3237 3240 3243 3246 3249 3252 3255 3258 3261 3264 3267 3270 3273 3276 3279 3282 3285 3288 3291 3294 3297 3300 3303 3306 3309 3312 3315 3318 3321 3324 3327 3330 3333 3336 3339 3342 3345 3348 3351 3354 3357 3360 3363 3366 3369 3372 3375 3378 3381 3384 3387 3390 3393 3396 3399 3402 3405 3408 3411 3414 3417 3420 3423 3426 3429 3432 3435 3438 3441 3444 3447 3450 3453 3456 3459 3462 3465 3468 3471 3474 3477 3480 3483 3486 3489 3492 3495 3498 3501 3504 3507 3510 3513 3516 3519 3522 3525 3528 3531 3534 3537 3540 3543 3546 3549 3552 3555 3558 3561 3564 3567 3570 3573 3576 3579 3582 3585 3588 3591 3594 3597 3600 3603 3606 3609 3612 3615 3618 3621 3624 3627 3630 3633 3636 3639 3642 3645 3648 3651 3654 3657 3660 3663 3666 3669 3672 3675 3678 3681 3684 3687 3690 3693 3696 3699 3702 3705 3708 3711 3714 3717 3720 3723 3726 3729 3732 3735 3738 3741 3744 3747 3750 3753 3756 3759 3762 3765 3768 3771 3774 3777 3780 3783 3786 3789 3792 3795 3798 3801 3804 3807 3810 3813 3816 3819 3822 3825 3828 3831 3834 3837 3840 3843 3846 3849 3852 3855 3858 3861 3864 3867 3870 3873 3876 3879 3882 3885 3888 3891 3894 3897 3900 3903 3906 3909 3912 3915 3918 3921 3924 3927 3930 3933 3936 3939 3942 3945 3948 3951 3954 3957 3960 3963 3966 3969 3972 3975 3978 3981 3984 3987 3990 3993 3996 3999 4002 4005 4008 4011 4014 4017 4020 4023 4026 4029 4032 4035 4038 4041 4044 4047 4050 4053 4056 4059 4062 4065 4068 4071 4074 4077 4080 4083 4086 4089 4092 4095 4098 4101 4104 4107 4110 4113 4116 4119 4122 4125 4128 4131 4134 4137 4140 4143 4146 4149 4152 4155 4158 4161 4164 4167 4170 4173 4176 4179 4182 4185 4188 4191 4194 4197 4200 4203 4206 4209 4212 4215 4218 4221 4224 4227 4230 4233 4236 4239 4242 4245 4248 4251 4254 4257 4260 4263 4266 4269 4272 4275 4278 4281 4284 4287 4290 4293 4296 4299 4302 4305 4308 4311 4314 4317 4320 4323 4326 4329 4332 4335 4338 4341 4344 4347 4350 4353 4356 4359 4362 4365 4368 4371 4374 4377 4380 4383 4386 4389 4392 4395 4398 4401 4404 4407 4410 4413 4416 4419 4422 4425 4428 4431 4434 4437 4440 4443 4446 4449 4452 4455 4458 4461 4464 4467 4470 4473 4476 4479 4482 4485 4488 4491 4494 4497 4500 4503 4506 4509 4512 4515 4518 4521 4524 4527 4530 4533 4536 4539 4542 4545 4548 4551 4554 4557 4560 4563 4566 4569 4572 4575 4578 4581 4584 4587 4590 4593 4596 4599 4602 4605 4608 4611 4614 4617 4620 4623 4626 4629 4632 4635 4638 4641 4644 4647 4650 
				</DataArray>
			</Polys>
		</Piece>
	</PolyData>
</VTKFile>
