<?xml version="1.0"?>
<VTKFile type="PolyData" version="0.1" byte_order="LittleEndian" compressor="vtkZLibDataCompressor">
	<PolyData>
		<Piece NumberOfPoints="545" NumberOfVerts="0" NumberOfLines="0" NumberOfStrips="0" NumberOfPolys="1096">
		<PointData Normals="Normals">
		<DataArray type="Float32" Name="Normals" NumberOfComponents="3" format="ascii">
			0.502774 -0.405932 -0.763176
			0.462141 -0.438197 -0.770979
			0.550276 -0.220689 -0.805291
			0.533002 0.055297 -0.844305
			0.450883 -0.386291 -0.804664
			0.442300 -0.647799 -0.620263
			0.340882 -0.778760 -0.526623
			0.453731 -0.540703 -0.708356
			0.455981 -0.390632 -0.799680
			0.438763 0.288266 -0.851111
			0.574332 0.088526 -0.813822
			0.558630 0.075297 -0.825992
			0.596308 -0.054163 -0.800927
			0.552781 -0.439467 -0.708027
			0.518815 -0.030442 -0.854344
			0.526786 0.126355 -0.840554
			0.562596 0.099006 -0.820783
			0.509149 0.269836 -0.817285
			0.535526 0.145408 -0.831907
			0.486709 0.241540 -0.839507
			0.521185 -0.600615 -0.606322
			0.569040 -0.332260 -0.752195
			0.412509 -0.769499 -0.487553
			0.237698 -0.918151 -0.317014
			0.160901 -0.966816 -0.198439
			0.480223 -0.745287 -0.462529
			0.304393 -0.893565 -0.329980
			0.159699 -0.969679 -0.184984
			0.524266 0.254759 -0.812553
			0.581157 0.035072 -0.813035
			0.605650 -0.272023 -0.747791
			0.700619 -0.175373 -0.691648
			0.595662 0.086497 -0.798565
			0.773168 0.008659 -0.634142
			0.435290 0.421805 -0.795363
			0.419584 0.391638 -0.818883
			0.487665 0.373600 -0.789053
			0.383818 0.528803 -0.757001
			0.446381 0.278164 -0.850511
			0.463606 0.283380 -0.839503
			0.624036 0.312599 -0.716143
			0.392145 0.392585 -0.831925
			0.454745 -0.678748 -0.576635
			0.085690 -0.993736 -0.071733
			-0.019602 -0.999544 -0.022985
			-0.087222 -0.981056 0.172977
			-0.160611 -0.956450 0.243735
			0.314792 -0.919611 -0.234995
			0.447354 -0.874771 -0.186146
			0.689916 -0.544793 -0.476672
			0.137718 -0.985758 -0.096509
			-0.028355 -0.997622 0.062828
			0.511799 0.269474 -0.815749
			0.451767 0.415807 -0.789311
			0.562481 0.064518 -0.824289
			0.442689 0.441234 -0.780602
			0.542278 -0.147553 -0.827141
			0.551772 0.018589 -0.833788
			0.800334 -0.144030 -0.581997
			0.723277 0.143795 -0.675421
			0.877443 -0.230002 -0.420944
			0.982311 -0.029555 -0.184908
			0.911680 0.103523 -0.397647
			0.345883 0.527435 -0.776001
			0.233685 0.754770 -0.612954
			0.240173 0.676810 -0.695878
			0.378685 0.583723 -0.718238
			0.333228 0.482793 -0.809858
			0.380658 0.512422 -0.769755
			0.572755 0.563048 -0.595759
			0.787263 0.271437 -0.553659
			0.558345 -0.511371 -0.653262
			0.351874 -0.855828 -0.379135
			0.026251 -0.993209 -0.113347
			-0.160309 -0.978783 0.127615
			-0.308714 -0.890061 0.335392
			-0.133730 -0.965038 0.225430
			-0.442697 -0.869691 0.218306
			-0.321956 -0.840299 0.436167
			-0.401706 -0.810502 0.426284
			-0.214129 -0.934494 0.284376
			-0.342677 -0.829522 0.440983
			0.217893 -0.975963 0.004439
			0.774232 -0.607070 -0.178972
			0.476372 -0.870768 0.121788
			0.721547 -0.691013 0.043255
			-0.113769 -0.972576 0.202859
			-0.011723 -0.980230 0.197514
			0.394799 0.523514 -0.755027
			0.549510 0.228231 -0.803709
			0.522970 0.123263 -0.843391
			0.456472 0.428806 -0.779589
			0.603082 -0.033149 -0.796990
			0.521370 -0.801414 -0.293103
			0.924734 0.218610 -0.311571
			0.946946 -0.307967 -0.091922
			0.907042 -0.394126 0.148117
			0.962204 0.183684 0.201058
			0.937507 -0.023894 0.347145
			0.938595 0.247571 0.240309
			0.156960 0.786047 -0.597907
			0.340047 0.637344 -0.691492
			0.235347 0.753114 -0.614354
			0.138297 0.859019 -0.492911
			0.027499 0.907396 -0.419376
			0.067745 0.854058 -0.515748
			0.069177 0.831318 -0.551476
			0.114163 0.734216 -0.669249
			0.248685 0.594847 -0.764403
			0.260169 0.561480 -0.785527
			0.301458 0.576780 -0.759242
			0.465236 0.722336 -0.511650
			0.780679 0.414360 -0.467810
			0.674037 0.706478 -0.215784
			0.813018 0.571635 -0.110613
			0.943960 0.289456 -0.158603
			0.968679 0.149471 0.198293
			0.709907 0.016758 -0.704096
			0.688805 -0.522041 -0.503011
			0.252143 -0.967494 0.019469
			0.027888 -0.996003 -0.084852
			-0.274141 -0.933437 0.231389
			-0.188583 -0.952138 0.240562
			-0.314323 -0.885678 0.341723
			-0.355716 -0.829080 0.431384
			-0.336741 -0.851274 0.402415
			-0.404691 -0.810406 0.423637
			-0.410299 -0.789342 0.456720
			-0.340531 -0.843851 0.414674
			-0.267801 -0.888059 0.373676
			0.116350 -0.935803 0.332769
			0.606179 -0.722536 0.332398
			-0.193208 -0.900467 0.389653
			0.327225 0.560372 -0.760859
			0.285821 0.682959 -0.672216
			0.547687 0.257858 -0.795957
			0.473997 0.426386 -0.770404
			0.597459 -0.786091 -0.158444
			0.218972 -0.954006 0.204751
			0.782676 0.344755 0.518230
			0.740590 0.153895 0.654096
			0.790834 0.448712 0.416221
			0.876279 0.251443 0.410988
			0.685206 -0.420490 0.594711
			0.134261 0.832511 -0.537494
			0.081211 0.877084 -0.473421
			0.069142 0.891057 -0.448594
			-0.007199 0.936755 -0.349912
			-0.012944 0.935348 -0.353492
			-0.155349 0.958467 -0.239180
			-0.035592 0.927685 -0.371665
			-0.008295 0.846499 -0.532325
			-0.096447 0.913941 -0.394220
			-0.006624 0.811212 -0.584715
			0.124888 0.686870 -0.715970
			0.216459 0.616111 -0.757333
			-0.044439 0.837430 -0.544736
			0.261952 0.737043 -0.623016
			0.160882 0.681677 -0.713746
			0.258876 0.870664 -0.418242
			0.448011 0.878080 -0.168114
			0.897032 0.439998 -0.041666
			0.698912 0.712996 0.056197
			0.794863 0.606332 0.023556
			0.754912 0.394189 0.524140
			0.936782 0.241691 0.253030
			0.716475 -0.056593 0.695313
			0.581440 0.488420 -0.650672
			0.751647 -0.481982 -0.450245
			0.808733 -0.099517 -0.579696
			0.751803 0.195951 -0.629600
			-0.054858 -0.952555 0.299382
			0.127028 -0.943445 0.306227
			-0.215649 -0.884368 0.413991
			-0.259286 -0.850915 0.456853
			-0.342674 -0.779718 0.524037
			-0.422509 -0.731369 0.535336
			-0.449735 -0.801824 0.393467
			-0.368174 -0.829454 0.420065
			-0.358882 -0.864816 0.351136
			-0.408693 -0.847605 0.338433
			-0.436885 -0.749847 0.496851
			-0.384067 -0.851799 0.356274
			-0.313544 -0.845120 0.432969
			-0.036582 -0.845922 0.532051
			0.433114 -0.701167 0.566372
			-0.231758 -0.864014 0.446954
			0.278190 0.648948 -0.708151
			0.212604 0.745216 -0.632023
			0.133254 0.831345 -0.539546
			0.337470 -0.882787 0.326803
			0.237903 -0.918516 0.315800
			-0.181381 -0.845975 0.501425
			-0.111372 -0.930057 0.350129
			0.006232 -0.887615 0.460545
			0.731355 0.455386 0.507684
			0.690015 0.053365 0.721825
			0.751491 0.290339 0.592422
			0.811303 0.528583 0.249775
			0.828392 0.510365 0.230855
			0.704489 -0.170511 0.688927
			0.670276 0.117469 0.732756
			0.584186 -0.355394 0.729672
			-0.008641 0.924284 -0.381606
			-0.032282 0.941344 -0.335900
			-0.114486 0.962176 -0.247203
			-0.202355 0.934457 -0.292988
			-0.265721 0.954404 -0.136031
			-0.364524 0.926038 -0.097857
			-0.257564 0.945661 -0.198459
			-0.144594 0.898113 -0.415313
			0.048658 0.873171 -0.484980
			-0.092108 0.893849 -0.438805
			0.259399 0.933826 -0.246335
			0.096271 0.971071 -0.218523
			0.273021 0.961611 -0.027629
			0.397029 0.916138 0.055307
			0.529623 0.840743 0.112478
			0.542046 0.484479 0.686634
			0.509784 -0.051915 0.858735
			0.377754 0.866953 0.325108
			0.406797 0.118661 0.905779
			0.333792 0.170414 0.927115
			0.312799 0.659175 -0.683846
			0.746297 0.219007 -0.628551
			0.536772 0.613016 -0.579730
			0.398209 0.695593 -0.597980
			0.724158 -0.295579 -0.623080
			0.615380 -0.717006 -0.327430
			0.733245 -0.095317 -0.673251
			-0.157996 -0.878548 0.450767
			-0.247191 -0.824804 0.508522
			-0.437704 -0.661263 0.609218
			-0.345573 -0.741686 0.574876
			-0.374799 -0.875915 0.303807
			-0.441599 -0.835059 0.328126
			-0.379191 -0.847740 0.370878
			-0.432253 -0.760403 0.484711
			-0.335630 -0.894696 0.294741
			-0.307050 -0.915427 0.260220
			0.156009 -0.734355 0.660594
			0.519170 -0.571176 0.635783
			-0.215393 -0.803947 0.554324
			-0.332590 -0.799458 0.500250
			-0.054387 -0.844518 0.532759
			0.184388 0.765295 -0.616705
			0.244792 0.717945 -0.651638
			0.057539 0.895201 -0.441932
			0.395021 -0.915264 0.079062
			0.196496 -0.929100 0.313310
			0.030860 -0.841583 0.539245
			-0.015830 -0.790192 0.612655
			-0.084296 -0.829150 0.552634
			-0.283936 -0.791733 0.540869
			-0.213537 -0.761462 0.612027
			-0.382751 -0.646964 0.659499
			0.765883 0.484368 0.422861
			0.524223 0.246264 0.815196
			0.614195 0.694510 0.374727
			0.611353 0.599093 0.517045
			0.420716 0.364234 0.830862
			0.288585 -0.390491 0.874206
			-0.152392 0.973892 -0.168262
			-0.084672 0.983366 -0.160690
			-0.275411 0.958612 -0.072191
			-0.242652 0.929454 -0.277913
			-0.534061 0.840899 0.087568
			-0.495233 0.866641 0.060640
			-0.293074 0.944836 -0.146261
			-0.677500 0.703191 0.215677
			-0.265775 0.948539 -0.172156
			-0.134784 0.955417 -0.262699
			-0.141993 0.989509 -0.026635
			0.134869 0.990698 0.018123
			0.338705 0.419146 0.842375
			0.405868 0.133735 0.904094
			0.149454 0.894074 0.422250
			0.474576 0.306159 0.825254
			0.314507 0.725003 -0.612744
			0.641877 0.181693 -0.744971
			0.321491 0.758235 -0.567206
			0.414651 0.575030 -0.705270
			0.617396 -0.437933 -0.653481
			0.644984 -0.286927 -0.708286
			0.606256 -0.082271 -0.791003
			0.499972 -0.731633 -0.463401
			0.441502 -0.887323 -0.133172
			-0.474197 -0.604831 0.639778
			-0.373689 -0.838687 0.396184
			-0.395999 -0.804578 0.442537
			-0.372169 -0.797315 0.475162
			-0.483975 -0.750122 0.450651
			-0.539522 -0.761413 0.359395
			-0.547188 -0.665336 0.507853
			-0.579879 -0.709618 0.400228
			-0.586429 -0.634029 0.504092
			-0.003993 -0.715691 0.698405
			-0.165287 -0.675508 0.718588
			0.230681 0.803084 -0.549402
			0.063081 0.926651 -0.370591
			0.152110 -0.985266 0.078186
			0.019953 -0.928894 0.369807
			-0.160375 -0.767036 0.621237
			-0.099875 -0.876707 0.470542
			-0.129620 -0.790763 0.598241
			-0.185674 -0.703990 0.685509
			-0.095420 -0.777415 0.621709
			-0.307199 -0.624770 0.717838
			-0.436186 -0.517596 0.736095
			-0.480270 -0.543266 0.688624
			-0.434356 -0.564093 0.702235
			0.485454 0.619799 0.616591
			0.385525 0.724281 0.571653
			0.423436 0.174950 0.888873
			0.526605 0.628553 0.572371
			0.169535 -0.215287 0.961722
			0.411653 -0.039989 0.910463
			-0.225156 0.970566 -0.085479
			-0.255729 0.964992 -0.058247
			0.189620 0.930195 -0.314295
			0.071270 0.991399 -0.109768
			-0.248592 0.968072 -0.032224
			-0.256427 0.966554 0.004241
			-0.116903 0.986853 0.111605
			-0.243044 0.963082 0.115769
			-0.554994 0.810619 0.186759
			-0.385212 0.914134 0.126375
			-0.286535 0.924270 -0.252236
			-0.319440 0.942631 -0.096978
			-0.775363 0.477614 0.413156
			-0.704901 0.640744 0.304239
			-0.754886 0.580658 0.304932
			-0.567511 0.804014 0.177463
			-0.376621 0.920918 0.100331
			-0.758655 0.516663 0.396864
			-0.800252 0.471938 0.369960
			-0.267636 0.949450 -0.164058
			-0.320516 0.945893 0.050558
			-0.307438 0.922259 0.234350
			0.091256 0.879338 0.467373
			0.489321 0.318518 0.811857
			0.456631 0.623714 0.634405
			0.640959 0.430599 0.635418
			0.308771 0.724856 -0.615828
			0.495132 0.200991 -0.845249
			0.253946 0.684066 -0.683787
			0.134435 0.687810 -0.713334
			0.362524 0.314140 -0.877435
			0.555475 -0.412489 -0.722011
			0.576774 -0.262591 -0.773549
			0.500182 -0.038145 -0.865080
			0.346645 -0.825210 -0.445943
			-0.538940 -0.631579 0.557361
			-0.547682 -0.572217 0.610419
			-0.353978 -0.712213 0.606179
			-0.472330 -0.570615 0.671791
			-0.500807 -0.613540 0.610541
			-0.591750 -0.668873 0.449934
			-0.804079 -0.084696 0.588459
			-0.832393 -0.239387 0.499815
			-0.730309 -0.264092 0.630003
			-0.763463 -0.126883 0.633265
			-0.702190 -0.361736 0.613251
			-0.226351 -0.585689 0.778289
			-0.006168 -0.411554 0.911364
			0.315848 0.804799 -0.502532
			-0.103539 -0.938591 0.329130
			-0.112707 -0.989464 0.090876
			-0.297717 -0.847778 0.438904
			-0.452439 -0.777549 0.436711
			-0.287232 -0.732022 0.617772
			-0.384148 -0.765532 0.516131
			-0.372010 -0.826211 0.423065
			-0.229140 -0.856350 0.462773
			-0.205162 -0.770731 0.603227
			-0.141913 -0.678362 0.720892
			-0.247802 -0.516246 0.819807
			-0.302723 -0.566960 0.766104
			-0.157383 -0.609898 0.776695
			-0.365369 -0.526384 0.767740
			-0.427076 -0.462149 0.777190
			-0.493291 -0.232072 0.838336
			-0.633055 -0.152244 0.758988
			-0.454818 -0.593391 0.664099
			-0.639624 -0.463829 0.612980
			0.612012 0.492679 0.618634
			0.044445 -0.181707 0.982348
			0.418230 0.374391 0.827596
			0.695081 0.548455 0.464823
			0.138405 0.987891 -0.070112
			0.090369 0.967234 -0.237260
			0.039012 0.991833 -0.121428
			-0.091771 0.994830 0.043492
			-0.217815 0.926179 0.307814
			-0.202034 0.958391 0.201668
			-0.233591 0.960695 0.150005
			-0.602121 0.517867 0.607671
			-0.365628 0.831930 0.417383
			-0.668628 0.544376 0.506548
			-0.702295 0.561011 0.438233
			-0.325700 0.932964 0.153291
			-0.819220 0.137303 0.556801
			-0.830847 0.252431 0.495957
			-0.816367 0.075665 0.572555
			-0.791119 0.440532 0.424337
			-0.600441 0.706411 0.374771
			-0.362960 0.855587 0.369095
			-0.258127 0.870809 0.418404
			-0.112617 0.847967 0.517947
			0.518919 0.533218 0.668133
			0.470062 0.541296 0.697166
			0.719393 0.347930 0.601181
			0.206586 0.653772 -0.727945
			0.313136 0.708454 -0.632486
			0.098856 0.631637 -0.768935
			-0.209679 0.514296 -0.831586
			0.015941 0.548871 -0.835755
			0.105894 0.616477 -0.780219
			0.319157 0.218527 -0.922163
			-0.020367 0.459566 -0.887910
			0.451693 -0.328454 -0.829513
			0.189034 0.019311 -0.981781
			0.182143 -0.797461 -0.575221
			-0.170994 -0.980993 -0.091729
			-0.636890 -0.369619 0.676574
			-0.773678 -0.104679 0.624872
			-0.343834 -0.454732 0.821582
			-0.538601 -0.354364 0.764418
			-0.743965 0.029104 0.667585
			0.280727 0.820384 -0.498160
			-0.345081 -0.894176 0.285252
			-0.650889 -0.724066 0.228195
			-0.474424 -0.845466 0.245171
			-0.338079 -0.805949 0.485951
			-0.594624 -0.798081 0.097415
			-0.658440 -0.719271 0.221600
			-0.528608 -0.744905 0.407050
			-0.299810 -0.450151 0.841117
			-0.369843 -0.401106 0.838051
			-0.244510 -0.381936 0.891258
			-0.333669 -0.493234 0.803359
			-0.401190 -0.472379 0.784796
			-0.535883 0.111188 0.836939
			0.656570 0.499324 0.565323
			-0.145868 -0.073897 0.986540
			0.108355 0.378636 0.919181
			0.395368 0.530000 0.750189
			0.103701 0.938700 -0.328768
			-0.224257 0.958120 0.178086
			-0.120747 0.992666 -0.005897
			-0.357074 0.817373 0.452105
			-0.472833 0.439718 0.763595
			-0.761442 0.238922 0.602597
			-0.755700 -0.072334 0.650911
			-0.592494 0.359742 0.720789
			-0.225166 0.806306 0.546966
			-0.425739 0.610110 0.668216
			0.016661 0.743660 0.668350
			0.129595 0.714168 -0.687873
			0.031708 0.607729 -0.793512
			0.134067 0.605842 -0.784207
			0.230272 0.767500 -0.598263
			-0.129948 0.439308 -0.888888
			-0.487106 0.441966 -0.753255
			-0.420115 0.130848 -0.897988
			-0.679799 0.061649 -0.730803
			0.032708 0.539113 -0.841598
			-0.185364 0.039497 -0.981876
			-0.447001 0.252660 -0.858110
			0.130719 -0.152600 -0.979605
			0.100511 -0.522566 -0.846653
			-0.368396 -0.295145 -0.881575
			-0.568753 -0.083621 -0.818246
			-0.274547 -0.798577 -0.535629
			-0.605985 -0.793832 -0.051121
			-0.673098 -0.106193 0.731889
			-0.608588 -0.213967 0.764094
			-0.470936 -0.055048 0.880448
			0.106437 0.861074 -0.497215
			-0.858891 -0.511418 0.027539
			-0.762961 -0.644869 -0.045102
			-0.860404 -0.476434 -0.180873
			-0.580983 -0.810846 0.070621
			-0.540011 -0.805418 0.244315
			-0.478875 -0.729768 0.487973
			-0.414517 -0.500625 0.759968
			-0.699503 -0.713897 -0.032348
			-0.672512 -0.721482 -0.164895
			-0.652643 -0.748432 -0.117930
			-0.681004 -0.731574 -0.032128
			-0.303292 -0.294805 0.906148
			-0.314304 -0.261967 0.912462
			-0.374424 -0.257956 0.890655
			-0.427436 -0.122155 0.895755
			-0.479975 0.353329 0.802984
			-0.193155 0.254389 0.947617
			-0.221146 0.482021 0.847791
			-0.077642 0.953851 -0.290067
			-0.352663 0.891724 0.283649
			-0.349623 0.924050 0.154583
			-0.299354 0.953332 -0.039307
			-0.420843 0.860082 0.288356
			-0.489821 0.586537 0.645019
			-0.526127 0.279950 0.803006
			-0.552340 0.091724 0.828557
			-0.077515 0.683204 -0.726102
			-0.109678 0.849482 -0.516092
			-0.498697 0.149398 -0.853804
			-0.148406 0.588109 -0.795049
			-0.595960 0.161842 -0.786536
			-0.704793 -0.110385 -0.700773
			-0.836604 -0.107949 -0.537067
			-0.801317 -0.431474 -0.414393
			-0.746722 -0.424176 -0.512329
			-0.835297 -0.272533 -0.477499
			-0.711285 -0.582265 -0.393753
			-0.627739 -0.771228 0.105595
			-0.641936 -0.608514 0.466507
			-0.619010 -0.450294 0.643477
			-0.564583 -0.198887 0.801055
			-0.793943 -0.568795 -0.214771
			-0.699173 -0.714952 0.000895
			-0.372093 0.122365 0.920094
			-0.424399 -0.133876 0.895524
			-0.212507 0.933029 -0.290340
			-0.389081 0.921183 0.006205
			-0.325248 0.915504 -0.236781
			-0.487768 0.863497 0.128278
			-0.681671 0.502835 0.531490
			-0.516058 0.385824 0.764738
			-0.326373 0.690722 -0.645278
			-0.367415 0.856684 -0.362076
			-0.614803 0.348760 -0.707378
			-0.797364 0.009445 -0.603424
			-0.896705 -0.442497 -0.010743
			-0.679973 -0.610379 0.406292
			-0.867272 -0.021833 0.497356
			-0.748031 -0.337704 0.571320
			-0.615014 0.067026 0.785663
			-0.947326 0.034771 -0.318377
			-0.496846 0.839417 -0.220280
			-0.773135 0.596246 0.216223
			-0.741148 0.632817 -0.224147
			-0.648857 0.591538 -0.478610
			-0.974976 0.214719 0.057604
		</DataArray>
	</PointData>
	<Points>
		<DataArray type="Float32" NumberOfComponents="3" format="ascii">
			-0.011110 -0.074386 0.040204
			-0.010630 -0.074130 0.040390
			-0.009647 -0.074462 0.041165
			-0.011443 -0.074958 0.040039
			-0.011631 -0.074197 0.039834
			-0.010473 -0.073413 0.039892
			-0.011387 -0.073338 0.039182
			-0.010962 -0.073456 0.039606
			-0.010079 -0.073724 0.040425
			-0.009512 -0.073314 0.040472
			-0.009456 -0.075140 0.041329
			-0.009854 -0.075333 0.041034
			-0.008232 -0.074711 0.042258
			-0.009191 -0.073980 0.041263
			-0.012597 -0.074500 0.039359
			-0.012525 -0.075871 0.039220
			-0.013043 -0.075804 0.038908
			-0.009049 -0.076077 0.041423
			-0.012660 -0.076715 0.039012
			-0.011036 -0.077003 0.039931
			-0.013033 -0.073751 0.038630
			-0.013137 -0.074298 0.038998
			-0.008628 -0.073368 0.041197
			-0.009663 -0.073061 0.039729
			-0.010097 -0.073064 0.039374
			-0.013409 -0.073669 0.038179
			-0.012638 -0.073338 0.038211
			-0.012116 -0.073208 0.038241
			-0.007726 -0.075847 0.042360
			-0.007752 -0.074785 0.042609
			-0.007924 -0.073913 0.042332
			-0.013520 -0.074627 0.038756
			-0.013399 -0.076152 0.038652
			-0.013990 -0.075498 0.038112
			-0.009447 -0.077067 0.040773
			-0.009922 -0.077121 0.040478
			-0.008357 -0.076433 0.041722
			-0.008822 -0.077215 0.041027
			-0.011714 -0.077620 0.039349
			-0.012660 -0.077866 0.038829
			-0.012903 -0.078300 0.038516
			-0.010333 -0.077322 0.040202
			-0.007049 -0.073545 0.042856
			-0.009079 -0.073008 0.039922
			-0.008286 -0.072994 0.040699
			-0.010134 -0.073079 0.038663
			-0.009006 -0.073113 0.039156
			-0.013041 -0.073306 0.037664
			-0.013485 -0.073390 0.037356
			-0.013810 -0.073776 0.037846
			-0.012432 -0.073163 0.037789
			-0.010966 -0.073109 0.038126
			-0.006933 -0.075483 0.042962
			-0.007029 -0.076185 0.042645
			-0.007351 -0.074586 0.042897
			-0.007864 -0.076417 0.042015
			-0.006582 -0.073901 0.043361
			-0.006948 -0.074380 0.043179
			-0.013865 -0.074831 0.038313
			-0.013721 -0.076441 0.038336
			-0.014197 -0.074309 0.037710
			-0.014347 -0.075057 0.037466
			-0.014291 -0.075653 0.037711
			-0.009819 -0.077625 0.040217
			-0.007534 -0.077835 0.040912
			-0.008463 -0.077772 0.040638
			-0.006945 -0.076894 0.042168
			-0.010969 -0.077923 0.039575
			-0.012580 -0.078738 0.038436
			-0.012783 -0.079027 0.038012
			-0.013582 -0.077709 0.037971
			-0.005588 -0.073412 0.043716
			-0.005923 -0.073318 0.043300
			-0.006634 -0.073016 0.042216
			-0.008573 -0.072976 0.040200
			-0.008455 -0.073176 0.039438
			-0.007163 -0.073014 0.041190
			-0.007921 -0.073296 0.039762
			-0.007033 -0.073391 0.040506
			-0.007096 -0.073927 0.039560
			-0.010756 -0.073274 0.037602
			-0.008915 -0.073422 0.038639
			-0.013125 -0.073236 0.036953
			-0.014060 -0.073785 0.037326
			-0.013525 -0.073369 0.036630
			-0.013902 -0.073590 0.036886
			-0.011765 -0.073175 0.037186
			-0.012692 -0.073223 0.036551
			-0.005921 -0.076289 0.043192
			-0.005215 -0.075077 0.044204
			-0.006659 -0.075074 0.043262
			-0.005141 -0.075969 0.043826
			-0.005556 -0.074265 0.044112
			-0.004716 -0.073041 0.044242
			-0.014081 -0.076464 0.037904
			-0.014327 -0.074354 0.037196
			-0.014341 -0.074240 0.036564
			-0.014396 -0.075744 0.037191
			-0.014181 -0.074421 0.035993
			-0.013993 -0.076863 0.036997
			-0.007836 -0.078155 0.040396
			-0.006358 -0.076976 0.042426
			-0.006002 -0.077299 0.042261
			-0.006776 -0.077958 0.041035
			-0.006956 -0.078527 0.039977
			-0.007739 -0.078496 0.039923
			-0.008721 -0.078738 0.039434
			-0.009689 -0.078569 0.039480
			-0.010113 -0.078195 0.039681
			-0.011030 -0.078501 0.039164
			-0.011909 -0.078965 0.038565
			-0.012439 -0.079396 0.037883
			-0.013397 -0.078352 0.037946
			-0.012965 -0.079344 0.037158
			-0.013274 -0.078897 0.037245
			-0.013819 -0.077824 0.037310
			-0.013935 -0.077353 0.037127
			-0.004332 -0.073959 0.045103
			-0.004421 -0.073065 0.044737
			-0.005156 -0.073109 0.043553
			-0.005697 -0.073127 0.042886
			-0.006685 -0.073016 0.041508
			-0.005806 -0.073140 0.042274
			-0.005925 -0.073277 0.041787
			-0.006102 -0.074052 0.039985
			-0.005978 -0.073917 0.040481
			-0.008745 -0.074146 0.037709
			-0.006880 -0.074870 0.037956
			-0.009905 -0.073420 0.037868
			-0.011365 -0.073342 0.036904
			-0.013069 -0.073337 0.036198
			-0.013744 -0.073584 0.036184
			-0.012063 -0.073345 0.036508
			-0.004189 -0.075835 0.044397
			-0.005196 -0.076526 0.043400
			-0.004826 -0.074922 0.044524
			-0.003896 -0.074863 0.045153
			-0.003920 -0.072615 0.044810
			-0.004079 -0.072691 0.044239
			-0.014109 -0.075728 0.036562
			-0.013462 -0.077120 0.036493
			-0.013907 -0.075544 0.036127
			-0.013884 -0.074911 0.035450
			-0.013932 -0.074223 0.035600
			-0.004600 -0.077404 0.042541
			-0.004852 -0.077615 0.042121
			-0.005622 -0.077901 0.041461
			-0.005983 -0.078318 0.040490
			-0.006364 -0.078443 0.040147
			-0.006095 -0.078645 0.039249
			-0.007196 -0.078707 0.039531
			-0.008728 -0.079123 0.038877
			-0.007518 -0.078865 0.039151
			-0.009731 -0.079442 0.038446
			-0.010717 -0.079337 0.038541
			-0.010453 -0.078470 0.039376
			-0.009126 -0.079314 0.038583
			-0.011888 -0.079454 0.038161
			-0.011495 -0.079288 0.038474
			-0.011891 -0.079832 0.037600
			-0.012240 -0.079843 0.037170
			-0.013629 -0.078309 0.037115
			-0.012777 -0.079517 0.036614
			-0.013126 -0.079083 0.036664
			-0.013173 -0.078980 0.036001
			-0.013702 -0.078019 0.036700
			-0.013329 -0.078327 0.036053
			-0.003681 -0.074534 0.045547
			-0.003416 -0.072599 0.045848
			-0.003725 -0.073534 0.045843
			-0.003961 -0.073938 0.045505
			-0.004478 -0.073258 0.042627
			-0.004516 -0.073031 0.043302
			-0.005089 -0.073592 0.041736
			-0.005569 -0.073819 0.040890
			-0.004344 -0.074668 0.040192
			-0.005737 -0.075063 0.038647
			-0.007511 -0.075238 0.036587
			-0.010074 -0.073948 0.036779
			-0.009325 -0.074464 0.036351
			-0.008752 -0.074577 0.036716
			-0.005918 -0.075301 0.038194
			-0.006504 -0.075529 0.037215
			-0.011085 -0.073614 0.036586
			-0.012666 -0.073491 0.035906
			-0.013270 -0.073614 0.035764
			-0.011599 -0.074013 0.035401
			-0.003431 -0.076224 0.044329
			-0.004076 -0.076950 0.043342
			-0.004276 -0.077228 0.042910
			-0.003075 -0.072017 0.045247
			-0.003368 -0.072264 0.044884
			-0.003118 -0.073619 0.042317
			-0.004009 -0.072933 0.043542
			-0.002735 -0.072762 0.043801
			-0.013519 -0.075965 0.036112
			-0.013084 -0.077232 0.036120
			-0.013222 -0.076416 0.036014
			-0.013095 -0.076100 0.035336
			-0.012939 -0.076284 0.034762
			-0.013516 -0.074868 0.034894
			-0.012670 -0.076117 0.033942
			-0.012796 -0.074908 0.034388
			-0.003860 -0.077698 0.042010
			-0.004297 -0.077818 0.041714
			-0.005395 -0.078215 0.040655
			-0.007264 -0.079123 0.038296
			-0.004920 -0.078337 0.039530
			-0.005797 -0.078880 0.037586
			-0.006891 -0.079104 0.037945
			-0.008655 -0.079448 0.038219
			-0.010730 -0.080103 0.037425
			-0.010090 -0.080016 0.037552
			-0.011609 -0.080038 0.037212
			-0.010902 -0.080286 0.036922
			-0.011446 -0.080197 0.036621
			-0.011914 -0.080018 0.036315
			-0.012393 -0.079783 0.036421
			-0.012789 -0.079341 0.035914
			-0.012918 -0.077725 0.035903
			-0.011671 -0.080016 0.035646
			-0.012203 -0.078273 0.035471
			-0.011810 -0.078679 0.035445
			-0.002873 -0.075993 0.044781
			-0.003338 -0.073970 0.046331
			-0.002975 -0.074476 0.046379
			-0.002450 -0.075354 0.045583
			-0.003100 -0.072638 0.046333
			-0.002626 -0.071961 0.046315
			-0.003426 -0.073422 0.046268
			-0.004260 -0.073634 0.041860
			-0.004316 -0.074161 0.040910
			-0.004463 -0.075011 0.039717
			-0.003890 -0.074634 0.040514
			-0.007583 -0.075564 0.035883
			-0.008021 -0.075393 0.035625
			-0.009098 -0.074816 0.035567
			-0.004087 -0.075608 0.039396
			-0.005911 -0.075612 0.037572
			-0.005854 -0.075772 0.036846
			-0.012771 -0.074353 0.034779
			-0.013097 -0.074159 0.035126
			-0.010934 -0.074845 0.034244
			-0.009819 -0.074925 0.034773
			-0.012017 -0.074343 0.034749
			-0.002901 -0.076454 0.044283
			-0.002509 -0.076288 0.044595
			-0.002906 -0.077195 0.043148
			-0.002589 -0.071764 0.045431
			-0.002138 -0.071573 0.045677
			-0.001733 -0.071724 0.045382
			-0.001555 -0.072612 0.044157
			-0.001957 -0.072811 0.043868
			-0.003687 -0.073984 0.041512
			-0.002547 -0.073613 0.042546
			-0.002781 -0.074732 0.041056
			-0.012498 -0.077156 0.035316
			-0.012199 -0.077764 0.035398
			-0.012227 -0.077147 0.034674
			-0.012539 -0.076583 0.034138
			-0.011896 -0.076543 0.033707
			-0.012176 -0.075136 0.033966
			-0.004708 -0.078108 0.040729
			-0.001795 -0.077332 0.042761
			-0.004557 -0.078201 0.039885
			-0.009707 -0.080080 0.037235
			-0.005125 -0.078554 0.037565
			-0.006223 -0.079149 0.036231
			-0.006663 -0.079254 0.037058
			-0.005770 -0.078846 0.036470
			-0.008121 -0.079613 0.037061
			-0.010099 -0.080248 0.036923
			-0.009832 -0.080379 0.035990
			-0.010449 -0.080363 0.036120
			-0.010852 -0.080019 0.035237
			-0.011337 -0.079378 0.035359
			-0.010239 -0.080372 0.035420
			-0.010848 -0.078497 0.035001
			-0.001736 -0.075996 0.045252
			-0.002829 -0.074081 0.046803
			-0.001889 -0.075019 0.046411
			-0.002071 -0.074507 0.047074
			-0.002276 -0.072024 0.046782
			-0.002696 -0.072761 0.046778
			-0.002635 -0.073338 0.047009
			-0.001779 -0.071572 0.046856
			-0.001997 -0.071508 0.046270
			-0.003751 -0.075296 0.039963
			-0.005817 -0.076004 0.036175
			-0.006729 -0.075997 0.035498
			-0.008978 -0.075311 0.034807
			-0.003596 -0.075902 0.039370
			-0.004088 -0.075989 0.038355
			-0.004930 -0.076098 0.036919
			-0.004189 -0.076170 0.037784
			-0.005262 -0.076141 0.036545
			-0.011513 -0.074884 0.034040
			-0.010588 -0.075566 0.033533
			-0.001754 -0.076420 0.044726
			-0.002171 -0.077220 0.043135
			-0.001375 -0.071317 0.046361
			-0.001612 -0.071470 0.045900
			-0.000560 -0.072323 0.044611
			-0.000542 -0.071534 0.045707
			-0.000807 -0.072676 0.044202
			-0.001403 -0.073948 0.042421
			-0.000651 -0.073600 0.042990
			-0.001838 -0.074631 0.041652
			-0.001941 -0.075721 0.040783
			-0.002996 -0.075065 0.040665
			-0.002607 -0.075551 0.040551
			-0.011701 -0.077680 0.034960
			-0.011775 -0.077077 0.034196
			-0.010021 -0.077093 0.033025
			-0.010984 -0.077335 0.034022
			-0.010901 -0.076089 0.033230
			-0.011477 -0.076041 0.033422
			-0.003684 -0.077848 0.041171
			-0.003723 -0.077939 0.040500
			-0.001676 -0.077124 0.043497
			-0.001179 -0.077278 0.043121
			-0.003104 -0.077758 0.040596
			-0.001776 -0.077418 0.041475
			-0.001117 -0.077308 0.042324
			-0.001374 -0.077311 0.041809
			-0.004178 -0.078046 0.038709
			-0.003617 -0.077864 0.039612
			-0.009179 -0.080056 0.036740
			-0.007064 -0.079494 0.036036
			-0.003908 -0.077621 0.038248
			-0.004633 -0.078098 0.037643
			-0.005782 -0.078650 0.035953
			-0.006588 -0.079277 0.035493
			-0.007099 -0.079510 0.035324
			-0.005153 -0.078102 0.036612
			-0.005459 -0.078279 0.036225
			-0.009468 -0.080245 0.036345
			-0.008817 -0.080096 0.035677
			-0.008884 -0.080030 0.034953
			-0.009629 -0.080252 0.035085
			-0.010362 -0.079590 0.034882
			-0.011157 -0.077738 0.034739
			-0.010151 -0.078544 0.034475
			-0.000575 -0.076138 0.045768
			-0.002189 -0.073950 0.047280
			-0.001504 -0.074513 0.047313
			-0.000178 -0.074999 0.047098
			-0.000874 -0.073915 0.047936
			-0.001848 -0.072146 0.047203
			-0.002275 -0.072649 0.047090
			-0.001230 -0.073027 0.047831
			-0.000880 -0.071429 0.047469
			-0.003413 -0.075684 0.039848
			-0.005990 -0.076219 0.035707
			-0.008722 -0.076155 0.033630
			-0.008205 -0.076697 0.033427
			-0.006565 -0.076569 0.034878
			-0.003167 -0.076053 0.039594
			-0.003004 -0.076741 0.039105
			-0.003603 -0.076622 0.038210
			-0.004271 -0.076572 0.037306
			-0.004524 -0.077039 0.037017
			-0.005319 -0.076618 0.036026
			-0.009284 -0.076129 0.033377
			-0.010043 -0.076045 0.033295
			-0.000640 -0.076865 0.044683
			-0.000430 -0.071325 0.046255
			-0.000206 -0.071204 0.046743
			0.001126 -0.073114 0.044217
			0.000814 -0.072630 0.045014
			-0.000169 -0.072157 0.044923
			0.000205 -0.072055 0.045284
			0.000024 -0.071541 0.045947
			0.000864 -0.073257 0.043774
			0.000954 -0.073659 0.043140
			-0.000819 -0.073893 0.042613
			-0.000695 -0.074609 0.042104
			-0.001271 -0.074637 0.041891
			0.000552 -0.073860 0.042853
			-0.001497 -0.075007 0.041528
			-0.001388 -0.075773 0.041056
			-0.001373 -0.076371 0.040764
			-0.001939 -0.076453 0.040389
			-0.002876 -0.075794 0.040164
			-0.002753 -0.076466 0.039603
			-0.010005 -0.077752 0.033291
			-0.009489 -0.077154 0.032793
			-0.009490 -0.077663 0.032869
			-0.010153 -0.078075 0.033949
			-0.000781 -0.077293 0.043517
			-0.000079 -0.077251 0.044361
			-0.000199 -0.077364 0.043846
			0.000027 -0.077367 0.043162
			0.000146 -0.077177 0.042613
			-0.000167 -0.077061 0.042087
			-0.000768 -0.077178 0.041942
			-0.001363 -0.077095 0.040938
			-0.001033 -0.077145 0.041413
			-0.003285 -0.077483 0.039119
			-0.003661 -0.077646 0.038789
			-0.008424 -0.079855 0.035198
			-0.005074 -0.077487 0.036329
			-0.005676 -0.077813 0.035439
			-0.003854 -0.076829 0.037806
			-0.006265 -0.078681 0.034902
			-0.006709 -0.079172 0.034799
			-0.007357 -0.079515 0.034807
			-0.008489 -0.079657 0.034406
			-0.008991 -0.079810 0.034427
			-0.009931 -0.079685 0.034558
			-0.009402 -0.079590 0.034150
			-0.009854 -0.078995 0.034377
			0.000148 -0.075795 0.046445
			-0.000026 -0.076100 0.046075
			-0.000525 -0.074286 0.047815
			0.000822 -0.074576 0.047408
			0.000793 -0.075160 0.047045
			0.000340 -0.075435 0.046776
			-0.000502 -0.073573 0.048191
			0.000215 -0.073797 0.048211
			-0.000462 -0.071957 0.048105
			-0.000203 -0.072976 0.048375
			-0.000365 -0.071405 0.047741
			0.000134 -0.071224 0.047197
			-0.006612 -0.077100 0.034434
			-0.005436 -0.077257 0.035697
			-0.008483 -0.077000 0.033080
			-0.007887 -0.077156 0.033365
			-0.002555 -0.077009 0.039723
			-0.000091 -0.076934 0.044969
			0.000187 -0.071380 0.046462
			0.000681 -0.071572 0.046816
			0.002221 -0.073626 0.044225
			0.001628 -0.073488 0.043806
			0.002325 -0.073538 0.045234
			0.001397 -0.072901 0.045299
			0.000505 -0.071863 0.045939
			0.001665 -0.074306 0.042811
			0.000129 -0.075655 0.041873
			0.000609 -0.074683 0.042458
			-0.000932 -0.075020 0.041772
			-0.000995 -0.075608 0.041370
			-0.000427 -0.076261 0.041354
			-0.009809 -0.078197 0.033547
			-0.008922 -0.077361 0.032767
			-0.009124 -0.078248 0.033009
			-0.009246 -0.078757 0.033420
			0.000490 -0.077253 0.044598
			0.000947 -0.077215 0.043406
			0.000919 -0.077316 0.044238
			0.000887 -0.076947 0.042575
			0.000025 -0.076702 0.041734
			-0.006540 -0.078465 0.034292
			-0.006338 -0.077713 0.034488
			-0.006905 -0.078598 0.033938
			-0.008171 -0.079319 0.033947
			-0.007364 -0.078870 0.033741
			-0.009103 -0.079376 0.033802
			0.000868 -0.076411 0.046093
			0.001327 -0.075896 0.046591
			0.000735 -0.075726 0.046626
			0.000471 -0.076593 0.045792
			0.001978 -0.075373 0.046835
			0.000729 -0.073869 0.047967
			0.002113 -0.074469 0.046977
			0.001596 -0.073700 0.047416
			0.001154 -0.075464 0.046866
			0.000286 -0.073071 0.048469
			0.000695 -0.073329 0.048299
			0.000023 -0.072453 0.048423
			0.000042 -0.071782 0.048190
			0.000601 -0.072148 0.048330
			0.000916 -0.072593 0.048249
			0.000443 -0.071534 0.047935
			0.000752 -0.071511 0.047326
			-0.006746 -0.077691 0.034097
			-0.007216 -0.077589 0.033722
			-0.008078 -0.077711 0.033061
			0.001049 -0.076925 0.045430
			0.001085 -0.071950 0.047260
			0.001057 -0.072277 0.046125
			0.001618 -0.073028 0.047185
			0.002532 -0.073750 0.044757
			0.002628 -0.073907 0.044077
			0.002430 -0.074041 0.043488
			0.002227 -0.074331 0.043064
			0.001913 -0.073201 0.045801
			0.002251 -0.073485 0.046058
			0.003065 -0.074197 0.045444
			0.001428 -0.072619 0.046489
			0.000901 -0.075104 0.042400
			0.001533 -0.075136 0.042591
			0.002399 -0.074917 0.042959
			0.000849 -0.075908 0.042093
			0.000502 -0.076650 0.042027
			-0.008563 -0.077964 0.032879
			-0.008212 -0.078852 0.033374
			0.001068 -0.077216 0.044803
			0.001236 -0.077009 0.043041
			0.001440 -0.077055 0.043632
			0.001436 -0.077188 0.044453
			0.002234 -0.076731 0.043498
			0.002134 -0.076527 0.042950
			0.001561 -0.076416 0.042448
			-0.007426 -0.078202 0.033464
			0.001786 -0.076333 0.046195
			0.001440 -0.076760 0.045745
			0.002615 -0.075400 0.046699
			0.002213 -0.076038 0.046410
			0.001067 -0.073091 0.048018
			0.002544 -0.074563 0.046654
			0.001328 -0.072888 0.047637
			0.001863 -0.073495 0.047040
			0.002981 -0.074342 0.045987
			0.001177 -0.072390 0.047868
			0.000900 -0.071776 0.047809
			0.003089 -0.074151 0.044448
			0.002850 -0.074225 0.043738
			0.002923 -0.074674 0.043353
			0.002832 -0.075357 0.043022
			0.003682 -0.074739 0.045367
			0.003345 -0.074340 0.044982
			0.001862 -0.075950 0.042451
			0.002346 -0.075638 0.042717
			0.001521 -0.077058 0.045065
			0.002152 -0.076895 0.044407
			0.002085 -0.076853 0.045202
			0.003027 -0.076510 0.044170
			0.003416 -0.075963 0.043542
			0.002593 -0.076162 0.042886
			0.002750 -0.076098 0.046183
			0.002674 -0.076513 0.045572
			0.003206 -0.075638 0.046249
			0.003633 -0.075225 0.045844
			0.003830 -0.074768 0.044611
			0.003325 -0.074423 0.044073
			0.003709 -0.075486 0.043791
			0.003901 -0.075234 0.044243
			0.003026 -0.075870 0.043099
			0.003907 -0.075370 0.045378
			0.003281 -0.076312 0.045346
			0.003614 -0.076123 0.044196
			0.003616 -0.076141 0.044955
			0.003329 -0.075988 0.045820
			0.003987 -0.075577 0.044734
		</DataArray>
	</Points>
			<Polys>
				<DataArray type="Int32" Name="connectivity" format="ascii">
					0 1 2 
					2 3 0 
					4 0 3 
					5 1 0 
					0 4 6 
					0 7 5 
					6 7 0 
					2 1 8 
					8 1 9 
					1 5 9 
					2 10 11 
					11 3 2 
					2 12 10 
					12 2 13 
					13 2 8 
					3 14 4 
					15 16 3 
					14 3 16 
					11 17 3 
					18 3 19 
					3 18 15 
					3 17 19 
					20 6 4 
					4 14 21 
					4 21 20 
					9 5 7 
					22 7 5 
					5 23 22 
					24 23 5 
					24 5 7 
					20 25 6 
					6 25 26 
					26 27 6 
					27 24 6 
					7 6 24 
					7 22 9 
					9 13 8 
					9 22 13 
					11 10 17 
					28 10 12 
					17 10 28 
					12 29 28 
					29 12 30 
					13 30 12 
					30 13 22 
					31 14 16 
					14 31 21 
					16 15 18 
					16 32 33 
					31 16 33 
					32 16 18 
					17 34 35 
					28 36 17 
					37 34 17 
					35 19 17 
					17 36 37 
					19 38 18 
					18 38 39 
					32 18 40 
					39 40 18 
					35 41 19 
					19 41 38 
					21 31 20 
					31 25 20 
					42 30 22 
					43 44 22 
					22 44 42 
					23 43 22 
					24 43 23 
					27 45 24 
					24 45 46 
					24 46 43 
					47 26 25 
					48 47 25 
					25 49 48 
					25 31 49 
					50 27 26 
					26 47 50 
					51 45 27 
					51 27 50 
					52 53 28 
					29 54 28 
					28 53 55 
					28 54 52 
					28 55 36 
					30 54 29 
					56 30 42 
					30 56 57 
					57 54 30 
					33 58 31 
					49 31 58 
					32 59 33 
					40 59 32 
					60 33 61 
					61 33 62 
					62 33 59 
					58 33 60 
					63 35 34 
					37 63 34 
					63 41 35 
					37 36 55 
					37 64 65 
					37 66 64 
					55 66 37 
					37 65 63 
					38 41 67 
					38 67 39 
					40 39 68 
					39 67 68 
					40 68 69 
					59 40 70 
					69 70 40 
					67 41 63 
					42 71 56 
					72 71 42 
					42 44 73 
					73 72 42 
					43 74 44 
					74 43 75 
					46 75 43 
					76 73 44 
					77 44 74 
					78 76 44 
					79 44 77 
					44 79 78 
					80 81 45 
					45 51 80 
					81 46 45 
					81 75 46 
					50 47 82 
					47 48 82 
					48 49 83 
					84 82 48 
					85 84 48 
					85 48 83 
					58 60 49 
					83 49 60 
					50 86 51 
					50 82 87 
					87 86 50 
					80 51 86 
					88 53 52 
					89 52 90 
					91 88 52 
					57 52 54 
					52 89 91 
					57 90 52 
					55 53 66 
					53 88 66 
					90 57 56 
					56 89 90 
					56 92 89 
					71 93 56 
					56 93 71 
					56 71 92 
					70 94 59 
					62 59 94 
					61 95 60 
					83 60 95 
					95 61 96 
					62 97 61 
					98 96 61 
					61 97 98 
					99 62 94 
					62 99 97 
					67 63 65 
					65 64 100 
					64 101 102 
					102 103 64 
					66 101 64 
					64 103 104 
					100 64 105 
					64 104 105 
					65 100 106 
					107 65 106 
					65 107 108 
					67 65 108 
					88 101 66 
					68 67 109 
					108 109 67 
					69 68 110 
					109 110 68 
					69 110 111 
					70 69 112 
					111 113 69 
					114 112 69 
					114 69 113 
					70 115 116 
					94 70 116 
					70 112 115 
					93 71 72 
					71 117 92 
					71 93 118 
					118 117 71 
					119 93 72 
					120 72 73 
					120 119 72 
					73 121 120 
					76 121 73 
					73 122 120 
					120 121 73 
					123 73 121 
					123 122 73 
					75 77 74 
					77 75 79 
					79 75 81 
					76 78 121 
					78 123 121 
					79 124 78 
					125 123 78 
					124 125 78 
					79 126 127 
					127 124 79 
					126 79 81 
					128 81 80 
					128 80 129 
					86 129 80 
					126 81 128 
					130 87 82 
					82 84 130 
					85 83 95 
					84 131 130 
					84 85 96 
					96 131 84 
					85 95 96 
					132 86 87 
					132 129 86 
					132 87 130 
					88 91 133 
					134 88 133 
					102 101 88 
					88 134 102 
					135 89 92 
					89 135 91 
					91 135 136 
					136 133 91 
					117 135 92 
					93 137 118 
					138 137 93 
					138 93 119 
					94 116 99 
					98 131 96 
					97 139 98 
					99 140 97 
					139 97 140 
					139 141 98 
					98 141 142 
					142 143 98 
					131 98 143 
					99 116 140 
					100 105 106 
					144 102 134 
					144 145 102 
					145 146 102 
					102 146 103 
					146 147 103 
					103 147 148 
					103 148 104 
					104 148 149 
					150 104 149 
					105 104 150 
					106 105 150 
					106 151 107 
					151 106 152 
					106 150 152 
					107 153 154 
					155 108 107 
					156 153 107 
					154 155 107 
					107 151 156 
					108 155 109 
					110 109 154 
					154 109 155 
					110 157 111 
					110 158 157 
					154 158 110 
					111 159 160 
					111 157 159 
					111 160 113 
					112 161 115 
					114 161 112 
					162 114 113 
					162 113 160 
					114 162 163 
					164 114 163 
					161 114 164 
					115 165 116 
					165 115 161 
					140 116 166 
					116 165 166 
					117 136 135 
					117 167 136 
					118 168 117 
					169 170 117 
					117 168 169 
					117 170 167 
					118 137 168 
					119 120 171 
					119 172 138 
					171 172 119 
					122 171 120 
					122 173 171 
					173 122 123 
					174 173 123 
					125 174 123 
					125 124 175 
					176 175 124 
					176 124 127 
					175 174 125 
					177 127 126 
					128 178 126 
					179 180 126 
					177 126 180 
					179 126 178 
					181 176 127 
					182 181 127 
					127 177 182 
					129 178 128 
					178 129 183 
					183 129 132 
					130 184 132 
					184 130 185 
					131 185 130 
					143 185 131 
					132 186 183 
					132 184 186 
					136 187 133 
					187 134 133 
					134 187 188 
					134 189 144 
					134 188 189 
					136 167 187 
					137 190 168 
					191 190 137 
					138 191 137 
					191 190 138 
					138 190 191 
					192 138 193 
					138 194 191 
					172 193 138 
					192 194 138 
					140 195 139 
					139 195 141 
					196 140 166 
					197 140 196 
					140 197 195 
					141 195 198 
					142 141 198 
					142 198 199 
					142 200 143 
					199 201 142 
					200 142 201 
					202 185 143 
					200 202 143 
					203 144 189 
					203 145 144 
					146 145 204 
					203 204 145 
					205 146 204 
					205 147 146 
					149 148 147 
					147 205 149 
					149 206 152 
					152 150 149 
					205 207 149 
					149 207 208 
					149 208 209 
					209 206 149 
					152 210 151 
					156 151 210 
					210 152 206 
					154 153 211 
					153 212 211 
					212 153 156 
					158 154 211 
					156 210 212 
					211 157 158 
					159 157 211 
					160 159 213 
					159 214 213 
					211 214 159 
					213 215 160 
					160 215 216 
					160 216 217 
					160 217 162 
					165 161 164 
					218 162 217 
					218 164 162 
					163 162 164 
					164 166 165 
					164 219 166 
					220 164 218 
					220 218 164 
					164 221 219 
					222 221 164 
					164 218 222 
					166 219 196 
					223 187 167 
					224 225 167 
					167 225 226 
					170 224 167 
					223 167 226 
					227 168 228 
					190 228 168 
					168 227 169 
					224 170 169 
					229 169 227 
					169 229 224 
					173 230 171 
					230 193 171 
					171 193 172 
					231 230 173 
					173 174 231 
					175 231 174 
					232 233 175 
					175 233 231 
					232 175 176 
					176 181 232 
					182 177 234 
					235 177 180 
					235 234 177 
					183 186 178 
					178 186 179 
					236 180 179 
					186 236 179 
					180 236 235 
					237 232 181 
					182 238 181 
					238 237 181 
					239 238 182 
					239 182 234 
					186 184 240 
					241 240 184 
					241 184 185 
					185 202 241 
					186 242 243 
					240 244 186 
					244 242 186 
					243 236 186 
					188 187 245 
					246 187 223 
					187 246 245 
					245 189 188 
					247 203 189 
					247 189 245 
					228 190 248 
					190 249 248 
					250 190 251 
					190 191 252 
					252 251 190 
					250 249 190 
					194 252 191 
					253 192 230 
					192 193 230 
					252 192 254 
					255 254 192 
					192 252 194 
					255 192 253 
					197 256 195 
					198 195 256 
					257 196 219 
					196 257 256 
					256 197 196 
					256 199 198 
					199 256 258 
					258 259 199 
					199 259 201 
					202 200 201 
					259 260 201 
					201 261 202 
					261 201 260 
					261 240 202 
					202 240 241 
					262 204 203 
					263 262 203 
					203 247 263 
					205 204 262 
					205 262 264 
					205 264 207 
					210 206 265 
					265 206 209 
					207 266 208 
					207 264 266 
					267 268 208 
					208 268 209 
					269 267 208 
					269 208 266 
					209 270 265 
					270 209 268 
					210 265 212 
					211 212 271 
					214 211 271 
					271 212 265 
					213 214 215 
					272 214 271 
					214 272 273 
					215 214 273 
					220 216 215 
					215 273 220 
					217 216 220 
					218 217 220 
					218 274 275 
					275 222 218 
					220 274 218 
					219 221 257 
					273 276 220 
					220 276 274 
					257 221 222 
					222 277 257 
					275 277 222 
					223 278 246 
					226 278 223 
					279 225 224 
					229 279 224 
					280 226 225 
					225 281 280 
					281 225 279 
					226 280 278 
					228 282 227 
					283 227 282 
					227 279 229 
					284 279 227 
					227 283 284 
					228 285 282 
					248 249 228 
					286 285 228 
					286 228 249 
					231 253 230 
					233 253 231 
					233 232 255 
					287 255 232 
					237 287 232 
					255 253 233 
					288 239 234 
					234 289 288 
					289 234 235 
					236 290 235 
					235 290 289 
					236 243 290 
					237 291 287 
					292 237 238 
					292 291 237 
					238 239 293 
					293 294 238 
					294 292 238 
					288 295 239 
					239 295 293 
					244 240 296 
					240 261 296 
					242 297 243 
					297 242 296 
					296 242 244 
					297 290 243 
					245 298 247 
					298 245 246 
					246 278 298 
					299 247 298 
					247 299 263 
					249 300 286 
					249 301 300 
					249 250 301 
					251 302 250 
					303 301 250 
					302 303 250 
					251 304 302 
					304 251 252 
					252 305 306 
					304 252 306 
					254 305 252 
					254 307 305 
					307 254 255 
					255 308 307 
					255 309 310 
					310 308 255 
					287 309 255 
					256 311 258 
					256 257 311 
					257 277 311 
					258 312 259 
					258 311 312 
					312 260 259 
					313 260 314 
					315 316 260 
					313 315 260 
					260 312 314 
					260 316 261 
					297 296 261 
					261 315 297 
					316 315 261 
					317 262 263 
					317 318 262 
					262 318 264 
					263 319 320 
					321 263 322 
					319 263 299 
					321 317 263 
					263 323 324 
					263 324 322 
					263 320 323 
					325 266 264 
					264 318 326 
					264 326 325 
					271 265 327 
					327 265 328 
					265 270 328 
					325 329 266 
					266 329 330 
					266 330 269 
					267 269 331 
					332 267 331 
					268 267 328 
					328 267 333 
					332 333 267 
					270 268 328 
					334 269 330 
					269 335 331 
					269 334 335 
					271 336 272 
					327 336 271 
					272 276 273 
					336 337 272 
					337 338 272 
					339 272 338 
					276 272 339 
					274 340 275 
					274 276 340 
					275 340 277 
					276 339 340 
					311 277 341 
					277 340 342 
					277 342 341 
					298 278 343 
					343 278 280 
					284 344 279 
					344 281 279 
					280 345 346 
					281 345 280 
					280 346 343 
					347 345 281 
					281 344 347 
					285 348 282 
					282 348 349 
					282 349 283 
					283 349 284 
					284 349 350 
					344 284 347 
					350 347 284 
					348 285 351 
					300 285 286 
					300 351 285 
					291 352 287 
					352 309 287 
					295 288 353 
					353 288 289 
					354 355 289 
					356 353 289 
					290 354 289 
					356 289 355 
					297 354 290 
					352 291 357 
					292 357 291 
					358 357 292 
					292 359 358 
					294 359 292 
					360 294 293 
					361 360 293 
					293 295 361 
					360 359 294 
					362 361 295 
					353 362 295 
					363 354 297 
					297 364 363 
					315 364 297 
					343 365 298 
					298 365 319 
					298 319 299 
					300 303 366 
					366 367 300 
					300 367 351 
					303 300 301 
					368 369 302 
					369 370 302 
					302 370 303 
					368 302 304 
					371 372 303 
					303 372 366 
					370 371 303 
					373 304 374 
					374 304 306 
					304 373 368 
					305 375 306 
					375 305 376 
					307 377 305 
					305 377 376 
					378 306 375 
					306 378 374 
					379 307 308 
					379 377 307 
					308 380 379 
					381 380 308 
					308 382 381 
					308 383 384 
					382 308 384 
					310 383 308 
					383 310 309 
					309 352 383 
					311 341 312 
					312 341 314 
					364 315 313 
					314 385 313 
					364 313 386 
					387 386 313 
					385 387 313 
					314 341 342 
					314 342 388 
					314 388 385 
					321 318 317 
					326 318 321 
					389 320 319 
					319 365 390 
					319 391 389 
					390 391 319 
					323 320 392 
					392 320 389 
					326 321 322 
					322 324 326 
					392 393 323 
					393 394 323 
					395 324 323 
					395 323 394 
					326 324 396 
					324 395 397 
					324 397 396 
					325 398 399 
					326 398 325 
					325 399 329 
					396 398 326 
					328 336 327 
					328 337 336 
					328 400 337 
					400 328 333 
					358 329 399 
					329 401 402 
					329 402 334 
					334 330 329 
					359 329 358 
					359 403 329 
					401 329 403 
					402 331 335 
					402 404 331 
					404 405 331 
					332 331 405 
					333 332 405 
					406 333 405 
					400 333 406 
					335 334 402 
					400 338 337 
					407 338 400 
					408 338 407 
					338 408 339 
					339 409 340 
					408 410 339 
					339 410 409 
					340 411 342 
					340 409 410 
					340 410 411 
					342 411 388 
					412 413 343 
					343 413 365 
					412 343 346 
					345 414 346 
					345 347 414 
					415 416 346 
					415 346 414 
					346 416 417 
					346 417 412 
					350 418 347 
					414 347 419 
					418 419 347 
					348 351 420 
					420 349 348 
					420 350 349 
					350 420 421 
					350 421 418 
					422 420 351 
					422 351 423 
					367 423 351 
					384 383 352 
					357 384 352 
					424 353 356 
					425 362 353 
					425 353 424 
					426 355 354 
					354 363 426 
					355 424 356 
					427 355 426 
					424 355 427 
					358 384 357 
					399 398 358 
					398 428 358 
					428 384 358 
					360 403 359 
					361 403 360 
					401 403 361 
					425 401 361 
					362 425 361 
					386 363 364 
					386 426 363 
					429 365 413 
					365 429 390 
					430 367 366 
					366 372 430 
					431 367 430 
					367 431 423 
					432 369 368 
					368 433 432 
					368 373 433 
					369 432 434 
					435 369 434 
					436 371 369 
					369 435 436 
					369 371 370 
					436 372 371 
					372 431 430 
					431 372 436 
					374 433 373 
					437 433 374 
					437 374 378 
					375 376 378 
					438 439 376 
					376 439 378 
					376 440 438 
					376 377 440 
					377 379 440 
					378 439 437 
					380 441 379 
					440 379 438 
					441 438 379 
					441 380 381 
					442 381 396 
					396 381 382 
					381 442 438 
					381 438 441 
					428 396 382 
					384 428 382 
					388 443 385 
					443 387 385 
					426 386 444 
					444 386 445 
					387 445 386 
					387 443 446 
					446 445 387 
					443 388 411 
					389 391 392 
					429 447 390 
					391 390 392 
					448 392 390 
					390 449 448 
					447 449 390 
					392 448 393 
					448 450 393 
					393 450 394 
					394 450 397 
					394 397 395 
					398 396 428 
					396 397 442 
					451 397 450 
					397 451 442 
					407 400 406 
					402 401 425 
					452 404 402 
					402 425 453 
					452 402 453 
					405 404 452 
					454 406 405 
					405 452 454 
					455 407 406 
					406 454 456 
					406 456 455 
					457 407 455 
					407 457 408 
					408 457 410 
					411 410 443 
					457 446 410 
					410 446 443 
					413 412 458 
					459 412 460 
					417 460 412 
					459 458 412 
					458 461 413 
					413 461 429 
					414 419 415 
					416 415 462 
					415 419 463 
					462 415 464 
					465 464 415 
					465 415 463 
					462 466 416 
					466 417 416 
					417 466 460 
					419 418 421 
					467 419 421 
					419 468 463 
					467 468 419 
					421 420 469 
					422 470 420 
					420 470 469 
					471 421 469 
					421 471 472 
					472 467 421 
					422 423 473 
					473 470 422 
					431 474 423 
					423 474 473 
					425 424 453 
					475 453 424 
					476 475 424 
					427 476 424 
					426 477 427 
					477 426 444 
					476 427 477 
					429 478 447 
					429 461 478 
					474 431 479 
					435 431 436 
					480 431 435 
					479 431 481 
					480 481 431 
					432 482 434 
					432 483 482 
					484 483 432 
					432 433 484 
					433 485 484 
					437 485 433 
					434 486 435 
					434 487 486 
					488 487 434 
					482 488 434 
					486 489 435 
					435 489 480 
					490 437 439 
					490 491 437 
					437 492 485 
					491 492 437 
					490 439 438 
					493 438 442 
					438 493 490 
					442 451 494 
					494 493 442 
					444 495 477 
					495 444 445 
					445 446 496 
					445 496 495 
					496 446 457 
					447 497 449 
					478 497 447 
					448 498 450 
					448 499 498 
					499 448 449 
					497 500 449 
					449 500 499 
					501 450 498 
					450 494 451 
					501 502 450 
					450 502 503 
					450 503 494 
					452 453 475 
					454 452 475 
					504 454 475 
					496 456 454 
					496 454 504 
					457 455 496 
					496 455 456 
					458 505 506 
					458 459 505 
					478 461 458 
					458 506 478 
					459 462 505 
					462 459 466 
					460 466 459 
					464 507 462 
					462 508 505 
					462 507 508 
					509 463 468 
					463 509 465 
					507 464 510 
					464 465 510 
					465 472 511 
					465 511 512 
					465 509 472 
					513 465 512 
					465 513 510 
					509 468 467 
					467 472 509 
					469 470 471 
					473 471 470 
					471 514 472 
					515 514 471 
					515 471 473 
					514 511 472 
					515 473 474 
					474 479 515 
					504 475 476 
					504 476 477 
					504 477 496 
					496 477 495 
					478 506 497 
					479 514 515 
					481 514 479 
					481 480 489 
					481 512 511 
					481 511 514 
					489 486 481 
					481 486 512 
					516 488 482 
					483 516 482 
					516 483 517 
					483 484 517 
					517 484 518 
					484 485 518 
					485 519 518 
					492 519 485 
					512 486 487 
					487 488 513 
					513 512 487 
					488 520 513 
					521 520 488 
					516 521 488 
					491 490 493 
					493 522 491 
					491 522 523 
					523 492 491 
					523 519 492 
					494 503 493 
					503 502 493 
					502 522 493 
					524 497 506 
					497 524 500 
					499 501 498 
					499 525 501 
					500 525 499 
					500 526 525 
					524 526 500 
					501 525 527 
					527 528 501 
					501 528 502 
					528 529 502 
					522 502 529 
					505 508 530 
					530 506 505 
					506 530 531 
					531 526 506 
					526 524 506 
					530 508 507 
					507 510 513 
					532 530 507 
					533 507 513 
					507 533 532 
					533 513 520 
					516 520 521 
					516 534 520 
					517 535 516 
					535 534 516 
					536 517 518 
					535 517 537 
					517 536 537 
					519 536 518 
					528 536 519 
					519 538 528 
					538 519 523 
					520 539 533 
					534 539 520 
					523 522 529 
					523 529 538 
					540 527 525 
					525 526 531 
					525 531 540 
					528 527 541 
					540 542 527 
					527 542 541 
					538 529 528 
					528 541 536 
					532 543 530 
					531 530 543 
					543 540 531 
					543 532 533 
					543 533 542 
					542 533 539 
					534 537 536 
					534 536 544 
					544 539 534 
					537 534 535 
					541 544 536 
					542 539 544 
					542 540 543 
					544 541 542 
				</DataArray>
				<DataArray type="Int32" Name="offsets" format="ascii">
					3 6 9 12 15 18 21 24 27 30 33 36 39 42 45 48 51 54 57 60 63 66 69 72 75 78 81 84 87 90 93 96 99 102 105 108 111 114 117 120 123 126 129 132 135 138 141 144 147 150 153 156 159 162 165 168 171 174 177 180 183 186 189 192 195 198 201 204 207 210 213 216 219 222 225 228 231 234 237 240 243 246 249 252 255 258 261 264 267 270 273 276 279 282 285 288 291 294 297 300 303 306 309 312 315 318 321 324 327 330 333 336 339 342 345 348 351 354 357 360 363 366 369 372 375 378 381 384 387 390 393 396 399 402 405 408 411 414 417 420 423 426 429 432 435 438 441 444 447 450 453 456 459 462 465 468 471 474 477 480 483 486 489 492 495 498 501 504 507 510 513 516 519 522 525 528 531 534 537 540 543 546 549 552 555 558 561 564 567 570 573 576 579 582 585 588 591 594 597 600 603 606 609 612 615 618 621 624 627 630 633 636 639 642 645 648 651 654 657 660 663 666 669 672 675 678 681 684 687 690 693 696 699 702 705 708 711 714 717 720 723 726 729 732 735 738 741 744 747 750 753 756 759 762 765 768 771 774 777 780 783 786 789 792 795 798 801 804 807 810 813 816 819 822 825 828 831 834 837 840 843 846 849 852 855 858 861 864 867 870 873 876 879 882 885 888 891 894 897 900 903 906 909 912 915 918 921 924 927 930 933 936 939 942 945 948 951 954 957 960 963 966 969 972 975 978 981 984 987 990 993 996 999 1002 1005 1008 1011 1014 1017 1020 1023 1026 1029 1032 1035 1038 1041 1044 1047 1050 1053 1056 1059 1062 1065 1068 1071 1074 1077 1080 1083 1086 1089 1092 1095 1098 1101 1104 1107 1110 1113 1116 1119 1122 1125 1128 1131 1134 1137 1140 1143 1146 1149 1152 1155 1158 1161 1164 1167 1170 1173 1176 1179 1182 1185 1188 1191 1194 1197 1200 1203 1206 1209 1212 1215 1218 1221 1224 1227 1230 1233 1236 1239 1242 1245 1248 1251 1254 1257 1260 1263 1266 1269 1272 1275 1278 1281 1284 1287 1290 1293 1296 1299 1302 1305 1308 1311 1314 1317 1320 1323 1326 1329 1332 1335 1338 1341 1344 1347 1350 1353 1356 1359 1362 1365 1368 1371 1374 1377 1380 1383 1386 1389 1392 1395 1398 1401 1404 1407 1410 1413 1416 1419 1422 1425 1428 1431 1434 1437 1440 1443 1446 1449 1452 1455 1458 1461 1464 1467 1470 1473 1476 1479 1482 1485 1488 1491 1494 1497 1500 1503 1506 1509 1512 1515 1518 1521 1524 1527 1530 1533 1536 1539 1542 1545 1548 1551 1554 1557 1560 1563 1566 1569 1572 1575 1578 1581 1584 1587 1590 1593 1596 1599 1602 1605 1608 1611 1614 1617 1620 1623 1626 1629 1632 1635 1638 1641 1644 1647 1650 1653 1656 1659 1662 1665 1668 1671 1674 1677 1680 1683 1686 1689 1692 1695 1698 1701 1704 1707 1710 1713 1716 1719 1722 1725 1728 1731 1734 1737 1740 1743 1746 1749 1752 1755 1758 1761 1764 1767 1770 1773 1776 1779 1782 1785 1788 1791 1794 1797 1800 1803 1806 1809 1812 1815 1818 1821 1824 1827 1830 1833 1836 1839 1842 1845 1848 1851 1854 1857 1860 1863 1866 1869 1872 1875 1878 1881 1884 1887 1890 1893 1896 1899 1902 1905 1908 1911 1914 1917 1920 1923 1926 1929 1932 1935 1938 1941 1944 1947 1950 1953 1956 1959 1962 1965 1968 1971 1974 1977 1980 1983 1986 1989 1992 1995 1998 2001 2004 2007 2010 2013 2016 2019 2022 2025 2028 2031 2034 2037 2040 2043 2046 2049 2052 2055 2058 2061 2064 2067 2070 2073 2076 2079 2082 2085 2088 2091 2094 2097 2100 2103 2106 2109 2112 2115 2118 2121 2124 2127 2130 2133 2136 2139 2142 2145 2148 2151 2154 2157 2160 2163 2166 2169 2172 2175 2178 2181 2184 2187 2190 2193 2196 2199 2202 2205 2208 2211 2214 2217 2220 2223 2226 2229 2232 2235 2238 2241 2244 2247 2250 2253 2256 2259 2262 2265 2268 2271 2274 2277 2280 2283 2286 2289 2292 2295 2298 2301 2304 2307 2310 2313 2316 2319 2322 2325 2328 2331 2334 2337 2340 2343 2346 2349 2352 2355 2358 2361 2364 2367 2370 2373 2376 2379 2382 2385 2388 2391 2394 2397 2400 2403 2406 2409 2412 2415 2418 2421 2424 2427 2430 2433 2436 2439 2442 2445 2448 2451 2454 2457 2460 2463 2466 2469 2472 2475 2478 2481 2484 2487 2490 2493 2496 2499 2502 2505 2508 2511 2514 2517 2520 2523 2526 2529 2532 2535 2538 2541 2544 2547 2550 2553 2556 2559 2562 2565 2568 2571 2574 2577 2580 2583 2586 2589 2592 2595 2598 2601 2604 2607 2610 2613 2616 2619 2622 2625 2628 2631 2634 2637 2640 2643 2646 2649 2652 2655 2658 2661 2664 2667 2670 2673 2676 2679 2682 2685 2688 2691 2694 2697 2700 2703 2706 2709 2712 2715 2718 2721 2724 2727 2730 2733 2736 2739 2742 2745 2748 2751 2754 2757 2760 2763 2766 2769 2772 2775 2778 2781 2784 2787 2790 2793 2796 2799 2802 2805 2808 2811 2814 2817 2820 2823 2826 2829 2832 2835 2838 2841 2844 2847 2850 2853 2856 2859 2862 2865 2868 2871 2874 2877 2880 2883 2886 2889 2892 2895 2898 2901 2904 2907 2910 2913 2916 2919 2922 2925 2928 2931 2934 2937 2940 2943 2946 2949 2952 2955 2958 2961 2964 2967 2970 2973 2976 2979 2982 2985 2988 2991 2994 2997 3000 3003 3006 3009 3012 3015 3018 3021 3024 3027 3030 3033 3036 3039 3042 3045 3048 3051 3054 3057 3060 3063 3066 3069 3072 3075 3078 3081 3084 3087 3090 3093 3096 3099 3102 3105 3108 3111 3114 3117 3120 3123 3126 3129 3132 3135 3138 3141 3144 3147 3150 3153 3156 3159 3162 3165 3168 3171 3174 3177 3180 3183 3186 3189 3192 3195 3198 3201 3204 3207 3210 3213 3216 3219 3222 3225 3228 3231 3234 3237 3240 3243 3246 3249 3252 3255 3258 3261 3264 3267 3270 3273 3276 3279 3282 3285 3288 
				</DataArray>
			</Polys>
		</Piece>
	</PolyData>
</VTKFile>
