T,100
nz,6
w,0.9805806756909201,0.19611613513818402
Sstart,0,0,0,0,0,0
Sgoal,1.5707963267948966,-1.5707963267948966,0.0,0.0,0.0,0.0
X,0.0,0.0,0.0,-2.1330390061644325e-43,0.0,-4.694349855488137e-42,7.394038928163918e-44,-2.1334221737132713e-45,0.0,9.64093446453889e-34,91.81481174342841,-223.82954180791052,-6.18760853153427e-43,9.639331123260533e-36,0.918148117434284,-2.238295418079105,85.15050461391866,-207.67907526498325,0.00918148117434284,-0.02238295418079105,1.7696531635734707,-4.315086170728938,78.26028143062291,-191.01056408748235,0.02687801281007755,-0.06553381588808042,2.5522559778797,-6.225191811603762,70.65027128366049,-172.71912234765836,0.052400572588874546,-0.12778573400411805,3.258758690716305,-7.952383035080344,61.67619232581946,-151.36050498432738,0.0849881594960376,-0.20730956435492148,3.8755206139744995,-9.46598808492362,50.90396947320761,-125.97992465160974,0.12374336563578259,-0.3019694452041577,4.384560308706575,-10.725787331439717,38.41702218307812,-96.80956033870241,0.16758896872284834,-0.4092273185185548,4.768730530537356,-11.69388293482674,24.999435248323046,-65.68225845106565,0.21527627402822191,-0.5261661478668223,5.018724883020587,-12.350705519337398,11.95197857212217,-35.59488038649861,0.2654635228584278,-0.6496732030601963,5.138244668741809,-12.706654323202383,0.5743180393619014,-9.508647006696552,0.3168459695458459,-0.7767397462922201,5.143987849135428,-12.801740793269348,-8.32981328786976,10.784210692814339,0.36828584803720016,-0.9047571542249135,5.0606897162567295,-12.693898686341205,-14.609611593112199,25.005090216298132,0.41889274519976744,-1.0316961410883256,4.914593600325608,-12.443847784178224,-18.59990128202011,33.990343517838326,0.4680386812030235,-1.1561346189301078,4.728594587505406,-12.10394434899984,-20.83689891020188,39.02830868452355,0.5153246270780776,-1.2771740624201062,4.520225598403387,-11.713661262154604,-21.840989031189366,41.36018442935559,0.5605268830621114,-1.3943106750416523,4.301815708091493,-11.300059417861048,-22.02754606312203,41.97598855289201,0.6035450401430263,-1.5073112692202628,4.081540247460273,-10.880299532332128,-21.69032840367677,41.583184808889946,0.644360442617629,-1.6161142645435842,3.8646369634235054,-10.464467684243228,-21.022378799908697,40.653868867758035,0.6830068122518641,-1.7207589413860165,3.6544131754244185,-10.057928995565646,-20.142985017495207,39.48805135142192,0.7195509440061083,-1.8213382313416728,3.4529833252494666,-9.663048482051428,-19.122377800301614,38.27015751026376,0.754080777258603,-1.9179687161621872,3.2617595472464505,-9.28034690694879,-18.000761457346023,37.111111926895845,0.7866983727310675,-2.010772185231675,3.08175193267299,-8.909235787679831,-16.799807560923522,36.070145886460374,0.8175158920577974,-2.0998645431084735,2.913753857063755,-8.548534328815228,-15.533828765497613,35.17931659185026,0.8466534306284349,-2.185349886396626,2.758415569408779,-8.196741162896725,-14.214341935240295,34.449827413406034,0.8742375863225227,-2.2673172980255933,2.616272150056376,-7.852242888762664,-12.854390158965108,33.881035030565634,0.9004003078230863,-2.34583972691322,2.487728248466725,-7.513432538457008,-11.471463974074158,33.46480523536161,0.9252775903077536,-2.4209740522977903,2.3730136087259837,-7.178784486103392,-10.087681037970821,33.18700876499933,0.9490077263950134,-2.4927618971588243,2.2721367983462755,-6.846914398453398,-8.729646865666778,33.03089764444285,0.9717290943784761,-2.5612310411433583,2.1848403296896075,-6.516605422008969,-7.42674134874551,32.97680571845915,0.9935774976753722,-2.6263970953634477,2.1105729162021527,-6.1868373648243775,-6.20877253613268,33.00388066559701,1.0146832268373938,-2.6882654690116916,2.0484851908408257,-5.856798558168407,-5.10299078243808,33.091837101056115,1.035168078745802,-2.7468334545933755,1.9974552830164456,-5.5258801871578465,-4.131824323483157,33.21982919914531,1.0551426315759664,-2.802092256464954,1.9561370397816138,-5.193681895166393,-3.3100769928515055,33.36894006610696,1.0747040019737826,-2.8540290754166184,1.9230362698530985,-4.859992494505324,-2.6443443374846534,33.52156028347331,1.0939343646723136,-2.9026290003616717,1.896592826478252,-4.524776891670591,-2.132462470385237,33.66278931866667,1.1129002929370961,-2.9478767692783774,1.8752682017743998,-4.188148998483923,-1.7645793087173338,33.77895662693311,1.13165297495484,-2.9897582592632164,1.8576224086872264,-3.850359432214592,-1.524592954721158,33.859804901986514,1.1502291990417124,-3.028261853585362,1.8423764791400148,-3.511761383194727,-1.3921492054728999,33.89571675240745,1.1686529638331125,-3.063379467417309,1.8284549870852858,-3.172804215670652,-1.3446940455945648,33.879956719610895,1.1869375137039653,-3.095107509574016,1.8150080466293401,-2.834004648474543,-1.3596516058201558,33.80708318080853,1.2050875941702588,-3.1234475560587613,1.8014115305711387,-2.495933816666458,-1.415783985663924,33.672772127790395,1.2231017094759702,-3.1484068942254257,1.7872536907144994,-2.159206095388554,-1.4941905768657333,33.473684088932124,1.2409742463831153,-3.1699989551793113,1.7723117849458419,-1.824469254499233,-1.5791435993219167,33.20770518247107,1.2586973642325736,-3.1882436477243035,1.7565203489526229,-1.4923922026745222,-1.658617399263307,32.87479243131242,1.2762625677220998,-3.203167569751049,1.7399341749599897,-1.1636442783613978,-1.72440191292603,32.473168433272626,1.2936619094716997,-3.214804012534663,1.7226901558307295,-0.8389125940286717,-1.7713443683080987,32.00492831340341,1.310888811030007,-3.22319313847495,1.7049767121476487,-0.5188633108946377,-1.7980036679756868,31.471016277363702,1.3279385781514834,-3.2283817715838965,1.6869966754678916,-0.20415314812100047,-1.8057667648975235,30.873661156600797,1.3448085449061622,-3.230423303065107,1.6689390078189164,0.10458346344500752,-1.7986082023648322,30.21534606557866,1.3614979349843515,-3.2293774684306564,1.650952925795268,0.40673692410079415,-1.7829021200798436,29.50084968820272,1.3780074642423041,-3.2253100991896484,1.6331239045944694,0.7017454209828213,-1.7666931943732296,28.73324704065365,1.394338703288249,-3.2182926449798206,1.615456972650737,0.9890778913893578,-1.759693895180078,27.91801945635403,1.4104932730147564,-3.208401866065927,1.5978600336989364,1.2682580859528982,-1.772437808364788,27.059805194344086,1.4264718733517459,-3.1957192852063976,1.5801356556152886,1.538856137896339,-1.8163054367454825,26.163791531646297,1.4422732299078986,-3.180330723827434,1.5619726012478339,1.8004940532128022,-1.9026510506445737,25.23483773450853,1.4578929559203768,-3.162325783295306,1.542946090741388,2.052842430557887,-2.0424773009228416,24.27800435669019,1.4733224168277907,-3.1417973589897272,1.5225213177321597,2.295622474124789,-2.245685971641787,23.29807363674376,1.4885476300051124,-3.118841134248479,1.5000644580157418,2.5286032104922267,-2.520519049104509,22.299345144134964,1.50354827458527,-3.093555102143557,1.4748592675246965,2.7515966619335765,-2.8731001334810418,21.28511823410725,1.5182968672605168,-3.066039135524221,1.446128266189886,2.964447844274649,-3.3065244113200136,20.25874041006132,1.5327581499224159,-3.036394657081475,1.413063022076686,3.167035248375263,-3.820770109568647,19.22261754170559,1.5468887801431828,-3.004724304597722,1.3748553209809995,3.3592614237923186,-4.411204206349864,18.17810242723356,1.5606373333529928,-2.971131690359799,1.3307432789175009,3.5410424480646543,-5.0700569758493,17.126291633507446,1.5739447661421677,-2.9357212658791525,1.280042709159008,3.712305364399729,-5.784718705281372,16.06755198862013,1.5867451932337577,-2.898598212235155,1.2221955221061942,3.87298088428593,-6.538721523379769,15.001036707614455,1.5989671484548196,-2.8598684033922956,1.1568083068723967,4.0229912513620745,-7.312716110279819,13.925758206696482,1.6105352315235437,-2.819638490878675,1.0836811457695983,4.1622488334290395,-8.08414676016763,12.839307821639734,1.6213720429812395,-2.7780160025443847,1.002839678167922,4.290641911645436,-8.829397774194812,11.740185980046823,1.6314004397629187,-2.73510958342793,0.9145457004259739,4.408043771445905,-9.524099759441624,10.624968172108785,1.6405458967671782,-2.6910291457134714,0.8193047028315577,4.514293453166992,-10.145133860159413,9.490159255509514,1.6487389437954938,-2.6458862111818013,0.7178533642299636,4.609195045722087,-10.671215444827101,8.33162425819813,1.6559174774377934,-2.5997942607245803,0.6111412097816926,4.692511288304069,-11.083969172919039,7.144871292796708,1.6620288895356103,-2.5528691478415397,0.5003015180525022,4.763960001232036,-11.3690157342414,5.924684617021005,1.6670319047161355,-2.5052295478292192,0.38661136071008817,4.823206847402246,-11.515800693110096,4.66508919892339,1.6708980183232365,-2.4569974793551967,0.2714533537789872,4.86985773939148,-11.518200148162101,3.35901012334721,1.6736125518610263,-2.408298901961282,0.1562713522973662,4.903447840624953,-11.37384304001749,1.9992665563442344,1.675175265384,-2.3592644235550324,0.04253292189719128,4.923440506188395,-11.083868783365297,0.5773948766855747,1.6756005946029717,-2.3100300184931486,-0.06830576593646168,4.92921445495525,-10.652169009651773,-0.9154249060294866,1.6749175369436071,-2.260737873943596,-0.17482745603297942,4.920060205894956,-10.08494490290098,-2.4893693886421375,1.6731692623832772,-2.211537271884646,-0.2756769050619892,4.895166512008535,-9.38966769431012,-4.154794683754522,1.6704124933326574,-2.162585606764561,-0.36957358200509044,4.85361856517099,-8.574834286950537,-5.921889347077101,1.6667167575126065,-2.114049421112851,-0.4553219248745959,4.794399671700219,-7.649125809453878,-7.801231139403083,1.6621635382638604,-2.066105424395849,-0.5318131829691347,4.7163873603061885,-6.621374935100194,-9.802346675316233,1.656845406434169,-2.018941550792787,-0.5980269323201366,4.618363893553026,-5.500581239341042,-11.93423021917544,1.6508651371109677,-1.9727579118572567,-0.6530327447135469,4.499021591361272,-4.295367338830858,-14.202928395572963,1.6443348096638324,-1.9277676959436438,-0.6959864181018555,4.356992307405542,-3.014795135380356,-16.612278304383576,1.6373749454828137,-1.8841977728695884,-0.7261343694556591,4.190869524361706,-1.6685078429727749,-19.162159596990065,1.6301136017882571,-1.8422890776259713,-0.7428194478853869,3.9992479283918048,-0.2666474236332686,-21.8477809399511,1.6226854073094035,-1.8022965983420534,-0.7454859221217197,3.780770118992294,1.1776595934835572,-24.657050590424472,1.6152305480881863,-1.7644888971521304,-0.7337093261868841,3.5341996130880493,2.650877223766417,-27.572904248832238,1.6078934548263175,-1.72914690102125,-0.7072005539492199,3.258470570599727,4.135827921499688,-30.568154844237814,1.6008214492868253,-1.6965621953152525,-0.6658422747342231,2.952789022157349,5.612720979003754,-33.60898964292589,1.5941630265394828,-1.6670343050936791,-0.6097150649441855,2.6166991257280903,7.058575121718553,-36.65228274682644,1.588065875890041,-1.6408673138363983,-0.5391293137269999,2.250176298259826,8.447133265944467,-39.64592683211895,1.582674582752771,-1.6183655508538,-0.4546579810675553,1.8537170299386363,9.749197403708028,-42.530906111089784,1.5781280029420954,-1.5998283805544138,-0.35716600703047496,1.4284079688277387,10.933167909641101,-45.24294569057442,1.5745563428717906,-1.5855443008661363,-0.24783432793406393,0.9759785119219943,11.96670481787174,-47.71596167200207,1.5720779995924499,-1.5757845157469164,-0.12816727975534656,0.4988188952019736,12.816727975534656,-49.881889520197355,1.5707963267948966,-1.5707963267948966,8.668593347009667e-34,-3.6491409313770844e-31,0.0,0.0
