X,114.69401555168322,112.71265569723019,110.707756287088,107.02330256455224,106.7963166881229,56.77439771917686,103.12418855129766,101.28415355049331,99.48506292365033,97.76069161683614,96.09229998145967,94.463103998191,92.91779729160646,91.38583078286916,89.9862625030184,-21.420733863793544,87.35169464696386,15.515053442903593,84.64161681132289,83.59367865656507,82.48103329622002,81.38103992232391,80.32138322338484,79.26121274430433,-7.100446631600676,77.27934718169568,76.33109825407467,75.46766298184706,74.43639470512947,73.52699809740085,73.11104660790834,71.76897415675806,70.7982476152884,69.93605883647542,69.00861677418794,67.84303307972162,67.08070375577527,65.95671259121585,63.25258065906766,63.54460481322127,61.677240896124836,7.369123955837089,6.670249214381086,5.9668207036345295,5.266666029641036,4.603331419627285,3.9253118488628016,3.2362782721560053,2.566512330755677,1.8922936163998083,1.2167949152753448,0.523371250895302,-0.10937451133827714,-0.8251344548714161,-1.5120246321007007,-2.2057362307286237,-2.9080279276307865,-7.380256568856327,-4.307158833862055,-5.033193283262572,-5.759755285234415,-6.5276046602770785,-11.41847509082378,-7.988865057208794,-8.757180207404433,-9.524654177451513,-10.289515423250654,-11.108439149972059,-11.904348453271941,-12.72010687325145,-13.54053255220595,-14.373706198287477,-15.226825111919249,-16.067952768872576,-16.925836466569177,-17.78961857446645,-18.661487815784994,-19.528531297907996,-21.11585012137356,-21.307794160663498,-22.218981390424073,-23.197707037841624,-24.31411205597729,-25.855649969617495,-28.205807265219192,-35.51599646203567,-112.67077422648265,-109.87280421490355,-104.80885788565803
Y,-523.178136640015,-519.1776304075037,-515.0667136306944,-539.1513889470098,-506.8384191950892,-527.3460852890253,-498.74405417148506,-494.5704790564845,-490.42265156088905,-486.38323037762206,-482.38335567959774,-478.403649119229,-474.57212077919627,-470.73869154593166,-467.0932874607706,-455.85649842659717,-459.8811476919559,-451.5404381428839,-452.9687922993165,-449.72375096395086,-446.54752300467,-443.32277295460034,-440.17499580619295,-437.09376297000705,-435.23238218904663,-430.8368230845496,-427.73315138851336,-424.98964803047255,-421.56149740307853,-418.2992420797846,-415.3444614373847,-412.18728482885894,-408.72310010566036,-405.3762390986449,-402.05311358199833,-397.89623608451535,-394.2659394716828,-389.641060348785,-384.1880174690008,-378.6099756465194,-371.677616546011,-187.38318297392618,-185.178027705859,-182.97011060064938,-180.76528369501077,-178.615052034546,-176.45314309183834,-174.2558890038332,-172.07971283085405,-169.90014094525273,-167.7040932056881,-165.4844715330006,-163.28671365969274,-161.01875923789072,-158.7312536403888,-156.4296773377697,-154.097487788998,-153.5995337069922,-149.34860548909091,-146.8936915583008,-144.4166693902613,-141.83677775360496,-143.34047624372275,-136.62874501609707,-133.91362156236303,-131.13089415468085,-128.25570061663862,-125.34561980159175,-122.28709048399277,-119.14667915410834,-115.89419413339256,-112.51574055927757,-108.98894879283222,-105.31928657357676,-101.46244592694065,-97.35675235103395,-93.09340388603907,-88.50560170548175,-84.60333594365314,-78.1869589379261,-72.271216274988,-65.5932313133873,-57.820853406369416,-48.31914159485163,-35.35033544003652,-10.303700822193756,171.31649705298886,182.09258610023596,191.72759282434544
W1,0.9998476951563913,0.9993908270190958,0.9986295347545739,0.9975640502598243,0.9961946980917455,0.9945218953682734,0.9925461516413221,0.9902680687415704,0.9876883405951378,0.9848077530122081,0.981627183447664,0.9781476007338057,0.9743700647852352,0.9702957262759965,0.9659258262890683,0.9612616959383189,0.9563047559630354,0.9510565162951536,0.9455185755993168,0.9396926207859084,0.9335804264972017,0.9271838545667874,0.9205048534524404,0.913545457642601,0.9063077870366499,0.898794046299167,0.8910065241883679,0.882947592858927,0.8746197071393959,0.8660254037844387,0.8571673007021123,0.8480480961564261,0.838670567945424,0.8290375725550417,0.8191520442889919,0.8090169943749475,0.7986355100472928,0.7880107536067221,0.7771459614569709,0.7660444431189781,0.7547095802227721,0.7431448254773942,0.7313537016191706,0.7193398003386512,0.7071067811865476,0.6946583704589974,0.6819983600624986,0.6691306063588583,0.6560590289905073,0.6427876096865394,0.6293203910498376,0.6156614753256583,0.6018150231520484,0.5877852522924731,0.5735764363510462,0.5591929034707468,0.5446390350150272,0.529919264233205,0.5150380749100544,0.5000000000000001,0.4848096202463371,0.46947156278589086,0.45399049973954686,0.43837114678907746,0.42261826174069944,0.40673664307580026,0.39073112848927394,0.37460659341591196,0.3583679495453004,0.3420201433256689,0.3255681544571568,0.3090169943749475,0.2923717047227368,0.27563735581699916,0.25881904510252074,0.2419218955996679,0.22495105434386492,0.20791169081775948,0.19080899537654492,0.17364817766693041,0.15643446504023092,0.13917310096006572,0.1218693434051475,0.10452846326765347,0.08715574274765814,0.06975647374412547,0.05233595624294397,0.03489949670250108,0.017452406437283376
W2,0.01745240643728351,0.03489949670250097,0.052335956242943835,0.06975647374412532,0.08715574274765817,0.10452846326765347,0.12186934340514749,0.13917310096006544,0.15643446504023087,0.17364817766693036,0.1908089953765448,0.20791169081775931,0.224951054343865,0.24192189559966773,0.25881904510252074,0.27563735581699916,0.29237170472273677,0.30901699437494745,0.32556815445715664,0.3420201433256687,0.35836794954530027,0.374606593415912,0.3907311284892737,0.4067366430758002,0.42261826174069944,0.4383711467890774,0.45399049973954675,0.4694715627858908,0.4848096202463371,0.49999999999999994,0.5150380749100542,0.529919264233205,0.5446390350150271,0.559192903470747,0.5735764363510462,0.5877852522924731,0.6018150231520483,0.6156614753256583,0.6293203910498374,0.6427876096865394,0.6560590289905072,0.6691306063588582,0.6819983600624985,0.6946583704589973,0.7071067811865475,0.7193398003386511,0.7313537016191706,0.7431448254773942,0.754709580222772,0.766044443118978,0.7771459614569709,0.788010753606722,0.7986355100472928,0.8090169943749475,0.8191520442889918,0.8290375725550417,0.8386705679454239,0.8480480961564261,0.8571673007021122,0.8660254037844386,0.8746197071393957,0.8829475928589269,0.8910065241883679,0.898794046299167,0.9063077870366499,0.913545457642601,0.9205048534524403,0.9271838545667874,0.9335804264972017,0.9396926207859084,0.9455185755993168,0.9510565162951536,0.9563047559630355,0.9612616959383189,0.9659258262890683,0.9702957262759965,0.9743700647852352,0.9781476007338057,0.981627183447664,0.984807753012208,0.9876883405951378,0.9902680687415704,0.9925461516413221,0.9945218953682734,0.9961946980917455,0.9975640502598243,0.9986295347545739,0.9993908270190958,0.9998476951563913
