Type,0
T,101
nz,6
Mod,1.0,1.0,1.0,1.0,0.5,0.5,0.5,0.5
w,0.8320502943378436,0.5547001962252291
Sstart,0,0,0,0,0,0
Sgoal,2.0943951023931953,0.6981317007977318,0.0,0.0,0.0,0.0
X,0.0,0.0,0.0,0.0,0.0,0.0,0.0,0.0,-1.8380139872052677e-35,0.0,-51.31128798835516,154.00718523084404,1.4439295060920958e-36,0.0,-0.5080325543401502,1.5248236161469706,-47.446447786754874,143.44285967469966,-0.005030025290496536,0.01509726352620763,-0.9777993641100003,2.9450499495598383,-43.55882705302573,132.831114724827,-0.014711207113367826,0.0442561739178892,-1.409074879486493,4.260209501290799,-39.53650389465419,121.92652135774846,-0.028662443543927163,0.08643646600987732,-1.8005254130969304,5.467402782060586,-35.21758538103286,110.37640153206296,-0.04648942783201558,0.14056916682235837,-2.1492143772655727,6.560238440793882,-30.451276603667406,97.86410213623381,-0.06776877810197175,0.20552202267180272,-2.4507121654206956,7.5291899470932275,-25.143180939470096,84.21188363420255,-0.09203325498732517,0.28006845779153766,-2.6996545509600036,8.362970973174441,-19.299204799533022,69.48238841541445,-0.1187625079671272,0.362870150595245,-2.8907357865989445,9.05091541293102,-13.05004839130508,54.03305348046756,-0.14738365436909695,0.4524831744856511,-3.019944186512856,9.5858961404604,-6.6428018350936515,38.49109901143576,-0.17728409185932323,0.5473930372624869,-3.085714501711803,9.966996130672637,-0.38204151137183856,23.604528864289925,-0.20783572058914307,0.6460761672691466,-3.0894970909333064,10.200704337249766,5.431087930203178,10.09420631244277,-0.2384248006973936,0.7470732399151838,-3.0357239431095127,10.300646974006627,10.570006818589404,-1.518240799235563,-0.26848147340144823,0.8490598436182196,-2.931070410252192,10.285614886885481,14.914965522698887,-10.983501434281393,-0.29750197251285604,0.9508976147755017,-2.7833974842848757,10.1768673479322,18.45007197283317,-18.31201469151078,-0.32506036344636974,1.0516586776263157,-2.6007235043558343,9.99556027177863,21.241038370097264,-23.71497240173648,-0.35081010111325917,1.1506246209112523,-2.390416193760812,9.760758564830743,23.393138906984827,-27.49811376548228,-0.3744775881801979,1.2472657948204675,-2.1588009570579914,9.488500012697255,25.025406440270288,-29.998080519460885,-0.3958518550817621,1.3412113395006384,-1.9110246556691768,9.191489314484771,26.24888496590282,-31.529531077429922,-0.4147728912765065,1.4322161841985077,-1.6511347055117231,8.879315739460711,27.154835616210466,-32.35595011792842,-0.4311207596479097,1.5201302014208913,-1.382274946935382,8.558959797699046,27.8143969316748,-32.690311127443806,-0.44480665021162635,1.604872377635733,-1.1068848783049385,8.23529335089267,28.278693048278182,-32.69524988600444,-0.45576590643246734,1.6864099355653634,-0.8268978184209961,7.911578005486686,28.582774789309138,-32.49253836909827,-0.46395301354554647,1.7647423910652316,-0.5439000482298166,7.589869704802545,28.747631346998077,-32.166947475696865,-0.46933816253792093,1.839889615865257,-0.2592700348932019,7.271385076330299,28.785500901915967,-31.77876619338332,-0.4719051925863684,1.9118835275120916,0.02573492453170866,6.956743826890859,28.70287715280934,-31.370068358848215,-0.4716503913533812,1.9807621792634862,0.30992182703477145,6.6461490906646405,28.500976765794874,-30.96342139564784,-0.4685818584124428,2.0465656356067004,0.5921097158050177,6.339580561994859,28.181055176093956,-30.575373297880734,-0.4627193859787298,2.109333759982887,0.8711300640831758,6.036854093699011,27.743276315285033,-30.211896951666347,-0.4540943358392924,2.1691045925937686,1.1458159681949087,5.7377264011082545,27.18931283745296,-29.873842288190378,-0.4427496232829072,2.2259137648819687,1.4150170853974136,5.4419457843935,26.522960229661944,-29.55936294965078,-0.42873955313045753,2.279794416212598,1.6776206520277297,5.149278824495966,25.750046384836704,-29.263829182594936,-0.41212944766483645,2.330777374870974,1.9325716063330436,4.859537941499978,24.87870529173232,-28.980927628708148,-0.3929950753249053,2.3788916119155283,2.1788954211026703,4.572598063988016,23.919623143945373,-28.705632504151687,-0.3714218533337897,2.424164860073825,2.415723373022922,4.288383880778593,22.88457286320916,-28.43153576402419,-0.347503800135543,2.466624106418168,2.642303302361627,4.006883526679344,21.787293409521105,-28.155700099074327,-0.3213423813002793,2.5062962205437054,2.8580190786935185,3.7281142187677174,20.641533766740835,-27.874369645186793,-0.29304516269935343,2.5432082425117026,3.0623907001463984,3.452130360894581,19.461459796785004,-27.58677537201549,-0.2627244626979039,2.5773877510354115,3.2550784209066457,3.1789939710726447,18.259814721039305,-27.291384496504953,-0.23049596348100643,2.608862938867814,3.435868665669411,2.908782243384477,17.049786606661574,-26.992160491448736,-0.19647746184071524,2.6376627630597396,3.6046784340521993,2.641533129607757,15.841857862310192,-26.69012591011728,-0.1607875763550499,2.6638165564221925,3.7615285118968544,2.3772744572303584,14.645940951654135,-26.390296686699482,-0.12354471980161567,2.68735392728586,3.9065378282498657,2.115984391025413,13.469690244449852,-26.095820018022945,-0.08486612744270611,2.708304267791062,4.039901097996895,1.857609935401423,12.31946407324105,-25.812737681979847,-0.044867106670459636,2.7266964453692943,4.161875989811161,1.6020382751838012,11.199935231942444,-25.545186421466656,-0.003660413702032292,2.742558210470124,4.272766437652177,1.3491156373474977,10.114507132709328,-25.298269712095752,0.03864420449254371,2.755915791037921,4.372910072629496,1.0986377194059556,9.065391574100238,-25.07697139532931,0.08194034382550901,2.7667933922201575,4.462666424848309,0.8503508739076454,8.053175920131945,-24.883403215429855,0.12612515991311601,2.7752127078034015,4.542400839899121,0.6039805450420033,7.078502195300267,-24.72280636448887,0.1710994256546915,2.781192713199857,4.612485020050608,0.35920028400746007,6.140345148441983,-24.59532381988729,0.21676759417004404,2.784749151655377,4.673280516569836,0.11568222638481365,5.238024352021945,-24.50349813693916,0.26303769829449786,2.7858945202334437,4.725142143817578,-0.1269266660601285,4.3696539153114795,-24.446194188741867,0.3098212838768501,2.7846378205694826,4.7684060439691764,-0.3689681926813351,3.5339881005060985,-24.423566532116244,0.3570332249062479,2.7809846701468945,4.803396025162307,-0.6107856830983276,2.729150412652778,-24.433007889520134,0.4045916013930034,2.7749372871459217,4.830417316376692,-0.8526966523014973,1.9535944544932797,-24.471540728943975,0.45241751541653497,2.766494746034026,4.8497598357281095,-1.094989134766289,1.2059621517586998,-24.53497956878948,0.5004349395326548,2.7556532694521807,4.861700055052453,-1.337909724556284,0.48533148524144054,-24.618567609033647,0.5485705836420851,2.74240663851598,4.8665053172825665,-1.581657918705132,-0.20892029434858597,-24.7154558241926,0.5967538046052787,2.7267466591228597,4.8644367995167395,-1.8263654021129796,-0.876332382589051,-24.819733495415242,0.6449165451945534,2.708663833359365,4.855760241273282,-2.0721053377111502,-1.5162522244132264,-24.923159841819746,0.6929933792665662,2.688147938926581,4.840747843011766,-2.3188692965410485,-2.127017177758758,-25.017854776181288,0.7409215757320293,2.6651888369806307,4.819688266994352,-2.5665708289784877,-2.706066066838615,-25.09546835264026,0.7886412615438544,2.6397772446145074,4.792895533659316,-2.815040812667995,-3.250111748486709,-25.147154086463946,0.8360956727682041,2.6119055533999727,4.760716209416873,-3.064022536296351,-3.755448091862978,-25.163999544125573,0.8832314768218366,2.5815686966049594,4.7235335550419935,-3.313171046634228,-4.217486674236573,-25.137460698369658,0.9299991357826484,2.548765022875908,4.681776261237671,-3.562056796123037,-4.6316037100789815,-25.059270744918503,0.9763533561909421,2.5134971338053824,4.635918798761641,-3.8101683876568826,-4.993194231209126,-24.920984055987415,1.022253542317295,2.475772694323631,4.586481232116006,-4.056910804052799,-5.2979869070239385,-24.716360708685734,1.0676642475857703,2.435605260620138,4.534025916204877,-4.301627246713053,-5.542573140443593,-24.438805633511596,1.1125555932907691,2.3930148918408007,4.4791489544183065,-4.543595619322079,-5.725026801683042,-24.082112580446346,1.1569036027404553,2.348028796599988,4.4224655207382755,-4.78203237754432,-5.845100026059783,-23.641773369692594,1.2006903900744978,2.3006819413767774,4.364593243252536,-5.016109341600682,-5.904614871199921,-23.11279741219252,1.2439041845621464,2.2510174924500377,4.306131709874319,-5.2449489199392225,-5.908108280938544,-22.490430808923854,1.286539151986645,2.1990873051239066,4.247635588280869,-5.467626452700845,-5.8626753544480215,-21.76920282774108,1.3285949498904155,2.1449523897506313,4.18958929764277,-5.683163114361647,-5.778644252826497,-20.941551333571507,1.3700760320452945,2.088683448024278,4.132374998109833,-5.8905052067732475,-5.668859359009295,-19.99916079222886,1.410990635986976,2.03036161429385,4.076247677723603,-6.088516699765611,-5.549556179980946,-18.928625062231532,1.4513495238852296,1.970079270731814,4.021301576931713,-6.275928829094636,-5.439882873352827,-17.712588763503156,1.4911643909835632,1.907941361532857,3.9674413504628725,-6.451300995069916,-5.3613635273013704,-16.328963562199263,1.530445988512899,1.844067094254937,3.914358543261869,-6.6129739016263445,-5.338625648259665,-14.748310604611962,1.5692020136937095,1.7785921051299236,3.8615008635761296,-6.75899677889973,-5.399165208662892,-12.932569382927399,1.6074346955112953,1.7116713449427976,3.80804378230224,-6.887042020314852,-5.572776576575173,-10.836229920019107,1.6451380992964655,1.643482810088195,3.7528677765935745,-6.994331425463557,-5.892655854100346,-8.402051442031357,1.6822952059954122,1.5742320038954865,3.694524649325254,-7.0775200536024805,-6.3941904128173865,-5.564042907077,1.7188746579689294,1.5041575479192244,3.6312158333567646,-7.132609587335917,-7.114613982167312,-2.2483412617611704,1.754827289982363,1.4335376510149083,3.560774110761049,-7.154870391907809,-8.093752501838747,1.6297557001358558,1.7900824791978187,1.3626973501049302,3.4806379473765072,-7.138734196856959,-9.371850583541862,6.159449808539904,1.8245442410530317,1.2920168135023857,3.387847347539459,-7.077749545287257,-10.987821511248493,11.430150356881908,1.8580872840979767,1.221940085331225,3.2790570355468995,-6.9645797397735745,-12.975889615861115,17.52281283739941,1.8905531953410155,1.152983850283962,3.150582880934414,-6.79108654336368,-15.361717958922599,24.50004713560149,1.921747085251257,1.0857453696565986,2.998486663519338,-6.548511819248813,-18.16140675104474,32.40344809751761,1.9514350720187752,1.0209086189709666,2.8186707550931525,-6.227685600461512,-21.371840680260984,41.22855499881515,1.9793427032573214,0.959248365501051,2.6070683721202714,-5.819482085621757,-24.969658782608043,50.92247971718285,2.005155261397126,0.9016297309899444,2.3598440277380135,-5.315299118124897,-28.90775280788074,61.37397534455219,2.028520053750968,0.8490030070481137,2.0736286534025608,-4.707635995901607,-33.11481486669146,72.41254671200896,2.04905103051733,0.8023927496629494,1.7457591992769026,-3.9906800878619144,-37.4990880154358,83.81669583305712,2.0663357750646263,0.7628810656247125,1.374481100114172,-3.1608118122870916,-41.948018269258995,95.3112826597219,2.0799444988281324,0.7315858991664245,0.9591541865571522,-2.217135746349251,-46.33853871733644,106.59514320351397,2.0894410749326586,0.7096340600936596,0.500356773514217,-1.161738288888716,-50.536034124935924,117.33556717776031,2.0943951023931953,0.6981317007977318,2.302142085580291e-35,-3.353194664258444e-32,0.0,0.0
