X,61.663552471965026,61.03636759611072,60.42884126434604,59.840728754063555,58.99022689175982,58.717562145171286,58.1900089997585,57.68856694154309,57.2107722581342,56.756625766937425,56.17463515344088,55.91555554249433,55.5256492521608,55.15798169213026,54.806763254616605,54.47055678824801,54.155695548834515,53.85604040645708,53.56092895430608,53.28748501678973,53.031497403299724,52.78645426637868,52.54106873014532,52.32129297078546,52.10244891554207,51.89294166652717,51.69567768469474,51.5030180704149,50.86862058350339,51.133801039079465,50.97823562695375,50.81031553015878,50.65682917215788,50.51493729111473,50.35636145472827,50.2245586255923,50.08693710402293,49.96246981887313,49.84023375717257,49.72063671408301,49.23903988153351,49.145748056686664,49.39716150787956,49.29761534153202,49.205070206544676,49.11498651492848,49.02750532245778,48.03005574729661,48.8711780347702,48.80178116773249,48.732975464031874,48.67322848244982,48.61478058041352,48.565761638248425,48.51886545790193,48.48045788173147,48.4479859930822,48.42945864453531,48.399878239064634,48.385154892002944,48.378642237027904,48.400168068020115,48.39798099127949,48.42221711674558,48.451158243417886,48.50396492145421,48.56306611786988,48.64016594551599,48.73217429210417,48.847036816902545,48.979509051055736,49.14057782576541,49.32784748342103,49.495483813571035,49.8050655419556,50.13459494965366,50.44966472854848,50.88922258994175,51.38169243909605,51.977821485478174,52.65917249784415,53.506658886197435,54.509545734798955,55.726097664001635,57.1891027249468,59.03532718855561,61.3074648113212,64.15125305906906,67.73035203498114
Y,-175.31057236731124,-173.06540143460003,-170.86300075206262,-168.71363484163507,-166.79562796359394,-164.63928439607355,-162.69476520425022,-160.83335183350053,-159.04444587625034,-157.33135524085625,-155.86531805526946,-154.1034208925678,-152.5859028965451,-151.13727132655393,-149.73513819947792,-148.38538463358105,-147.1026238701936,-145.84880713207284,-144.6353176646514,-143.48123332806387,-142.35726986011773,-141.2682742281061,-140.20939602308104,-139.1864920227976,-138.18737325991876,-137.2157737013436,-136.274400426853,-135.35130259666218,-134.4108924772826,-133.5663584694853,-132.71255137200947,-131.86630975118004,-131.04374873984432,-130.23158784001572,-129.42467771680177,-128.65074307396821,-127.87091573712699,-127.11531564682181,-126.367170911039,-125.62346328612081,-124.97889170148802,-124.09159490816725,-123.4550356604201,-122.74287656327942,-122.0456131592917,-121.34766654175083,-120.65216527010001,-119.9985715296257,-119.28173665971583,-118.60424120889489,-117.92456771611543,-117.25152675330456,-116.57329431097713,-115.90699965614606,-115.2367631219761,-114.5673997871125,-113.90196826481395,-113.23065393520822,-112.56017933804092,-111.88649653808727,-111.21207669829603,-110.5459082098298,-109.86886500518449,-109.19503460737103,-108.50939706063808,-107.83394969434123,-107.14963461160303,-106.46773803377559,-105.77915093686467,-105.09407314624356,-104.40379092132949,-103.71671021349489,-103.03040498549105,-102.31789742420582,-101.6598946844194,-100.99654298119295,-100.30754684018089,-99.68490751436819,-99.06419555054696,-98.48186655520887,-97.91793624485186,-97.43279710409337,-97.0097413565348,-96.6861705402491,-96.47060124730561,-96.46790627603262,-96.65341330876232,-97.13680146522395,-97.98513455419803
W1,0.9998476951563913,0.9993908270190958,0.9986295347545739,0.9975640502598243,0.9961946980917455,0.9945218953682734,0.9925461516413221,0.9902680687415704,0.9876883405951378,0.9848077530122081,0.981627183447664,0.9781476007338057,0.9743700647852352,0.9702957262759965,0.9659258262890683,0.9612616959383189,0.9563047559630354,0.9510565162951536,0.9455185755993168,0.9396926207859084,0.9335804264972017,0.9271838545667874,0.9205048534524404,0.913545457642601,0.9063077870366499,0.898794046299167,0.8910065241883679,0.882947592858927,0.8746197071393959,0.8660254037844387,0.8571673007021123,0.8480480961564261,0.838670567945424,0.8290375725550417,0.8191520442889919,0.8090169943749475,0.7986355100472928,0.7880107536067221,0.7771459614569709,0.7660444431189781,0.7547095802227721,0.7431448254773942,0.7313537016191706,0.7193398003386512,0.7071067811865476,0.6946583704589974,0.6819983600624986,0.6691306063588583,0.6560590289905073,0.6427876096865394,0.6293203910498376,0.6156614753256583,0.6018150231520484,0.5877852522924731,0.5735764363510462,0.5591929034707468,0.5446390350150272,0.529919264233205,0.5150380749100544,0.5000000000000001,0.4848096202463371,0.46947156278589086,0.45399049973954686,0.43837114678907746,0.42261826174069944,0.40673664307580026,0.39073112848927394,0.37460659341591196,0.3583679495453004,0.3420201433256689,0.3255681544571568,0.3090169943749475,0.2923717047227368,0.27563735581699916,0.25881904510252074,0.2419218955996679,0.22495105434386492,0.20791169081775948,0.19080899537654492,0.17364817766693041,0.15643446504023092,0.13917310096006572,0.1218693434051475,0.10452846326765347,0.08715574274765814,0.06975647374412547,0.05233595624294397,0.03489949670250108,0.017452406437283376
W2,0.01745240643728351,0.03489949670250097,0.052335956242943835,0.06975647374412532,0.08715574274765817,0.10452846326765347,0.12186934340514749,0.13917310096006544,0.15643446504023087,0.17364817766693036,0.1908089953765448,0.20791169081775931,0.224951054343865,0.24192189559966773,0.25881904510252074,0.27563735581699916,0.29237170472273677,0.30901699437494745,0.32556815445715664,0.3420201433256687,0.35836794954530027,0.374606593415912,0.3907311284892737,0.4067366430758002,0.42261826174069944,0.4383711467890774,0.45399049973954675,0.4694715627858908,0.4848096202463371,0.49999999999999994,0.5150380749100542,0.529919264233205,0.5446390350150271,0.559192903470747,0.5735764363510462,0.5877852522924731,0.6018150231520483,0.6156614753256583,0.6293203910498374,0.6427876096865394,0.6560590289905072,0.6691306063588582,0.6819983600624985,0.6946583704589973,0.7071067811865475,0.7193398003386511,0.7313537016191706,0.7431448254773942,0.754709580222772,0.766044443118978,0.7771459614569709,0.788010753606722,0.7986355100472928,0.8090169943749475,0.8191520442889918,0.8290375725550417,0.8386705679454239,0.8480480961564261,0.8571673007021122,0.8660254037844386,0.8746197071393957,0.8829475928589269,0.8910065241883679,0.898794046299167,0.9063077870366499,0.913545457642601,0.9205048534524403,0.9271838545667874,0.9335804264972017,0.9396926207859084,0.9455185755993168,0.9510565162951536,0.9563047559630355,0.9612616959383189,0.9659258262890683,0.9702957262759965,0.9743700647852352,0.9781476007338057,0.981627183447664,0.984807753012208,0.9876883405951378,0.9902680687415704,0.9925461516413221,0.9945218953682734,0.9961946980917455,0.9975640502598243,0.9986295347545739,0.9993908270190958,0.9998476951563913
