Type,0
T,101
nz,6
Mod,1.0,1.0,1.0,1.0,0.5,0.5,0.5,0.5
w,0.5,0.5
Sstart,0.012619412649009523,-0.00021453361620096893,-0.0065219996040882305,0.0040503368175377474,-0.003917873702510205,-0.023353611153912046,-0.0012732990285830386,-0.018742939455139628,-0.01607758351434249,0.012985431521879757,-0.011190419595018842,-0.03061694291007127,-0.017377857452053603,-0.02770926179710996,-0.03578136254978473,-0.022052418821829917,-0.04504589725751863,-0.04554013540301437,-0.08236248722429584,-0.09254265446611024,-0.07868514777510183,-0.08893158087387312,-0.08740671333357286,-0.09282610355779178,-0.10408047567688292,-0.09657286361122962,-0.11059798273481512,-0.112285989759982,-0.12627504954097887,-0.11595867362414791,-0.10298519708746827,-0.11501267533432323,-0.11144519879346447,-0.10796777438027803,-0.10608166330110484,-0.06855326649011038,-0.05766737040872237,-0.04766337976324816,-0.04569462699569657,-0.03703568027086946,-0.0285091321951217,0.003104653217253067,0.03490065147940397,0.0564393702997827,0.0760502861173188,0.10273089832504827,0.1230251712411514,0.15192052322570748,0.18284648985060795,0.23440400533383737,0.27237688792433185,0.3338152461162008,0.3651838272733903,0.3994299720000674,0.445069272729576,0.48339848967592036,0.5370464267730861,0.5910385249191343,0.6483554499476906,0.7078493418408619,0.7535580710228607,0.7957585521093709,0.8556545612067905,0.9103674965550269,0.9555087752368621,1.0106897673573585,1.0770217456594784,1.1321805864286518,1.1735620631770578,1.247705537797356,1.3020291361099894,1.3368054390744766,1.4195855533090298,1.4621858098223426,1.4890940361756113,1.554322423145756,1.5899059998973453,1.6365983992468456,1.6887934869054704,1.7330586232621428,1.7800804078106538,1.8109750772937998,1.8472616397282848,1.8715606057037821,1.9102149908915826,1.9483769492319294,1.9588215541249834,1.985369989282187,1.99857931256791,2.032832953098888,2.038614958225273,2.039698597478947,2.0596949767281094,2.097813291650655,2.092917324070852,2.092886089046868,2.0941195631967586,2.108994723273439,2.1010289359296044,2.0874681101722286,2.093398458702208
Sgoal,-0.005602837238554588,7.29496192602068,13.741807006468624,19.32995106305546,24.20370424746484,28.323799169051835,31.72995128552568,34.512144592913,36.65407591874995,38.2242265091094,39.27834174036768,39.79175611783733,39.87193305199026,39.48946761248483,38.73472843762118,37.56215968590902,36.11445000565251,34.322039937039186,32.27517281564161,29.966898433581918,27.45459271467395,24.74929143872231,21.87321726875837,18.855417081685257,15.74594262039652,12.518058471462085,9.222839092037582,5.880468585445802,2.5569121327139803,-0.8237244046390048,-4.1546343919492985,-7.4877498616471225,-10.7331407627299,-13.943445694898609,-17.045396322221485,-20.041752916173824,-22.929360951693468,-25.728800762398787,-28.341432028897877,-30.803523053830276,-33.13235747636522,-35.27920218138184,-37.24977178393914,-39.02473112368826,-40.63656031483519,-42.01185484822156,-43.17871613580029,-44.150351466064045,-44.928412626996234,-45.43961085956773,-45.77206415226785,-45.85047547904901,-45.75066322424653,-45.4017826430646,-44.842047373949725,-44.074452321714304,-43.102556178988806,-41.89874309367927,-40.51060225018708,-38.93401045098488,-37.161513189090165,-35.19730239709882,-33.08996203938169,-30.791321017531782,-28.337013475591537,-25.781786351418628,-23.059682228270276,-20.23375215556702,-17.306572957393783,-14.302319891979973,-11.19289907898299,-8.065730119131079,-4.883245149570618,-1.713350599409205,1.5033172578589005,4.6323814461214,7.767831248999641,10.84054049278883,13.808865945930545,16.680024673962734,19.421883986780152,21.992829476255512,24.371621471186366,26.53260057227218,28.44869969702421,30.094741404288868,31.46021883053929,32.48821921292579,33.13226454874452,33.42045649064549,33.246940963456986,32.60855951393825,31.462613212561024,29.82097616677668,27.57052731092376,24.734541572613143,21.24998358892215,17.042949468484412,12.146656866394789,6.488154931182673,0.0021915095254419264
X,0.012619412649009523,-0.0016550899194852581,-0.0021319531786070474,0.016946642909103228,0.007364322002635676,-0.005602837238554588,-0.00021453361620096893,-0.017722873522309727,-0.0029428636369116584,0.01726433650523614,-1.5555899432028355,7.29496192602068,-0.0065219996040882305,0.019990671565128317,-0.01748521684617659,0.16284557249645093,-2.8618285981958382,13.741807006468624,0.0040503368175377474,0.0073669344086838675,-0.06739900384611773,0.2881503050612172,-3.90069022262631,19.32995106305546,-0.003917873702510205,0.015124212339842484,-0.10667451369001327,0.5275365173170781,-4.725229200566203,24.20370424746484,-0.023353611153912046,0.013060311563057729,-0.14959832576385473,0.7775307505180952,-5.335515825864847,28.323799169051835,-0.0012732990285830386,0.02050195374926183,-0.19795137067621496,1.0762374255326173,-5.7343770136670456,31.72995128552568,-0.018742939455139628,0.03693032320391097,-0.27334412922290946,1.426096925198583,-5.931582388631575,34.512144592913,-0.01607758351434249,0.06299210855710605,-0.3333978020411346,1.763255942423008,-5.959031800295873,36.65407591874995,0.012985431521879757,0.06192600149298302,-0.3761019573551492,2.1527843054024234,-5.862984460651387,38.2242265091094,-0.011190419595018842,0.08315290281421497,-0.44562018401714876,2.526021666696626,-5.56849166641864,39.27834174036768,-0.03061694291007127,0.12393704854311763,-0.5074199793760278,2.9395238622949567,-5.159593389370398,39.79175611783733,-0.017377857452053603,0.15441242620358334,-0.5348727136616842,3.3187922404762897,-4.611649703236852,39.87193305199026,-0.02770926179710996,0.19639462313016978,-0.6093365024694858,3.7559569759422637,-3.9914813834835563,39.48946761248483,-0.03578136254978473,0.2524126805520759,-0.6273514041624232,4.120462137704972,-3.2683039993178533,38.73472843762118,-0.022052418821829917,0.2646657395556842,-0.6480673703145269,4.502809746197465,-2.4327645835284577,37.56215968590902,-0.04504589725751863,0.31433046389580116,-0.6752459719282626,4.876123090980135,-1.5384644222632313,36.11445000565251,-0.04554013540301437,0.3825023465775678,-0.6871343332110302,5.228206155050083,-0.5578503599314836,34.322039937039186,-0.08236248722429584,0.4137580500237893,-0.6860527696293299,5.5654550556717295,0.43589947542702095,32.27517281564161,-0.09254265446611024,0.4726936952796904,-0.6760912023736289,5.870697809029167,1.525257236970218,29.966898433581918,-0.07868514777510183,0.5343636374912923,-0.6663926659705233,6.151956947115046,2.6315901932645174,27.45459271467395,-0.08893158087387312,0.585677517892268,-0.632603249433444,6.4263787803183545,3.7490791897945543,24.74929143872231,-0.08740671333357286,0.6686574072269842,-0.5858847557527943,6.663467249688179,4.873909543409589,21.87321726875837,-0.09282610355779178,0.7308853472927392,-0.5161164966290159,6.858790626680701,6.027748807330094,18.855417081685257,-0.10408047567688292,0.813687888884796,-0.448630713020165,7.026084565735982,7.176514141822658,15.74594262039652,-0.09657286361122962,0.8843056968038494,-0.40176650764065974,7.165923978762079,8.347025569361257,12.518058471462085,-0.11059798273481512,0.9582542678626838,-0.31987080314153027,7.2773069556208245,9.451158030796178,9.222839092037582,-0.112285989759982,1.0350244435972282,-0.19174637902753072,7.353078847006645,10.548479429467635,5.880468585445802,-0.12627504954097887,1.1070590184825437,-0.09027749892534453,7.403266369288042,11.60629317270182,2.5569121327139803,-0.11595867362414791,1.1740286922941363,0.035036895417075026,7.403574224921338,12.66239742588707,-0.8237244046390048,-0.10298519708746827,1.2384961656956954,0.161753141966711,7.380936841229386,13.673000874077205,-4.1546343919492985,-0.11501267533432323,1.319568152022074,0.31948420805457756,7.325058296211986,14.606320503375187,-7.4877498616471225,-0.11144519879346447,1.404016338578556,0.4600987155636763,7.250770909717471,15.482088040829764,-10.7331407627299,-0.10796777438027803,1.4750033523432127,0.6330306333632546,7.104028504639941,16.314378329327543,-13.943445694898609,-0.10608166330110484,1.5393039086777152,0.7800695924270227,6.972393857971158,17.1129827501903,-17.045396322221485,-0.06855326649011038,1.5974117149893108,0.9778964427554047,6.776952998007231,17.80997124925556,-20.041752916173824,-0.05766737040872237,1.665350407339215,1.1385575740160356,6.545717385238711,18.437626745948744,-22.929360951693468,-0.04766337976324816,1.7376180382502426,1.3215186805986994,6.322911138111769,18.997465863816384,-25.728800762398787,-0.04569462699569657,1.8088330598712348,1.5176083348063782,6.033469328838025,19.484414384478132,-28.341432028897877,-0.03703568027086946,1.851044707879977,1.737276936506629,5.738387943615912,19.869032540813144,-30.803523053830276,-0.0285091321951217,1.904104691205298,1.9156570014913936,5.422377089543631,20.196006850718646,-33.13235747636522,0.003104653217253067,1.9610600061044126,2.127789276763838,5.082572973454614,20.429496570436118,-35.27920218138184,0.03490065147940397,2.023295187233523,2.3248674147554964,4.717096613678494,20.55516277023,-37.24977178393914,0.0564393702997827,2.0479322453852378,2.5273656786489993,4.34344647540175,20.636860603763587,-39.02473112368826,0.0760502861173188,2.093838644909785,2.7499332985615035,3.9312649320818416,20.593824933843706,-40.63656031483519,0.10273089832504827,2.129053221796692,2.9392813648718588,3.527552792692942,20.459188729348675,-42.01185484822156,0.1230251712411514,2.1665309082814157,3.158863124779693,3.097566449688609,20.237969643279964,-43.17871613580029,0.15192052322570748,2.1899490069600547,3.342206287376301,2.6638460941411406,19.947330479325807,-44.150351466064045,0.18284648985060795,2.2117671269992316,3.5357532182371294,2.2081661052318706,19.522726955079047,-44.928412626996234,0.23440400533383737,2.252893076620321,3.752022526597693,1.7746234145649213,19.02693528189825,-45.43961085956773,0.27237688792433185,2.251018728855337,3.9264258170212707,1.3246137486218479,18.461205936020228,-45.77206415226785,0.3338152461162008,2.2565250579467726,4.115938038526939,0.8571652635900718,17.766307228421415,-45.85047547904901,0.3651838272733903,2.2726764876365153,4.262223933079571,0.40333265043951433,17.021152098369345,-45.75066322424653,0.3994299720000674,2.2797790752367013,4.4479809050390005,-0.07806558975004549,16.169036569102445,-45.4017826430646,0.445069272729576,2.271141674562692,4.578328516590767,-0.5285523442370862,15.212437480353415,-44.842047373949725,0.48339848967592036,2.253073858848722,4.761564014018145,-0.9596738444089259,14.232978548691765,-44.074452321714304,0.5370464267730861,2.2742414848008172,4.9008156073626425,-1.414017709301662,13.162918660023086,-43.102556178988806,0.5910385249191343,2.2392841958611545,5.011208006408913,-1.8230350915061233,12.019117967644044,-41.89874309367927,0.6483554499476906,2.2189331870703044,5.1314969498312335,-2.232100681638127,10.776638998508307,-40.51060225018708,0.7078493418408619,2.1831493232065387,5.228082610388934,-2.632323061050624,9.492924854341288,-38.93401045098488,0.7535580710228607,2.1769827504300423,5.322691418495725,-3.018135947459458,8.13063663252864,-37.161513189090165,0.7957585521093709,2.1426249950707748,5.390887237596785,-3.36855268947219,6.720725185434345,-35.19730239709882,0.8556545612067905,2.0897386974960086,5.448122999304259,-3.727138250897221,5.249218193864196,-33.08996203938169,0.9103674965550269,2.0560048398435873,5.502157656662576,-4.027820974044674,3.773959220610457,-30.791321017531782,0.9555087752368621,2.0302545151217526,5.5063050739666215,-4.328148171475223,2.2228828936475855,-28.337013475591537,1.0106897673573585,1.9708436103292528,5.562966915589482,-4.597088513070752,0.6668054465696057,-25.781786351418628,1.0770217456594784,1.9373505250931857,5.545425438168106,-4.841199664242403,-0.9255009566318018,-23.059682228270276,1.1321805864286518,1.874665816554099,5.525565349087069,-5.06966898909233,-2.5683106653343986,-20.23375215556702,1.1735620631770578,1.8170379004712296,5.491615791180164,-5.264566854507799,-4.189842486910336,-17.306572957393783,1.247705537797356,1.7772379704764012,5.447022491311638,-5.415760720535717,-5.832508337959717,-14.302319891979973,1.3020291361099894,1.7039732033784047,5.372354565556464,-5.5365447775111765,-7.455450328504154,-11.19289907898299,1.3368054390744766,1.6486689696100612,5.2926975945306465,-5.640660042962111,-9.0649676633471,-8.065730119131079,1.4195855533090298,1.5980187164273822,5.189488379938036,-5.692215292101955,-10.669774872695827,-4.883245149570618,1.4621858098223426,1.5425879081040923,5.083131010386451,-5.734843847984049,-12.229469062935856,-1.713350599409205,1.4890940361756113,1.4858382569568442,4.924259536429762,-5.710865328545886,-13.763910197176731,1.5033172578589005,1.554322423145756,1.4291495721920453,4.777428702352916,-5.682122594438585,-15.2370615025933,4.6323814461214,1.5899059998973453,1.3760175563755235,4.651784506545676,-5.62140298166978,-16.678534870956224,7.767831248999641,1.6365983992468456,1.3215767693382907,4.451178417792822,-5.5574628107681825,-18.005972464859205,10.84054049278883,1.6887934869054704,1.2597980414765508,4.288311226925953,-5.413639246889756,-19.26410515536164,13.808865945930545,1.7330586232621428,1.1973555551240858,4.079681827983452,-5.2682074603199345,-20.434844478512026,16.680024673962734,1.7800804078106538,1.140751884767455,3.884470253761505,-5.102596532583288,-21.500740271453743,19.421883986780152,1.8109750772937998,1.1065304266088174,3.6421997690581502,-4.900465389435686,-22.47139447082926,21.992829476255512,1.8472616397282848,1.0608455932826972,3.4096066654713506,-4.667251775780151,-23.295962018087963,24.371621471186366,1.8715606057037821,1.0106120335811708,3.1983720868834693,-4.397946176254728,-23.96076093386388,26.53260057227218,1.9102149908915826,0.9658279105421925,2.9536885067443706,-4.116012698976297,-24.496107461306824,28.44869969702421,1.9483769492319294,0.9312543612319771,2.7072619407669025,-3.8232799190734625,-24.862448579854505,30.094741404288868,1.9588215541249834,0.896081570743229,2.4572322960129855,-3.5224269926062495,-25.046603061359917,31.46021883053929,1.985369989282187,0.8747467123022461,2.20759993082286,-3.2049564167463096,-25.028402602015124,32.48821921292579,1.99857931256791,0.8423112220960087,1.9481838271205187,-2.870323163320571,-24.782543818590884,33.13226454874452,2.032832953098888,0.8269872356984557,1.7173413115141756,-2.5415482775727476,-24.35254902568436,33.42045649064549,2.038614958225273,0.7749074139579573,1.4578928643794564,-2.1700641856233327,-23.647113465059384,33.246940963456986,2.039698597478947,0.7671671778697139,1.239594136132358,-1.8833481686353946,-22.72059828803511,32.60855951393825,2.0596949767281094,0.7403241337479399,1.0181062904337286,-1.5472536261940846,-21.50100383787026,31.462613212561024,2.097813291650655,0.7335099601246885,0.8112725137912414,-1.2558422288432936,-19.984779612459217,29.82097616677668,2.092917324070852,0.7227512709499054,0.6127300691976744,-0.9386093441847109,-18.176657011758937,27.57052731092376,2.092886089046868,0.7106705843449321,0.45591438872635415,-0.688139832765335,-16.06075559062207,24.734541572613143,2.0941195631967586,0.713767187077387,0.29078354889459324,-0.4761919907989696,-13.600189690428705,21.24998358892215,2.108994723273439,0.6869707500185694,0.18100313818468888,-0.2914373838038922,-10.794435464024767,17.042949468484412,2.1010289359296044,0.7135173164428928,0.06807995319126631,-0.13743787409210556,-7.583099773678959,12.146656866394789,2.0874681101722286,0.7071222002839385,0.003331115772240656,-0.02911089830220012,-3.996005654449651,6.488154931182673,2.093398458702208,0.699231636044116,0.007889972361598914,0.006936664332947031,0.005386989546385518,0.0021915095254419264
