Type,0
T,201
nz,6
Mod,1.0,1.0,1.0,1.0,0.5,0.5,0.5,0.5
w,0.8320502943378436,0.5547001962252291
Sstart,0,0,0,0,0,0
Sgoal,2.0943951023931953,0.6981317007977318,0.0,0.0,0.0,0.0
X,-6.03616713193964e-38,0.0,0.0,0.0,0.0,0.0,-6.03616713193964e-38,0.0,0.0,0.0,-51.80077029969292,154.7731004422397,-6.03616713193964e-38,7.748171083536145e-31,-0.25771527512285036,0.7700154250857696,-49.93676910237109,149.67613269448583,-0.0012821655478748772,0.0038309225128645256,-0.5061569124480797,1.5146728016752515,-48.070575460967916,144.57414375853216,-0.00380035914214393,0.011366608093338412,-0.7453140042936912,2.233947148732625,-46.19344256463765,139.44778409258012,-0.007508389014251846,0.0224807730124062,-0.9751321265058188,2.9277172188449643,-44.292228816990594,134.26842139927865,-0.012359792628708656,0.03704653032009259,-1.1954914738540308,3.5957193153587883,-42.34755807075397,128.99285506480672,-0.018307511404101844,0.05493568114277313,-1.4061758423652444,4.237474813193648,-40.34057427093691,123.58090804705951,-0.025303411117361767,0.07601764538751765,-1.6068752168475178,4.852305201487476,-38.247662424679106,117.98022525374556,-0.033297815181279763,0.10015846728546529,-1.7971620945822397,5.43927149628223,-36.049074397592605,112.1490140271463,-0.04223892012945012,0.1272195195057749,-1.976510723425984,5.997226789949624,-33.72819463922105,106.0534655573889,-0.05207230681316148,0.15705646870950438,-2.1443126868051934,6.524855971827181,-31.271240648615525,99.66653130755445,-0.06274052913557537,0.18951843871859483,-2.2998909984898477,7.020709361417005,-28.668643503650003,92.97072042462001,-0.0741827729091567,0.22444734101420183,-2.442521065672186,7.48325025905193,-25.922657387801973,85.9781143808571,-0.08633461900702828,0.26167744180550495,-2.5714895103876185,7.911002071892015,-23.03993867946597,78.7103171304321,-0.09912809915821046,0.30103566106864926,-2.6861160709819765,8.302595689456354,-20.034296586429715,71.20559774874272,-0.11249186070538447,0.34234210728485004,-2.785789188327398,8.65685239467398,-16.93022317132322,63.52784075832969,-0.12635150840850584,0.38541102467128774,-2.8700191543538818,8.9729113039194,-13.758998116790767,55.75661184565846,-0.1406302106689729,0.43005237444203104,-2.9384718813030895,9.250307382753522,-10.555396446503249,47.97862186587004,-0.15524947376003306,0.476073804206974,-2.9909862914846976,9.489006994026507,-7.358283682575141,40.28936473182143,-0.17013000257338975,0.5232827942270063,-3.027594668014922,9.689451594682335,-4.207294784739829,32.7852729666842,-0.18519266261326497,0.571489021066222,-3.048526482864374,9.852562405461859,-1.1413607308279092,25.55995480245692,-0.2003594610354758,0.6205067444764799,-3.0542048944605327,9.979726359702939,1.806760120744705,18.690405651488806,-0.21555451026164762,0.6701571243754995,-3.04521603813842,10.072713452496414,4.607865848967447,12.244329843419544,-0.23070483880959997,0.7202701266267254,-3.022291332422164,10.133630516394023,7.237346612886066,6.277796257057264,-0.24574111409528238,0.7706861988475913,-2.9862846328555666,10.164863333593313,9.683100834873,0.814447613266462,-0.2605982515721757,0.8212576582187023,-2.938110001836298,10.168915311768767,11.933279497271464,-4.121605879203511,-0.2752157142678787,0.8718492766852135,-2.8787404520986293,10.148409809882184,13.986881541111227,-8.534156616414569,-0.2895378060693644,0.9223388777294035,-2.8091539767697173,10.105951319253256,15.845794624059028,-12.433896578373755,-0.30351369650105453,0.9726172425018077,-2.7303191776450455,10.044091137271296,17.516528130755837,-15.842518327970675,-0.3170973740017762,1.0225878451747992,-2.643172271521882,9.965272638127164,19.00840956869823,-18.788834412475644,-0.3302474848053676,1.0721663160112527,-2.5486030696875623,9.871795850005395,20.334511001975788,-21.310781465030946,-0.3429271020674948,1.1212797282003344,-2.4474363482846977,9.765772061622156,21.50785146411215,-23.44608477377487,-0.3551034023077172,1.169865658855171,-2.340432112144837,9.649124873692928,22.54171755392002,-25.232500236081258,-0.36674734316415913,1.217871255241703,-2.228284263617871,9.523590046647747,23.449887949194974,-26.709208576917227,-0.3778333345254421,1.2652523002499008,-2.1116181544178962,9.390708411936718,24.24651947433392,-27.916652112836953,-0.3883388974827451,1.3119722425978446,-1.990988704296832,9.251819595454942,24.94306745874408,-28.88771295317739,-0.3982443139220328,1.3580011958090632,-1.8668938413180056,9.108099630513761,25.550944367691503,-29.655536822527328,-0.4075323429833164,1.403315124319082,-1.7397747151105853,8.960559646322084,26.08070243920809,-30.25137158270779,-0.41618793858088154,1.4478950230570027,-1.6100199766070624,8.810055310089705,26.53990436812206,-30.69810500520325,-0.4241979882157425,1.4917261440027227,-1.4779806513925249,8.657328419516555,26.936764388937704,-31.021109288793387,-0.43155112578485955,1.5347974296719593,-1.3439668982137305,8.50299454245788,27.278022475735,-31.241896541140843,-0.43823752826353485,1.577100885107073,-1.2082553436080836,8.347562221357677,27.568987737791158,-31.378024115779763,-0.4442487488785004,1.618631045412335,-1.0710962006339984,8.191452648642356,27.8134785796729,-31.44337847723316,-0.44957758569757506,1.659384541176725,-0.9327206853122425,8.03501792985015,28.015200554564185,-31.451555918226653,-0.4542179871170389,1.699359754758069,-0.7933415780756048,7.878542527271909,28.17760513849057,-31.415646931825165,-0.4581649601422907,1.7385564837494716,-0.653154487834358,7.7222457763673065,28.30254501802531,-31.343980186513985,-0.461414484957387,1.7769756169652293,-0.5123458061526402,7.566305576434401,28.39164862504875,-31.244799319837238,-0.46396346906759917,1.8146189282907736,-0.37109382294344245,7.410858813649141,28.44638487486522,-31.12525787156526,-0.4658097069926909,1.8514888726372867,-0.22956952008341647,7.256006784437374,28.467496029792173,-30.990872003757104,-0.46695184390852884,1.8875884088782686,-0.0879401866018634,7.101823341632612,28.45581338899784,-30.846384240085275,-0.46738935727470726,1.9229208633142518,0.05363102428867311,6.948358743423232,28.411515461826948,-30.69488154069414,-0.4671225362583457,1.9574898122865065,0.19498184748184202,6.795647889986943,28.33503050883164,-30.53955675172158,-0.46615247731564996,1.9912990057690287,0.3359521485208054,6.643709796694796,28.226397989377336,-30.382442022535507,-0.46448107359166585,2.02435228833965,0.4763819892639762,6.492553368721983,28.086138440872727,-30.225737734046646,-0.4621110139435864,2.056653548880555,0.6161140213081191,6.342176564074984,27.914274409032025,-30.070864343361784,-0.45904577005648134,2.088206666114759,0.7549910084177311,6.192570273809503,27.71101724537727,-29.917772693205016,-0.4552895958852488,2.1190154734471442,0.892856765857419,6.043725633544802,27.476662977797037,-29.767319840701905,-0.4508475224232716,2.149083760181198,1.0295565816673546,5.8956295149343445,27.211979532313254,-29.620130727306147,-0.4457253503751753,2.1784152503052496,1.1649395644151816,5.748265680470134,26.917314151237616,-29.476251896946238,-0.4399296311492291,2.2070135870240066,1.2988565502422345,5.601617661082342,26.59309547575125,-29.33389501358066,-0.43346765826245187,2.234882331606506,1.4311605078330367,5.4556778848953735,26.24065035254879,-29.19451006388199,-0.4263474567309442,2.2620250076507613,1.5617110070994487,5.310431566169592,25.860857135462147,-29.05703681811188,-0.4185777502279619,2.2884450651938937,1.6903719878728922,5.16586919394018,25.454901541707912,-28.921248722859346,-0.41016793934302215,2.3141459069547903,1.8170132890754191,5.0219823843737155,25.02401413829672,-28.786212643918518,-0.40112807223319413,2.339130893941724,1.9415108718530147,4.8787673960955145,24.56958719694746,-28.651480873100493,-0.3914688141642737,2.363403368549165,2.063747624076634,4.736222715134815,24.093146493601388,-28.516534360960257,-0.38120141304946453,2.3869666656393878,2.1836140245423126,4.594349409856406,23.596225360744782,-28.380330934586325,-0.3703376616835824,2.4098241253899175,2.301008180565918,4.453153733564932,23.081077242435548,-28.244159910276665,-0.35888985979021965,2.4319791190892452,2.4158394106277865,4.312635525056093,22.548992126470772,-28.10647172305664,-0.3468707582448078,2.453435017223853,2.5280234510579893,4.1728023324040695,22.001628548505465,-27.96608054433575,-0.33429352714501676,2.474195227832828,2.6374842896077677,4.033667603327772,21.44098845174651,-27.823235342680558,-0.3211717147589085,2.494263225859335,2.7441558739448153,3.8952435468965256,20.869125062935577,-27.67872492800319,-0.3075191979731134,2.5136425469881734,2.847982366795241,3.7575384477522316,20.287717877627067,-27.53171999054445,-0.2933501314716445,2.5323367681212687,2.9489162865844305,3.6205647164559904,19.698367858049114,-27.382263994510204,-0.2786789061652543,2.5503495279046318,3.0469181167239783,3.484334547329074,19.10305279920661,-27.23081989809487,-0.2635201095646375,2.567684525652538,3.1419581804016232,3.3488578314181545,18.503537998998926,-27.077735797964785,-0.24788847682632095,2.5843455098884496,3.2340155833817175,3.214142727945693,17.901191779331107,-26.92288639248292,-0.23179884705825268,2.600336269728975,3.32307623900028,3.0801980195253797,17.297339469571043,-26.765981320541734,-0.21526612945128612,2.6156606379853202,3.4091326542717777,2.9470339333535303,16.693837454917265,-26.60834599298504,-0.1983052704748096,2.6303224983502633,3.4921865719579332,2.8146541025426592,16.09185093732733,-26.45049052031234,-0.18093120792775522,2.644325752591769,3.572245531845134,2.6830596223421006,15.492648487655947,-26.29316802736336,-0.16315884209767992,2.6576743079268046,3.6493233850175515,2.5522478411114373,14.896982973665517,-26.135324918691307,-0.1450030043612742,2.6703720583800954,3.7234377281701163,2.422221348978645,14.306099634749506,-25.978942228272082,-0.12647843854948257,2.6824229108625763,3.7946123532186213,2.292972880181271,13.72110444245458,-25.824596582800847,-0.10759977012550932,2.69383073613711,3.8628765544248633,2.164492300167337,13.142447129858414,-25.672241290089286,-0.08838147880996274,2.704599354545903,3.9282618635286366,2.036769706684306,12.571215871772838,-25.523556819958127,-0.06883788744912375,2.7147325371662228,3.99080522607477,1.9097868369332704,12.00762935689062,-25.37844604364663,-0.048983135080592564,2.724233964215642,4.050544675611539,1.7835259113429889,11.452465568009849,-25.237907064746263,-0.02883117152033615,2.7331072274561543,4.107522116248404,1.6579641846527087,10.90579956305123,-25.101751639924785,-0.008395738106164983,2.741355805489252,4.161779825517316,1.5330798481356702,10.368331070418886,-24.97152295646421,0.01230963416009032,2.7489830684153005,4.213363562186067,1.408843415516445,9.84012997214313,-24.847333341346836,0.033271641932160305,2.7559922396367758,4.262319432694241,1.2852248416788987,9.321366688907355,-24.729587457904273,0.05447721124904707,2.762386393077964,4.3086943913455205,1.1621920682564895,8.812456440807887,-24.61977761331492,0.07591350175325365,2.768168443168792,4.352537458215212,1.0397056124688528,8.312891006556756,-24.516437838626842,0.0975679169682547,2.7733411079074433,4.3938951249145,0.9177332849134956,7.823218391640624,-24.42163115391114,0.11942809171907312,2.7779069451458187,4.432816609450025,0.796232632406475,7.343268392770465,-24.33551635759101,0.14148190569643643,2.7818683015259507,4.469350283045898,0.6751604117219426,6.8725424313056305,-24.256909749551625,0.16371747924392846,2.785227308549443,4.503542036435478,0.5544792686893475,6.411657512869544,-24.18815476381518,0.18612316101723927,2.7879859118762558,4.535440830031844,0.4341401902624063,5.959701615735347,-24.12701105030878,0.2086875432562037,2.7901458133203474,4.5650910868265475,0.31410530941509895,5.517196442357819,-24.076277668866517,0.23139943921056463,2.791708526302512,4.592539825345741,0.19432283345058896,5.08339562414402,-24.0337871184585,0.25424789605308074,2.7926753065684355,4.617830350838995,0.07475175325925312,4.658454855893347,-24.00048818492152,0.27722217640551355,2.7930472058383824,4.641006743156872,-0.0446536605960778,4.2420485119504,-23.976409251706105,0.3003117621923636,2.792825048322979,4.6621114621218,-0.16393927876376987,3.8338201304958326,-23.960846846585863,0.32350634658102934,2.7920094300206717,4.681185194114316,-0.2831474720303662,3.433790823652751,-23.95404962094204,0.3467958251587125,2.790600736129973,4.698268730550399,-0.40232184825395845,3.0414794255752886,-23.955479231831532,0.3701702964549831,2.788599134894879,4.713400468986097,-0.5215033369695382,2.6567231855737474,-23.96452862765781,0.3936200500320284,2.7860045909298563,4.726617997272534,-0.6407298475549004,2.279403474617593,-23.981565906112902,0.41713556245626987,2.7828168802455036,4.737958313066652,-0.7600411207196411,1.909438901745536,-24.00568743414168,0.44070749436207407,2.779035581137445,4.7474580090952365,-0.8794724014865152,1.5463413561229518,-24.035868827638957,0.4643266884371748,2.7746600965529353,4.755151249672963,-0.9990538384399429,1.1899870280238574,-24.07197529488294,0.48798415734102035,2.7696896794462686,4.761071583145719,-1.1188149095587634,0.8405820382964068,-24.113679731386867,0.5116710806402528,2.764123436115131,4.765253583336247,-1.2387834654363101,0.4978129206820154,-24.159792960712785,0.5353788099105824,2.75796033429704,4.767730264533671,-1.3589814403652294,0.1616299392231672,-24.209714753030035,0.5590988609779141,2.7511992326036805,4.768534393584532,-1.4794277824201052,-0.16813225957893305,-24.262215969154305,0.5828229126872899,2.7438388953777095,4.767697914681155,-1.6001353245552012,-0.4911935712701957,-24.317374277477313,0.6065428028100817,2.735878023116241,4.765254165570358,-1.7211172861346904,-0.8075695891152759,-24.373866050897853,0.6302505349770984,2.7273152505484064,4.76123640642053,-1.8423803013132867,-1.1172126393822455,-24.43087741682313,0.6539382782926234,2.7181491793975945,4.755678134582808,-1.9639269551283272,-1.419984713962386,-24.48680329706718,0.6775983685144285,2.708378398526309,4.74861353401583,-2.085751847153537,-1.7155527343365373,-24.541481394140625,0.701223311469731,2.698001523664849,4.740078445785301,-2.2078487695124456,-2.003589765945213,-24.594159997605164,0.7248057912995087,2.6870172014284686,4.730110337497016,-2.3302077744756553,-2.284264871095966,-24.642020163362073,0.7483386785507377,2.6754241279236144,4.718745835650767,-2.4528048897162624,-2.5565592212891,-24.686645244421076,0.7718150259917862,2.6632211185220407,4.706026635544852,-2.5756240202855216,-2.8205491703889236,-24.72450458464721,0.7952280938303177,2.650407068669874,4.691994052607593,-2.698631505781279,-3.0756249139747616,-24.756047062623797,0.8185713478233904,2.6369810412779278,4.676692436120157,-2.8217959190281636,-3.321195036698274,-24.780091763248414,0.8418384743712518,2.622942255611121,4.660169077728623,-2.9450799576512896,-3.5567743582435414,-24.795859777171255,0.8650233951559713,2.6082901165183285,4.642473682911492,-3.0684424441048783,-3.7819959922493602,-24.801490241485187,0.8881202791505558,2.5930242337118363,4.623657782452539,-3.191832942818735,-3.996086506456207,-24.796387453653946,0.911123551700071,2.5771444678271664,4.603776755057234,-3.315198054528456,-4.198674692815051,-24.779228861673893,0.9340279136655298,2.5606509451678208,4.5828878262372585,-3.438477800108923,-4.388851850709386,-24.75010394662565,0.9568283506119838,2.543544090440911,4.561052742402884,-3.5616126456145234,-4.5663921149437465,-24.70734730717619,0.9795201553005554,2.5258246245423313,4.5383343736718205,-3.6845347715208723,-4.730473709888907,-24.650516872107694,1.0020989332790222,2.5074936057785457,4.514799678597746,-3.8071741589442936,-4.880691944821831,-24.578522524240466,1.0245606232222946,2.488552440808674,4.490517629121021,-3.9294553655325544,-5.016525604354969,-24.491012315920145,1.0469015069492649,2.46900291162692,4.465559790293384,-4.0513011979500675,-5.137622994215271,-24.386626393081958,1.069118222323859,2.448847184273934,4.439999476889328,-4.172627697418137,-5.243707824068651,-24.265140992033853,1.091207771960124,2.4280878424957346,4.413911378262121,-4.293349791905868,-5.334451941708044,-24.125896700656515,1.1131675300609307,2.4067278932822727,4.387371816363076,-4.413379128725055,-5.40942060775094,-23.9691070732857,1.1349952505403489,2.384770783189113,4.360459276026007,-4.532628417646873,-5.468938374652087,-23.79331450606942,1.1566890777842593,2.3622203930515666,4.333250627395897,-4.651003116682045,-5.51329429260728,-23.597361157975456,1.1782475386170748,2.3390810740630985,4.305821302557055,-4.768402923438142,-5.542301114441288,-23.382161768518216,1.1996695351472093,2.315357676434053,4.278247665171775,-4.884732086465596,-5.556320438676487,-23.146864679372882,1.2209543494017954,2.291055526750144,4.250604279904728,-4.999890617208744,-5.556070242198285,-22.890871086740407,1.2421016343764457,2.2661804490525883,4.222962139396278,-5.113775547988547,-5.5422485044938865,-22.613351745975102,1.2631113962639895,2.24073877965961,4.195388763752031,-5.226279785530712,-5.515608676754261,-22.314096506859777,1.2839839771781787,2.214737387691796,4.167947924564198,-5.337295191037477,-5.4773670866291,-21.991982121747917,1.3047200365043687,2.1881836802736987,4.140697342043655,-5.446708037414333,-5.428414825075103,-21.647155531193665,1.325320520793143,2.161085630336314,4.113690303112933,-5.554405328614301,-5.370374842625473,-21.277910203542728,1.3457866417041526,2.133451772980024,4.086972020313802,-5.66026557838317,-5.304749676202654,-20.883577234304422,1.366119835835067,2.1052912477144363,4.060580230879958,-5.76416397258369,-5.233438561661937,-20.462424451628912,1.3863217275309871,2.0766138150150146,4.034543223110496,-5.865967079308212,-5.158048927531492,-20.01375699986186,1.4063940818748204,2.047429899197561,4.008881288147652,-5.965538009655783,-5.080857247977459,-19.535259766762483,1.4263387649004304,2.017750605617184,3.983603391391545,-6.062728356754104,-5.004122405817363,-19.025272637628287,1.446157687245662,1.9875877779716413,3.958707260019319,-6.1573814544537475,-4.929863196462187,-18.4823996889101,1.465852748240783,1.9569540393922693,3.9341805774498555,-6.249333691712007,-4.861375072002656,-17.90184801982592,1.4854257859395386,1.9258628269956923,3.9099946318180017,-6.338397612208653,-4.80098233419866,-17.28213225189862,1.5048784955505734,1.8943285105170422,3.886109147568257,-6.4243783696807855,-4.751645505449845,-16.619596542286136,1.5242123719066343,1.8623664290758444,3.862469120177959,-6.5070629295926565,-4.71645688038914,-15.90994118948055,1.5434286361861267,1.8299929816649356,3.8390041605740333,-6.586216865858729,-4.698897637105062,-15.14838981794344,1.562528159373062,1.7972257335760862,3.815626560389431,-6.661581989331085,-4.701977868207754,-14.331077832422965,1.5815113760914175,1.7640835346241903,3.7922336356719795,-6.732880884019756,-4.729939847799413,-13.450616773772138,1.600378210099736,1.7305866148031968,3.768701596628201,-6.799799375431557,-4.785822538116943,-12.50290046196799,1.619127969286941,1.6967567671642336,3.74489153424951,-6.862002860316971,-4.8736002951953425,-11.481114991785796,1.6377592704523614,1.6626174494512138,3.720644766611722,-6.919122835400482,-4.998253544652209,-10.375497986087332,1.6562699409330166,1.6281939527576792,3.695777833553751,-6.970742228366091,-5.163162240437658,-9.180366912845606,1.6746568953288063,1.593513643163818,3.6700904592232155,-7.016415695594178,-5.373252363343418,-7.886074370834884,1.6929160518423547,1.5586061023897178,3.643357860400611,-7.055649896444103,-5.633021168996618,-6.483409976038176,1.7110422103518106,1.5235033665865132,3.61533287946033,-7.087905667469168,-5.94752149942512,-4.961926117061254,1.7290289410953943,1.4882401543105475,3.58574322025921,-7.112591867056537,-6.321071740255456,-3.3126215597618347,1.7468684596041466,1.4528541251212113,3.5542951021484863,-7.129072571333959,-6.759208529162591,-1.5232295832396283,1.7645515198138404,1.4173861023782564,3.520667199018324,-7.136650827966992,-7.266207050400668,0.4155312144695348,1.7820672770228867,1.3818803768659826,3.484516915185485,-7.134583508492019,-7.847908987150465,2.517098556149346,1.7994031820735608,1.3463849365252263,3.4454725918663285,-7.122060630103217,-8.508468942500299,4.790654092286799,1.8165448367594628,1.3109517990620263,3.403141900610108,-7.098226530141591,-9.253351241510519,7.249554263651342,1.833475890991354,1.2756372392105755,3.35710532726926,-7.0621590959940725,-10.085907240548424,9.901063823964721,1.8501779075449323,1.240502119330008,3.3069266842814566,-7.012900071994247,-11.011690402324714,12.759106687584318,1.8666302791085219,1.2056120692205838,3.252142154916657,-6.949421929269947,-12.03265942374719,15.828050498004002,1.882810090824525,1.1710378307665046,3.1922781776840843,-6.8706754093793805,-13.152789068457718,19.117982518271567,1.898692071808028,1.1368553660432241,3.1268414161494684,-6.775561068492457,-14.373986930170616,22.63377299946967,1.9142484967639954,1.103146106995998,3.0553290433625504,-6.6629552326742,-15.697656178089101,26.379466126552217,1.9294491387707744,1.0699970759876687,2.9772312514317587,-6.5317141076664775,-17.123179408188342,30.353142464710615,1.9442612345490418,1.0375009858997757,2.892041304127339,-6.380703448638067,-18.65060389301555,34.55630931183845,1.9586494997437052,1.0057561926229694,2.7992522300327347,-6.208781511763249,-20.276382396009062,38.98016600691476,1.972576127753818,0.9748667323654409,2.69837470567448,-6.014850337599493,-21.996755132923738,43.61656332999947,1.9860008775332931,0.9449421038201696,2.5889381129733673,-5.797852510087059,-23.80649779766026,48.45291528814844,1.9988811666525637,0.9160970664565524,2.470497825422819,-5.556793230046519,-25.69894313540354,53.47326792306531,2.011172200609891,0.8884513289936344,2.342642386938224,-5.290757071225298,-27.665164095568173,58.656684900352204,2.02282713785834,0.8621291545099264,2.2050047546219647,-4.998932768238471,-29.694058512753898,63.97571381841816,2.033797310766907,0.837258842230133,2.0572731202301537,-4.680645634813505,-31.77828218153938,69.41368548687035,2.0440325004197937,0.8139720480270808,1.899172213854336,-4.335303915973354,-33.90065624381668,74.92780369446302,2.0534811183991684,0.7924033718282084,1.7305122325418152,-3.962528773214831,-36.051874647963906,80.4963761108968,2.062090631993904,0.7726892983296272,1.5511496721041838,-3.562049290076041,-38.21665223461,86.08150492915063,2.0698077945416857,0.7549676600705424,1.3610170739220446,-3.133783096398675,-40.380872166936705,91.64872619587435,2.0765790237651784,0.7393766993919421,1.1601172123949963,-2.6778192844789017,-42.525300403430656,97.1500032343711,2.082350751190029,0.7260542153895595,0.9485485536714607,-2.19448593505417,-44.64044641648037,102.56326517551267,2.0870698982232203,0.7151363749166532,0.7264567804551405,-1.6842209341809726,-46.703481830721344,107.83042887268903,2.0906841110613055,0.7067571662888871,0.4941011494565269,-1.1477511387944601,-48.70090128184994,112.91852648720695,2.0931423257352186,0.701046961618268,0.25180810825329336,-0.5859674249277588,-50.61342975891197,117.77945241047951,2.0943951023931953,0.6981317007977318,-6.387974957593555e-26,3.180627865263821e-26,0.0,0.0
