Type,0
T,101
nz,6
Mod,1.0,1.0,1.0,1.0,0.5,0.5,0.5,0.5
w,0.9,0.1
Sstart,0.012643587820424594,-0.0077267407113544295,-0.02091266327300839,0.0016720571886447548,0.00435519923300866,-0.0053533364591599845,-0.004818142855599126,-0.015147647681982334,-0.02655097534965726,-0.03080552936575432,-0.01230573253895329,-0.047652990447914344,-0.03614260662567381,-0.054115012338547264,-0.061203393174510526,-0.076944753072592,-0.09118138710988785,-0.08740265489885278,-0.11788345815538916,-0.11291145726624537,-0.10683608929004128,-0.13031454218316396,-0.1601835114450312,-0.15954629005800555,-0.16783357411999142,-0.17011257345249003,-0.17031212740645074,-0.1802054772810204,-0.18379172931614224,-0.18208355027388953,-0.19477097741523025,-0.17587743395457872,-0.2012132662389099,-0.207862916367079,-0.20609373496517983,-0.19291646916168279,-0.18183539671034296,-0.1506045121077386,-0.17128705490191165,-0.1569497655759471,-0.14879315748281435,-0.11950287808537728,-0.08869381450510432,-0.08556507759745245,-0.05838600861972568,-0.04197312487379476,-0.0026347615060520174,0.018472123404033713,0.05564756265842256,0.08507995282204309,0.12568675949125296,0.1691694032604079,0.22136606747004942,0.26881036043340584,0.2946509972583211,0.3498177693168222,0.40958000759489555,0.45793804721720927,0.5038539610129291,0.5700437142409627,0.6110555716231455,0.6868963784951322,0.7289008263617107,0.7882374878889994,0.844648338629751,0.931428012745703,0.9862225085820124,1.0444853431008736,1.1060260212254192,1.15434099876496,1.2003341981551399,1.263960922781252,1.323014022681349,1.3901217752472317,1.4411918497636111,1.494852812557186,1.56063132263427,1.5799966268931804,1.6445046548451134,1.6888128581348059,1.7339179374705342,1.7714593670072056,1.8255280761304726,1.8502581280957429,1.8757465742019974,1.9185775777328045,1.9498923176678609,1.9812251350597765,1.9965355225193488,2.0332428030944754,2.045579380711528,2.0451036145347543,2.0516081669756985,2.0887205064604655,2.0903730780129752,2.090819157948385,2.090866726422845,2.097799493686967,2.0827262502136503,2.093190729731701,2.1052227488450916
Sgoal,0.0012587719608593195,9.66178432246755,18.18758287059785,25.618836889688662,31.99104350833375,37.419885157742,41.91100275027521,45.53777783108178,48.33212601962244,50.3894650763471,51.71103350145078,52.37784877314895,52.40247237035132,51.857029456932565,50.78386282342135,49.22083914282907,47.207469815675324,44.773613292422944,42.01314597502173,38.892012164847394,35.50397998716642,31.87449213262785,27.995573388172666,23.93853323582683,19.75639894208352,15.460878029324052,11.048870582301356,6.611790813445079,2.1137401873829322,-2.3439390284887116,-6.811589162421301,-11.207468820176372,-15.556773091774565,-19.806007803388432,-23.927300807849942,-27.931483851285147,-31.73993791894789,-35.38479745729731,-38.89052968386436,-42.149503150418354,-45.2073029658109,-48.0455475813962,-50.618257476367404,-52.92234508847092,-55.00714403950909,-56.796530917003494,-58.299512199809904,-59.52979670610663,-60.46961168477936,-61.13593661954048,-61.487283224493716,-61.55175311855077,-61.314626179974766,-60.7814749878263,-59.983518520864415,-58.862314116627296,-57.490120167487945,-55.82539363897818,-53.88353988046932,-51.68704175852904,-49.23901257691652,-46.53410689094161,-43.613973490392546,-40.51395759244322,-37.15596791881295,-33.64125050313682,-29.937228604405664,-26.098771697724082,-22.128477540124173,-18.024522827547095,-13.847484674392641,-9.604609742003602,-5.313587208337605,-0.9713349261697172,3.338912963904995,7.594554688843092,11.815642272982386,15.934724088773185,19.956586045470136,23.806031609892965,27.459735763592228,30.90025271852244,34.08739830565878,36.97403713281067,39.530928188152885,41.73583181138283,43.531767831730484,44.84654872435108,45.6810679081336,45.979247080788035,45.692832739358586,44.772517902320814,43.175732381550475,40.86046677434278,37.76150104764435,33.84003751057878,29.052007181226916,23.335087979175622,16.614351874730968,8.859457671590594,0.0018572448487862428
X,0.012643587820424594,-0.0006971205389749024,0.003083627599775752,0.01572247153510262,-0.0040783120070592375,0.0012587719608593195,-0.0077267407113544295,-0.016000106596211674,-0.019952397932123223,0.04320690293674936,-2.085526921149751,9.66178432246755,-0.02091266327300839,-0.002956826688835099,-0.05043193956400731,0.1979050419383499,-3.8458723917463242,18.18758287059785,0.0016720571886447548,0.02376660937292773,-0.09037844033529525,0.40755622045158607,-5.290412580581822,25.618836889688662,0.00435519923300866,0.014088666509261386,-0.1376166739607646,0.7151922953934128,-6.441222054163713,31.99104350833375,-0.0053533364591599845,0.024304928516768888,-0.22296842074929032,1.0204578238633972,-7.345463950614813,37.419885157742,-0.004818142855599126,0.034661316206748984,-0.29896443800052735,1.434149850200529,-7.996908885027742,41.91100275027521,-0.015147647681982334,0.04821416604301336,-0.3683418625704733,1.870551184361572,-8.372914268040835,45.53777783108178,-0.02655097534965726,0.062172555878875345,-0.44594330504846463,2.330703255954757,-8.575727581649815,48.33212601962244,-0.03080552936575432,0.10649542753338066,-0.5290247463245457,2.8426842108121035,-8.540168948659424,50.3894650763471,-0.01230573253895329,0.10939107841673333,-0.6394284183886897,3.356530142391739,-8.315936897088719,51.71103350145078,-0.047652990447914344,0.17016613911983278,-0.7288128319242022,3.8715990634287403,-7.953636063729588,52.37784877314895,-0.03614260662567381,0.20066738379194946,-0.7792732871090502,4.397822182582439,-7.4306324463810345,52.40247237035132,-0.054115012338547264,0.25643336100476477,-0.8617457726460916,4.916500213861536,-6.760502931026357,51.857029456932565,-0.061203393174510526,0.28485363902226213,-0.9172391496018141,5.444624329442479,-5.926423535436813,50.78386282342135,-0.076944753072592,0.36171841696317497,-0.9635066472477979,5.9317557587890555,-5.009119474715595,49.22083914282907,-0.09118138710988785,0.4025777984794776,-1.0183235674856548,6.426647343807255,-4.007056762046967,47.207469815675324,-0.08740265489885278,0.468869532973457,-1.066276254152993,6.889169336582011,-2.898600069419762,44.773613292422944,-0.11788345815538916,0.5551231379559164,-1.0704597623948942,7.311614456188282,-1.7115764215157985,42.01314597502173,-0.11291145726624537,0.6373033988700337,-1.103514831663976,7.718713828500181,-0.45349936191571083,38.892012164847394,-0.10683608929004128,0.7051222300240036,-1.077873885293741,8.067115956780063,0.8287872408159722,35.50397998716642,-0.13031454218316396,0.7851319362610986,-1.0987431493217203,8.437533676732208,2.164887200574705,31.87449213262785,-0.1601835114450312,0.88296618365628,-1.0343138473963518,8.751652341588013,3.5129593157917323,27.995573388172666,-0.15954629005800555,0.9796210013675124,-1.00957278881286,8.977386519891047,4.895772470380949,23.93853323582683,-0.16783357411999142,1.0629850452317329,-0.9306030412927595,9.20526858741118,6.26823853030109,19.75639894208352,-0.17011257345249003,1.1482716835848275,-0.8791385671514442,9.387293389872694,7.675647046298497,15.460878029324052,-0.17031212740645074,1.236268186672194,-0.7938288609968606,9.530200077436733,9.046574951547063,11.048870582301356,-0.1802054772810204,1.3500701562964805,-0.6942441631448283,9.586834691972815,10.395157802041233,6.611790813445079,-0.18379172931614224,1.4413435075740246,-0.5883829391916653,9.643583395840613,11.694400806228268,2.1137401873829322,-0.18208355027388953,1.5242527040782963,-0.4681072501754126,9.638866394079173,13.015221165889313,-2.3439390284887116,-0.19477097741523025,1.6346499676657087,-0.32746030067623244,9.589517175154601,14.231337938367153,-6.811589162421301,-0.17587743395457872,1.7379473309552038,-0.17948128419427295,9.501863817304846,15.438742479965976,-11.207468820176372,-0.2012132662389099,1.8259904778503573,-0.004490696607443129,9.376091468978846,16.573641627693906,-15.556773091774565,-0.207862916367079,1.9171517312900475,0.14933289601285243,9.210517354209726,17.640922703881508,-19.806007803388432,-0.20609373496517983,1.997080585159596,0.3449174072987515,9.000104746512468,18.617268825534705,-23.927300807849942,-0.19291646916168279,2.090876241207954,0.5405733347025555,8.721132234562608,19.57457063391338,-27.931483851285147,-0.18183539671034296,2.1778902684302652,0.7110508563345527,8.440176521800707,20.400018314989058,-31.73993791894789,-0.1506045121077386,2.2613611076219313,0.9182569876157153,8.096627373563386,21.163519757690768,-35.38479745729731,-0.17128705490191165,2.341729587475958,1.1449332565712242,7.7229315555633224,21.83495582291473,-38.89052968386436,-0.1569497655759471,2.414826435979752,1.377685141166476,7.297245035062978,22.405153796016915,-42.149503150418354,-0.14879315748281435,2.499225777769706,1.5884893860747038,6.868480918164727,22.898589635963592,-45.2073029658109,-0.11950287808537728,2.5401667764958407,1.82435630325005,6.405308086400661,23.266216267492112,-48.0455475813962,-0.08869381450510432,2.624731629378395,2.0564529715094024,5.9216702972165605,23.544524829309058,-50.618257476367404,-0.08556507759745245,2.6762789835343033,2.301988528781346,5.377065154107821,23.722282065435518,-52.92234508847092,-0.05838600861972568,2.7303288882127164,2.5304839707482025,4.860734210566033,23.761869466226532,-55.00714403950909,-0.04197312487379476,2.761810057333617,2.7641965089361475,4.2982770327954665,23.756372593592804,-56.796530917003494,-0.0026347615060520174,2.823826960786971,3.010418638624646,3.7096556346377496,23.603708873264942,-58.299512199809904,0.018472123404033713,2.8418601537074046,3.247152091804184,3.1344445441596362,23.34459451363112,-59.52979670610663,0.05564756265842256,2.880139187238669,3.4760524811460245,2.5274413284084933,22.997535122676833,-60.46961168477936,0.08507995282204309,2.8959856748730717,3.69677281141349,1.933746192758306,22.506450488562635,-61.13593661954048,0.12568675949125296,2.9128469428368096,3.93724436410633,1.3055501821357902,21.94041395537594,-61.487283224493716,0.1691694032604079,2.918076589595867,4.168992444232451,0.6946471771938066,21.274158433359133,-61.55175311855077,0.22136606747004942,2.9102987422436337,4.340053573819529,0.06724305047597653,20.49384472370016,-61.314626179974766,0.26881036043340584,2.92705898048844,4.564701969999824,-0.5417982014416597,19.597296232833667,-60.7814749878263,0.2946509972583211,2.90377715522968,4.738250796647151,-1.1415867571101312,18.603199032341546,-59.983518520864415,0.3498177693168222,2.893247902377806,4.919826396620297,-1.7348048171976373,17.523245946290537,-58.862314116627296,0.40958000759489555,2.8787483030368506,5.082734388284489,-2.3116671956310175,16.358851215582668,-57.490120167487945,0.45793804721720927,2.8614355440828296,5.243947844375984,-2.893063087260564,15.092901153271022,-55.82539363897818,0.5038539610129291,2.8178484475352685,5.391373958841505,-3.4140548595538713,13.755662909390725,-53.88353988046932,0.5700437142409627,2.7850140233055876,5.525899728237014,-3.9488389437785822,12.319262728377893,-51.68704175852904,0.6110555716231455,2.7314036335650744,5.634170561798057,-4.458823283089409,10.818873733613612,-49.23901257691652,0.6868963784951322,2.6842951349954824,5.73942203843324,-4.93876538817416,9.2496523012814,-46.53410689094161,0.7289008263617107,2.641598161598072,5.828587356856803,-5.388358292860203,7.611924525795471,-43.613973490392546,0.7882374878889994,2.587387707362909,5.8849000107844835,-5.809876498800275,5.930155605111644,-40.51395759244322,0.844648338629751,2.528192816360684,5.940177569472637,-6.20388895069953,4.212731202152069,-37.15596791881295,0.931428012745703,2.4667211282094765,5.981319315757838,-6.558364368233156,2.4154630676127296,-33.64125050313682,0.9862225085820124,2.40116216553314,6.003416051787373,-6.8745839518231895,0.6063341451444748,-29.937228604405664,1.0444853431008736,2.3514938960925034,5.985886918743999,-7.140425359867514,-1.264596375171023,-26.098771697724082,1.1060260212254192,2.240070737098714,5.978061386183823,-7.392128595393649,-3.122874800007902,-22.128477540124173,1.15434099876496,2.1851121983307706,5.936059379734183,-7.60543225783322,-5.000716702971775,-18.024522827547095,1.2003341981551399,2.1054372571181466,5.8770270086808765,-7.733449075301498,-6.874571136922798,-13.847484674392641,1.263960922781252,2.022686669398167,5.80231192514453,-7.875951282720298,-8.724786109140839,-9.604609742003602,1.323014022681349,1.941576006267961,5.711814648285796,-7.945972233622057,-10.583890332749181,-5.313587208337605,1.3901217752472317,1.873036368464109,5.572018380546943,-7.963581867020626,-12.404250060517995,-0.9713349261697172,1.4411918497636111,1.7855290338696441,5.465766229678767,-7.975030879438874,-14.161009487836958,3.338912963904995,1.494852812557186,1.7126314428948823,5.294788276389377,-7.9186725719276225,-15.89825974873674,7.594554688843092,1.56063132263427,1.6074502282082357,5.131635252232408,-7.8167753435661425,-17.559983333020835,11.815642272982386,1.5799966268931804,1.5608038775629316,4.959383787956963,-7.674029440463538,-19.146965200490385,15.934724088773185,1.6445046548451134,1.4727929986733912,4.7484269631802025,-7.493106186620325,-20.64282890423255,19.956586045470136,1.6888128581348059,1.401275127635159,4.544724976364583,-7.278817141837911,-22.040643690305355,23.806031609892965,1.7339179374705342,1.3189875776604125,4.297733056173573,-7.024828592542938,-23.288252847025518,27.459735763592228,1.7714593670072056,1.2880796745409728,4.057799930042755,-6.73482649407027,-24.447571596355886,30.90025271852244,1.8255280761304726,1.205561267298803,3.841988014906524,-6.424749316388624,-25.447577235584852,34.08739830565878,1.8502581280957429,1.1234340851003035,3.5579243621161,-6.037320292593223,-26.30512731480523,36.97403713281067,1.8757465742019974,1.0652867929997645,3.2931175478245613,-5.673716432509228,-26.960656519859242,39.530928188152885,1.9185775777328045,1.0241597193491,3.014641428515939,-5.244928719446022,-27.45024391479062,41.73583181138283,1.9498923176678609,0.9734192120319901,2.737669186444574,-4.831756573222868,-27.724760909677514,43.531767831730484,1.9812251350597765,0.9324719985367541,2.479101117051496,-4.36800055335986,-27.757686062893114,44.84654872435108,1.9965355225193488,0.8802897595492155,2.1780115566389044,-3.9266567105413426,-27.577303223446027,45.6810679081336,2.0332428030944754,0.8322503268309988,1.9139717324700247,-3.489665606102812,-27.15393326397484,45.979247080788035,2.045579380711528,0.7996010069356714,1.6370111332496198,-3.012082577650778,-26.431351845499215,45.692832739358586,2.0451036145347543,0.7760746019240984,1.3952265895702745,-2.5596833555732865,-25.422614623505098,44.772517902320814,2.0516081669756985,0.7497274695234476,1.1226357883043525,-2.1293092709340273,-24.09186136914167,43.175732381550475,2.0887205064604655,0.7360371179620081,0.9041464624307906,-1.6975141645049419,-22.446764614588062,40.86046677434278,2.0903730780129752,0.7188422055702887,0.6825736917279419,-1.3015672143384611,-20.467682774219384,37.76150104764435,2.090819157948385,0.708885651827117,0.5148856727884493,-0.9601430381483489,-18.089544658366012,33.84003751057878,2.090866726422845,0.690358403326073,0.33081851444672106,-0.6543277336272325,-15.327406421907511,29.052007181226916,2.097799493686967,0.6994896104604928,0.17969886338840388,-0.38118441384331514,-12.177435662145715,23.335087979175622,2.0827262502136503,0.7175057838050215,0.09261949206939764,-0.154998134025763,-8.55438091906664,16.614351874730968,2.093190729731701,0.6924818466440217,0.02472856259255223,-0.04663463826919017,-4.515641944724557,8.859457671590594,2.1052227488450916,0.6975707667500927,0.00657485246417743,0.0005098319298411438,0.0035371255257080824,0.0018572448487862428
