Constants
  AX=0;
  AY=1;
  AZ=0;
  XE=20;
  YE=20;
  ZE=-20;
  d3=28.74;
  d5=27.15;
  d8=3.76;

Variables
  theta1 in [-pi/2,pi/2];
  theta2 in [-pi,0];
  theta3 in [-pi/2,pi/2];
  theta4 in [-pi,pi];
  theta5 in [-pi,pi];
  theta6 in [-pi/2,pi/2];
  theta7 in [-pi/2,pi/2];
  lsw in [0,oo];
  lsc in [0,oo];
  rc in [0,oo];
  XW in [-oo,oo];
  YW in [-oo,oo];
  ZW in [-oo,oo];
  nX in [-oo,oo];
  nY in [-oo,oo];
  nZ in [-oo,oo];
  XC in [-oo,oo];
  YC in [-oo,oo];
  ZC in [-oo,oo];
  uX in [-oo,oo];
  uY in [-oo,oo];
  uZ in [-oo,oo];
  vX in [-oo,oo];
  vY in [-oo,oo];
  vZ in [-oo,oo];
  XEL in [-oo,oo];
  YEL in [-oo,oo];
  ZEL in [-oo,oo];
  psi in [1.9,1.9];
  phi in [-0.5,-0.5];
  R11 in [-1,1];
  R12 in [-1,1];
  R13 in [-1,1];
  R21 in [-1,1];
  R22 in [-1,1];
  R23 in [-1,1];
  R31 in [-1,1];
  R32 in [-1,1];
  R33 in [-1,1];

Constraints
R11 = (cos(phi) * (-AX ^ 2 + AZ + 1) + sin(phi) * AX * (1 + AZ)) / (1 + AZ);
R12 = -1 / (1 + AZ) * AX * AY;
R13 = ((AX ^ 2 - AZ - 1) * sin(phi) + cos(phi) * AX * (1 + AZ)) / (1 + AZ);
R21 = -AY * ((-AZ - 1) * sin(phi) + cos(phi) * AX) / (1 + AZ);
R22 = (-AY ^ 2 + AZ + 1) / (1 + AZ);
R23 = AY * (sin(phi) * AX + (1 + AZ) * cos(phi)) / (1 + AZ);
R31 = ((-AX ^ 2 - AY ^ 2 + AZ + 1) * sin(phi) - cos(phi) * AX * (1 + AZ)) / (1 + AZ);
R32 = -AY;
R33 = ((-AX ^ 2 - AY ^ 2 + AZ + 1) * cos(phi) + sin(phi) * AX * (1 + AZ)) / (1 + AZ);

  R11 = ((((cos(theta5) * cos(theta6) * cos(theta4) - sin(theta4) * sin(theta6)) * cos(theta3) - cos(theta6) * sin(theta3) * sin(theta5)) * cos(theta2) - sin(theta2) * (cos(theta5) * cos(theta6) * sin(theta4) + sin(theta6) * cos(theta4))) * cos(theta7) - ((sin(theta5) * cos(theta3) * cos(theta4) + cos(theta5) * sin(theta3)) * cos(theta2) - sin(theta2) * sin(theta4) * sin(theta5)) * sin(theta7)) * cos(theta1) - ((cos(theta3) * cos(theta6) * sin(theta5) + sin(theta3) * (cos(theta5) * cos(theta6) * cos(theta4) - sin(theta4) * sin(theta6))) * cos(theta7) + sin(theta7) * (-sin(theta3) * sin(theta5) * cos(theta4) + cos(theta5) * cos(theta3))) * sin(theta1);
  R12 = ((((-cos(theta5) * cos(theta6) * cos(theta4) + sin(theta4) * sin(theta6)) * cos(theta3) + cos(theta6) * sin(theta3) * sin(theta5)) * cos(theta2) + sin(theta2) * (cos(theta5) * cos(theta6) * sin(theta4) + sin(theta6) * cos(theta4))) * sin(theta7) - ((sin(theta5) * cos(theta3) * cos(theta4) + cos(theta5) * sin(theta3)) * cos(theta2) - sin(theta2) * sin(theta4) * sin(theta5)) * cos(theta7)) * cos(theta1) - sin(theta1) * ((-cos(theta3) * cos(theta6) * sin(theta5) - sin(theta3) * (cos(theta5) * cos(theta6) * cos(theta4) - sin(theta4) * sin(theta6))) * sin(theta7) + cos(theta7) * (-sin(theta3) * sin(theta5) * cos(theta4) + cos(theta5) * cos(theta3)));
  R13 = (((-cos(theta3) * cos(theta4) * cos(theta5) + sin(theta5) * sin(theta3)) * cos(theta2) + cos(theta5) * sin(theta2) * sin(theta4)) * sin(theta6) - cos(theta6) * (sin(theta4) * cos(theta2) * cos(theta3) + cos(theta4) * sin(theta2))) * cos(theta1) + ((cos(theta5) * sin(theta3) * cos(theta4) + sin(theta5) * cos(theta3)) * sin(theta6) + cos(theta6) * sin(theta3) * sin(theta4)) * sin(theta1);
  R21 = ((((cos(theta5) * cos(theta6) * cos(theta4) - sin(theta4) * sin(theta6)) * cos(theta3) - cos(theta6) * sin(theta3) * sin(theta5)) * cos(theta2) - sin(theta2) * (cos(theta5) * cos(theta6) * sin(theta4) + sin(theta6) * cos(theta4))) * sin(theta1) + (cos(theta3) * cos(theta6) * sin(theta5) + sin(theta3) * (cos(theta5) * cos(theta6) * cos(theta4) - sin(theta4) * sin(theta6))) * cos(theta1)) * cos(theta7) - sin(theta7) * (((sin(theta5) * cos(theta3) * cos(theta4) + cos(theta5) * sin(theta3)) * cos(theta2) - sin(theta2) * sin(theta4) * sin(theta5)) * sin(theta1) - cos(theta1) * (-sin(theta3) * sin(theta5) * cos(theta4) + cos(theta5) * cos(theta3)));
  R22 = ((((-cos(theta5) * cos(theta6) * cos(theta4) + sin(theta4) * sin(theta6)) * cos(theta3) + cos(theta6) * sin(theta3) * sin(theta5)) * cos(theta2) + sin(theta2) * (cos(theta5) * cos(theta6) * sin(theta4) + sin(theta6) * cos(theta4))) * sin(theta7) - ((sin(theta5) * cos(theta3) * cos(theta4) + cos(theta5) * sin(theta3)) * cos(theta2) - sin(theta2) * sin(theta4) * sin(theta5)) * cos(theta7)) * sin(theta1) + cos(theta1) * ((-cos(theta3) * cos(theta6) * sin(theta5) - sin(theta3) * (cos(theta5) * cos(theta6) * cos(theta4) - sin(theta4) * sin(theta6))) * sin(theta7) + cos(theta7) * (-sin(theta3) * sin(theta5) * cos(theta4) + cos(theta5) * cos(theta3)));
  R23 = (((-cos(theta3) * cos(theta4) * cos(theta5) + sin(theta5) * sin(theta3)) * cos(theta2) + cos(theta5) * sin(theta2) * sin(theta4)) * sin(theta6) - cos(theta6) * (sin(theta4) * cos(theta2) * cos(theta3) + cos(theta4) * sin(theta2))) * sin(theta1) - ((cos(theta5) * sin(theta3) * cos(theta4) + sin(theta5) * cos(theta3)) * sin(theta6) + cos(theta6) * sin(theta3) * sin(theta4)) * cos(theta1);
  R31 = (((cos(theta5) * cos(theta6) * cos(theta4) - sin(theta4) * sin(theta6)) * cos(theta3) - cos(theta6) * sin(theta3) * sin(theta5)) * sin(theta2) + cos(theta2) * (cos(theta5) * cos(theta6) * sin(theta4) + sin(theta6) * cos(theta4))) * cos(theta7) - ((sin(theta5) * cos(theta3) * cos(theta4) + cos(theta5) * sin(theta3)) * sin(theta2) + sin(theta5) * sin(theta4) * cos(theta2)) * sin(theta7);
  R32 = (((-cos(theta5) * cos(theta6) * cos(theta4) + sin(theta4) * sin(theta6)) * cos(theta3) + cos(theta6) * sin(theta3) * sin(theta5)) * sin(theta7) - cos(theta7) * (sin(theta5) * cos(theta3) * cos(theta4) + cos(theta5) * sin(theta3))) * sin(theta2) - ((cos(theta5) * cos(theta6) * sin(theta4) + sin(theta6) * cos(theta4)) * sin(theta7) + cos(theta7) * sin(theta4) * sin(theta5)) * cos(theta2);
  R33 = ((-cos(theta3) * cos(theta4) * cos(theta5) + sin(theta5) * sin(theta3)) * sin(theta6) - cos(theta6) * sin(theta4) * cos(theta3)) * sin(theta2) + cos(theta2) * (-sin(theta4) * cos(theta5) * sin(theta6) + cos(theta6) * cos(theta4));
  XE = ((cos(theta5) * sin(theta2) * sin(theta6) * d8 - cos(theta2) * cos(theta3) * (cos(theta6) * d8 + d5)) * sin(theta4) - cos(theta2) * d8 * (cos(theta3) * cos(theta4) * cos(theta5) - sin(theta5) * sin(theta3)) * sin(theta6) - ((cos(theta6) * d8 + d5) * cos(theta4) + d3) * sin(theta2)) * cos(theta1) + sin(theta1) * (sin(theta3) * (cos(theta6) * d8 + d5) * sin(theta4) + sin(theta6) * d8 * (cos(theta5) * sin(theta3) * cos(theta4) + sin(theta5) * cos(theta3)));
  YE = ((cos(theta5) * sin(theta2) * sin(theta6) * d8 - cos(theta2) * cos(theta3) * (cos(theta6) * d8 + d5)) * sin(theta4) - cos(theta2) * d8 * (cos(theta3) * cos(theta4) * cos(theta5) - sin(theta5) * sin(theta3)) * sin(theta6) - ((cos(theta6) * d8 + d5) * cos(theta4) + d3) * sin(theta2)) * sin(theta1) - (sin(theta3) * (cos(theta6) * d8 + d5) * sin(theta4) + sin(theta6) * d8 * (cos(theta5) * sin(theta3) * cos(theta4) + sin(theta5) * cos(theta3))) * cos(theta1);
  ZE = ((cos(theta6) * d8 + d5) * cos(theta4) - cos(theta5) * sin(theta4) * sin(theta6) * d8 + d3) * cos(theta2) - ((cos(theta4) * cos(theta5) * sin(theta6) * d8 + sin(theta4) * (cos(theta6) * d8 + d5)) * cos(theta3) - sin(theta3) * sin(theta5) * sin(theta6) * d8) * sin(theta2);
  lsw = sqrt((d8 ^ 2 + (-2 * R13 * XE - 2 * R23 * YE - 2 * R33 * ZE) * d8 + XE ^ 2 + YE ^ 2 + ZE ^ 2));
  XW = -R13 * d8 + XE;
  YW = -R23 * d8 + YE;
  ZW = -R33 * d8 + ZE;
  nX = XW/lsw;
  nY = YW/lsw;
  nZ = ZW/lsw;
  nX^2+nY^2+nZ^2=1;
  lsc = ((d8 ^ 2 + (-2 * R13 * XE - 2 * R23 * YE - 2 * R33 * ZE) * d8 + XE ^ 2 + YE ^ 2 + ZE ^ 2) + d3^2 - d5^2) / (2*lsw);
  XC = nX*lsc;
  YC = nY*lsc;
  ZC = nZ*lsc;
  rc = sqrt(d3^2-lsc^2);
  uX = -nZ * nX * (1 + nZ ^ 4 + (nX ^ 2 + nY ^ 2 - 2) * nZ ^ 2) ^ (-0.1e1 / 0.2e1);
  uY = -nZ * nY * (1 + nZ ^ 4 + (nX ^ 2 + nY ^ 2 - 2) * nZ ^ 2) ^ (-0.1e1 / 0.2e1);
  uZ = (-nZ ^ 2 + 1) * (1 + nZ ^ 4 + (nX ^ 2 + nY ^ 2 - 2) * nZ ^ 2) ^ (-0.1e1 / 0.2e1);
  vX = nY * uZ - nZ * uY;
  vY = -nX * uZ + nZ * uX;
  vZ = nX * uY - nY * uX;
  XEL = XC + rc*(cos(psi)*uX+sin(psi)*vX);
  YEL = YC + rc*(cos(psi)*uY+sin(psi)*vY);
  ZEL = ZC + rc*(cos(psi)*uZ+sin(psi)*vZ);
  XEL = -cos(theta1) * sin(theta2) * d3;
  YEL = -sin(theta1) * sin(theta2) * d3;
  ZEL = cos(theta2) * d3;

end
