Type,0
T,101
nz,6
Mod,1.0,1.0,1.0,1.0,0.5,0.5,0.5,0.5
w,0.1,0.9
Sstart,-0.0013776165030717164,0.005627049359390396,0.0011882754665900161,0.007515749232636258,0.0030821987962782937,0.02891051882798899,0.004371964781833287,-0.015997796882733464,-0.015779732492943066,-0.020400654744313948,-0.026919227351794712,-0.018918736675539907,-0.03814200451645703,-0.03649993396132876,-0.03813473579845569,-0.05808204106777208,-0.0646870113812069,-0.06299054932193054,-0.08082768895754995,-0.09529821166036455,-0.1066918746658896,-0.10052186712366455,-0.12643686978516097,-0.12400805328053355,-0.13959415731793148,-0.16338814519791273,-0.1389507567356578,-0.15271398071565362,-0.17147287131091313,-0.18342292375374236,-0.16216896372808598,-0.16940029745472696,-0.1810342147312854,-0.16221324908284135,-0.16833517778966967,-0.15779369606716398,-0.16264214171882946,-0.13384800780263145,-0.12610735630044967,-0.11383870916402855,-0.08356462237193002,-0.07214728749941907,-0.06096708143507135,-0.0348167919301189,-0.024971653817197285,0.007472655539461512,0.05098506156988741,0.04566141682532808,0.11497566960031161,0.14070431731044902,0.18131586830381444,0.22555572102389806,0.27274501244802435,0.3131046932331075,0.34394445753766145,0.4138709680606498,0.4527736499704155,0.5076253667518185,0.55342665796864,0.6254438882822679,0.6752702807942202,0.7257193243508776,0.7787954377674844,0.840801559039784,0.8987558783452688,0.9593782893336474,1.0067737408522563,1.058336436166953,1.1194457821374215,1.1712140937625528,1.2582704589468006,1.2983211072101768,1.3508023146252854,1.401394597909324,1.469763682403579,1.5287513371835164,1.5684858633253738,1.625508734747918,1.6652186309911885,1.690762373137795,1.7474523855892983,1.7949881762397109,1.8203570217704361,1.8626095885407319,1.8838688220340098,1.9033793672473298,1.9470325936407717,1.9801935679322644,1.998280512921029,2.002044832756361,2.0640543271893836,2.0514940214551634,2.074517047857284,2.081737577087182,2.0834645508633214,2.0859345141204306,2.0926203480517165,2.0750220839127276,2.0877364959994886,2.0969350756047094,2.0810198724829787
Sgoal,-0.013274751861523508,5.85939177514541,11.041112035888135,15.567950884125407,19.499618082481216,22.81387000662529,25.587076353455952,27.83442081005022,29.605349057108196,30.891578393023984,31.742871851874398,32.20852247505981,32.28645014299261,32.025616211133666,31.452416711577722,30.5515278469711,29.4083929556896,28.01316123187589,26.40991579038153,24.605243826410746,22.602286637164827,20.46358451668274,18.18121900103972,15.77714290503523,13.295977813848525,10.712370649753906,8.104485175364282,5.465760039397585,2.777855350254861,0.10846251304064908,-2.5571325883273586,-5.223920132032064,-7.828191736214772,-10.39975158912906,-12.875691787512935,-15.303606172412078,-17.62618666942773,-19.866919131334512,-21.981909455731568,-23.976722347656235,-25.85726961003125,-27.600035453143533,-29.194267034724547,-30.64921297360445,-31.933713487419332,-33.07461935431487,-34.06674837320725,-34.86975059291786,-35.50740629444435,-35.95822624085682,-36.291868746093414,-36.4087235750783,-36.33815211325658,-36.11879534507131,-35.72173357745537,-35.15054276028825,-34.414104867724674,-33.52536453371674,-32.45833703792132,-31.226661693277187,-29.8692323216193,-28.35628713863763,-26.699899502372368,-24.914251010361184,-23.01607065580078,-21.011722390295226,-18.889358665374196,-16.692095198092172,-14.407607728018315,-12.027081357972783,-9.602692413718955,-7.14124653942136,-4.658257098179091,-2.1369639713254536,0.36311875692038625,2.8663345039445813,5.350239162081885,7.745647160488946,10.116170532369301,12.402801282166596,14.550146493192123,16.600651525193037,18.503790983317902,20.215445886543005,21.766879539476797,23.088584013957263,24.163232402248926,25.01947663541012,25.569295170722917,25.807024362419337,25.717973448378746,25.257703019619004,24.400190238105154,23.159083344687218,21.429780269796556,19.232978085448984,16.539115717278083,13.315064670967136,9.45951704471676,5.0691986116706245,0.0009423860385118801
X,-0.0013776165030717164,-0.01046495606993213,-0.009694711734290819,0.0023791925659739015,-0.011500925822852361,-0.013274751861523508,0.005627049359390396,-0.0018418998259437745,-0.018983594883034756,0.04104674676669385,-1.9163469578203658,5.85939177514541,0.0011882754665900161,0.006800825441365706,-0.03301163400486999,0.09802416939876955,-3.507522275700744,11.041112035888135,0.007515749232636258,-0.00991868506759174,-0.08876396812100838,0.21988181279375338,-4.81740077021478,15.567950884125407,0.0030821987962782937,0.005833840623297289,-0.13464919556174704,0.4193162468262186,-5.848337415902907,19.499618082481216,0.02891051882798899,0.0037403312004334055,-0.1810414970098276,0.629079850826202,-6.617413993876094,22.81387000662529,0.004371964781833287,0.021955495209952085,-0.2726924926242088,0.8747383465232799,-7.202195597554558,25.587076353455952,-0.015997796882733464,0.03816792338610951,-0.3249254236667685,1.1519257763793094,-7.509666979267958,27.83442081005022,-0.015779732492943066,0.043776442453523245,-0.4073455247847971,1.423258899625009,-7.639525993056748,29.605349057108196,-0.020400654744313948,0.06859577097067493,-0.5039538540279773,1.7465876437859915,-7.588106275312016,30.891578393023984,-0.026919227351794712,0.08373520854665563,-0.5749313949918825,2.0508670367599104,-7.358599803676669,31.742871851874398,-0.018918736675539907,0.1147212107226023,-0.6248665454411929,2.380646605802291,-6.958563339063903,32.20852247505981,-0.03814200451645703,0.1310975467172482,-0.7157840557041777,2.683378483420272,-6.441764419715855,32.28645014299261,-0.03649993396132876,0.13947732723521294,-0.7548567797176413,3.016048691636629,-5.796523343139802,32.025616211133666,-0.03813473579845569,0.179642987583347,-0.8309189309322534,3.33827478902936,-4.997051980060436,31.452416711577722,-0.05808204106777208,0.18781059667136857,-0.8643237059942553,3.6419032117420884,-4.116498740007757,30.5515278469711,-0.0646870113812069,0.2889735973122488,-0.8813794499120757,3.945330170865961,-3.134867050257458,29.4083929556896,-0.06299054932193054,0.2895572104558882,-0.9186894232273958,4.220440694348258,-2.077437371394739,28.01316123187589,-0.08082768895754995,0.3373999799400584,-0.9622462192282214,4.486251868727065,-0.9344665368465405,26.40991579038153,-0.09529821166036455,0.4004000315362347,-0.939355192065237,4.76306223265416,0.22461260275614925,24.605243826410746,-0.1066918746658896,0.4285765773154369,-0.9408392138011498,4.991750170686349,1.4798889962684851,22.602286637164827,-0.10052186712366455,0.4890004032620081,-0.9043117831441913,5.208145557922578,2.708923956193661,20.46358451668274,-0.12643686978516097,0.5595917390388535,-0.9022799827783179,5.397170296158213,3.9912561309506134,18.18121900103972,-0.12400805328053355,0.6043789359063696,-0.8428006439343634,5.577737466338655,5.3114387675850585,15.77714290503523,-0.13959415731793148,0.6551896952917304,-0.7677045587840697,5.705257801249915,6.609925198302187,13.295977813848525,-0.16338814519791273,0.7082207446913058,-0.7152852934156692,5.846000470228887,7.901156720759438,10.712370649753906,-0.1389507567356578,0.7630338612060963,-0.6332545438135742,5.920370517622082,9.189877380529618,8.104485175364282,-0.15271398071565362,0.8324686442833088,-0.5266597199653644,6.007453845166873,10.453859223999144,5.465760039397585,-0.17147287131091313,0.8935129450710235,-0.3861558496879332,6.037086548111167,11.678892657360139,2.777855350254861,-0.18342292375374236,0.9663554170102755,-0.3055054349353475,6.056746350367334,12.872645391740239,0.10846251304064908,-0.16216896372808598,1.0077207856982986,-0.15240428951508248,6.064071941575817,14.055664095918075,-2.5571325883273586,-0.16940029745472696,1.0760884252222642,-0.005877257946082259,6.012683191540189,15.152176986048365,-5.223920132032064,-0.1810342147312854,1.1250576166738226,0.15546419348795806,5.922273474434677,16.19928623376331,-7.828191736214772,-0.16221324908284135,1.1848533519384132,0.31222642007864604,5.842137933237517,17.18487950248236,-10.39975158912906,-0.16833517778966967,1.2683196318476417,0.49566037862485385,5.724558513852034,18.09641432910578,-12.875691787512935,-0.15779369606716398,1.284646782718871,0.689819645933444,5.590831714961901,18.936537497795392,-15.303606172412078,-0.16264214171882946,1.3605293071974291,0.8879350522188532,5.416921874405803,19.710509688938266,-17.62618666942773,-0.13384800780263145,1.4179139017391933,1.0795460297451953,5.230713051621255,20.38596780243101,-19.866919131334512,-0.12610735630044967,1.4734858504500972,1.277493991880295,5.0393272402346385,20.99533078298632,-21.981909455731568,-0.11383870916402855,1.5270894555816297,1.4949328311196914,4.800053315157284,21.513950864051846,-23.976722347656235,-0.08356462237193002,1.5477681439065918,1.7168096071149304,4.551548409096701,21.966030945267864,-25.85726961003125,-0.07214728749941907,1.596771672225488,1.9400455089425634,4.276137257246444,22.268201307396254,-27.600035453143533,-0.06096708143507135,1.6492444567133286,2.155714135651871,4.00764475346721,22.505338018927034,-29.194267034724547,-0.0348167919301189,1.6755204225253049,2.367556059255424,3.6955453967490004,22.631878624485857,-30.64921297360445,-0.024971653817197285,1.71461339528689,2.611030524762186,3.394474361447761,22.66640607579698,-31.933713487419332,0.007472655539461512,1.7605195614133098,2.8253975186224176,3.057454301410592,22.59634140025527,-33.07461935431487,0.05098506156988741,1.779472252858428,3.0740041182518927,2.725204830232601,22.430510072142003,-34.06674837320725,0.04566141682532808,1.8022996950207943,3.294262779493007,2.4019392803257453,22.15834211439101,-34.86975059291786,0.11497566960031161,1.836102744008695,3.484802445395151,2.0349370127429025,21.770150586792433,-35.50740629444435,0.14070431731044902,1.8378757695156156,3.699970291855631,1.6724326746664258,21.299714771286624,-35.95822624085682,0.18131586830381444,1.8596567311413625,3.9381112879979585,1.3151391320273147,20.690334941721453,-36.291868746093414,0.22555572102389806,1.8689590711538806,4.1242850839618175,0.9429321012543905,20.036347265558128,-36.4087235750783,0.27274501244802435,1.8811286029525058,4.321436937593574,0.5700408652730949,19.272985737499656,-36.33815211325658,0.3131046932331075,1.880772307004985,4.496359610549678,0.20965800320083733,18.400652432550405,-36.11879534507131,0.34394445753766145,1.8742107798270857,4.718628474439243,-0.15148565464282532,17.441801195031168,-35.72173357745537,0.4138709680606498,1.8855817610562322,4.857288267190648,-0.5046550243122172,16.373917905933013,-35.15054276028825,0.4527736499704155,1.8643532838762213,5.016911428904727,-0.8648516994505627,15.207049501345788,-34.414104867724674,0.5076253667518185,1.8636813085675308,5.161113983926394,-1.1811425111492349,14.008756369709655,-33.52536453371674,0.55342665796864,1.857273324648171,5.305820233986471,-1.511249942687969,12.690627108428028,-32.45833703792132,0.6254438882822679,1.835949387531026,5.410283113512926,-1.8297678101107988,11.326445332396757,-31.226661693277187,0.6752702807942202,1.8269157945342454,5.540500179795161,-2.1233789628526654,9.875521765411658,-29.8692323216193,0.7257193243508776,1.8104348926285019,5.607308532473025,-2.4253979184945957,8.365760710450315,-28.35628713863763,0.7787954377674844,1.764401407144207,5.698846510753775,-2.7031647261535836,6.782624071984646,-26.699899502372368,0.840801559039784,1.729718116524787,5.752859859164482,-2.9498639457825004,5.1746115682097145,-24.914251010361184,0.8987558783452688,1.6959422686259047,5.8076091428432175,-3.190479663736906,3.515183574677685,-23.01607065580078,0.9593782893336474,1.6834756508551845,5.817801207940202,-3.4174067717192105,1.8022994635092482,-21.011722390295226,1.0067737408522563,1.6618316380775995,5.850295257077815,-3.629114222990599,0.047686269731854324,-18.889358665374196,1.058336436166953,1.594887781987852,5.814054048372298,-3.7882010069829763,-1.7187996309419284,-16.692095198092172,1.1194457821374215,1.5433275501896753,5.812371305180519,-3.955419715390795,-3.5039431220681716,-14.407607728018315,1.1712140937625528,1.5229273797012346,5.767321744829329,-4.093628332367409,-5.276901183297619,-12.027081357972783,1.2582704589468006,1.479002595176853,5.692652469195304,-4.188522274536209,-7.073991255818929,-9.602692413718955,1.2983211072101768,1.4341500535823322,5.615499800853703,-4.277792289967498,-8.873411486121013,-7.14124653942136,1.3508023146252854,1.4136760089489018,5.515868929935119,-4.350349239055891,-10.616467060296833,-4.658257098179091,1.401394597909324,1.3452405680137502,5.417167958894966,-4.354572216265614,-12.351013483175299,-2.1369639713254536,1.469763682403579,1.316328515342112,5.28293812563882,-4.38325984096045,-14.02247101866746,0.36311875692038625,1.5287513371835164,1.2636559816912538,5.124890988189439,-4.363661836334913,-15.668793047694733,2.8663345039445813,1.5684858633253738,1.2380259499651691,4.938473626263887,-4.320561314035195,-17.236672320403127,5.350239162081885,1.625508734747918,1.157223889297899,4.760061105851395,-4.263269687676137,-18.756162560345164,7.745647160488946,1.6652186309911885,1.1370204510853215,4.572925229353254,-4.164554715838489,-20.158422993056217,10.116170532369301,1.690762373137795,1.0966668718012862,4.379506725669614,-4.056357490478939,-21.461796091933177,12.402801282166596,1.7474523855892983,1.0375858806076694,4.157148392701093,-3.925139167031912,-22.660107281095915,14.550146493192123,1.7949881762397109,1.031066346426037,3.933609276389733,-3.7592301735577855,-23.736092413519525,16.600651525193037,1.8203570217704361,1.004605249582672,3.6775636908775047,-3.591715092224782,-24.679681699425817,18.503790983317902,1.8626095885407319,0.9541764837494231,3.410861583085129,-3.3871756573010554,-25.475000627362785,20.215445886543005,1.8838688220340098,0.9076091311163232,3.16701623843235,-3.1803434655002456,-26.084496636048325,21.766879539476797,1.9033793672473298,0.8776565467635403,2.9075387789739304,-2.9734820989012354,-26.523872059117533,23.088584013957263,1.9470325936407717,0.8465497425755676,2.6482524472915925,-2.7214990935523478,-26.78191056720352,24.163232402248926,1.9801935679322644,0.8453241152673667,2.3701831454615743,-2.472379184463121,-26.806040259628656,25.01947663541012,1.998280512921029,0.8025396210650512,2.102611593421607,-2.218915826819447,-26.598142585296742,25.569295170722917,2.002044832756361,0.7956436661247187,1.8315635961847365,-1.9850999788935093,-26.172029444373752,25.807024362419337,2.0640543271893836,0.7740305685617694,1.5836855695324497,-1.7239668467049003,-25.43997691157272,25.717973448378746,2.0514940214551634,0.7441692763050523,1.336166907181821,-1.4605999169993602,-24.485704816762247,25.257703019619004,2.074517047857284,0.7412483534808172,1.1064946658835975,-1.214131074094068,-23.188253232650545,24.400190238105154,2.081737577087182,0.7238368771956898,0.857961786246658,-0.9753526209055422,-21.57572362719732,23.159083344687218,2.0834645508633214,0.7129991014258142,0.6447683881680528,-0.7496223443802681,-19.64915884200638,21.429780269796556,2.0859345141204306,0.7003935769088331,0.4727119940743151,-0.5414010998245632,-17.37081310124915,19.232978085448984,2.0926203480517165,0.7001670892129075,0.33087382643018604,-0.3579154863784363,-14.723590079009803,16.539115717278083,2.0750220839127276,0.699198590887931,0.1931336191491154,-0.22796477121052824,-11.680259203257524,13.315064670967136,2.0877364959994886,0.69517196806114,0.07251560513965738,-0.11468056063621834,-8.229654607108069,9.45951704471676,2.0969350756047094,0.7033407953897025,0.0221148281546326,-0.017893247425172603,-4.337508006838221,5.0691986116706245,2.0810198724829787,0.708644717138363,-0.0023673057732391096,0.0026651009775004553,-0.008096644714071365,0.0009423860385118801
