Arg1
2.1845410501327923e-11,0.11231755844911916,2.036480917332736,2.0907363597910704,10.01652204960362,48.241098326500776,291.8396212894934,365.36530231335195
2.1845410501327923e-11,0.31324658785089365,0.8153470785533425,1.4504750473999348,9.82102509495662,18.28789567774702,155.81871378489183,105.34126704488185
2.1845410501327923e-11,0.49182743023859643,2.0196252327956286,0.7487036667507424,8.74972112617408,10.417928026119743,132.115995612794,495.8477697090802
2.1845410501327923e-11,0.30910942967969834,1.565001061051216,2.853302793268913,2.5433027595566466,33.33992037567354,222.9542164937535,226.0636380913111
2.1845410501327923e-11,0.33951396295326725,1.5784763928882,1.6299797241315137,15.396015266141108,22.11454302869526,143.27117477490864,199.64699941474296
2.1845410501327923e-11,0.3497780383591868,0.5281998238069655,4.181149308138914,16.434448563603684,9.94143135154213,65.76694851452231,455.5861374829562
2.1845410501327923e-11,0.17683261157106572,1.5221835819122729,0.661566054250262,9.918213347878632,58.277701226902664,112.19340343156837,309.54631833240626
2.1845410501327923e-11,0.3281885988974993,0.6384705159990948,2.3351878584338412,23.90270653386934,34.59408040850838,23.343762212551454,125.00230164883594
2.1845410501327923e-11,0.4983591998646336,0.2134960259522469,3.6427652775080293,18.828211865431154,10.940206219920336,62.65267739935137,259.96432552743073
2.1845410501327923e-11,0.20484686610391584,1.0231904024323535,0.5862257297669228,23.44984413273671,10.055737086868128,129.33737487539986,188.30531932581792
2.1845410501327923e-11,0.1622009426569157,0.27272504492286304,2.142754438936814,24.36871533574972,22.623199171916045,251.9114326685231,174.0270406915751
2.1845410501327923e-11,0.541774559234773,1.8352387680229394,3.3452863715937617,18.97676397478259,26.624789912652716,239.848041329333,603.9165151145714
2.1845410501327923e-11,0.4550242156962594,0.4494253100599541,6.765206206893077,7.730032272185151,50.85487807077374,165.46579912430542,512.7169836058968
2.1845410501327923e-11,0.37336268546522405,3.0584639992478024,4.4799614206163,7.721880091600023,31.630026211469282,74.37288447981572,420.49760803896453
2.1845410501327923e-11,0.46244079201936034,2.8869520298441214,2.219337897152653,14.485267957228409,13.22148315552169,36.29842086429274,161.76516866365282
2.1845410501327923e-11,0.1290487429333048,0.8682485740720121,1.022072539319183,26.69585705162647,8.839720679239955,194.2168124481345,28.568029874481123
2.1845410501327923e-11,0.11459137834695836,1.0282903104624583,1.7355988214776448,16.958376355413,40.98835138036184,210.28999135567352,354.7317137021724
2.1845410501327923e-11,0.16872811545446526,2.081120933185396,2.5660927794242796,18.133214799155404,12.797818812305355,27.43117877431761,209.34404393691315
2.1845410501327923e-11,0.07205524880038884,1.735109393684868,2.587424606226834,11.023357112150366,43.34203068321667,129.60393287380776,373.2370844704337
2.1845410501327923e-11,0.41113585276377396,1.6591525297909944,1.4466995463495538,11.24694668333448,36.73884637456687,175.8696126384405,125.93552326000979
2.1845410501327923e-11,0.16269223931450796,0.8962006149826484,2.9377250492029887,6.1673736950015705,36.22758045772924,260.07392319254825,188.36149144831694
2.1845410501327923e-11,0.13025832688135627,0.5985065253819063,3.307117212315873,8.38627764205998,25.8645369533571,103.69804894353688,417.85904204602406
2.1845410501327923e-11,0.1696638604091191,0.7790746460981797,1.507152108349586,1.441119682856649,40.41738640286999,114.40986522487366,330.0350578324727
2.1845410501327923e-11,0.3809351579166746,1.177120401814579,1.9903239006514255,8.946630540919738,43.13950549192241,81.11994040363062,392.9489051407872
2.1845410501327923e-11,0.14794312172897595,1.1284544505075502,3.0965273099731783,15.299102239087759,28.601291678505422,53.63907345623445,203.78534958503428
2.1845410501327923e-11,0.12184645398554857,0.9937262430674353,4.758306127501827,4.6206994589606385,24.20537567926015,142.25025464815707,125.09803306537174
2.1845410501327923e-11,0.25522857429178125,1.1198495619125408,3.4806441533498194,12.446141047320129,34.190357659663945,185.64180668910888,271.8200660981936
2.1845410501327923e-11,0.24841418637659665,2.046533754285065,3.796360273215192,11.122501979392974,33.019507383154604,159.85122542683695,250.77467541054793
2.1845410501327923e-11,0.3120638782585489,1.9020612128306946,5.76643535081386,9.382378392075713,18.36232150701686,143.28588288737475,272.6329538631798
2.1845410501327923e-11,0.11105326855246285,1.0747212066411014,1.0662824662419397,16.35964399443792,33.78307031627391,83.25456150549714,232.93808514492986
2.1845410501327923e-11,0.27865382894004526,0.5978276472891788,3.14093742698379,6.588970418331503,24.56638031555356,78.39492068150246,105.42074242784831
2.1845410501327923e-11,0.3520110656255723,0.5777393100456515,1.452229073774556,11.838456557311885,16.675378614264616,170.2576339238546,136.1883641361097
2.1845410501327923e-11,0.16019988289460813,1.6801611961193244,0.9090959945485173,6.735139296661391,22.821378260905693,167.28979486997505,139.40892313092522
2.1845410501327923e-11,0.3331624098252139,1.080191299644536,2.978712409773066,14.502647232432574,63.04405305186021,123.31238535928239,456.6815685843079
2.1845410501327923e-11,0.2324769501170703,0.30938177667072203,2.6802777296076887,21.799058578359958,2.4367835803346733,179.40811173407104,224.88979315266127
2.1845410501327923e-11,0.31891086144179903,1.255669127847824,3.0469550064475075,12.168272069021027,12.894415938808182,127.3127555615707,198.93727893722306
2.1845410501327923e-11,0.20298037623333381,1.710891406141913,4.855024604950845,11.034603387040749,38.26955401491274,35.60153768270301,286.79697792215313
2.1845410501327923e-11,0.232925301078438,0.5322289531274382,1.0814748429206553,31.317860036522127,46.103651926034445,100.07671034676609,353.4676583732538
2.1845410501327923e-11,0.21614675369155806,1.6219875803462254,3.27745408923745,26.346363850845634,28.250204314157354,135.16888770989493,184.49192462034608
2.1845410501327923e-11,0.25603463470583526,1.1730668149090415,1.549583774094254,24.898789027107416,33.50525846634064,72.67821386483959,75.9326112130009
2.1845410501327923e-11,0.16376087642754933,0.8739013903554858,2.830598173746167,20.346044577448254,6.755912772320982,150.5096829155581,384.1601635027672
2.1845410501327923e-11,0.45115421224774654,1.1089218925480147,2.214364450219029,17.39507036804057,16.964202821266632,151.65837973038242,277.75676506626485
2.1845410501327923e-11,0.18543890899226598,1.1040273040412276,1.252549199596072,6.7387459704877335,9.368272754172885,212.5584189507323,198.99002735309097
2.1845410501327923e-11,0.3360281311118305,1.8700820284566786,2.7944909776959954,12.58024215355732,38.4270604750131,154.40654041672667,172.20486556667748
2.1845410501327923e-11,0.26027228623813076,1.0347894454442397,2.834274913356032,8.627697135170042,23.853449905154033,96.71404568972453,450.926898875695
2.1845410501327923e-11,0.42756006598346974,2.0014358702396637,0.8811261969817563,4.969087843083635,50.73662745010575,205.5719561561849,601.2519407241923
2.1845410501327923e-11,0.1973136176310339,1.995685373823629,3.988239268088062,14.90777131267184,24.194551495376754,160.2783600940504,172.08242788243956
2.1845410501327923e-11,0.17427412447373725,0.12151769547408856,3.015013311713871,6.617729402927439,35.743498930165806,88.81701721295431,341.12117132602845
2.1845410501327923e-11,0.23982328046060383,2.625276893775875,3.3054785318802056,11.28419713243405,32.644127592406235,26.75119049359174,223.46523963287873
2.1845410501327923e-11,0.26626009518539495,0.25248308197490443,2.9667197952233235,5.802037101000077,24.267944044291575,203.07879032514595,333.46645814152896
2.1845410501327923e-11,0.3495646685608721,1.0144353883547603,1.9928833039059886,3.3133838948688683,8.05961782750286,78.29490162774024,693.2539492260572
2.1845410501327923e-11,0.04923298915887883,1.1397063879858234,2.439985516440558,9.008391924369066,12.303875663536123,132.0532389416781,54.2686398168241
2.1845410501327923e-11,0.5237617702138017,1.6019076453358476,1.166649067766833,21.941064687998967,27.831121798805746,34.62983808477849,215.27148204224468
2.1845410501327923e-11,0.11113881127971695,1.6032847858159112,1.2264923296560317,16.070927693859026,12.081300601159754,113.45575402449964,450.505274849993
2.1845410501327923e-11,0.028603381620570693,0.6008722628604003,1.3231360021393237,10.198787013940219,10.824280524169925,39.20127110212297,143.93166580617833
2.1845410501327923e-11,0.2007953054179948,1.1997767453778518,3.132386721231834,5.939073551837316,30.68427326823779,133.7898822191436,121.7747009580566
2.1845410501327923e-11,0.5791356735210549,0.4345570088471225,0.5383811988548162,4.4003860493224565,6.691753224447304,163.94105393548543,108.36035199140481
2.1845410501327923e-11,0.5348856245825664,2.3597981073360126,0.1957388980629653,1.9638384877525759,44.52051140390081,218.38593005734958,227.09065505760802
2.1845410501327923e-11,0.4618617461386585,2.0446512519368785,1.931824480684709,15.740324783058577,24.66321019241758,132.70086528942295,11.70586194270794
2.1845410501327923e-11,0.2548506826852546,2.1238428272210785,1.5522684823518986,21.114982226130284,10.012215350768587,176.9394524997563,268.27512461670034
2.1845410501327923e-11,0.1576245142831808,2.130817120563228,2.605880706086017,15.099228252008867,39.92552352923634,117.56814944959092,253.68401589782223
2.1845410501327923e-11,0.1382876924002743,1.0651198675899178,2.805622022795941,28.687898618107475,20.401571260667737,189.67033867466398,244.89578640476003
2.1845410501327923e-11,0.22902743889448207,0.7567866906159626,0.6181404130930374,18.91057617125467,40.99981480661436,35.87740759287552,164.82587560464535
2.1845410501327923e-11,0.3932535031679531,0.9789583889406352,3.5908661564484166,20.31636692089051,36.272728730036135,105.15053264033277,17.545881889069914
2.1845410501327923e-11,0.31587070102413295,1.363789850869926,4.199833996350417,6.131592260578496,42.17497185769847,271.45901109550925,498.16613512179083
2.1845410501327923e-11,0.3709603512867557,1.1997395525410177,2.3700302301292986,19.076472404651508,21.736559626919075,46.3888849068845,101.60860904998034
2.1845410501327923e-11,0.33297912649970235,0.8987138015051165,3.7743420630954225,14.169134766711371,37.24622103873632,175.9157000439224,546.3274669702713
2.1845410501327923e-11,0.178857891242235,1.088100450281118,3.1875311613120836,11.091409470774181,41.29991320780973,22.63814233464368,149.16486197099636
2.1845410501327923e-11,0.2188755293090663,1.1190534542431299,5.414249964844926,10.064893151811743,3.6799108406808125,95.04037801868253,190.11512061696527
2.1845410501327923e-11,0.22604966944632718,2.1286628408453807,1.1456177259348708,31.175271869529276,57.57628492570802,95.00593245773362,334.0967078250667
2.1845410501327923e-11,0.2400409689427545,1.7692726940008736,0.6618014991057103,18.415591362544703,20.054009871254816,256.99138781500125,199.6568005793901
2.1845410501327923e-11,0.19492234162215316,1.093441970700817,0.6419463295077019,13.15368431736297,8.13028441584945,104.44813777760541,85.65890433220896
2.1845410501327923e-11,0.31995567565449057,1.7064460285543586,3.992844075193605,7.477975545640577,24.804469859037233,77.99699258203167,565.9850867185803
2.1845410501327923e-11,0.27362102721844844,0.9065489827939369,0.9220069570428505,15.886391104820776,4.090769915037689,24.01342025249787,301.83663977292196
2.1845410501327923e-11,0.1324846933422216,1.4732015215926118,1.8550378234420357,4.284623484025246,21.526179716803895,173.37530474012414,600.1648226773573
2.1845410501327923e-11,0.191248020628229,3.3421131234676795,5.325916300411388,3.551726736589224,15.04794920070485,63.7593144572905,111.49335996699011
2.1845410501327923e-11,0.2925507310276881,1.0109681143916998,1.438810912012033,7.284949351284926,19.2060148711146,101.27433873377156,248.30974321969197
2.1845410501327923e-11,0.2242861537471302,1.4324770113494605,2.3055911527786175,8.867609858610786,30.986038189823606,153.1230977307419,260.53210366283423
2.1845410501327923e-11,0.23775840032722034,1.30223067087531,5.072289519462258,2.855123671816788,15.945234321016457,268.96312788084373,88.85650824270316
2.1845410501327923e-11,0.4837772035760869,0.7486538273678242,3.7662670673786622,23.63467390645454,7.77445783121379,104.45009193908656,245.170194401015
2.1845410501327923e-11,0.05406251500365919,0.33217334524298814,3.5780835682899683,18.164396406430946,27.26943179043911,35.58481048031552,220.68622406071074
2.1845410501327923e-11,0.4720347160772187,1.309567339459789,1.2654737168536083,9.059998686814788,43.374397390219926,125.0325558788027,383.62599634602003
2.1845410501327923e-11,0.13196715502895537,1.0355500350648188,1.1016790661405707,4.424280111578078,28.935356816531854,75.63907235164605,426.6878086177535
2.1845410501327923e-11,0.1206859995912372,0.7501047921851973,1.6517118732753309,19.47488950365689,12.286516389751984,98.46912205290634,708.7276761763277
2.1845410501327923e-11,0.16893944005767,1.2497929065384625,1.5411120947557613,14.79841852574555,27.45212312906611,23.50321181292258,340.3585645895538
2.1845410501327923e-11,0.32260036720592233,2.2799044747340322,3.2648078947795907,14.129525218807556,40.893380803902744,138.37686883901765,385.80449947714084
2.1845410501327923e-11,0.16485374531859198,1.2243901148167167,0.8664791343345994,7.433542328693497,26.946325569282482,107.4554828938746,247.11632998930605
2.1845410501327923e-11,0.22525287619288628,2.3935516067174087,1.8254582940436712,15.035902584669502,29.930579124640204,187.62923691790436,458.45316522516697
2.1845410501327923e-11,0.11868104710062359,0.8714177771840043,2.887053604599343,18.903462783625333,14.910836799821922,188.19655412074653,47.346625624215434
2.1845410501327923e-11,0.23577940154710456,1.169738706676677,2.2726168796377726,19.869283701947165,30.36872389122276,253.67256068187854,182.41664868893918
2.1845410501327923e-11,0.1712409156137323,0.5916879181389529,2.003924738844865,6.257328997976648,13.488314718599801,51.760011320274344,330.9414769598646
2.1845410501327923e-11,0.12170589827218091,1.5646810767882113,2.1964532292657504,10.868422133353894,25.88121695274607,93.61572956082351,491.41217805126087
2.1845410501327923e-11,0.2794905800991214,0.9824077252163474,2.851738950042834,3.5431108436285093,13.10666440647179,82.19265115262152,117.60140169819574
2.1845410501327923e-11,0.34402535939684076,1.0475679077598747,3.968596632331946,6.872907798720072,10.704648211120766,20.627287283890016,211.39846494121215
2.1845410501327923e-11,0.13278721954599823,1.162264293358235,3.1315525482486546,6.749207056648749,24.973868296297674,46.99005095049677,554.6674096249344
2.1845410501327923e-11,0.02428084708300993,1.023823365177937,2.112377926592859,22.08466952006237,32.33284551407792,110.26571563066312,201.46983639276345
2.1845410501327923e-11,0.1860002575734558,1.0846711140083187,3.012120105546778,11.645192098595128,8.893131994353876,90.4622760660536,149.86004878537636
2.1845410501327923e-11,0.41743641716757995,0.7380871404586833,0.1512060228952288,8.231820475412643,5.133119708122828,61.59999939799103,195.62543268545159
2.1845410501327923e-11,0.2051543036444664,0.59642875604221,2.1826936051965307,17.845773976262898,15.370565902246328,18.620435343433567,301.18696631832694
2.1845410501327923e-11,0.08767692076880554,1.14307374354778,3.586612390878491,21.520242427093518,30.14586779832319,95.19886800841704,240.05967748136183
Arg2
8.904571375064527e-06,0.029746937603271822,0.05079115504361302,0.2254320263182108,0.8713228362553388,3.858247651470567,21.657861004262358,21.87791980145687
8.904571375064527e-06,0.01591975051308359,0.0837927046798144,0.012681650902595928,0.42741492465046904,3.022517669075647,3.630263485595421,22.740984979848534
8.904571375064527e-06,0.012631532239495754,0.053848921014257936,0.09005880804196614,0.8337445702155957,1.0238937678408597,21.70880159409556,8.588563826233681
8.904571375064527e-06,0.007410081147212983,0.12414820195868097,0.08841368539315116,1.1498008400214452,4.447301750064532,20.21284068297652,10.32464003137714
8.904571375064527e-06,0.02272320502593397,0.03405569757670199,0.21277580711380012,1.2271087023438338,1.9770197705798982,2.4151376508822864,8.147949403838654
8.904571375064527e-06,0.03822246579134204,0.10668875196606295,0.20549387595081886,0.3361943392908265,1.6981435834302407,5.288916481043038,29.678889758315645
8.904571375064527e-06,0.020251980671935864,0.14981273884336793,0.2699886945048436,0.5312949063044639,1.2645081110626182,6.636389048428523,40.20940175259845
8.904571375064527e-06,0.014947763484001774,0.06628109417441344,0.446194417963101,0.6288557474378751,1.1371040238632983,4.368271234062268,1.7992172071726633
8.904571375064527e-06,0.01458409848666104,0.06941605616521572,0.16307780433912727,1.7064213776675863,1.0981347639231493,16.49819802148871,16.44351240297862
8.904571375064527e-06,0.012015905509136428,0.09325918545077917,0.04014475468216921,0.07922559145480915,1.963393493913667,19.575554409124848,25.241894454802264
8.904571375064527e-06,0.02675628375395586,0.1434750086867756,0.1298201417978981,0.748569173274256,1.3639313521078171,7.199497272006496,30.762870636632584
8.904571375064527e-06,0.02492921508869787,0.1418546996674175,0.15537802726643474,0.7872576036004604,1.8555773881087412,1.419785843426051,31.708079839651365
8.904571375064527e-06,0.004307653139258318,0.10701901209917909,0.39836849145340986,1.24556945051852,0.7557780833364222,13.993147910026234,21.727987727904186
8.904571375064527e-06,0.013492035639180347,0.06664761987521522,0.05951720737861407,1.6541261431038101,2.3361154612203068,11.230561929925706,18.322540194751227
8.904571375064527e-06,0.017077578309700484,0.17399689037880453,0.14913799473824627,0.3432418491799934,4.023995628452724,11.858047757152768,33.325335394791516
8.904571375064527e-06,0.010228045493264323,0.052420146682339804,0.13927372306017607,1.1335584929561604,0.6517033056432652,2.9286668075888493,1.7295090347415678
8.904571375064527e-06,0.01312641399486774,0.11943777236353843,0.12367784665334758,0.915571161541633,3.2276427153785288,19.07681297311201,19.95803839991116
8.904571375064527e-06,0.010025179550272018,0.07682257417993944,0.21293540773373915,0.6661495478719014,2.420218036629227,9.138120107115503,19.4349071929912
8.904571375064527e-06,0.006138728884541717,0.070005226253197,0.14451870491610272,1.2481686669250887,1.05640143219198,6.914918398532197,14.543522477000971
8.904571375064527e-06,0.009568785129928049,0.108855745794247,0.08961200285958454,0.5302736185205321,0.4409287486713069,11.909108459393815,9.690831734285
8.904571375064527e-06,0.033092120572980124,0.11292175906028619,0.38085879716014165,0.6818139165340856,2.6968510181980583,13.329972531186092,8.116268857670493
8.904571375064527e-06,0.028548668887442032,0.0406406757665786,0.05605467592724764,1.8024084027324605,1.5319795784917318,8.250275051814615,16.91765491810641
8.904571375064527e-06,0.016136878797837984,0.08680898715066784,0.17865709448776082,0.27333016890751777,2.095895626843764,17.362635395042318,15.424741587582094
8.904571375064527e-06,0.032580434716641495,0.13645160768281056,0.1422894612340901,1.6151397493655708,0.8537763245768816,5.832420150217247,19.265190313719977
8.904571375064527e-06,0.02371778827336673,0.15688905606665243,0.3382492050483381,0.6970939898803228,4.2631112439449685,11.021933220945971,17.52876067619765
8.904571375064527e-06,0.018328123257149605,0.11764804763997225,0.1794146764848866,0.8729608997627532,0.5628798263343538,12.349846950864489,19.66173528095487
8.904571375064527e-06,0.025550872872290544,0.11140887712541518,0.1519997628407136,1.4586069096465735,1.642153308479787,7.157179216942914,23.220959924349767
8.904571375064527e-06,0.016785791002944715,0.07618794491393494,0.23412294816515924,1.2272366733776086,4.715024349148037,13.326287445976963,18.94542486369849
8.904571375064527e-06,0.02056606325019639,0.08856958142385155,0.307526976523721,0.5676215284998214,2.9298891017092688,7.460402129222393,12.311656634760551
8.904571375064527e-06,0.01912215881579832,0.15170475458477384,0.2946570355052612,0.20876480467060518,2.741090635716583,5.981051297407079,16.32010510916724
8.904571375064527e-06,0.024020924743256143,0.054384662012886324,0.08148483992884734,0.6230431396642071,1.9783287846701876,12.95400355206414,13.047988614128313
8.904571375064527e-06,0.028273180047000617,0.10464126906974662,0.13112981872511495,0.6295307222893829,1.5973441573367377,12.611850474277473,10.366311267189445
8.904571375064527e-06,0.005836428589314356,0.0927314680473537,0.1222237703363844,0.93180956994195,1.1730369129840994,20.081963420021843,16.690154434046686
8.904571375064527e-06,0.027177536054429324,0.09374906225290401,0.18080465211433175,2.7645222237477625,2.937392296216062,21.33226977289766,24.633988345143024
8.904571375064527e-06,0.028951187245731508,0.05675300544926294,0.2874716160381199,1.701623542845809,2.106562121850763,1.5688397148984112,27.13605657724
8.904571375064527e-06,0.03396307675039221,0.04395188022970607,0.2051317357954654,0.39589650823947325,4.072200935114688,7.861778163441081,12.612749561190242
8.904571375064527e-06,0.014103529501623076,0.15219378951653023,0.256013724979482,1.3520400851603707,1.585755283391674,5.160707438660168,10.774010953976319
8.904571375064527e-06,0.037969277408438605,0.08643601176375582,0.07440205543465599,1.2640078122227107,3.352070394892311,10.8891654623259,12.27643490454374
8.904571375064527e-06,0.035727206249589846,0.03039647157485849,0.25736209484321204,1.008887736967463,2.2988202438392205,8.589160495827311,12.07558142534756
8.904571375064527e-06,0.010255038389171366,0.02602559798106426,0.0967053157602242,0.9248928300780359,2.4504492140756233,2.0746047953515414,18.08286899809228
8.904571375064527e-06,0.0056368040896245105,0.10248640051171123,0.14289066107288023,1.1575665199189316,1.8694672297254495,8.166831538581897,22.763806671692553
8.904571375064527e-06,0.0119063388530869,0.07506486412541297,0.23954555640859684,0.10354246125122399,2.545108176686964,14.422053704448224,20.682479932584016
8.904571375064527e-06,0.032029871890130734,0.06252345272994253,0.04538176431148715,0.24866925700439677,1.2351086406948635,5.215015006741935,19.837145244375076
8.904571375064527e-06,0.025898367925276552,0.11174286047242216,0.06646042542097244,1.4018448485545834,0.8658382302595232,14.554320369782621,25.4965979540613
8.904571375064527e-06,0.006119329510310864,0.08762818499828268,0.07273789856202675,0.09361856851688843,0.26781906048364434,16.286571307239644,3.1518333060144474
8.904571375064527e-06,0.03810719285050979,0.06564284708057626,0.11597247615322497,0.9284707169685611,1.9901335608260042,7.084765925821149,24.198875659526767
8.904571375064527e-06,0.0007199686114084998,0.0059797416534342175,0.1091336148565347,0.4758734561545729,1.987442536089624,15.477357337390075,10.098029975303755
8.904571375064527e-06,0.009244160914021334,0.08166878288686283,0.4483366733084013,0.4314738674742761,3.0337387099425075,13.227486482281252,15.57861270771439
8.904571375064527e-06,0.0053109373740189625,0.13701438839087962,0.21445817525577032,0.8303292021814725,1.4123462153558266,9.371713584543745,4.967196687448848
8.904571375064527e-06,0.017922861257796734,0.11974868418785596,0.19809347561262736,1.5364852213010691,3.6981396903329316,4.640619156663569,24.589129926670378
8.904571375064527e-06,0.03950659702453658,0.05701758054641105,0.09908301118797115,0.5669570892317707,0.30029374025572014,5.5932759572791095,28.85691273339732
8.904571375064527e-06,0.007092435973560828,0.04035062920453988,0.018731527654867658,1.6453332577922863,1.4989286598896248,13.953330889422494,32.65721931731604
8.904571375064527e-06,0.019074581801382405,0.12337789186379061,0.11890501987289558,0.7872320723465931,2.8239477013489784,10.38212887439056,13.160154462949247
8.904571375064527e-06,0.030167571719904945,0.04736928982738284,0.18720927741194224,1.8817073520939072,1.9800121527447172,5.720440559683625,2.271364791264508
8.904571375064527e-06,0.019520215410683238,0.11318536437315455,0.1595524252018015,0.5956282246376907,1.7490879309452354,10.11172604783373,16.302453253604934
8.904571375064527e-06,0.047372583137477685,0.1682195500384433,0.08201667337869663,1.4506939713572349,2.837653866920636,21.769126627582306,8.960394826911848
8.904571375064527e-06,0.017220686468867756,0.09237544040006387,0.41299861783192926,0.39651055171552935,3.6891025327056353,11.490670923317914,5.287451161241825
8.904571375064527e-06,0.022936311515592566,0.11837081919891179,0.23987756047798683,1.6672681503824434,1.8280848367791052,6.073526736636303,16.602384193057016
8.904571375064527e-06,0.010338632362936463,0.11756253846375732,0.08213520749214007,0.6988208208728826,3.4056065321005264,6.918075847893002,32.52445446030502
8.904571375064527e-06,0.00852476722559252,0.1447853439716973,0.07725758728886274,0.4217384073942102,4.405468981897658,6.371707980001085,12.847730387007957
8.904571375064527e-06,0.004389600924704897,0.03531815072897243,0.12855656725171427,2.113761393559898,3.622958504257445,5.773106657836878,13.450699768644622
8.904571375064527e-06,0.01857078990749888,0.08896297237299489,0.08883747788407308,0.8908201582007621,1.6968238588494224,9.551724730514762,17.193725636725244
8.904571375064527e-06,0.00876898261419843,0.028599970728176213,0.1854172681954807,1.1118406423466967,2.568447662941386,5.073641349828745,15.308367045804543
8.904571375064527e-06,0.028858645174538625,0.02370560964109147,0.017056253684512464,0.32488084153620744,1.9734270227132773,9.171644344278635,17.75875301791078
8.904571375064527e-06,0.020547802528496834,0.19868896312235662,0.1862184160421901,0.3098280478883084,2.1872670205817877,16.079911545716147,33.228278301599225
8.904571375064527e-06,0.006380655008045907,0.05382330338634933,0.1742041354597515,0.5746785546001054,1.4380253792695175,14.570525517222295,23.31593765565027
8.904571375064527e-06,0.011991091860297651,0.14946531957837753,0.1722491290548282,0.5757037780213176,2.987497980188947,14.021818140304788,44.35195992697875
8.904571375064527e-06,0.025071738512082536,0.08142265794531356,0.09405743694139548,0.5386561910797076,2.334380665018914,30.39235468787088,18.640057233377597
8.904571375064527e-06,0.022408927605648533,0.04758187935610948,0.3545724125940903,0.6923365294935568,1.9955926984743928,17.02479307452417,20.79906374118696
8.904571375064527e-06,0.006984255021497116,0.15759725196247543,0.2734575549170035,0.22056491048131943,2.407902952473665,13.319958977796233,5.451431901240278
8.904571375064527e-06,0.026918725294507454,0.09717565595292992,0.19152658294872157,0.8642376451209616,1.22078959758889,9.065322704218314,25.963742420840973
8.904571375064527e-06,0.03285796957433273,0.049798880446277775,0.17010144711607192,0.9625701135976288,1.206508920695459,10.775480564028305,23.75843997983797
8.904571375064527e-06,0.01621706224560218,0.12022499711210793,0.12661892851413228,0.7201291823898573,1.0235656756828522,8.982796283076489,46.438922590119844
8.904571375064527e-06,0.008079160676660976,0.041365740858488466,0.08038722394082436,0.5026868707030552,2.803459796151142,12.419278997052103,14.071035885703127
8.904571375064527e-06,0.025604025737302773,0.13314373665116278,0.17910165189993418,0.34670472347874187,2.2619607037590206,12.55693379680551,15.50885146458994
8.904571375064527e-06,0.01689961020307104,0.17766104207264993,0.10904661169652169,0.5007887231552873,1.639461635744391,14.519167167658331,36.678238084430504
8.904571375064527e-06,0.017692336882284436,0.09683772608463423,0.06838045283127055,1.1084438666196683,0.21436439364303855,13.228209572344593,8.076415496627195
8.904571375064527e-06,0.030424032575919916,0.12927022981189837,0.18438021749029285,0.9013838508055608,0.5795230420940566,1.101167312232527,9.382915689700814
8.904571375064527e-06,0.024043629838314977,0.028613326206546687,0.258587884712047,1.0566542538521104,2.9570131503829673,1.4135824897826452,8.993423747844565
8.904571375064527e-06,0.027235054947212102,0.07561732007576884,0.27416480528015935,1.594169595677203,1.1268107567882493,5.151120526864574,3.6182767991581453
8.904571375064527e-06,0.02831794739616368,0.10519917482959273,0.2844013730893816,1.2594669082067818,0.9865008813495546,14.135232548066625,6.9225200932493065
8.904571375064527e-06,0.007615309251600988,0.11236213786265008,0.05869547866790731,0.56069060482669,2.2114582179080253,13.797160090266098,23.754201874969727
8.904571375064527e-06,0.024440239561328368,0.03885013549338948,0.08374356195394775,0.9852288639670213,1.5404770444410785,7.802116465978391,24.881766572796113
8.904571375064527e-06,0.006255591220296209,0.19625657493567467,0.22907871140303684,1.1473437358340717,3.261405875861857,5.52107511276186,36.39983160966381
8.904571375064527e-06,0.025775718873767946,0.012664779173483413,0.1350354142905359,0.9612245732072701,0.8396092436145492,12.75821071845717,19.42124823536979
8.904571375064527e-06,0.03229705892815739,0.1394089500071904,0.1370620497214175,0.9933798836894626,1.8580205860240642,2.0163488265136804,8.12877099225908
8.904571375064527e-06,0.00934469035398899,0.11827139860598108,0.10076055227640099,1.9676257394954542,2.426721093651286,7.850176265579354,19.245072886142694
8.904571375064527e-06,0.02778963510580511,0.14136117264766598,0.019186063221201057,0.4810866745593267,1.513092944702889,9.565959677073524,24.70074610060195
8.904571375064527e-06,0.019348268159910323,0.0938397807151389,0.3055621494359196,0.7482923577038291,1.2886521214764122,13.602610692950353,13.167886630314175
8.904571375064527e-06,0.011301080476842383,0.08268374016054034,0.1042360194907903,0.7484703468699536,1.3641042621661343,21.678850115112965,21.492125113470937
8.904571375064527e-06,0.018694692606052086,0.11619973058969155,0.15605736863003888,0.33076430532980894,2.2453042349947334,1.9162790484278827,27.084054936991734
8.904571375064527e-06,0.0179450433328019,0.12539596666437977,0.062325728128729566,0.8122813620971859,2.470077034404028,13.58012459273323,44.95314980589239
8.904571375064527e-06,0.010959655685430454,0.11485212248377337,0.20356021543853067,0.3956941859073816,2.4077976202270577,15.802095633528133,20.78849835004659
8.904571375064527e-06,0.01953292374939361,0.08990784315906392,0.06238979098883659,0.2867016501594409,3.86389323720368,11.304018729939811,9.634419547568891
8.904571375064527e-06,0.009092990421442392,0.16033781103861267,0.30622082327629124,0.54272267431086,2.189173489100614,21.66960972653093,9.79375617738002
8.904571375064527e-06,0.041041169905376186,0.06659835196792008,0.03737933373023311,0.8988906004542692,1.1375256165359535,9.16945136810377,43.92981004754193
8.904571375064527e-06,0.001431465393412543,0.08389804718725784,0.18744005906318736,2.125573748641887,4.238265222912942,11.644602079737652,45.406643570160576
8.904571375064527e-06,0.012333307592651435,0.1194332853767272,0.14587892073591993,0.5534752215317538,0.7953351327255922,7.39714520292131,27.169067659238824
8.904571375064527e-06,0.029874191174805515,0.04221756876223716,0.02348833162279654,0.5494502322356869,2.726064716002859,7.4975968833572155,22.981675005686046
8.904571375064527e-06,0.020973202610040667,0.05168607771460746,0.10541265015631583,0.7293751245100705,1.7272528295400678,9.216954444572952,29.982398487279852
W1
0.02004168567200992,0.007191524058919799,0.3388327229834428,0.9979473842348506,0.17317244686197403,0.3907347822934243,0.46291404451609686,0.6364893464715762
0.02004168567200992,0.5127299448165633,0.34003371049112274,0.9146220724579248,0.4440382872340848,0.5484994735129599,0.842779444429151,0.40097146537228207
0.02004168567200992,0.9969376852449461,0.4138411757627597,0.9989284029573339,0.6439148528721071,0.7473640758341309,0.8764757767990009,0.7788355550184335
0.02004168567200992,0.16190126346588501,0.150962379917864,0.9971243711943755,0.11535434157117999,0.7314724091911585,0.8710666802679473,0.5439381135751077
0.02004168567200992,0.9956406781955802,0.9837407788512307,0.9909115392137221,0.4135125163732857,0.4874187459762405,0.4175978420492552,0.5902810137042819
0.02004168567200992,0.9999538669774107,0.9906112828221759,0.5746901029578717,0.37620346177764447,0.5081692455360924,0.9219522835485706,0.41694797194671057
0.02004168567200992,0.054928376442629476,0.08756191879276987,0.9677246752197809,0.6369745351328046,0.9852120541363134,0.5311636793613994,0.903684698901695
0.02004168567200992,0.03977702094359343,0.23228133901436174,0.27389034366451975,0.6985833910735214,0.7068051575460724,0.9850846446997731,0.4193836560962187
0.02004168567200992,0.9985849002768352,0.10100903137505222,0.30228442622149,0.7143911399911186,0.2682224607304505,0.8249384897032209,0.7809545492396126
0.02004168567200992,0.9988975576766771,0.9955075228611412,0.9912788843098924,0.15884748177743224,0.12843256730385116,0.48763139399937816,0.490086785354573
0.02004168567200992,0.9972279643658304,0.8992369172048458,0.9531103961513696,0.7824411785536308,0.834523150186911,0.9509161150695002,0.9137660170185816
0.02004168567200992,0.014568021901189311,0.8793138144938085,0.050956551283204574,0.06730790734950161,0.7436675216073497,0.40345078788581434,0.15010694271286196
0.02004168567200992,0.09084734988210147,0.9718638326280327,0.798838066633514,0.8385716265237085,0.8085776833476418,0.37083542005802517,0.4496082421133184
0.02004168567200992,0.20265919793615772,0.9523534472876253,0.22408936301923602,0.3249292881330082,0.7583109864220431,0.17759538004284217,0.9019221273023855
0.02004168567200992,0.18853752469643614,0.5563280310917239,0.9834019922419254,0.6894082976892745,0.3829292675202294,0.3879583975078872,0.15605258407348158
0.02004168567200992,0.18592007362605698,0.02626656709576325,0.9650754504540567,0.2514803853043728,0.32159183042778705,0.18590177854488246,0.39312606399548894
0.02004168567200992,0.9975210637924541,0.46051849403840994,0.9474801476536024,0.3595447428664449,0.9761051444004081,0.8866090494045511,0.6357793518621907
0.02004168567200992,0.9998370416218505,0.5823365669001234,0.23569668147192227,0.9752836458210938,0.7819151127352705,0.5761338181082474,0.43173133198483515
0.02004168567200992,0.04543415612421498,0.1445464148289512,0.6045916818944449,0.8064099392417731,0.8277128004974614,0.947027245252831,0.9248255630715703
0.02004168567200992,0.07417489219163866,0.9893212882786591,0.9883330589002779,0.5705732258011438,0.3868945622403887,0.3051652783262486,0.47465173346016454
0.02004168567200992,0.020631363212903948,0.983137235663008,0.9894489710481359,0.947450881947784,0.2102065110589734,0.9461116274123852,0.6487259728404767
0.02004168567200992,0.9996370274003195,0.9804980874716691,0.9862514613425589,0.03521868199947075,0.4305772763966363,0.42786408078672444,0.7334592359182053
0.02004168567200992,0.9977910769742306,0.9694433699782581,0.9982304874074026,0.9890938895131111,0.775346390577319,0.8900114070000935,0.8100807638873542
0.02004168567200992,0.06916160026971367,0.035385397723329305,0.8354553480403574,0.16392498049268153,0.6211083068137355,0.26427705913216076,0.573546119856464
0.02004168567200992,0.13885658674983062,0.9978422168516508,0.5098807712404995,0.9763233914858682,0.5163878738847862,0.7469666384811758,0.8787007024135474
0.02004168567200992,0.08830607451528909,0.19383527690846478,0.26413831166266905,0.27510739588947736,0.5195713610555064,0.2826559931290567,0.2549752055954084
0.02004168567200992,0.01203223202846132,0.9758424108819873,0.6193382246128741,0.7945919688606354,0.27812767615224676,0.48020897607860913,0.4324673876203533
0.02004168567200992,0.99996028198982,0.3123539324887178,0.9895539021682016,0.8521654685123908,0.9504745183602057,0.43930965810149103,0.8922007659375526
0.02004168567200992,0.0666921068935557,0.8465187251010211,0.16216936238024218,0.3737183471278831,0.3591602437731597,0.506513271756043,0.8770262642518258
0.02004168567200992,0.9997237768467293,0.5008194371518199,0.9901667460264276,0.6124564921338369,0.978638865115562,0.42979083980324484,0.8939533861292049
0.02004168567200992,0.027239433514049706,0.961742297247672,0.9227188484736987,0.3804471511491547,0.6282885914863783,0.7188066759349461,0.8407923924390351
0.02004168567200992,0.9938611246065764,0.9567327830033131,0.5141114242127759,0.803027532337524,0.3014842499559502,0.7844192239016907,0.8780749548673319
0.02004168567200992,0.10163731802950318,0.8888664925408005,0.9656619672973175,0.3551271398769307,0.1185430869563901,0.25367505071148133,0.5517335434888593
0.02004168567200992,0.9876388600653662,0.9661428905479107,0.9919357990538681,0.9050663468714195,0.8708547595635576,0.49113393942505185,0.453308619951056
0.02004168567200992,0.053421638947488644,0.15814547981937344,0.21608514544834137,0.5719198237998561,0.9655698049035186,0.8760466056260171,0.874468923234058
0.02004168567200992,0.052577712392090456,0.14759349914348938,0.18124207601937947,0.5777450889944221,0.8207349544604894,0.5354196790002362,0.9079853914842975
0.02004168567200992,0.0032232759225139765,0.9765899360313891,0.5587407752772441,0.36619283684861154,0.826646262254608,0.9191197697358936,0.585589754858962
0.02004168567200992,0.13281386983241053,0.8593244113184229,0.9817341832559591,0.8744283730322241,0.5044844466516957,0.6430417652103306,0.6262305412336174
0.02004168567200992,0.9932842256253943,0.7180881967317095,0.9560324313075607,0.31254171827047206,0.7334740745397442,0.8927496026609847,0.9121310929173485
0.02004168567200992,0.1178271200909348,0.562654624840236,0.9980696239535974,0.9039759329613337,0.36408925943353354,0.6473997666985103,0.5744158679631505
0.02004168567200992,0.999142028231413,0.9871612815990891,0.2782473318767623,0.8578918060243222,0.3868977268438227,0.8777930356471201,0.4920082071688554
0.02004168567200992,0.9944829888980206,0.9817815024308038,0.508884364176792,0.3220099883607895,0.416300380578772,0.43018301678349097,0.8438410206074868
0.02004168567200992,0.9953018744386722,0.055467283036864906,0.6171262530086212,0.3511893083571357,0.3113924191939356,0.9353699733048602,0.5639732303142357
0.02004168567200992,0.05363212081955205,0.9967615697513972,0.372698712708631,0.4541152922735299,0.7113698439468708,0.8587526631125334,0.3840277743529203
0.02004168567200992,0.1717439293392342,0.9847789594790431,0.9762879611065696,0.840741749438349,0.537363368077143,0.40181304793622774,0.4479429809171025
0.02004168567200992,0.008670792432476513,0.97124519939979,0.874201348775014,0.3261681804779374,0.324878618619257,0.5450971531930568,0.24018655140900144
0.02004168567200992,0.9759852768933307,0.2707696173683161,0.9623807701208636,0.6101711224603161,0.39995693364076734,0.7061458639570237,0.5800226980447073
0.02004168567200992,0.16746060854179756,0.7567742914807024,0.19074004742105416,0.9102360444508143,0.9466479880478197,0.36033018714788906,0.5283707857542748
0.02004168567200992,0.12099147102066313,0.4103963890080969,0.7966076493064137,0.7186554163063693,0.6360592840622347,0.7142801575408753,0.6283425142083218
0.02004168567200992,0.09157069211067749,0.435033612491239,0.4365232863559112,0.7730523190896265,0.8227715014135182,0.30332642465789256,0.36263880603878823
0.02004168567200992,0.9882963480598045,0.9895974875776846,0.7743875160235811,0.9053695742347705,0.9359801773670093,0.548544587283014,0.9374687963784427
0.02004168567200992,0.06786302636145627,0.3561325460775086,0.9794584990430465,0.7219991024848894,0.1466364175954364,0.9538063582295988,0.8465892508697717
0.02004168567200992,0.98035600879455,0.9825483497969667,0.9344989303882765,0.8514386743963748,0.24507201638319487,0.9663288585425414,0.5649632707558996
0.02004168567200992,0.999269404300821,0.7543654559029634,0.9870593981735148,0.8828307113495393,0.8935505759607256,0.38759325487377067,0.7790707336404921
0.02004168567200992,0.9994391281351909,0.11847956379851685,0.9609628774540945,0.21093387511681946,0.5173736445180929,0.5076105517380519,0.9105052960282142
0.02004168567200992,0.2645806775694287,0.9888851563096364,0.9922529858195261,0.9414392033558264,0.969426947997294,0.4418385434769314,0.9757781512764634
0.02004168567200992,0.12437324053220286,0.9986803950552126,0.2086079057049974,0.7963741091474128,0.9367820847596493,0.9950443010592964,0.4264123575820563
0.02004168567200992,0.9949453731400209,0.9937373800637155,0.07181380306864575,0.9345086211580914,0.8051471583387304,0.3842654233807549,0.7111369830087048
0.02004168567200992,0.9818215699216399,0.2252758957303346,0.6867887166083176,0.542372484161925,0.5033993314176929,0.9051938707200058,0.6170237932340481
0.02004168567200992,0.05669105252034692,0.6057002261288774,0.21454462692503484,0.631822018107757,0.5981717123080674,0.9026874808575995,0.4299244500328037
0.02004168567200992,0.977210652014979,0.8625790723476437,0.35413887493348517,0.288508105295223,0.9878115944887148,0.463814832991435,0.43010492489932795
0.02004168567200992,0.0658788817190585,0.9535233072926422,0.8937770679975616,0.16866273254425504,0.46293504411795555,0.9380036412388586,0.4693266004950556
0.02004168567200992,0.9906071040791391,0.9914331869881118,0.6970620858682991,0.8127452681994501,0.9935115998108808,0.4655202075870881,0.27150772452980165
0.02004168567200992,0.9959500241003599,0.25603575343367896,0.19291955345659537,0.26242796600439555,0.1491934279288118,0.353174612677001,0.8674013429779514
0.02004168567200992,0.10654321877671243,0.3215588010327731,0.4927702993562633,0.9417820582476535,0.9343997984224686,0.22634883122051108,0.6818737510213561
0.02004168567200992,0.9719838966367449,0.9976480851343009,0.9949487922522483,0.7661315013619849,0.17977898272700324,0.8002111941291511,0.510915617473301
0.02004168567200992,0.04022614476615355,0.4853137290151069,0.25399131393495045,0.279951169518387,0.9876340133754663,0.4985439373305751,0.8205171520908268
0.02004168567200992,0.05765926674098298,0.10427524833894626,0.12750122267221925,0.6814134307758829,0.3329109074306266,0.30465277457516887,0.9149536184704501
0.02004168567200992,0.06561581250447064,0.9984832961108543,0.9903636128155101,0.5793684367034251,0.3425859361638305,0.43786864907926026,0.4333706050777622
0.02004168567200992,0.022953738525934134,0.158213535464018,0.25512930588227006,0.4240568552744371,0.27400429651510494,0.4619987275681891,0.5145505535827537
0.02004168567200992,0.09383327001292027,0.395160892161348,0.9935687001937936,0.5333720487743036,0.8627513783171717,0.5410058874267177,0.45701877251783624
0.02004168567200992,0.9869582524791245,0.42968658119003944,0.21339640960478373,0.9507842896608831,0.10052347511342533,0.5154168297174093,0.49940053357818837
0.02004168567200992,0.9861917521522907,0.8727393034213095,0.1942823884033087,0.3377306918927764,0.7409186932151499,0.8942101992050476,0.43887255269244485
0.02004168567200992,0.9979469146148262,0.21754333114882768,0.99407032369211,0.9995794581801066,0.9835081747365385,0.3593665569539546,0.45181195549524106
0.02004168567200992,0.06347416556094579,0.9786703649804156,0.9765950003125258,0.8549228888998694,0.47449632025993926,0.8532724117763041,0.9964413962934117
0.02004168567200992,0.10610916296246972,0.993123944002756,0.15283015438571054,0.1618708981327875,0.49437339804536656,0.8944221897244532,0.6633194414174505
0.02004168567200992,0.09186235776490588,0.024702875895264015,0.36993349348510973,0.9074864748667291,0.512211711508513,0.23115225664241265,0.8869079735927331
0.02004168567200992,0.03545304536931437,0.07824818776032096,0.9833317576113116,0.3611932235481961,0.9021093483696974,0.8926096274786159,0.4240886765139555
0.02004168567200992,0.01594374730576346,0.2503785275395027,0.17061006108827872,0.8532167036238184,0.9138774142012039,0.42667709751695515,0.6456119962467803
0.02004168567200992,0.09943548955092987,0.9923716179956653,0.9978649129440958,0.6907853210463704,0.8196469390128264,0.9679334645697911,0.5847681186620631
0.02004168567200992,0.3932281756549747,0.9769893897159149,0.9982623567128807,0.885238065422891,0.9808770293810856,0.5632367377805683,0.42439932562744864
0.02004168567200992,0.20921526972544327,0.16755526115189925,0.9662045189820903,0.9111811667507028,0.19223222884110736,0.31085022210551855,0.5387238327038494
0.02004168567200992,0.08859013270881635,0.9462136673898166,0.21323263447697513,0.7770246570869939,0.9995111580878211,0.5605590603463704,0.5537541061805956
0.02004168567200992,0.3217105590231519,0.9985275512916205,0.9860096877882636,0.9807577339699531,0.9814283239562649,0.29803252431927946,0.19801469400914684
0.02004168567200992,0.030258598949284322,0.4746383809705461,0.9827472327229537,0.832852060302988,0.5489632041247668,0.8312158272481482,0.4488517742070366
0.02004168567200992,0.0823564004633376,0.9810717024630103,0.46745944986979976,0.1271863555218739,0.8631366308058404,0.8744572259278032,0.4686913357469507
0.02004168567200992,0.0956261533745811,0.7302348568732834,0.24659248547339954,0.05852099889759682,0.7559427351821165,0.4106707530614351,0.40899711705563596
0.02004168567200992,0.9915923258376969,0.2582390944219211,0.7760459819972426,0.9555521367497548,0.888661144779679,0.8273527045456612,0.7799930219370743
0.02004168567200992,0.005974865602563761,0.8919810600131046,0.991812403113889,0.8218238194976313,0.5592378573581902,0.8364156904340647,0.9395585123495361
0.02004168567200992,0.07768942722889408,0.8842002391906744,0.9883133943132287,0.9864359715158715,0.4704302104560942,0.6845207186998573,0.8825931862758428
0.02004168567200992,0.024264303623626166,0.9994836372773599,0.7359429029677464,0.6423737719852046,0.9954899271030465,0.8124150854607977,0.8084217411983277
0.02004168567200992,0.05118904976799951,0.42018705628021613,0.9691146570666453,0.8797272422401566,0.9986551585281233,0.9120314013969816,0.9195228169822691
0.02004168567200992,0.13101177832375524,0.9402612964291847,0.05415128688895947,0.6643564731746491,0.4037458664944943,0.5296614091672666,0.5292539779300375
0.02004168567200992,0.9875605232974218,0.15920027523965488,0.6446316529033232,0.26348173428537647,0.6673872260563674,0.17236426553449352,0.38600895096491267
0.02004168567200992,0.9999445916403804,0.3554900530689063,0.9830223674993009,0.9896733069699237,0.39325870469128427,0.9513709975508288,0.4958219839502337
0.02004168567200992,0.03523167318914682,0.8695436913929709,0.8643077719676264,0.21148956469158392,0.6963891772374382,0.48683668432185173,0.45661585620961437
0.02004168567200992,0.9958594033732585,0.9778950493944536,0.235067263355557,0.7475624251048154,0.26626405064106773,0.6209216264264679,0.8896645594045376
0.02004168567200992,0.9998835475681496,0.10716605688524714,0.18264866346900904,0.9864059013815911,0.4413528354913837,0.3333253465734374,0.44604145646115057
0.02004168567200992,0.123849203403912,0.9552400596618185,0.9244014533715165,0.9419434049061838,0.6978272337309539,0.3521361393805953,0.43737174594968253
0.02004168567200992,0.05297010216080615,0.990624062127162,0.9908861599245331,0.7306840160276926,0.9349865078286089,0.23261977276081267,0.5019789573091424
W2
0.02003822182565599,0.028237450096148264,0.022441569783151018,0.12985660286589315,0.3273255706731354,0.980899129671737,0.9918929920478439,0.9863030151472805
0.02003822182565599,0.02576870854987526,0.04383853386782819,0.007563398702540039,0.9858009140932487,0.15978620019211862,0.03759558598994491,0.1792305282085828
0.02003822182565599,0.012324123648154533,0.03912972882195161,0.9948463786725917,0.1996454776594418,0.2950531097388027,0.6201377625421803,0.8346145936068905
0.02003822182565599,0.01584589309833963,0.036084899336561845,0.039712948441277304,0.9976309948886709,0.051899431383802305,0.8121679182004266,0.9666549564317699
0.02003822182565599,0.029330426653227555,0.026955065419847796,0.03975211179029544,0.9667834411207142,0.8867761395197669,0.2611251033998727,0.297806396375039
0.02003822182565599,0.017144614513417793,0.028818358096417074,0.014164841046600726,0.4376337796905837,0.9718474271406685,0.27450825253916744,0.9750775910293838
0.02003822182565599,0.02059971586141262,0.9991966604027739,0.15892660397727223,0.9392159189204478,0.21788635032870077,0.9966025061670382,0.5148891228873116
0.02003822182565599,0.014434670737518461,0.01614920639366045,0.050678948843417976,0.07649015166182456,0.09398593258358615,0.22860177234528345,0.9893007298894082
0.02003822182565599,0.02490348442679749,0.0026743235605458803,0.024820899040038397,0.43012319436468904,0.9792485132237354,0.9507617711030473,0.0877368491768325
0.02003822182565599,0.02212705907317226,0.06672071131388722,0.03595823515366539,0.44710399391432465,0.8524023727003112,0.17920034796642093,0.8751734649040238
0.02003822182565599,0.02843958262181005,0.04532650701318631,0.9963266646488456,0.4251297409276388,0.23780283018846748,0.9372188870629611,0.8784745173814983
0.02003822182565599,0.01891374593375085,0.036964288255818656,0.0538584619837259,0.10088679810446227,0.09070011627878621,0.5425441667487284,0.6608259991186596
0.02003822182565599,0.019247754964303143,0.040010450851156155,0.9953453690239934,0.3385463803502684,0.9910425065372612,0.20848045549798574,0.9832066035138205
0.02003822182565599,0.027086396121466152,0.014195841444163878,0.005713764484738142,0.8534103357164972,0.17920189516733068,0.524952118892841,0.9729442293481808
0.02003822182565599,0.029618051192255683,0.061745983363050184,0.052451672943458,0.05297682879662281,0.9663297330018201,0.9295358059274718,0.37486077110746874
0.02003822182565599,0.017126776100861385,0.011182006840276265,0.042003061838827044,0.1450225388032725,0.9987899226211553,0.3384004179147766,0.9392333974320736
0.02003822182565599,0.028218028072787903,0.0828577798031165,0.03599149176767291,0.47432197660931796,0.9695793970991203,0.1796967917823653,0.6206324887240152
0.02003822182565599,0.01423564270989779,0.040005510227294226,0.04629735922065688,0.15033702446938935,0.14432117067065717,0.684591795365661,0.4424476447758977
0.02003822182565599,0.013256212507661331,0.009867793870326056,0.021051971363968438,0.9436569620249171,0.030807729911684203,0.7583901627647015,0.9949385054030484
0.02003822182565599,0.02437550806946339,0.019277763062545028,0.05517213394111889,0.1375176655653886,0.933270993304056,0.22115850108584562,0.2972397298160713
0.02003822182565599,0.04270249159778573,0.01698292198306153,0.11073102557390807,0.12651099544606514,0.47787588498831635,0.22078368065990506,0.9910726564432311
0.02003822182565599,0.0325471332710827,0.004135063191551819,0.9992158622147832,0.6654866226354879,0.09889594505501051,0.7076044713263133,0.941881321390684
0.02003822182565599,0.028559719594497768,0.01132826685891511,0.09750376628790305,0.007616307143217632,0.9743748816510431,0.9422304367754413,0.6255632631593825
0.02003822182565599,0.0041189822940324375,0.03670092334107854,0.9998424084204228,0.3683866724712344,0.19401775167803642,0.9749403077966732,0.26164171937478836
0.02003822182565599,0.023550787069717853,0.005219548511266686,0.9998132479628871,0.9966755644900981,0.8389175816398284,0.3058997742392282,0.7005143681936502
0.02003822182565599,0.013551987743306982,0.05125183044108594,0.0027272299805684995,0.24219054002476129,0.9273422906810855,0.6142004744823909,0.29791633749358265
0.02003822182565599,0.008749571717899805,0.0322145569847517,0.046559782354276484,0.8717951513593742,0.26556217299856133,0.9019922089753721,0.6302934653757414
0.02003822182565599,0.02710442281743346,0.00100278151154439,0.008434257988822231,0.5217705646878298,0.6663596586066531,0.9800047397239099,0.591014422404054
0.02003822182565599,0.006830744634759404,0.03745141083123915,0.010951218119349659,0.12938326337517167,0.4293885575749497,0.9744686772387078,0.17975823080135767
0.02003822182565599,0.0120489615702148,0.017223650909402907,0.13053092914541228,0.9989369535734585,0.8818611076996171,0.9466795154300286,0.9347965914805715
0.02003822182565599,0.02713190426323005,0.011137117762675817,0.02070165272861481,0.9481811590717568,0.995490270413497,0.1635728942090957,0.7127478612137617
0.02003822182565599,0.01626240637897638,0.070819554512151,0.9969286055361816,0.982920503243198,0.10248185987674152,0.13972082588276438,0.07547313902322615
0.02003822182565599,0.023732287483915416,0.056578900264315,0.040156728456410086,0.9794977283996097,0.25272021752700047,0.20709404602855286,0.5252554086853346
0.02003822182565599,0.00045102907738254935,0.06396211397235453,0.0062890375800541696,0.6175568881478444,0.19218461477571602,0.9830402771165679,0.2662315021725083
0.02003822182565599,0.02258225472211839,0.026953225777143708,0.9994480803145291,0.993077080598064,0.1345240191416364,0.9945996736096343,0.27090771885069254
0.02003822182565599,0.0314414731999378,0.04844276683396725,0.0814156325126379,0.4985591768852524,0.07061776879709884,0.25959833952428035,0.3597602976857323
0.02003822182565599,0.024870389465089297,0.05899759549649038,0.05799923505490367,0.9823063131810382,0.9873722040295283,0.8297589750568733,0.9890233948612658
0.02003822182565599,0.011651190616083584,0.03071653530296945,0.015131838193162238,0.9710656002728875,0.30671776056297945,0.984197434405994,0.3454306322442829
0.02003822182565599,0.006130808015169667,0.027836987618789864,0.05427239445751969,0.026135429947281602,0.9675991581780035,0.8323734542254049,0.20601390067388708
0.02003822182565599,0.02124115226631302,0.035906197178055745,0.02860976939076082,0.5314502614597332,0.42091318979075243,0.21549299144203254,0.25790034156043723
0.02003822182565599,0.027173919684169788,0.06923086122829103,0.04159168534635822,0.26873015335165445,0.2974475809671236,0.7794396718167038,0.9786245721791702
0.02003822182565599,0.019758320213182495,0.037795234039552546,0.033383714254909096,0.99633707807442,0.1571962281990981,0.8507836205567267,0.9576661575937776
0.02003822182565599,0.03047067047145708,0.012220658982079868,0.01071498372508538,0.997347300404893,0.017443544149379944,0.9826064332336449,0.5027323976352815
0.02003822182565599,0.017166128356160642,0.07867240766408154,0.005650517635782108,0.7821460678553926,0.09080462215550571,0.9784007036424465,0.22811475976656734
0.02003822182565599,0.021952096517020268,0.030996957725831723,0.040405871800933475,0.9993083664781768,0.9993144986089522,0.8713959074698251,0.4575965390555719
0.02003822182565599,0.012782988283668657,0.02890132717816622,0.03965041393878516,0.9491353686562353,0.9989924870654161,0.08326187052148887,0.8301701093510164
0.02003822182565599,0.014958366377646037,0.014158407539213958,0.037623390459963574,0.06911130440335657,0.9920355831473217,0.649546753272013,0.30987508554273935
0.02003822182565599,0.013732493063711998,0.0461820989870201,0.1359486125291233,0.9982882130456568,0.4337673125876954,0.9538807639107244,0.9018639344738435
0.02003822182565599,0.023208392454580406,0.025908346492157886,0.9966550882210383,0.9798722210765002,0.24882637267174482,0.2160657445745853,0.9850107828030399
0.02003822182565599,0.01505994744176971,0.07988897573059787,0.06256263569783434,0.9829686569496807,0.6360796089671398,0.39442624612497856,0.21165556334252097
0.02003822182565599,0.02263075824409304,0.025338408298395086,0.042610998056213545,0.24258647869791414,0.1697673318492879,0.9905874379458806,0.8209412599094494
0.02003822182565599,0.019867476761922066,0.02469751267662494,0.11123289316464915,0.5086807614460301,0.09010142362224798,0.8193898923398807,0.8417823618777495
0.02003822182565599,0.014865664760883029,0.03880819858080901,0.01722553089396012,0.9916994040302742,0.9837739143996355,0.8615929566433863,0.3240268993934495
0.02003822182565599,0.03338862889852521,0.01061549262636854,0.07784823789732198,0.22021814331709577,0.9742211767423303,0.98912284508464,0.7600732583360028
0.02003822182565599,0.014595341147430533,0.043488636046995745,0.036187280808290985,0.2322878907374599,0.9863178262713851,0.9876422375226476,0.627954688135746
0.02003822182565599,0.04112669718389603,0.08056465372327072,0.0055376619163183755,0.22203067812471444,0.9663607257501053,0.24592980646521884,0.9527231457075876
0.02003822182565599,0.018056711654137858,0.049910182008823786,0.1984367317665683,0.00480750763338227,0.927472423065701,0.5081844959809473,0.891681390847141
0.02003822182565599,0.013303796349542337,0.06278690616714624,0.040387332323459355,0.9819782428744713,0.44601683510442,0.6715184612232354,0.6387887008673784
0.02003822182565599,0.018620172604053464,0.057420339068709546,0.035298548300803256,0.15413294311171485,0.46819015392401575,0.8490838173863058,0.924883540770318
0.02003822182565599,0.015760563167782658,0.08184369463342613,0.1526085725947738,0.2712537844820195,0.9861982789426467,0.9635025505987616,0.478482607826194
0.02003822182565599,0.020218376106259203,0.010118712371470603,0.1456854295886403,0.9747169850435552,0.24871132586818742,0.4206579312010815,0.9879042503866315
0.02003822182565599,0.011205438858062404,0.03759784742705919,0.0865976198744796,0.43579125923783896,0.14373485051995366,0.935978434767433,0.9858690492668009
0.02003822182565599,0.022653572803741577,0.03660403894093174,0.09313780460122537,0.09401062849647954,0.4333737096430718,0.6750121391681658,0.9912679847268017
0.02003822182565599,0.023987775283059096,0.008271331749179392,0.020220753853788687,0.12722878344609662,0.9881382974983052,0.9296199430903047,0.4932869923347532
0.02003822182565599,0.01915200333183786,0.06386331435062766,0.06472255066768305,0.11177452466671352,0.977129102655499,0.15024285617192196,0.6130358644292451
0.02003822182565599,0.018823692554655633,0.01355080445788307,0.08019852238103185,0.22892748861230908,0.8284113740795418,0.5289454055361743,0.9824977598563047
0.02003822182565599,0.015399978895410314,0.03967795152541653,0.16392497386080482,0.9957576269060084,0.212792035587522,0.971382702867355,0.8541635114041357
0.02003822182565599,0.03209699080508553,0.05841763563549344,0.05097839699889615,0.3324491072161532,0.19102119977709842,0.9883495565540791,0.5001963658980735
0.02003822182565599,0.026363407970840178,0.051749630132691044,0.07217150398241104,0.24981296894306831,0.09382535116869337,0.9802222170940914,0.551211458863028
0.02003822182565599,0.019515280013948713,0.08715114588900968,0.12323220184151465,0.029716665059524403,0.9989844458124691,0.32134703499185757,0.4951653200330269
0.02003822182565599,0.018055974281280848,0.019058083496883847,0.03331245328768801,0.6959881809701352,0.9967329739636244,0.023997657905030965,0.5268392406644641
0.02003822182565599,0.007544315745394767,0.03283572574881316,0.09031913493876974,0.9660902797186738,0.9452499483754183,0.769474307149855,0.67980827954358
0.02003822182565599,0.024901198196084096,0.03933190928782054,0.0030633506034142667,0.9022977182497183,0.9436087061328424,0.9810529749929261,0.9597077247206517
0.02003822182565599,0.02024692415695376,0.08241028847712276,0.0258260861487813,0.4276598847970314,0.169761975532316,0.767596408153474,0.9354924421018391
0.02003822182565599,0.02797710641158829,0.007159938729875866,0.09630038045648938,0.9193805387202699,0.038371826824816414,0.4011915561268698,0.825158125574273
0.02003822182565599,0.007537760545470132,0.012803152780799826,0.002875677980086574,0.30078537568093067,0.344965671677624,0.98419444989199,0.6794570787977923
0.02003822182565599,0.02120687190646225,0.05052708859223198,0.06710386978705933,0.983166882206414,0.34418033297105977,0.8532540508656302,0.35010868379243754
0.02003822182565599,0.006502627511891518,0.06653987941730728,0.07530599282234043,0.3819059360058572,0.48316147708947,0.9979662405002553,0.972198718237484
0.02003822182565599,0.025721141656245596,0.028924982290761705,0.07673449626246454,0.9993599723122422,0.8294725452075172,0.3239146796429632,0.9020836359892431
0.02003822182565599,0.041673490146227926,0.013818454410413647,0.9953642824450567,0.34343624202087114,0.2471298163508881,0.9129171000723451,0.811773415146151
0.02003822182565599,0.0249798542394643,0.07879718803808576,0.08883395271548669,0.32634821790032587,0.9902963069873943,0.9956532239477998,0.13997980532623383
0.02003822182565599,0.023654528325559743,0.03778061257016816,0.02771436984244272,0.23558158606121443,0.8689659155069632,0.5230746210682663,0.8368682262373238
0.02003822182565599,0.021526448952078198,0.0349526274437185,0.047881137725721966,0.07654287977048958,0.9972370489272723,0.18124646716867227,0.49643020818093064
0.02003822182565599,0.0204435813875699,0.10284597423229005,0.03922806428709481,0.981514996573411,0.589971314274903,0.5793252024755171,0.19965049532663487
0.02003822182565599,0.023261534750476154,0.009073416400884401,0.101956901447372,0.3313087528172914,0.044903659685550344,0.12784832911675564,0.19521381560664292
0.02003822182565599,0.02652506227436682,0.004857920304829898,0.05820866631042686,0.9123448178652025,0.928197818324207,0.982585279994543,0.47972229304908764
0.02003822182565599,0.018086502034382293,0.02696314020977725,0.11698493295608987,0.9759944385094877,0.03641830731465894,0.9919429712120761,0.1038092566977036
0.02003822182565599,0.03711183495561649,0.006033999859287919,0.0066345537994099485,0.8482324123820995,0.9277626061291429,0.8123369758597261,0.9235902741030844
0.02003822182565599,0.031186928820022424,0.9982410675012094,0.20306595061052,0.24667936967063248,0.9750617821597395,0.9890320364393812,0.40032765113960794
0.02003822182565599,0.02262178675854351,0.07238484147482258,0.023290635585473746,0.2663640221496816,0.20227802036366305,0.20616235338827216,0.904381565016361
0.02003822182565599,0.00773678467479521,0.028538593335333793,0.040545588269902975,0.19642973013227621,0.24370533899389749,0.9792551317818894,0.8635659457500099
0.02003822182565599,0.022299324781790614,0.09960927205403895,0.9973689961052759,0.03396661351762214,0.5777514210698914,0.5724743751588183,0.9180405421746395
0.02003822182565599,0.02168965605466792,0.019392608287650073,0.017959612334853207,0.2717965797555043,0.6455928896183922,0.9957923652922848,0.591831322680128
0.02003822182565599,0.012777390840921169,0.07236552893070593,0.9999777742787388,0.9964013687758166,0.45487707502926916,0.8973220575545469,0.9997088555615091
0.02003822182565599,0.020023024780189188,0.003193712269041672,0.12064410073043468,0.23243560427588567,0.9177605891058276,0.25097523559576995,0.9879313158233315
0.02003822182565599,0.012511071319735938,0.001343976409900919,0.013275583850494082,0.8911895074402157,0.9987319919021854,0.24276987628651533,0.9648511257054448
0.02003822182565599,0.015964934529955,0.058135433797860236,0.11076624205506203,0.7028045834003884,0.5118428680679691,0.6077823325482757,0.9792574302791368
0.02003822182565599,0.01621928664286451,0.0715726318306359,0.016514901014612636,0.9887248679575463,0.20343233154592025,0.06974291613418585,0.9823154309546605
0.02003822182565599,0.03467246038327758,0.03930616322896244,0.002141366588816508,0.42927631137852734,0.2716543638419561,0.2740919945155719,0.5859731761300522
0.02003822182565599,0.027497055622322235,0.0235811630181048,0.04951338897080327,0.03180065671637004,0.9940413572799095,0.6862757556754483,0.8180345898495149
Det1
-4.850229284006031e-12,1.6499881508057726e-10,5.438618230328506e-09,1.2532211171958292e-08,7.46507440643979e-08,-8.183041795533282e-07,1.195645915000725e-06,-1.6404024290900307e-08
-4.850229284006031e-12,-4.132680304928045e-10,-3.054311923881784e-09,-1.1408504682720543e-09,4.6556757053052396e-08,-3.5804063330064994e-08,3.118274465712877e-09,-2.5022916744034163e-08
-4.850229284006031e-12,8.193114076400061e-10,1.2008079620029239e-09,7.507222386374789e-09,8.706112749167943e-09,1.5588850502144795e-08,1.7102242696500427e-06,1.151102745197612e-06
-4.850229284006031e-12,-6.817378071680182e-11,-6.487797199207693e-09,-2.7534804398302594e-09,-3.5104350935431748e-09,-7.848864990694696e-07,4.995833548400451e-06,-1.1870176803917763e-07
-4.850229284006031e-12,6.706905274294478e-10,-7.397339551557803e-09,1.3142253697657265e-08,-4.896571217151503e-07,1.5562994436668966e-08,-1.1504927673810108e-08,-7.963841015149954e-08
-4.850229284006031e-12,1.1758498521284304e-09,1.1220959546333627e-09,-2.5593930482834007e-08,-5.073608653751351e-09,-5.647199030889665e-09,3.7193668397942337e-07,5.032696958207948e-06
-4.850229284006031e-12,-3.2079545444535543e-10,-1.9841659315205495e-09,-7.44136057600983e-10,-7.397429559299455e-08,2.389649039855038e-07,-4.1430123807973e-08,-2.933679960020606e-07
-4.850229284006031e-12,5.430639153647338e-10,-1.4452487093124545e-09,-1.3598638750567444e-08,-2.4406059659467765e-06,2.13603511362403e-06,-1.59773056911746e-10,-3.4300720831501107e-09
-4.850229284006031e-12,6.61892072313348e-10,-5.300519749844963e-10,-3.0241688084244924e-08,3.488266154623658e-07,-4.071819620373514e-07,-2.2340470541839506e-08,-3.9177068538200806e-08
-4.850229284006031e-12,7.99372728457761e-10,-1.8055191615563372e-09,9.005258521870998e-10,-1.2457301119444997e-07,1.4402203180891249e-08,-1.5108128010254342e-06,-1.4826410202286554e-09
-4.850229284006031e-12,1.1108508999949526e-10,-1.6881455252608333e-10,5.270627573936904e-09,2.653258271027891e-08,4.4598580965043e-08,3.610585201625594e-07,-1.193376307243683e-07
-4.850229284006031e-12,1.0045465446925339e-09,1.2453749583327843e-10,2.1025452084934488e-08,1.0484859057616802e-06,-7.694350156057853e-08,-1.1239060164859592e-05,-3.5917628619708725e-08
-4.850229284006031e-12,7.578745873971315e-10,-1.0877702621666174e-10,1.1677740589552998e-07,7.828766480685742e-08,-4.895349660921445e-08,-0.0002809996824836099,4.695624371865642e-09
-4.850229284006031e-12,-1.0479355471998266e-10,-2.722374009380478e-08,2.0338447358894974e-08,-1.7844671378216402e-07,-1.621769861112912e-07,1.295824149500459e-09,-2.337156620439539e-08
-4.850229284006031e-12,-1.8864840263289777e-10,1.0418202767896443e-08,7.454154015006161e-09,-8.968000182352517e-08,5.8776465444063545e-09,-1.0826159842283922e-07,-1.5156453863860125e-09
-4.850229284006031e-12,-2.8208252320822935e-11,-1.9302719172224707e-09,3.87646121350843e-09,-6.363123158112174e-07,3.1425069146142853e-08,-2.4187077650899887e-06,-3.433733459729426e-08
-4.850229284006031e-12,1.696453009574869e-10,-5.6401643141621376e-09,-1.6775515530965037e-08,1.0897651279410764e-07,-7.423119444197497e-09,9.057411627659309e-08,-4.69532367249755e-09
-4.850229284006031e-12,4.3375456277311693e-10,-1.9742779133018005e-09,-3.945740519876045e-09,1.8503094583652338e-07,1.4984607978385382e-07,-2.8346243301615496e-10,-2.4430245208126967e-07
-4.850229284006031e-12,1.8737847523403877e-10,4.125157955025037e-09,7.780161038728269e-10,6.243854635716399e-08,9.185478159346807e-08,1.1223993248191825e-08,2.0289790430605803e-08
-4.850229284006031e-12,-7.944272913271798e-10,5.225594121630936e-09,6.151091103451979e-09,-9.694680102420663e-08,-1.301570536617663e-09,1.664779690246522e-08,3.0132694597886826e-09
-4.850229284006031e-12,1.855358440240271e-10,3.8557723151531185e-09,1.962018241419868e-08,-4.913418161077461e-08,5.098110829303769e-07,9.973523957753039e-08,-3.2562292970005867e-09
-4.850229284006031e-12,2.589363746515384e-10,-2.211229820866319e-10,1.4764555025367972e-08,-1.5067425771253904e-07,-6.171872003761153e-07,4.5416701701168e-08,-9.490040551452794e-07
-4.850229284006031e-12,9.37696153385958e-11,1.5691259627640776e-11,1.1284120331969431e-08,2.2534588864642634e-08,4.819075541636373e-07,-3.20354552361571e-07,6.323042577072774e-07
-4.850229284006031e-12,-3.729787847847871e-10,1.59616237234082e-09,-9.608638641502904e-10,1.0558464683292739e-07,5.99017613477312e-07,2.6078919069418108e-08,2.355405598570651e-06
-4.850229284006031e-12,-1.1804217300552985e-10,4.445582263800311e-09,-1.4384757976674221e-08,2.8608798815456615e-09,5.3669855745913896e-08,6.665240505764016e-07,-1.6985116495720966e-09
-4.850229284006031e-12,-1.198598804545883e-10,-5.560994920876822e-10,-4.9001544701657885e-08,-8.041052288176518e-09,4.6024203075952566e-07,1.3304417889774245e-08,1.737934419906728e-07
-4.850229284006031e-12,2.0345948273221347e-10,2.9547269291266946e-10,-3.055409054860773e-08,-9.438832809153767e-08,-1.1767256465033357e-07,4.2755240293875896e-08,-2.5935171131753887e-06
-4.850229284006031e-12,1.9264551107518242e-10,-1.0084220661217247e-08,1.5358674429828e-08,8.710772645082973e-08,3.078279435502087e-09,-4.845113951246249e-08,1.1984267156459091e-08
-4.850229284006031e-12,3.4874142645181914e-10,-3.83783061206656e-09,5.423240517175702e-08,1.2724974571149791e-07,2.1656638789217374e-08,2.2739172875893068e-08,-7.221400558694663e-08
-4.850229284006031e-12,4.694563759406722e-10,-2.587945903605085e-09,-3.30602325340475e-09,-6.592780807212077e-07,2.6403420555439013e-08,5.214548400616881e-10,5.452146914485694e-09
-4.850229284006031e-12,-4.750111476834793e-10,5.911082948731175e-10,-1.669006784562752e-08,1.695193147824171e-08,-3.095906011163167e-07,1.318023902644401e-05,1.2657433564166e-09
-4.850229284006031e-12,1.493732268244249e-10,-4.655152945457597e-10,-3.784546259773698e-09,-4.523164124388349e-07,-2.3655777379156927e-07,-5.688447805740973e-09,-5.614354389897912e-09
-4.850229284006031e-12,-8.421372118560219e-11,-6.478458755774037e-10,-1.4628299613301453e-08,-8.049925591088062e-08,-3.06723153889168e-08,6.871853380598958e-08,2.8544577433961106e-07
-4.850229284006031e-12,-8.073595545026154e-10,-1.7286158896145178e-09,1.5766371321657383e-08,-3.334509869948115e-07,6.650114021182107e-07,2.5034326651508433e-07,3.140826812403646e-07
-4.850229284006031e-12,-4.447705029403851e-10,-3.4880044650539064e-10,3.026465238485386e-09,4.364705251442278e-07,-3.534661166640211e-09,-6.7175706090728e-08,-5.847609112855354e-10
-4.850229284006031e-12,-3.483066819097781e-10,2.6775423531182734e-09,8.465597273813234e-10,1.53235662244624e-08,1.9086242902212198e-09,5.258936256946834e-09,2.2222592871844314e-06
-4.850229284006031e-12,-2.0728412181151945e-10,-5.240396476447038e-09,-3.9407523688764915e-08,1.9318232525643812e-07,2.6987269253911304e-06,6.839701085914567e-10,-3.991216251409641e-09
-4.850229284006031e-12,-8.130586248742147e-11,-1.463189975818017e-09,-4.9485295665071674e-09,-7.201472366007558e-08,-2.0156231620962003e-07,-2.0059963448295242e-10,-1.1428310675914444e-08
-4.850229284006031e-12,1.6729978214243595e-10,4.426991193216512e-09,8.1760052548776e-09,9.374853610624625e-08,-6.90570804499045e-07,3.3485394214105133e-07,1.6917850327200203e-08
-4.850229284006031e-12,-6.097143787349575e-10,-2.982409044692431e-09,2.696511480533023e-09,-8.524945208728202e-08,1.2963375829878833e-07,4.837403485905202e-08,-1.796041583143368e-09
-4.850229284006031e-12,5.368370603579045e-10,-5.367042936248389e-12,-9.755312409730343e-09,-8.068441633457988e-08,4.534628611587707e-09,-4.086701869159762e-05,2.0133137598275593e-08
-4.850229284006031e-12,3.2815580027806487e-10,1.2419840515453878e-09,-1.63692511984195e-08,-9.23286727101561e-07,-4.0000150401263295e-07,-1.9257156202623604e-08,-1.1944440413989608e-08
-4.850229284006031e-12,1.2709616698678416e-10,4.606086719293297e-09,-2.0087062324303813e-09,-2.031835237475203e-07,-5.2466018780736806e-09,-8.982177368641129e-05,4.350857483450744e-07
-4.850229284006031e-12,-2.9006547203724415e-10,1.5433055918946026e-08,-1.2013058881715497e-08,1.5320217550724205e-07,1.2601836189176827e-07,-5.9990563196909234e-06,-1.214331392733983e-08
-4.850229284006031e-12,-1.558738928959044e-10,1.374202753141384e-09,9.177049214645575e-10,2.6656861767779976e-08,-1.377349140244631e-07,-2.271652961243005e-08,1.0707043615288392e-08
-4.850229284006031e-12,-8.001124808495975e-10,4.003234129666173e-09,6.563537196692556e-09,-1.9168864174489284e-08,-3.890936934470666e-08,2.1849240495744264e-07,1.8197661305460214e-07
-4.850229284006031e-12,-4.00447126631393e-10,-3.611257921325293e-09,1.9738670000554455e-08,3.9112677010214463e-08,1.165234485766084e-08,-1.1448374403881165e-06,-2.459415871576311e-09
-4.850229284006031e-12,4.445387847994581e-12,-1.7794015922685498e-10,-9.037737326378118e-09,6.755822911888806e-09,-2.6097704550402566e-08,-1.3156586903005818e-07,-1.3172525666305613e-08
-4.850229284006031e-12,1.0246645694759735e-10,-8.219650707836873e-09,1.4702159447905073e-08,-2.885234282412639e-07,1.4584736461074955e-06,-2.027093912941529e-09,7.935478130533551e-10
-4.850229284006031e-12,-1.0132644075017876e-10,-9.713151662518506e-11,-4.380601079450158e-08,-9.01834829962045e-08,4.306770981175726e-08,7.624951138508886e-08,-4.3544554630774195e-09
-4.850229284006031e-12,1.8582573002511182e-11,-9.017986510878255e-10,8.902144220362077e-09,-8.614632302664774e-08,-1.8670830855837316e-09,4.2278598752044365e-06,-1.5737959777471232e-05
-4.850229284006031e-12,2.943988221351974e-11,-2.090213633359408e-09,-3.498516768008504e-09,1.4479100738837659e-07,1.3706775262857964e-08,1.7498164294798805e-07,8.721824850457694e-09
-4.850229284006031e-12,2.577206503686268e-11,6.409538168194433e-09,-1.1576915669375323e-08,7.411079400820344e-07,-3.555993214011499e-08,9.382085307943352e-07,7.867441268887479e-08
-4.850229284006031e-12,3.100988418202139e-10,4.376882538484981e-09,2.0294049338359036e-08,-3.2019227973774173e-07,-2.11681872635738e-07,-3.060756091375471e-05,2.246444645003226e-09
-4.850229284006031e-12,2.1970566216957686e-10,-1.4916067756049618e-09,3.145666752887734e-09,3.4295988704111226e-08,1.0189810497813763e-08,8.859817964391246e-10,-6.672193371274202e-07
-4.850229284006031e-12,-6.189729189706309e-10,7.704025906469932e-10,-6.703084006718724e-09,3.70928663986185e-08,1.0108041963289454e-07,-1.408022677863251e-07,1.0694060309405362e-10
-4.850229284006031e-12,-1.4220791196585615e-09,5.304578841975276e-09,-2.6708950876508515e-10,-1.7276651427603432e-08,3.1559914390965744e-08,5.217287032862342e-06,-6.582883449205552e-07
-4.850229284006031e-12,-1.2697482574505632e-09,-5.147452053271953e-09,-3.4722063212201237e-11,1.614024639538027e-08,4.0587051695087753e-07,4.8657095168769e-07,1.5279109739828555e-07
-4.850229284006031e-12,-6.051779072513949e-11,4.141304742397346e-09,-3.124348591727626e-09,-1.51740452202822e-08,-5.041455252725582e-10,6.327966081739428e-09,-2.5163214180930726e-10
-4.850229284006031e-12,4.480657774043334e-10,-3.6393863286557663e-09,4.230067882129502e-09,1.8261748609595935e-07,-6.683955876982568e-08,7.123706098196164e-08,-5.788514416173726e-07
-4.850229284006031e-12,1.1058562202249719e-10,1.0218088834624635e-09,9.172847647335156e-09,3.373919532163962e-08,-1.3269063116666947e-07,1.081990060980405e-08,8.757788032351737e-08
-4.850229284006031e-12,-7.686361792744653e-11,2.7889272415614316e-10,-1.8306647275629762e-08,7.971705943300986e-08,1.1882822265382403e-07,-3.080248972600852e-09,4.3717592862259013e-07
-4.850229284006031e-12,-4.8674280286856e-10,-2.0578916499308365e-09,-4.4742445449242407e-10,4.971827158792199e-08,2.4969048028393625e-07,-1.6198409200391374e-08,1.7672294795778344e-07
-4.850229284006031e-12,-8.977614913182298e-10,-1.5438072689938697e-09,1.022913402636893e-08,-1.1133328288247603e-07,4.7660832960498355e-07,6.287024264400473e-07,2.70833065157565e-09
-4.850229284006031e-12,-6.438267231921844e-10,-5.96951741341376e-09,-5.5915911959261925e-08,-1.4927234726212922e-07,-2.6991609777977785e-06,-2.6725482989734034e-06,9.808871669392808e-07
-4.850229284006031e-12,1.3589955081186064e-10,-2.9524571986550336e-09,1.861404616389955e-08,3.925049698821236e-07,-3.256828721733306e-08,5.186610146069191e-06,2.8749285884406424e-09
-4.850229284006031e-12,5.778044272950277e-10,-2.4568431091664807e-09,-2.446309933971739e-08,-7.557994322579571e-08,4.1073437345205127e-07,4.7269329816456474e-08,-1.9773991140530678e-06
-4.850229284006031e-12,1.4557062761305628e-10,-2.192955609235211e-09,-1.9018923511553503e-08,-1.4791116751165412e-07,-4.2753703189298984e-09,4.831373717146177e-10,-9.438839787598599e-05
-4.850229284006031e-12,-1.8344567583993991e-10,3.557054746205673e-09,1.0389825213327723e-07,-1.2534449723085988e-07,-1.8007504280456247e-07,6.499197695430393e-09,1.0384095395638582e-08
-4.850229284006031e-12,-4.258582354126461e-10,-6.176184178477989e-09,-1.2700421815041178e-10,-2.536269113534638e-07,8.52765626630739e-08,9.1406385121089e-08,2.4077989524514765e-08
-4.850229284006031e-12,-7.61027858883225e-11,3.1213856059929285e-09,9.548499308047881e-09,-3.0242863971972964e-07,-7.358289607514475e-08,1.0919815716469373e-08,4.357323868461205e-09
-4.850229284006031e-12,-4.455595031619595e-10,1.612068422510923e-09,-5.4233972670957355e-09,-1.9338972562968318e-07,9.765188790654672e-08,-2.3336244995222977e-09,-2.204877301480131e-09
-4.850229284006031e-12,5.691906786257647e-10,-3.0002076498922415e-09,-7.133691296127228e-09,-2.3693909682772973e-07,3.166313441941605e-08,3.468234647655117e-08,2.2670013962026777e-06
-4.850229284006031e-12,2.3864236138623397e-10,-3.3534264391531725e-09,4.082837361463843e-11,7.349991037093721e-07,3.2803978373859524e-08,1.0659548153307369e-09,1.5139168949198916e-08
-4.850229284006031e-12,-1.3090823265435914e-10,6.724668300678186e-10,5.885502987348485e-09,8.074721175361739e-09,1.1122030924529004e-06,2.2002366824325043e-10,2.370932027278244e-06
-4.850229284006031e-12,-1.5320060040976179e-10,-1.52550651853974e-08,-5.77289157044171e-08,-3.735787577613625e-08,-2.1327792665795303e-08,-6.992493373062966e-07,-2.4597348536715644e-09
-4.850229284006031e-12,-1.5177410527488597e-10,-2.6811323750641617e-09,1.6235409289392337e-09,1.6676206127500478e-08,-1.4815860115884224e-08,-2.5122940357941327e-08,-1.2346534369535722e-07
-4.850229284006031e-12,4.608234299377809e-10,6.252895259694602e-09,4.172325923497287e-09,2.2590582770939732e-08,4.876061328495553e-07,3.7354786904866065e-06,1.9172524911659086e-08
-4.850229284006031e-12,-3.228624382438558e-10,-3.5393743247075715e-09,1.3463347047541737e-08,2.095253949730226e-08,-2.8301660826541707e-07,-1.0293515910784281e-06,7.405737064642004e-09
-4.850229284006031e-12,6.515681074658074e-10,9.136007990941243e-10,5.6065419402569426e-08,3.468525999520103e-07,-1.4995197781817216e-09,4.353358856742753e-07,4.332117854055312e-07
-4.850229284006031e-12,-3.4085353726204015e-10,-1.4307751525530208e-09,-9.479825075182122e-09,-1.3598003287853355e-06,3.738010405972813e-09,2.6386612835248027e-09,7.972304946372577e-09
-4.850229284006031e-12,-5.87209881653984e-12,3.644906822269284e-10,-1.0244356804598296e-08,3.869622837765598e-08,2.8011730399588094e-08,2.944718804835861e-09,0.001007783784565179
-4.850229284006031e-12,-1.5848675455107024e-10,1.7673729385039698e-09,3.4062943811651582e-09,-4.476552135623864e-08,1.4509219567082133e-07,3.391901472846947e-08,3.4454684663548027e-07
-4.850229284006031e-12,-2.967839658950075e-10,2.738846187570561e-09,7.115343312015749e-09,3.208322104757535e-07,1.0079112948590533e-07,8.944952065774189e-10,-5.414186149103275e-06
-4.850229284006031e-12,-2.70161214459461e-10,-8.017700119888529e-10,-1.3997766715775096e-10,-3.0912207803108317e-07,-5.094456123311039e-07,1.3893471090655346e-09,4.507992002249925e-08
-4.850229284006031e-12,-2.0445082981905466e-10,-8.901377579674818e-10,-2.749761118852622e-08,2.948686163766953e-07,2.7896207928701344e-07,1.4763434601016116e-07,-1.9740722641522627e-06
-4.850229284006031e-12,1.4100106425292867e-10,9.957100771769139e-10,1.1687183289344351e-09,1.3076720792069877e-07,-5.313289710188706e-07,-5.091961656446198e-06,-9.94263092142034e-06
-4.850229284006031e-12,3.3773232148922896e-10,-1.3123433662434855e-08,-1.2801756879692163e-08,-1.3246144485612104e-07,3.5371048169707175e-08,-1.6278389302405162e-08,-1.874435802323927e-08
-4.850229284006031e-12,-1.451646121019692e-10,1.3192337925089756e-09,-6.864711760280021e-09,-9.756572950748733e-08,-2.2934162725150863e-08,1.742784450626602e-06,-5.4533838956873465e-08
-4.850229284006031e-12,-1.37331677316546e-10,-1.4462790050511676e-09,6.2082037874301805e-09,2.4663617063508865e-07,5.386680695573223e-08,0.0005393578067366926,2.0965741647815898e-06
-4.850229284006031e-12,2.7631815114802904e-10,1.6389735171477048e-09,-1.2858864146571362e-09,-3.018996374657268e-08,2.3136431919888394e-07,-8.018929193950687e-09,1.3832498369910163e-08
-4.850229284006031e-12,-3.863683286751445e-11,-5.261649194238094e-09,4.503234502954405e-09,-1.4429775189123966e-07,5.017418411917839e-07,1.434786096180532e-08,-2.41974981885659e-06
-4.850229284006031e-12,-2.709163694345804e-10,-5.306344498195843e-10,8.565655715311158e-09,5.543329872325736e-09,-2.100667184332016e-07,-1.4659193395034108e-09,-4.6092875079890244e-09
-4.850229284006031e-12,9.25657898810517e-11,9.73433712838812e-10,-2.446417999606117e-08,-8.398282138163515e-08,-7.705214365784349e-08,-3.245125714089722e-09,-1.171629964125897e-09
-4.850229284006031e-12,4.055501950292963e-10,4.525293648724706e-09,-2.164059316815353e-09,2.0212321146853523e-07,2.265818702004367e-08,-8.914712322408518e-09,1.0377967593404059e-06
-4.850229284006031e-12,5.5958577038656036e-11,-2.102095487910149e-10,-7.589011457786949e-10,5.01013674218791e-07,8.144628428552249e-07,1.457360025292141e-08,-2.2480975340390432e-07
-4.850229284006031e-12,-3.5717386559650436e-10,-1.7379977908435616e-09,-2.0936327497480322e-08,-2.6891273361576575e-07,-1.5727811275256624e-08,1.9161740386571664e-07,8.212937045927693e-08
-4.850229284006031e-12,1.1649576001139492e-09,2.565701650470995e-10,-2.3218503315223005e-10,1.2701716328705599e-07,1.054363057311514e-08,-5.8822015113349734e-08,2.335730112641092e-09
-4.850229284006031e-12,1.7705388511373316e-10,-3.1252526549114566e-09,-1.4229786279098195e-08,2.3595092342800988e-07,-4.139760279194454e-08,-6.222498910332577e-08,-4.0975706606388255e-08
-4.850229284006031e-12,-1.5816166998092053e-10,2.6543392892868513e-09,2.2056288688845324e-08,2.3448017752939967e-07,5.032848497919791e-09,5.643140785742795e-06,-4.1121908050665884e-08
Det2
-4.840392070401671e-12,-5.415349010047168e-11,-6.614277560024459e-11,-2.045266022002157e-12,-3.280523574140806e-11,2.9290590778228307e-09,5.593326388983149e-07,3.2850173102650413e-07
-4.840392070401671e-12,7.852421914158125e-12,1.6014263043508176e-10,-4.979796482784189e-12,-1.0620417797333292e-09,1.1115267979679208e-08,4.838265950640138e-09,2.5415630276883743e-07
-4.840392070401671e-12,6.287524213189182e-12,-1.0114850244724328e-10,6.90300164017432e-11,2.0767056420905791e-10,5.45666881215765e-10,-3.9470002374527357e-07,-7.617058889764873e-08
-4.840392070401671e-12,-1.428963405118164e-11,-2.2148584613692116e-10,1.5785668537389386e-10,2.426525679188255e-09,3.53273981882793e-08,8.276528440523194e-07,1.098155530336913e-07
-4.840392070401671e-12,-3.712728516813088e-11,-6.85981945412513e-11,-3.9171770570318674e-10,8.762607400922812e-10,8.454610028901027e-09,-1.5942612132892807e-08,-5.770230221915325e-08
-4.840392070401671e-12,4.779819026105572e-11,-1.7571668252897164e-10,-3.4198125842106914e-10,-8.572380430814185e-11,4.849414991397539e-10,1.497412788631636e-08,-6.134523135376817e-07
-4.840392070401671e-12,-4.148507101590613e-11,3.039675196628376e-10,-4.245420745641909e-10,7.882559037415543e-11,1.2168748693983185e-09,8.397492145645137e-08,4.128175305660681e-06
-4.840392070401671e-12,2.689046969949081e-11,1.4051199281058362e-10,8.365534420855197e-10,-1.499013418557294e-09,1.9801427434717796e-09,6.681688766808144e-08,2.928359053721816e-08
-4.840392070401671e-12,-2.8401105369894e-11,-1.4240242765295014e-10,6.496853646242597e-11,-1.5742067859363851e-09,-1.3661576003761552e-09,-2.7508982622286497e-07,1.407333147657922e-07
-4.840392070401671e-12,-2.4140764855266905e-11,7.993116211871029e-11,7.779747830191676e-11,-5.169614493748211e-10,2.6239174292207774e-09,-2.2958149761895248e-08,-1.0600634513573037e-07
-4.840392070401671e-12,2.295204838445174e-11,-1.6149556449072126e-10,1.6730271093606e-10,-2.9265570046410837e-10,-1.8963229683409058e-09,1.0131477922481922e-07,-1.3125847546446805e-06
-4.840392070401671e-12,4.5439319744620143e-11,-2.2261352796101828e-10,4.046168012192108e-11,-1.008349452274448e-09,-6.7326080888744156e-09,5.1283234078672314e-09,-4.181919656407265e-06
-4.840392070401671e-12,-1.3096706874803903e-11,1.4900056256736396e-10,-3.1634775541691234e-10,2.337271074080711e-10,3.436142908387603e-09,-1.2476492023841645e-07,3.3561725383547886e-07
-4.840392070401671e-12,-2.5982604088665242e-11,1.0171661031772596e-10,5.781766917657323e-11,3.011204601169049e-09,-1.1514324276837866e-08,2.2915051092052812e-07,-3.789514871382347e-08
-4.840392070401671e-12,-1.726170773895676e-11,6.717338983359874e-11,2.1319774820378922e-10,-8.098547574910852e-10,4.18143423452362e-08,1.360350128240108e-07,-7.86932674523917e-07
-4.840392070401671e-12,3.3517687489219147e-12,-6.217061136185113e-11,1.6811726717607585e-10,-3.5167779135483504e-09,4.286771003519107e-09,-2.693389976044916e-08,-3.7432828105477333e-08
-4.840392070401671e-12,6.719113695760379e-12,-1.3031338509540887e-11,-8.186663135218266e-11,-1.3663046728633724e-10,-2.1138651100095517e-08,-1.1464160711939148e-07,-2.2658677624760412e-08
-4.840392070401671e-12,-6.92845696682288e-12,-1.2727199468958436e-10,3.6685482671319307e-10,-4.837523430538844e-10,6.153676957457007e-09,1.83443885500123e-07,1.1399025740509657e-07
-4.840392070401671e-12,-9.155783544895531e-12,1.2949460257667568e-10,-1.1287150423782158e-10,1.6641753924094943e-09,-3.038900535537594e-09,-8.609529567006268e-09,-9.223627176661249e-08
-4.840392070401671e-12,-1.2606519124286591e-11,1.526184766912595e-10,6.824508445464172e-11,-2.4453946276747655e-10,-9.54003040995509e-10,-3.996056498114423e-08,4.840649166506213e-08
-4.840392070401671e-12,-1.769057069942407e-11,-1.8526769971377435e-10,-3.6058758037298527e-10,-1.0186460163474215e-09,8.340391300215751e-09,3.552867761026416e-07,1.7483172767359665e-07
-4.840392070401671e-12,1.6315133325397692e-11,3.6273096496694414e-11,2.3949849429994455e-10,2.754842888491178e-09,2.561942936387801e-09,6.703238443640349e-08,1.2790110268226987e-07
-4.840392070401671e-12,-1.0447031898063796e-11,-1.03967901840278e-10,2.415511024734284e-10,6.918528478611252e-10,9.255333053886363e-10,8.731928126905001e-07,1.870814534821446e-08
-4.840392070401671e-12,-1.890734287425801e-11,1.021051523031536e-10,3.1267418867777295e-10,3.180809872085957e-10,1.7232545053001596e-10,-9.455952639382459e-08,1.5634810144410034e-07
-4.840392070401671e-12,3.2866233112405175e-11,2.8174030057595986e-10,8.029360025750014e-10,8.565363921220578e-11,-1.1036161622574643e-08,-6.409313261899143e-08,-2.0866321703885095e-07
-4.840392070401671e-12,-1.7773116190895707e-11,-3.088704177001853e-11,-1.878345317015962e-10,2.1160369451181073e-09,1.3274411699655948e-09,1.9558603274153442e-08,3.3874317214316815e-07
-4.840392070401671e-12,-2.99661647344915e-11,-6.459296752213403e-11,1.659873347264272e-10,3.5707164832892393e-09,-7.849386266606226e-09,1.8538085128406483e-08,-7.866659901566506e-07
-4.840392070401671e-12,1.8248769623892743e-11,5.768599752442611e-11,3.8526090827634187e-10,-2.455162180036317e-09,3.544407668901664e-08,-4.2201087934016014e-07,-4.83655746383501e-07
-4.840392070401671e-12,1.658638649043451e-11,-9.287797023568206e-11,-4.48251648318439e-10,-1.6379724110057404e-09,-1.829166939229792e-08,-1.198135522689598e-07,-1.6105947969238e-08
-4.840392070401671e-12,-2.513166363063631e-11,-2.519359585724175e-10,-6.69057499111821e-10,7.477281213201473e-10,5.96589097789456e-09,7.466762065777844e-09,1.7534131895959764e-07
-4.840392070401671e-12,-2.0964672186439053e-11,2.975455185480069e-11,-8.031180176017705e-11,3.643208902343387e-11,-5.673588338766742e-09,4.1243347631895947e-07,4.835144382650097e-08
-4.840392070401671e-12,3.6495490203074415e-11,3.6458675025300735e-11,2.5990894537110997e-10,-1.2660837871269614e-09,4.500100346037833e-09,-5.535443038392912e-08,-2.79921838878256e-07
-4.840392070401671e-12,-1.3846242978396254e-11,1.3304788927467017e-10,-2.205604456275042e-10,-3.909259063483407e-11,6.157584001408376e-10,-1.865850348140139e-07,-2.28125888326457e-07
-4.840392070401671e-12,-3.796810897423168e-12,-1.3579817346155837e-10,-3.269830862868893e-10,-9.94075813934219e-09,1.8953198113651663e-08,6.049734930170386e-07,-3.5203791796891944e-07
-4.840392070401671e-12,4.058305477076054e-11,2.7391726748928312e-11,5.185053545743682e-10,4.187443187271248e-09,4.753918215108094e-09,2.20796057526612e-08,-6.631911806434156e-07
-4.840392070401671e-12,-4.186688397033057e-11,7.217025101296232e-11,-7.512206862101099e-11,-8.276234712086267e-10,2.77609080010965e-08,1.6967636356119756e-08,1.2910146180107992e-07
-4.840392070401671e-12,-2.0795274168516615e-11,-5.882887609475619e-11,-1.7000172093279079e-10,-1.3864721533174612e-10,3.0000848763071536e-09,3.4408201694153953e-09,1.3477690587398306e-07
-4.840392070401671e-12,4.793078345276462e-11,1.5491999286015564e-10,-8.794236342433374e-11,1.1945537291545867e-09,1.4777901040805784e-08,2.4967291007641207e-07,7.951641689890639e-08
-4.840392070401671e-12,5.476493345284043e-11,-5.561780290702337e-11,-3.0397946827180167e-10,2.8868720625213198e-09,-6.596441739277084e-09,-8.748412764362235e-08,-7.432815674263338e-08
-4.840392070401671e-12,-8.206664224180507e-12,1.8462506064778064e-11,-6.677064745862963e-11,-5.089679488025595e-10,1.1803970672513518e-09,-1.345202179223946e-09,2.4101170583031474e-07
-4.840392070401671e-12,-2.7053017321162885e-12,-6.28141836995179e-11,8.258591438445184e-11,8.384571557182646e-10,-8.098107850269786e-09,5.9292818079033615e-08,-9.542510431517257e-07
-4.840392070401671e-12,-2.2155641173984897e-11,-1.266562471303276e-10,-2.66485191596044e-10,1.6705331080329538e-10,3.4568033836961144e-09,-1.6151461853536965e-07,3.0040487775115986e-07
-4.840392070401671e-12,-5.756480907105967e-11,-5.897236625555785e-12,3.972531245140019e-12,-4.2688951728834897e-10,8.44502449145075e-10,1.1035203363637024e-07,7.08583572660467e-08
-4.840392070401671e-12,-4.584655372034607e-11,2.4330690514749505e-11,1.803157608833026e-10,1.309196367322507e-09,2.7105081807641037e-09,1.1939468227972848e-07,7.545027518533138e-07
-4.840392070401671e-12,-4.414505529902232e-12,-1.2796344157802262e-10,-6.537594139724529e-12,5.255006613337812e-12,1.6545415296726575e-09,-2.2377950581157817e-07,2.6900063396034957e-09
-4.840392070401671e-12,-5.7449812557803586e-11,-1.3202295147532606e-10,-1.0423599475787153e-10,3.7308506201343704e-10,-9.165512456965953e-09,-1.1704532855624639e-07,-3.201093813766573e-08
-4.840392070401671e-12,5.639729005330369e-12,-3.223356422981162e-11,-1.1022766768175625e-10,6.595290425579358e-11,1.8625108406011606e-08,5.083078318452803e-07,-1.271106551418824e-07
-4.840392070401671e-12,1.4588831031231074e-12,-8.516882854581008e-11,7.704740661772937e-10,-2.9437803130682174e-10,-9.726383719475827e-09,2.0338243750912555e-07,1.6934113604631904e-07
-4.840392070401671e-12,-5.063750347606424e-12,-2.1904344204699372e-10,1.4472404643440548e-11,-3.182230832453943e-09,-1.3446045286889134e-09,1.545958232835893e-08,8.662346073502397e-08
-4.840392070401671e-12,4.411827900500624e-12,-1.0517637906492158e-10,-1.3573788583712113e-10,-2.7834445273187244e-11,-1.1511226554001445e-08,-5.32253739283833e-08,5.229624829977066e-07
-4.840392070401671e-12,-7.920880047208832e-11,5.013825638807299e-11,-6.251494723458348e-11,-2.806185932059288e-10,-6.070555873509446e-10,4.279585371436812e-08,-3.0073337251204555e-06
-4.840392070401671e-12,-1.4820579897867492e-11,1.3306640762644953e-11,-9.583111245449053e-11,2.5482132668883725e-09,-5.69082664860393e-09,-3.479181526350924e-07,-1.2131689908741239e-06
-4.840392070401671e-12,-3.1429698453527267e-11,-1.8224649504833063e-10,5.22122407563473e-11,-3.5689789606613775e-10,4.97340782897652e-09,-2.2346869185514304e-07,6.9007761817912614e-09
-4.840392070401671e-12,-6.5547328586199146e-12,-6.082994229561764e-11,-2.9565764443744386e-11,7.602269621210233e-09,1.8200792706974756e-09,4.485289287094567e-08,1.591566600186071e-08
-4.840392070401671e-12,3.0636853101893726e-11,1.5637140419743067e-11,1.2749928083648934e-10,-3.351913900183723e-10,-3.3971254270624376e-09,-3.482804150349776e-08,2.396244492651506e-09
-4.840392070401671e-12,-4.879939422060843e-11,2.073282059855807e-11,1.2341069134551474e-11,-5.475476176282313e-10,1.0381756682094367e-08,-1.1794925773432304e-07,-2.0923440870427216e-08
-4.840392070401671e-12,-2.7137963401674204e-11,1.6224611976585003e-10,-7.436211662373748e-12,8.820835132598499e-10,3.2387719449238394e-08,-2.9223648076766783e-07,-7.944416015982216e-09
-4.840392070401671e-12,-3.7215792664349924e-11,8.928237782976348e-11,-2.956608006142352e-10,1.0899645231269819e-09,-9.148401492513851e-09,-3.32107352914766e-08,-4.832730816143868e-08
-4.840392070401671e-12,-1.797267968361656e-11,-1.6650754690737734e-10,-1.294934093538913e-10,-6.35438911290403e-10,-1.964089252524946e-08,-6.211494768400436e-08,-6.471802672338416e-09
-4.840392070401671e-12,1.3979053329415198e-11,-2.2293310335983064e-10,-2.088591556722837e-10,-4.759404755093187e-10,-1.1690037836518217e-08,2.5539997938272367e-08,-3.585856272297134e-07
-4.840392070401671e-12,-6.48296434439542e-12,1.05606651410281e-10,-9.349166282613002e-11,-2.657177529772406e-09,-2.5311341965946636e-08,2.3178845202109247e-08,1.2946417863764276e-07
-4.840392070401671e-12,-3.4243253836520947e-12,-1.5355491068503832e-10,4.6448587310258365e-11,4.3026278761595623e-10,-2.587691082861924e-09,1.003115328618117e-07,4.014825895368437e-09
-4.840392070401671e-12,4.526558304894734e-12,-4.248568990935086e-12,9.328157452372348e-11,-1.9772269054197155e-09,-1.3848063706921665e-08,1.6543869110578156e-08,4.049150032875056e-07
-4.840392070401671e-12,-5.584274138569648e-11,4.3757499250203876e-11,2.6898634202551137e-11,-3.006472216452234e-10,1.2761398898155606e-08,-2.0319882846236125e-07,-3.8675931272415467e-07
-4.840392070401671e-12,-2.7941191954450698e-11,3.5693237173935216e-10,-1.0091692487878557e-10,-4.5283169246256865e-10,2.5982235520284897e-09,-2.143497302291353e-07,-3.710706416190101e-06
-4.840392070401671e-12,4.662250387478945e-12,-5.3811136012089305e-11,1.0207319173524909e-10,-5.3100930063039845e-11,-1.0313840225596712e-09,-2.602197036889454e-07,-8.983101421841184e-07
-4.840392070401671e-12,-1.0620651170820995e-14,1.2167626185902008e-10,-1.6344547730917055e-10,2.752918134606941e-09,3.5791323398085254e-09,-1.8573667462085802e-08,3.945296290564909e-06
-4.840392070401671e-12,-6.2427842012037414e-12,-5.525578123038426e-11,-2.028508469335491e-10,-8.595546422219133e-10,4.1234586923641086e-09,8.79662337803311e-07,9.834343966061101e-08
-4.840392070401671e-12,-3.404609447835602e-11,6.492056803063052e-11,6.336044344531052e-10,-9.033286040710626e-12,-9.591537174885957e-09,2.0069099474102877e-07,-6.28034504325452e-08
-4.840392070401671e-12,-3.2057527222597357e-12,-8.617295853920255e-11,-2.790097884321732e-11,-4.2983530556117004e-10,-5.2574422165523935e-09,-1.3199856947249903e-07,8.783909758571856e-08
-4.840392070401671e-12,-5.115133677707449e-11,-1.027134838701714e-10,-1.2568639704323602e-10,-6.700705506124529e-10,-1.78051485813022e-09,1.9950965376574103e-07,-7.84943472986522e-07
-4.840392070401671e-12,-3.3367671479118084e-11,5.7605658716550747e-11,-4.580851146305326e-11,4.828128487110873e-10,2.03449749429125e-09,-1.3071575835948919e-07,8.679635881027225e-08
-4.840392070401671e-12,-2.4930793930860345e-11,-2.157664650424622e-11,-1.813504051183285e-10,1.3036620691110778e-10,2.7077396220932414e-10,6.099089474456048e-08,1.4850078928329152e-06
-4.840392070401671e-12,-1.7703080694252735e-11,-1.5591561921825944e-11,1.3070068458147385e-10,-9.150718213023213e-10,3.025768748133007e-09,-1.1663321418116287e-07,-3.768077972390242e-07
-4.840392070401671e-12,-1.1189406632754873e-11,-1.355958040982021e-10,-7.985214489109428e-11,2.1552582768673939e-10,2.608790044555179e-09,-2.508044264530048e-07,-3.460074829752308e-07
-4.840392070401671e-12,1.1513865864957787e-11,-2.7177977400644007e-10,-6.190718553150645e-11,-4.948247432013161e-10,-5.341491454775987e-09,2.7491741390954585e-07,-1.3122067188296483e-07
-4.840392070401671e-12,6.799777872449475e-12,1.2991361097297804e-10,-1.0644863483655531e-10,-2.815161889447874e-10,-8.850403432050586e-11,-8.993213564146789e-08,-1.2180436679053005e-07
-4.840392070401671e-12,1.3283070614364546e-11,-2.603529119617067e-10,-1.277597941252775e-10,-6.638728841403803e-10,-2.5614576371808595e-09,1.2064610196668774e-08,-1.9564798251357542e-07
-4.840392070401671e-12,3.0408520023476413e-11,-2.8754111300549926e-11,-5.043456014574355e-10,-2.270305517338656e-09,8.746782197294786e-09,2.7240354367962794e-09,-1.6320447980618034e-07
-4.840392070401671e-12,5.905073313206751e-12,-1.1977956697289685e-10,2.6173357068275024e-10,3.010854189758576e-09,2.045997851880632e-09,2.5348356453127294e-08,3.9173652637150695e-08
-4.840392070401671e-12,-5.663828370211986e-11,8.03469007564246e-11,2.9049571771360976e-10,1.7559933433613481e-09,3.8182590245338565e-09,-1.438784383762193e-07,6.446585547218237e-08
-4.840392070401671e-12,-1.145876336127589e-11,-5.8095455520421405e-11,6.707423848573861e-11,-2.3448073127054334e-11,-3.541160584136714e-09,6.52827908109488e-08,-2.0983972293614992e-07
-4.840392070401671e-12,-5.265544290012761e-11,4.227964155141105e-11,8.271240674453743e-11,1.5681104546986442e-09,5.888714201338252e-09,4.9599208157347646e-08,-8.276009863778541e-07
-4.840392070401671e-12,7.860645772257406e-12,5.7469986680969274e-11,3.8847602479295133e-10,-4.263776484639073e-09,1.143770736757859e-08,-1.4553534964879613e-09,1.8310223211437691e-06
-4.840392070401671e-12,-3.825414790998227e-11,6.07719053289979e-12,3.5977435925198666e-11,-4.2231708554715577e-10,2.607477585248892e-09,-4.13900081596404e-08,-1.5024540147716482e-07
-4.840392070401671e-12,4.5024515469857056e-11,1.0387542992030945e-10,2.1578606694565265e-10,-2.480153470698508e-09,2.8369358858690894e-09,-3.1183407633757484e-09,-1.0845759528131242e-07
-4.840392070401671e-12,-1.3971104674539839e-11,1.0208931647201053e-10,-1.474710967613096e-10,1.5571451933321782e-10,-1.1963411676679964e-08,9.171247932155856e-08,3.547727357022743e-07
-4.840392070401671e-12,-2.147183524830444e-11,2.2946212253331986e-10,-3.115673678396554e-11,1.3200330636181497e-10,4.64280590386703e-09,-8.848195619470651e-08,5.232076347450804e-08
-4.840392070401671e-12,-2.7402207136569488e-11,1.7499185125591138e-10,-1.326415501098587e-10,-4.080785594005546e-10,2.71636645901692e-09,-1.1939363621573426e-07,7.766916531257253e-08
-4.840392070401671e-12,-1.4780000291263434e-11,-4.159762922727535e-12,2.1202945142370855e-10,-1.0216052435009241e-09,-4.3479511919469646e-09,-2.1718827880455962e-07,-1.5536733231433523e-07
-4.840392070401671e-12,-1.6586865312371524e-11,-8.651642282034566e-11,1.9153724518814897e-10,-1.592850496073925e-10,-3.1352404746886945e-09,1.479873714826855e-08,-1.3296269518209853e-07
-4.840392070401671e-12,2.6851064482802185e-11,-1.2043538379179422e-10,1.672596967059528e-10,-2.3653472044981087e-09,-7.554733576117813e-09,-1.487997544284715e-07,-2.5814747104821317e-06
-4.840392070401671e-12,-2.921362661686896e-11,-1.733921106160337e-10,-3.3349916930770247e-10,-8.137888293993342e-10,1.3304519310433407e-09,3.1380197887950114e-07,7.086655891506677e-07
-4.840392070401671e-12,-2.7936705656941245e-12,-3.8442487829450363e-11,1.1547146250324127e-10,5.8340184175389e-10,6.330284931432357e-09,2.1607880618218638e-07,3.467561489254609e-07
-4.840392070401671e-12,1.3661333507583489e-11,2.8921255947311455e-10,-4.2568429576017637e-10,-8.691231480341232e-11,1.5062459770523656e-09,-7.614702747950231e-07,7.56864434913445e-08
-4.840392070401671e-12,5.4124099730248826e-11,-9.510856940516213e-11,1.9457445729222e-11,2.891086371108192e-10,1.0897929492785112e-08,4.1129033967569214e-08,2.985938102176836e-07
-4.840392070401671e-12,3.8509094914849447e-13,-7.239796192287382e-11,-2.569164352337562e-10,9.24931849590634e-09,-3.9560844271656565e-08,-4.342892925694922e-09,-5.090794680957909e-08
-4.840392070401671e-12,-5.6220802810687685e-12,-2.2292462764150512e-10,-2.5220966812430864e-10,9.950661829535803e-11,-1.9460479240366555e-11,-1.4888994752275954e-07,9.763339185735632e-07
-4.840392070401671e-12,-6.312740109139553e-11,-1.061843141016727e-10,7.428392728850413e-11,-1.458289350331987e-09,-9.695334607681144e-09,-1.747973012706038e-08,-1.0962489672467389e-07
-4.840392070401671e-12,1.2432817121187062e-11,-7.98534142153642e-12,-2.3254087105881097e-11,2.4167907891239734e-09,-2.938462838268376e-09,1.7827058874176293e-08,1.6172745589040264e-06
