Type,1
T,101
nz,6
Mod,1.0,1.0,1.0,1.0,0.5,0.5,0.5,0.5
w,0.8320502943378437,0.5547001962252293
Sstart,0,0,0,0,0,0
Sgoal,2.0943951023931953,0.6981317007977318,0.0,0.0,0.0,0.0
degree,6
Polynome,-2.6592021702107212e-30,0.0,8.081374813616602e-30,-29.605583562016506,120.2326772219472,-139.08223314348575,50.54953458594826,5.4978118305615256e-30,-9.305040082043035e-30,1.3303011873470568e-30,137.45666892019406,-401.898031248616,395.6148459414363,-130.4753519122166
X,-2.6592021702107212e-30,5.4978118305615256e-30,0.0,-9.305040082043035e-30,1.6162749627233204e-29,2.6606023746941137e-30,-2.8417114463576793e-05,0.00013347711961695014,-0.008407668141653585,0.03964911100814968,-1.6348222808571475,7.772995652026561,-0.00021804926811646618,0.001036607283446264,-0.031789549838768236,0.15240125245427363,-2.997563696313579,14.628361814091384,-0.0007053051352793418,0.0033953109797586934,-0.06750585939956276,0.3293112355294275,-4.104368179372985,20.612163133906787,-0.0016009966640611003,0.007808344384078934,-0.11307643067904775,0.5618898207891214,-4.971015706390037,25.769524836651332,-0.0029919170739943278,0.01479181188170348,-0.1661770775125355,0.8420943239279821,-5.6129222970703845,30.144632724969792,-0.004942382458005861,0.0247835846479651,-0.22463595414914955,1.1623192215544154,-6.045140014470664,33.780733178973186,-0.007495736988722465,0.03814762528624396,-0.28642991568533493,1.5153867569652684,-6.282356964998491,36.720133156238774,-0.01067582172911157,0.05517821852372528,-0.34968087849836754,1.8945375459204912,-6.3388972984124585,39.00420019181002,-0.014488407047457153,0.07610410796490377,-0.4126521806798641,2.2934211824178012,-6.228721207822144,40.67336239819665,-0.0189225886366707,0.10109253890283464,-0.47374494246929233,2.706086844467343,-5.965424929688109,41.767108465374605,-0.023952147137937217,0.13025320718813088,-0.5314944266874801,3.1269738998663525,-5.562240743821892,42.32398766078605,-0.029536871368696448,0.163642114155708,-0.5845663991701255,3.5509025119738187,-5.032036973386011,42.3816098293394,-0.03562384515495908,0.20126532760927449,-0.6317534892013075,3.9730642454851446,-4.3873179848939685,41.976645393409314,-0.04214869776795813,0.24308264886356926,-0.6719715499469937,4.389012672206812,-3.640224188210243,41.14482535283664,-0.04903681796513532,0.28901118584434576,-0.7042560188885525,4.79465397683104,-2.8025320365503132,39.92094128492851,-0.05620453163546274,0.3389288322461033,-0.7277582782562617,5.186237562710455,-1.8856540264806108,38.33884534445822,-0.0635602430490994,0.3926776527475635,-0.7417420154628178,5.560346657632745,-0.9006386979185556,36.43145026366539,-0.07100553971138296,0.45006717428489423,-0.7455795835368476,5.913888919595323,0.14182936586741562,34.23072935225578,-0.07843626082115668,0.5108775833826813,-0.7387483615564155,6.244087042579992,1.2314295382579425,31.76771649740142,-0.08574352933343127,0.5748628295426447,-0.7208271150825358,6.5484693623276105,2.3582051492826452,29.072506163740606,-0.09281474762638192,0.641753634690102,-0.6914923565926807,6.824860462112746,3.5125634856201717,26.174253393377825,-0.09953455677268046,0.7112604086781807,-0.6505147059142912,7.071371778518345,4.68527579059819,23.101173805883796,-0.1057857594151627,0.783076070849773,-0.5977552506582873,7.286392207210389,5.8674772641933925,19.8805435982955,-0.11145020624683052,0.856878777657241,-0.5331619066525752,7.468578708712565,7.0506670630314625,16.538699545116106,-0.11640964609518945,0.9323345563398662,-0.4567657783755603,7.616846914180922,8.226708300387159,13.101038998315062,-0.12054653961092121,1.0090998446590478,-0.3686775193896549,7.7303617311785295,9.387828046184204,9.59201988732801,-0.12374483656089144,1.0868239366912438,-0.2690836927747898,7.808527949450148,10.526617326995352,6.035160719056827,-0.12589071672549212,1.1651513346786646,-0.15824313156192354,7.850980846696895,11.636031126042404,2.453040577869647,-0.12687329440031955,1.2437240069377056,-0.03648329916654729,7.857576794350886,12.709388383196131,-1.1327008743991587,-0.1265852865021875,1.3221835518251341,0.09580335017779432,7.828383863349926,13.740371994976394,-4.701363398449018,-0.12492364427947468,1.4001732677620193,0.23816301098600454,7.763672429912134,14.723028814551988,-8.233186177513096,-0.12179014862680843,1.4773401293154063,0.390084166087916,7.663905781310663,15.651769651740787,-11.709347817358394,-0.11709196900408289,1.553336669337741,0.5510012261947905,7.529730721648318,16.521369273009668,-15.111966346285575,-0.11074218595981163,1.6278227671640397,0.7202981694658029,7.36196817763219,17.326966401474547,-18.424099215129182,-0.10266027725881677,1.700467342866808,0.8973121810745259,7.161603804348394,18.064063716900286,-21.629743297257452,-0.0927725676142525,1.7709499575686996,1.0813372927754297,6.9297785910366985,18.728527855700843,-24.713834888572297,-0.08101264202396281,1.8389623198129306,1.2716280224703744,6.667779466865152,19.31658941093916,-27.66224970750961,-0.06732172271117695,1.9042096979914327,1.4674030137750846,6.377029906704813,19.824842932327215,-30.461802895039018,-0.05164900966953585,1.9664122388307543,1.667848675585657,6.059080536904339,20.250246926226005,-33.10024901466373,-0.03395198481245781,2.025306191935718,1.872122821645048,5.7155997410647075,20.590123855645494,-35.56628205242091,-0.014196679726837916,2.0806450403908117,2.079358310109543,5.348364265813861,20.842160140244815,-37.8495354168814,0.007642092968920301,2.132200537419325,2.288666683115273,4.959249826581332,21.00440615633183,-39.94058193914975,0.031580544662534155,2.179763649100257,2.499141806344698,4.550221713373,21.075276236863786,-41.830933872864435,0.05762575218113585,2.2231454031429307,2.7098635085930898,4.123325396545601,21.05354867144668,-43.51304289419768,0.08577553562023578,2.2621776437193897,2.9199012213350257,3.6806771325815792,20.93836570633558,-44.98030010185531,0.11601837256834836,2.2967136923545293,3.128317618290875,3.2244545698635587,20.729233544434663,-46.22703601707704,0.14833334872727746,2.3266289148739565,3.3341722549932973,2.756887354449186,20.426022345297035,-47.24852058363642,0.1826901449280805,2.3518211944096343,3.536525208353741,2.2802477358456468,20.02896622512489,-48.0409631678406,0.2190490605426782,2.372211310463234,3.734440716228896,1.7968411727843714,19.538663256769368,-48.601512558530615,0.25736107329114866,2.387743224027256,3.926990816987221,1.3089969389957616,18.956075469730678,-48.92825696708121,0.2975679354446727,2.398384268763899,4.113258989075438,0.8190587289838068,18.28252885015804,-49.02022402740106,0.3396023064241492,2.4041252482416575,4.29234379058497,0.3293752638006699,17.519713340849663,-48.877380795932346,0.38338792179447667,2.404980439229691,4.463362498818502,-0.15770910317853817,16.669682841252897,-48.50063375165128,0.4288397986544958,2.400987501049914,4.625454749856431,-0.6398637804810864,15.734855207463802,-47.89182879606743,0.4758644774226006,2.3922072909868493,4.777786178123332,-1.1147813327620562,14.718012252227863,-47.05375125322457,0.5243603000180125,2.3787235857552256,4.919552055954515,-1.580186875029687,13.62229974493931,-45.990125869700094,0.5742177244377198,2.3606427090253237,5.049980933162463,-2.033847466870578,12.45122741164142,-44.705616814605385,0.6253196757290813,2.338093065006047,5.168338276603322,-2.4735815066750835,11.208668935026731,-43.20582767958506,0.677541933358098,2.311224578085791,5.273930109743446,-2.8972681258628077,9.898861954436414,-41.49730147881766,0.7307535549733418,2.280208038530989,5.366106652225803,-3.3028565831077,8.52640806586083,-39.58752064901612,0.7848173365655609,2.2452343542424593,5.444265959436547,-3.6883756585635807,7.096272821939563,-37.48490704942622,0.8395903090229434,2.2065137085694766,5.507857562071451,-4.051943048089256,5.6137857319609195,-35.19882196182797,0.89492427108204,2.1642746241816013,5.55638610570241,-4.391774757474188,4.0846402618623685,-32.739566090535305,0.9506663586743604,2.11876293299824,5.5894149903439505,-4.70619449666352,2.514893834230279,-30.11837956239615,1.0066596506686374,2.070240652175967,5.606570010019734,-4.993643073983606,0.9109678283002708,-27.347441926790886,1.0627438110087415,2.018984766153558,5.6075429923289635,-5.252687790367234,-0.7203524200433082,-24.439872155635413,1.1187557672472763,1.965285914754862,5.592095438012955,-5.4820318335790095,-2.371917618266853,-21.40972864337808,1.1745304254748292,1.9094469873492939,5.560062160521671,-5.680523672440826,-4.036214517187754,-18.272009207001517,1.2299014216448902,1.8517816230701407,5.51135492558003,-5.847166451056785,-5.705365910974631,-15.042651086022195,1.2847019092944396,1.7926126170906729,5.445966090754591,-5.981127383039078,-7.371130637146721,-11.738530942490446,1.3387653836601787,1.7322702329578785,5.363972245019946,-6.081747145733105,-9.024903576574529,-8.377464860989733,1.3919265421904692,1.671090420983993,5.265537848325229,-6.148549274442495,-10.657715653479572,-4.978208348637918,1.4440221814528822,1.6094129426958534,5.1509188711605844,-6.181249556654855,-12.260233835434104,-1.5604563350868899,1.494892130437473,1.5475794013418536,5.020466434123678,-6.179765426267215,-13.822761133361457,1.8551568274789314,1.5443802202556545,1.4859311784568106,4.874630447486228,-6.144225357810775,-15.335236601535883,5.247057364340378,1.5923352902348074,1.4248072764844657,4.713963250760438,-6.074978260676639,-16.787235337583038,8.592732078244504,1.6386122304084842,1.3645420674576576,4.539123252265428,-5.972602873341264,-18.16796848247886,11.868728349404318,1.6830730604023156,1.3054629477365285,4.350878568693934,-5.837917157591826,-19.466283220550622,15.050654135500192,1.7255880447156042,1.247887898804103,4.1501106646786186,-5.671987692750827,-20.670662779476828,18.113177971678137,1.7660368443985317,1.1921229541199574,3.9378179923585237,-5.476139069902348,-21.769226430286608,21.030028970550394,1.8043097051250616,1.1384595720314206,3.7151196309457055,-5.251963286116912,-22.749729487360305,23.773996822195166,1.8403086816615088,1.0871719147425336,3.4832589262917013,-5.0013291386770415,-23.599563308428706,26.316931794156964,1.8739488987307493,1.038514033340845,3.2436071304539267,-4.726391619302446,-24.305755294574432,28.629744731446344,1.9051598482721437,0.9927169588819792,2.997667041262217,-4.429601308375081,-24.854968890230655,30.68240705654093,1.9338867230970598,0.9499856995317395,2.747076641885343,-4.1137137691654315,-25.233503583181026,32.44395076938423,1.9600917869401002,0.9104961437662488,2.4936127403975394,-3.7817989420567892,-25.427294904561347,33.882468447385776,1.98375578090601,0.8743918696296098,2.239194609344802,-3.4372505387707126,-25.421914428857214,34.96511324542114,2.004879366312212,0.8417808600493515,1.9858876253115922,-3.0837954365933813,-25.202569773905868,35.65809889583274,2.023484603927029,0.812732124209813,1.7359069084872467,-2.7255030725998086,-24.754104600895428,35.926699708428075,2.039616469603544,0.7872722249829133,1.4916209622324328,-2.366794837879815,-24.060998614365076,35.735250570482016,2.0533444063092032,0.7653817124171154,1.2555553126457295,-2.012453471762641,-23.10736756220452,35.047146946734934,2.064763912550936,0.746991463283722,1.0303961481300277,-1.6676324560433344,-21.876963235654927,33.82484487939542,2.0739981671961316,0.7319789266812,0.8189939589589922,-1.3378654092075082,-20.353173469308526,32.02986098813496,2.0811996906890866,0.7201642756969899,0.624367176843746,-1.0290754806564255,-18.519022141108042,29.622772470093903,2.086552042663282,0.7113064651274932,0.44970581449911823,-0.7475847449325095,-16.357169172347295,26.563217099877537,2.0902715559492306,0.7050991952551575,0.29837510521024085,-0.5001235959454556,-13.849910527671382,22.80989322955771,2.092609106978002,0.7011667816841677,0.17391914239909187,-0.2938401411965167,-10.97917821507645,18.320559788672178,2.0938519225804253,0.6990599312329615,0.08006451919096357,-0.13630959600357917,-7.726540285909184,13.052036284226014,2.094325423181948,0.6982514238850395,0.02072396798083044,-0.03554367772838323,-4.073200834867245,6.960202800689883,2.0943951023932073,0.6981317007977452,8.526512829121203e-14,-1.1368683772161603e-13,5.684341886080803e-14,-2.2737367544323206e-13
