Type,0
T,101
nz,6
Mod,1.0,1.0,1.0,1.0,0.5,0.5,0.5,0.5
w,0.20555661294825944,0.1370377419655063,0.6851887098275316,0.6851887098275316
Sstart,0,0,0,0,0,0
Sgoal,2.0943951023931953,0.6981317007977318,0.0,0.0,0.0,0.0
X,0.0,0.0,0.0,0.0,0.0,-2.951719212160551e-33,0.0,0.0,0.0,-2.9222468137205514e-35,13.000542333095698,7.973052302518066,0.0,1.6983395443886557e-34,0.12871824092173959,0.07894111190611947,12.685213868103922,7.717882119413278,0.0012744380289281144,0.0007815951673873213,0.2543144178336596,0.15535578635575584,12.369950556766543,7.4627392319156725,0.0037924025619346454,0.002319771269919558,0.37678917582144716,0.2292442936024457,12.054749493639013,7.2076773982235975,0.007522988461156894,0.004589516751131891,0.4961431312040116,0.30060743615911495,11.739744510642927,6.952820672035783,0.012435296690899583,0.00756582800023204,0.612378225368793,0.36944724479313257,11.425191839931218,6.698158376243621,0.018498447437125257,0.011223721513035334,0.7254989366552408,0.43576564455792094,11.111263145739446,6.4437196476358665,0.025681605225791007,0.015538232845291974,0.8355114430487006,0.49956484898995923,10.798231213255848,6.189644736299222,0.033953995751025666,0.02048441946895494,0.9424246233779665,0.5608484602404467,10.48638479645431,5.9359880629981925,0.04328493261615405,0.02603737452084055,1.0462502154220685,0.6196206192800328,10.176060091525231,5.682850820481379,0.05364384564013493,0.032172232137474534,1.1470032856351897,0.675886468987769,9.867523956534923,5.430368069664068,0.06500031381474076,0.0388641773749772,1.2447015426305847,0.7296524894794925,9.5611422927454,5.1785765662808725,0.07732409146454854,0.046088459449031574,1.339366317806282,0.7809255247892042,9.25722502108873,4.927612079997306,0.09058514411609589,0.0538203953380336,1.431022011084388,0.829713763205019,8.956092905386763,4.677549639834789,0.10475367887930766,0.06203538309253874,1.5196961982664354,0.8760261358766507,8.658079559284987,4.4285173599962455,0.11980017589184662,0.07070890919032737,1.605419758259356,0.9198728424112669,8.363379640159788,4.180881340228371,0.13569542102312737,0.07981656109538941,1.688225497270839,0.9612677071660033,8.072360282880641,3.93445581746329,0.152410524956502,0.08933406314653795,1.7681498565072808,1.0002227152596992,7.785291611568324,3.6895295028087123,0.16991695917934638,0.09923725834712903,1.8452319516713238,1.036752710337013,7.50233069688032,3.446360096985296,0.18818658246322087,0.10950213666729747,1.919512453620634,1.0708750875348874,7.223659512505095,3.205102323010379,0.207191656261445,0.12010486030625676,1.9910338349325656,1.102608773901327,6.949569607824341,2.9656981557012725,0.22690486254790607,0.13102177885973523,2.0598414548120143,1.1319721219775771,6.680130651584245,2.7285385059034044,0.24729933239752996,0.14222942363179047,2.1259813622534427,1.1589873547092941,6.415483621027414,2.493732749238675,0.2683486528158809,0.15370454595564484,2.1895010020655956,1.1836777779690828,6.155711698555207,2.261354396873137,0.29002688055910464,0.16542412791573477,2.25044864264535,1.2060674254628763,5.90089867796292,2.031781567854199,0.31230855028826654,0.17736538955398107,2.308873382031121,1.2261840746495516,5.651019179895613,1.8051410167436643,0.33516868278362416,0.18950582593664989,2.3648240669805833,1.2440567579836472,5.406109405052858,1.5814371372317093,0.3585827824566992,0.20182321958005234,2.4183499026741755,1.2597145514215848,5.166109677740771,1.361022492159212,0.3825268408990178,0.21429564088125616,2.469499503443886,1.2731900216409828,4.931030006077409,1.1439312551449452,0.4069773310321256,0.22690148267968174,2.5183215827119794,1.2845160736721208,4.70068256692129,0.9304626449196295,0.43191120808867983,0.2396194636071285,2.5648629942656553,1.2937285751069687,4.474993293485508,0.7207485423010734,0.45730589120022097,0.25242865742006876,2.6091698585575913,1.3008646992881676,4.253831862469368,0.5148848196087652,0.4831392561364347,0.2653085059278725,2.651287005710753,1.3059625687892442,4.036959104823339,0.31314606055876787,0.5093896225296105,0.27823882839113223,2.6912568978377167,1.3090630248343809,3.824208181339949,0.11569126470426028,0.5360357304289938,0.29119984843899743,2.7291203451777166,1.3102084829007596,3.6154225819588612,-0.07750118949998387,0.5630567239456048,0.3041722096558366,2.7649166083654277,1.309441144390859,3.4102793742017115,-0.2661787550991805,0.5904321359096191,0.31713697346168673,2.7986817506842563,1.306805711172055,3.208529989965284,-0.45016429481855896,0.6181418562134235,0.3300756438693308,2.830449374347279,1.3023486389461287,3.0099147343044717,-0.6293293119327766,0.6461661074445848,0.34297018484899544,2.8602505103304923,1.2961176556596656,2.8141226889737436,-0.8036107105833579,0.674485419428055,0.3558030329248338,2.88811311121142,1.2881611139707214,2.620801860651358,-0.9728765991752935,0.7030805987469798,0.36855710336018743,2.914061644485196,1.2785286723947284,2.4296846038185205,-1.136978064297807,0.7319326942369323,0.3812158030868679,2.9381179276913194,1.2672714638373246,2.2403540030466633,-1.2957164464776536,0.7610229707487275,0.393763045303079,2.9602996504937615,1.2544425881296248,2.0525239982755714,-1.4492351811898398,0.7903328682783688,0.4061832689479268,2.980621670278668,1.2400937249495276,1.8657818420574923,-1.5971353606773804,0.8198439739246922,0.41846142464049635,2.999094757823792,1.2242805035566822,1.6797666641067899,-1.7395373259364681,0.8495379814278979,0.43058301378462194,3.0157261109337603,1.2070573617157272,1.494076310338992,-1.8763070601604295,0.8793966557935788,0.44253407677190637,3.0305189456895922,1.1884800640903763,1.3083080085576795,-2.0072171830470324,0.9094017938697134,0.45430120611933583,3.043472490328777,1.1686066266344652,1.122141361760147,-2.1323832257897206,0.9395351848630678,0.4658715687592811,3.0545828008412537,1.1474939214286264,0.9350683143237414,-2.2515210217288635,0.969778578930803,0.47723289471402,3.0638409029632707,1.1252016340847761,0.7468134170240551,-2.364757402087925,1.0001136373759838,0.4883735049524831,3.0712350952110343,1.101788194460143,0.5568595886252439,-2.4718978754549927,1.0305219056454,0.4992822989570389,3.076748556484551,1.0773139580694997,0.3648723968704195,-2.5729019924611314,1.0609847626402966,0.5099487737894103,3.080361154473367,1.0518396809164192,0.17039290491378076,-2.6675564244116368,1.0914833879321122,0.5203630280559094,3.08204821293786,1.0254282311697693,-0.026916356644932807,-2.756051451458254,1.121998716773081,0.5305157828199665,3.081781714357217,0.9981405930365194,-0.22744300074602178,-2.8381354582732063,1.1525114070142415,0.5403983629490411,3.0795298034587417,0.9700402419645073,-0.4316519651455129,-2.9137019228493326,1.1830018011078924,0.5500027217803728,3.0752560216256177,0.94119170807491,-0.6398237591476642,-2.9827685500478167,1.213449880529928,0.5593214515632926,3.0689211329211856,0.9116593461932485,-0.8524542766449912,-3.0451960092384267,1.2438352382816233,0.5683477817236218,3.0604809915682645,0.8815088906562344,-1.069791272605961,-3.101026856429735,1.2741370302773487,0.5770755925221984,3.049888998770186,0.8508056544539597,-1.2922923549241712,-3.1500055942773058,1.3043339510572516,0.5854994108831288,3.037094024959055,0.8196174802531944,-1.5202420567685786,-3.192249074981391,1.334404188928133,0.5936144354400911,3.0220421234068917,0.78801105376823,-1.7540079450006243,-3.2275294445915486,1.3643253980707755,0.6014165250813607,3.004675708109856,0.7560553166930662,-1.9938662043512363,-3.255884588467505,1.3940746625075067,0.6089022212862426,2.9849344585618236,0.7238188356191304,-2.2402084397348214,-3.2771876868534005,1.4236284690279208,0.6160687444111845,2.9627541769802903,0.6913714327789977,-2.493283570158806,-3.2913418673180863,1.4529626688000028,0.6229140061218676,2.938068201038124,0.6587838895382248,-2.753419393010985,-3.2982327352046092,1.4820524529686974,0.6294366188895729,2.910806622889501,0.6261281198827335,-3.02082729527741,-3.297883674068163,1.5108723205220587,0.6356359072052434,2.8808974417481403,0.5934758062780983,-3.2958402675008633,-3.2901703053573828,1.5393960575690702,0.6415119052872049,2.8482653598916965,0.5608998626606984,-3.5786586475786075,-3.2749667836975003,1.5675967046967105,0.6470653692739444,2.812833096054284,0.5284744489607232,-3.8695534127494606,-3.252254121895388,1.5954465373309115,0.6522977895606843,2.7745206860270617,0.49627391310037267,-4.168654388291234,-3.222040313209241,1.6229170391727634,0.657211392660688,2.7332468802023957,0.4643725238606772,-4.4762508904157725,-3.184108946843699,1.649978889471797,0.6618091404216847,2.6889275644557054,0.4328466927038089,-4.792483611554735,-3.13853003489829,1.6766019346644279,0.6660947512405344,2.641477231668034,0.4017721379028357,-5.117549653985552,-3.085187993665999,1.7027551745819334,0.6700726931999684,2.590808423212732,0.3712257221239644,-5.451552061988193,-3.024058045646175,1.7284067431285939,0.6737481953992156,2.5368326602227493,0.3412845533551904,-5.794720110091244,-2.955038984783864,1.7535238981803043,0.6771272503829303,2.4794591937862025,0.31202674162465704,-6.147105215582852,-2.8782773947296856,1.7780729991088806,0.6802166240623824,2.4185967659091445,0.2835289456372344,-6.5088703817984905,-2.7935964083078724,1.802019501741644,0.6830238413459194,2.354152504703219,0.2558695752579485,-6.880084275895702,-2.701086505916725,1.8253279423822704,0.6855572034771862,2.2860328584072214,0.22912614450629776,-7.26089377565621,-2.6006291959649785,1.8479619310793713,0.6878257791653674,2.214142821024487,0.20337734058585244,-7.651337572163764,-2.4923605880926645,1.8698841372281285,0.6898394162008709,2.1383870034783112,0.17870050307998447,-8.051503107818762,-2.3763625844999905,1.891056285777419,0.6916087281125539,2.0586691509256503,0.15517216065919245,-8.46155380232082,-2.2525121938961132,1.911439148657871,0.6931450861388825,1.9748913905066323,0.13287005972952798,-8.881407074493195,-2.121051057058312,1.930992528761897,0.6944606312847194,1.8869566669967988,0.11186955421409917,-9.311267581827043,-1.9819993915770624,1.949675268039093,0.6955682506333738,1.7947658988598973,0.09224579786185103,-9.751113833316182,-1.835520770145484,1.9674452274337455,0.6964815753646793,1.6982202173419154,0.07407232489011356,-10.201077900136406,-1.6816605172163273,1.9842592889915862,0.6972149647200268,1.597219446053436,0.05742222075925883,-10.661224830913369,-1.5205546749184937,2.000073342912908,0.6977835015592275,1.4916627645592444,0.042367223977887614,-11.131540220095339,-1.3526380586658213,2.0148422811758704,0.698202979024355,1.3814494950533498,0.028974767951493337,-11.612233498956034,-1.1778214924196517,2.0285199989486755,0.6984898579149639,1.266476886152795,0.017313169016645296,-12.103373794912446,-0.9964780010465523,2.0410593740590994,0.6986612754299801,1.1466415020447513,0.0074470501944022055,-12.60506214287591,-0.8088444426743521,2.0524122602179586,0.6987350086002219,1.0218389065707325,-0.0005613106241557365,-13.117478955228611,-0.6151661267174526,2.062529477114699,0.6987294510692896,0.8919628773110432,-0.006652064354031506,-13.640809241108403,-0.4156144243947216,2.0713607927316393,0.6986635890459824,0.7569053600723461,-0.010767058654969344,-14.175084149831564,-0.21093195448165222,2.0788549052076037,0.6985569845048442,0.6165579922522315,-0.01285549384785699,-14.72066156096769,-0.0010917036446805532,2.0849594397843583,0.6984297023875385,0.4708088678862148,-0.012866302794834025,-15.27767593160383,0.21332044549217105,2.0896209137238255,0.698302313250956,0.3195447497515234,-0.010754219176099656,-15.846540833570549,0.43193463823126144,2.0927847231273065,0.6981958358333709,0.16264830585478532,-0.006477638599552515,-16.427478891333315,0.6542414985548041,2.0943951023931953,0.6981317007977318,7.130092037003655e-35,-3.3910468984363433e-31,0.0,-7.9e-322
