Type,1
T,101
nz,6
Mod,1.0,1.0,1.0,1.0,0.5,0.5,0.5,0.5
w,0.019418390934515438,0.09709195467257718,0.9709195467257717,0.19418390934515437,0.019418390934515438,0.09709195467257718
Sstart,0,0,0,0,0,0
Sgoal,2.0943951023931953,0.6981317007977318,0.0,0.0,0.0,0.0
degree,6
Polynome,-5.124779418022777e-37,0.0,-1.0606664176351123e-35,17.550690686834685,-21.23614552460615,2.3865896030674083,3.3932603370972516,7.548279059799816e-36,-2.897765407599828e-35,-7.158284221620962e-37,18.191780462687483,-44.103365876096476,37.82018056891689,-11.210463454710165
X,-5.124779418022777e-37,7.548279059799816e-36,0.0,-2.897765407599828e-35,-2.1213328352702246e-35,-1.4316568443241924e-36,1.7338571283809266e-05,1.7754517611519957e-05,0.005180383989388336,0.005283004958052232,1.0276068163507162,1.0393358291822752,0.0001370155964661319,0.00013859801226948388,0.02038324658969515,0.020448869750746695,2.0045475258881615,1.977314917983679,0.0004567278384837457,0.0004563652040928901,0.04510352156304575,0.0445061809803702,2.9311451665763446,2.8183546150671708,0.0010691379569841232,0.0010551962014011386,0.07883949520857769,0.07650729515915479,3.807747207853702,3.566791553758835,0.002061909255269273,0.0020099701640466394,0.12109305067718497,0.11554753155590897,4.634725550633095,4.226881652047885,0.003517742870387029,0.0033867308952137323,0.1713699122862624,0.16076436504264896,5.412476527301815,4.802800112586655,0.0055144174063697805,0.005243104361683927,0.22917988983444987,0.21133661894123018,6.14142090172158,5.298641422690612,0.00812483101062063,0.007628708142567437,0.29403712291637635,0.2664836578699779,6.822003869228531,5.7184193543383435,0.011417045893447034,0.010585552806501048,0.36546032523740474,0.32546458059031935,7.454695056633243,6.066066964171565,0.015454335290741845,0.014148435217312294,0.44297302892837553,0.3875774128534144,8.039988522220714,6.345436593495119,0.020295232869811792,0.01834532376814993,0.5261038288603512,0.4521583002467869,8.578402755750364,6.5602998682769735,0.025993584578353456,0.023197735544080725,0.6143866269593612,0.518580701040956,9.070480678456054,6.714347699148223,0.032598602936576654,0.028721105413152606,0.7073608765211452,0.5862545790360675,9.516789643046058,6.811190281403085,0.04015492377247524,0.03492514704592403,0.8045718265258976,0.654625596408525,9.917921433703086,6.8543570949989086,0.04870266540024537,0.04181420586345973,0.9055707659530126,0.7231743065576214,10.274492266084271,6.847296904556164,0.058277490241851304,0.04938760391379282,1.0099152680958272,0.7914153469521692,10.587142787321172,6.793377759358452,0.06891066889173841,0.057639976676853104,1.1171694348763666,0.8588966319771335,10.85653807601978,6.6958869933524925,0.08062914662469388,0.06656160179786165,1.2269041411600883,0.9251985457802617,11.083367642260507,6.558031225148141,0.09345561234685477,0.07613871974919206,1.338697279070625,0.9899331351187158,11.268345427598199,6.382936358018369,0.10740856998986344,0.08635384642069749,1.4521340023045317,1.0527433022057024,11.412209805062123,6.173647579899281,0.12250241234817043,0.09718607763850425,1.5668069704460255,1.1133019975571052,11.515723579155976,5.933129363390112,0.138747497359485,0.10861138561227206,1.682316593281736,1.1713114128381164,11.579673985857882,5.664265465753208,0.15615022682837276,0.12060290731091985,1.798271275115444,1.226502173709866,11.604872692620393,5.36985892891405,0.1747131275930009,0.13313122476681866,1.9142876590828275,1.2786325326760561,11.592155798370484,5.052632079461254,0.19443493513503132,0.14616463730845036,2.0299908714662083,1.3274875619295892,11.542383833509563,4.715226528646543,0.21531067963266015,0.1596694257215327,2.1450147660092935,1.372878346199201,11.45644175991346,4.360203172384786,0.23733177445680562,0.17361010833861099,2.2590021682319197,1.4146411755960917,11.335238970932435,3.9900421912539565,0.26048610711044323,0.18794968905711582,2.3716051197448,1.4526367384605574,11.179709291391172,3.6071430504951727,0.28475813261108784,0.20264989728588714,2.482485122564264,1.48674931420862,10.990810977588788,3.213824500012672,0.31012896931642436,0.21767141982016489,2.5913133834270083,1.5168859661786611,10.769526717298822,2.8123245743738208,0.3365764971930839,0.23297412464504538,2.6977710581048338,1.5429757344780486,10.51686362976924,2.404800592809101,0.36407545852856965,0.24851727666740456,2.8015494957193945,1.5649688288297732,10.233853265722438,1.9933291592121396,0.3925975610863286,0.26425974537628727,2.90235048305694,1.5828358214190774,9.921551607355239,1.5799061621396655,0.4221115837039711,0.28016020443176337,2.9998864888830603,1.5965668397400843,9.581039068338889,1.1664467748115528,0.45258348433463863,0.2961773231822488,3.0938809082574315,1.6061707594424357,9.213420493819068,0.7547854551107825,0.48397651053151725,0.31226995011029485,3.184068306848555,1.6116743971779162,8.819825160415872,0.3466759455835063,0.5162513123755014,0.32839728820684216,3.2701946652485114,1.6131217034470857,8.40140677622384,-0.05620872656105789,0.5493660578460013,0.34451906227394186,3.3520176232876913,1.6105729554459165,7.959343480811926,-0.45227624945053124,0.583276550634901,0.360595678155943,3.4293067243495523,1.6041039499124163,7.4948378452235085,-0.8400150265494136,0.6179363504036631,0.3765883738991452,3.501843659685357,1.593805195973264,7.009116871976403,-1.2179941766590732,0.6532968954835789,0.39245936283992017,3.5694225127289183,1.5797811079904416,6.503431995062849,-1.584863533917768,0.6893076280191694,0.4081719686212961,3.63185000341134,1.5621491984078655,5.979059079949521,-1.9393536478006257,0.7259161215547316,0.4236907521380115,3.6889457324757706,1.5410392705980134,5.4372984235774915,-2.2802757831196296,0.7630682110640312,0.438981630410033,3.7405424257921385,1.5165926117085606,4.8794747543622945,-2.606521920023661,0.800708125423146,0.45401198738454135,3.7864861786718986,1.4889611855090081,4.306937232193878,-2.9170647539984693,0.838778622326454,0.46875077666638204,3.8266367001827786,1.4583068252373177,3.7210594484366086,-3.210957695866665,0.8772211256457695,0.4831686161769838,3.8608675574635223,1.4248004264465348,3.1232394259292864,-3.4873348717877377,0.9159758652326276,0.497237874741742,3.889066420038632,1.3886211398514363,2.5148996189851527,-3.7454111232580862,0.9549820191637158,0.5109327506058692,3.9111353041331194,1.3499555641751375,1.897486913391856,-3.984482007110902,0.9941778584294523,0.5242293418787121,3.9269908169872387,1.3089969389957457,1.2724726264114707,-4.2039237955163244,1.0335008940657109,0.5371057089065343,3.936564401171239,1.2659443375929844,0.6413525067805128,-4.403193475981347,1.0728880267286975,0.5495419285737655,3.939802578900108,1.221001859794814,0.005646734709918064,-4.58182875134982,1.1122756987129692,0.5615201405327175,3.9366671963483157,1.1743778248240784,-0.6331000781149504,-4.739448039802504,1.1516000484126032,0.5730245853617653,3.927135667964553,1.1262839641451257,-1.2733188885343028,-4.87575047485698,1.1907970672255128,0.584041634651997,3.9112012207864875,1.0769346143104548,-1.9134162219139137,-4.990515905367748,1.22980275890091,0.5945598130223261,3.8888731387554945,1.026545909807318,-2.551774172145131,-5.083604895526146,1.2685533013299197,0.6045698120630739,3.8601770070314125,0.9753349759043827,-3.1867504016449146,-5.154958724860427,1.3069852107793323,0.6140644962080171,3.8251549563072835,0.9235191214983426,-3.8166781413557342,-5.204599388235701,1.345035508568517,0.6230389005348997,3.7838659071240928,0.8713150319605638,-4.439866190745673,-5.232629595853949,1.3826418901894655,0.631490220494413,3.73638581418552,0.8189379619836958,-5.054598917808385,-5.239232773253994,1.4197428968700025,0.6394177935676438,3.6828079106726768,0.7666009284283294,-5.659136259063085,-5.224673061311612,1.4562780895801266,0.6468230728519837,3.62324295255886,0.7145139031696017,-6.251713719554572,-5.1892953162393765,1.492188225481508,0.6537095925755116,3.5578194629242885,0.66288300594385,-6.830542372853178,-5.133525109586734,1.5274154368201343,0.660082925539834,3.4866839762708435,0.6119096971952181,-7.393808861054895,-5.0578687282400825,1.5619034122620958,0.6659506324914011,3.410001282836833,0.5617899709223136,-7.93967539478119,-4.962913174422644,1.5955975806725264,0.671322203421282,3.327954672911709,0.5127135475248366,-8.466279753179167,-4.849326165694493,1.62844529733769,0.6762089907934078,3.240746181150822,0.46486306665018406,-8.971735283921474,-4.717856134952599,1.6603960326302114,0.6806241347012847,3.1485968308901926,0.4184132800400887,-9.45413090320634,-4.569332230430802,1.6914015631174542,0.6845824799531693,3.051746878461203,0.3735302443772988,-9.911531095757589,-4.404664315699827,1.721416165113054,0.6881004850857083,2.9504560575053804,0.3303705141321356,-10.341975914824568,-4.2248429696673035,1.7503968106715893,0.6911961233060538,2.845003823289138,0.2890803344091833,-10.743480982182236,-4.030939486577664,1.7783033660264045,0.6938887753624366,2.73568959701849,0.24979483379387274,-11.114037488131137,-3.8241058760122586,1.8050987924705824,0.6961991143432029,2.6228330101538435,0.21263721719916165,-11.451612191497313,-3.605574862889328,1.8307493496810574,0.6981489824043321,2.5067741487247033,0.17771795871213864,-11.754147419632476,-3.3766598874638842,1.8552248014858845,0.6997612594254019,2.387873797644435,0.1451339944406218,-12.019561068413875,-3.1387551053279275,1.8784986240746475,0.7010597235940351,2.2665136850249854,0.11496791535988805,-12.245746602244273,-2.893335387410322,1.900548216652023,0.7020689039188026,2.1430967264916836,0.08728716015917791,-12.430573054052099,-2.6419563199767864,1.9213551145344854,0.7028139246706061,2.018047269497901,0.06214320808843926,-12.571885025291278,-2.3862542046298354,1.9409052046901607,0.7033203417524991,1.8918113376398789,0.03957077180486319,-12.667502685941356,-2.127946058309,1.95918894372183,0.7036139709980181,1.7648568749714106,0.019586990219609107,-12.715221774507473,-1.8688296132905977,1.9762015782930769,0.7037207083979332,1.637673990318632,0.0021906213443723477,-12.712813598020237,-1.610783317187774,1.9919433679975864,0.7036663422554912,1.5107752015947262,-0.012638764861982094,-12.65802503203597,-1.3557663329507075,2.0064198106715927,0.7034763572701377,1.3846956801146861,-0.02494159364678022,-12.548578520636438,-1.1058185388662674,2.0196418701494627,0.703175730549663,1.2599934949100817,-0.03477909261686829,-12.382172076429095,-0.8630605285583118,2.0316262064624393,0.7027887195508575,1.1372498570437435,-0.04223409889202878,-12.15647928054682,-0.6296936109875503,2.042395408480532,0.7023386419486086,1.0170693639245882,-0.04741186625835608,-11.86914928264826,-0.407999810451542,2.0519782289975455,0.7018476474334752,0.9000802436222846,-0.05044087232159003,-11.517806800917452,-0.20034186658476869,2.060409822259263,0.7013364814377169,0.7869345991820358,-0.05147362566049392,-11.100052122064115,-0.009163234358525188,2.0677319839347765,0.7008242407898059,0.6783086529393486,-0.0506874729802169,-10.613461101323526,0.1630119159190086,2.073993393530964,0.7003281212973849,0.5749029908347217,-0.048285406265719005,-10.05558516245647,0.3135786986027029,2.0792498592501065,0.6998631572587186,0.4774428067284114,-0.044496869935033226,-9.423951297749417,0.4398515127107064,2.0835645652906702,0.6994419529025822,0.3866781467152108,-0.0395785679927835,-8.716062068014272,0.5390640419240629,2.0870083215912145,0.6990744057566334,0.3033841534391541,-0.03381527118336043,-7.929395602588639,0.6083692545872269,2.0896598160174715,0.6987674219442437,0.2283613104082539,-0.027520624144472865,-7.061405599335657,0.6448394037075185,2.091605868992544,0.6985246234098058,0.1624356863092943,-0.021037952560409735,-6.109521324643961,0.6454660269555135,2.092941690570275,0.6983460470724967,0.10645917932251976,-0.01474107031545791,-5.071147613427902,0.6071599466649422,2.093771139951763,0.698227835908516,0.06130976143641016,-0.009035086647219477,-3.9436648691272858,0.5267512698326631,2.094206987444996,0.6981619219617773,0.027891722762432337,-0.004357213300031625,-2.7244290637074617,0.400989388118509,2.094371178867685,0.6981357012830789,0.0071359158497441896,-0.0011775716783374577,-1.4107717376595301,0.22654297784554728,2.094395102393193,0.698131700797731,-2.1213328352702246e-35,7.105427357601002e-15,-2.1213328352702246e-35,1.4210854715202004e-14
