Type,1
T,101
nz,6
Mod,1.0,1.0,1.0,1.0,0.5,0.5,0.5,0.5
w,0.07767356373806174,0.1165103456070926,0.9709195467257717,0.19418390934515437
Sstart,0,0,0,0,0,0
Sgoal,2.0943951023931953,0.6981317007977318,0.0,0.0,0.0,0.0
degree,7
Polynome,-8.383341154552458e-18,4.634879712662815e-18,8.115485407886698e-19,-0.5417428863307031,80.72615335636749,-194.94570560086117,164.540688394695,-47.68499816147742,3.336835429893947e-17,1.675460998277998e-17,2.5339461434755435e-18,231.95160651974027,-1092.5519497691355,1900.606975905725,-1446.4776066774198,407.16910572188755
X,-8.383341154552458e-18,3.336835429893947e-17,4.634879712662815e-18,1.675460998277998e-17,1.6230970815773396e-18,5.067892286951087e-18,2.461881405029619e-07,0.00022121470531375744,0.0001507328528642703,0.06530943946926057,0.06051705866530772,12.643613957807808,7.96888475570174e-06,0.0016867944291274208,0.001780326697664234,0.24487316105351176,0.29206846329528346,22.887152170637656,4.6142852932549445e-05,0.005422865468847604,0.006489935357533635,0.5157623666295432,0.6730077271036448,30.943322033982717,0.00015269111356316532,0.0122367339184965,0.0156699509478341,0.8571251399565044,1.1828249897824044,37.01482673102665,0.0003784337590370351,0.022737157697140523,0.03051124997474271,1.2500874306189564,1.8021229842627968,41.29457044587292,0.0007851480262571428,0.03735363867741087,0.05201619910144886,1.6776560901022142,2.5125930034762045,43.96586357677399,0.0014437372256561156,0.05635475543543911,0.08100942058196038,2.1246239599999877,3.2969908671150847,45.202627949360725,0.0024325061228884786,0.07986555714353032,0.11814831736251886,2.577477012354305,4.139112888393896,45.16960202987157,0.003835540369875107,0.1078840391268974,0.16393335785062443,3.0243035421277433,5.023771840810026,44.02254613838193,0.005741187581875975,0.14029672060577877,0.21871812035166968,3.4547054118079368,5.9367729249047185,41.90844766203334,0.00824063765726728,0.17689334514426264,0.28271909717318233,3.85971134814439,6.8648897350239935,38.96572626826287,0.01142659993669907,0.2173807243271411,0.35602525839667865,4.231692291017576,7.795840226079584,35.324439118032295,0.015392074798309409,0.2613957451861167,0.4386073753171243,4.564278794440334,8.718262680309854,31.106486079057497,0.02022921728567122,0.30851756189668383,0.5303271035500058,4.852280479691552,9.621691674040727,26.425814939037643,0.026028290365147873,0.35827899226700904,0.6309458258060102,5.0916075405821495,10.496534044446632,21.38862661888453,0.03287670540933372,0.41017713954013324,0.7401332543333156,5.279194300853346,11.33404485631138,16.093580385951828,0.04085814750325534,0.4636832600308159,0.8574757930274887,5.412924823707239,12.126303368789152,10.631999067264427,0.05005178317001003,0.5182518971183488,0.9824846592089941,5.491560573469636,12.866189002165383,5.088074262747659,0.0605315481125175,0.5733293021166587,1.1146037650683107,5.514670129385236,13.547357304617705,-0.46092844154337625,0.07236551256806036,0.6283611625430227,1.2532173587786588,5.482560951545057,14.164215918976868,-5.944464260194673,0.0856153218722904,0.68279965830672,1.3976574252763343,5.396213198946165,14.71190054948768,-11.298503995203673,0.10033570982937615,0.7361098663389433,1.5472108467086572,5.2572155996837395,15.186250928569907,-16.46532882275043,0.11657408248496752,0.7877755341852886,1.7011263225495237,5.06770337327534,15.583786783579225,-21.393325079968008,0.1343701698986548,0.8373042430821557,1.8586210493825677,4.830298205117558,15.901683803568153,-26.03677905171338,0.15375574351259663,0.8842319810383694,2.018887160351939,4.548050273074942,16.13774960604692,-30.355671757337973,0.1747543967129942,0.9281271464433567,2.181097924280682,4.224382326201141,16.29039970374448,-34.31547373745854,0.19738138618108692,0.9685940027231952,2.3444137044567266,3.863035815592471,16.35863347136938,-37.88693984072775,0.2216435316303467,1.0052756045658564,2.507987677086491,3.46801907737364,16.342010112370684,-41.04590401060507,0.24753917152654506,1.037856216236973,2.670971309416089,3.043557567815827,16.24062462569896,-43.77307407212735,0.27505817238737257,1.0660632425074388,2.8325195975201547,2.5940461505871086,16.055083772567105,-46.053826518679465,0.3041819892582817,1.0896686927141932,2.9917960637582652,2.1240034361351,15.78648204321135,-47.8780012987654,0.3348837749612341,1.1084901984754671,3.1479775138989776,1.6380281732018922,15.436377623652191,-49.23969660277842,0.36712853571302606,1.1223916055818604,3.3002585539114824,1.1407576924713156,15.006768362455306,-50.13706364977207,0.400873330709867,1.13128316058455,3.447855866424856,0.6368284023484608,14.50006773749237,-50.572101474231104,0.43606751327489085,1.1351213126019406,3.5900122468549247,0.13083833687161678,13.919080822702181,-50.55045171284194,0.47265301116527186,1.1339081508661244,3.726000399198743,-0.37268824424375147,13.266980254851433,-50.08119339126306,0.5105646436356256,1.1276904985304061,3.8551264914966747,-0.8693342034285418,12.547282200295745,-49.17663771089721,0.5497304728543657,1.1165586832592826,3.97673347096209,-1.3548208209511126,11.763822321740424,-47.85212283565899,0.5900721872696995,1.100645005122166,4.090204138778664,-1.8250370384765582,10.920731745001635,-46.125808678749884,0.6315055145219308,1.080121922312159,4.194963984565288,-2.2760666504933034,10.022413025767133,-44.0184716894245,0.6739406614987521,1.0551999752112633,4.2904837805086,-2.7042134436073417,9.07351611635728,-41.553299639765356,0.7172827791302011,1.0261254693232493,4.376281935163099,-3.1060242837046093,8.078914332485834,-38.755686411450334,0.7614324495199535,0.9931779375956324,4.451926606918903,-3.478310150980636,7.043680320021152,-35.653026782525735,0.8062861930096336,0.95666740265195,4.517037577137082,-3.818165122838138,5.97306202174684,-32.274511214174744,0.8517369927728142,0.9169314594557815,4.571287882952622,-4.122983304652283,4.872458644122825,-28.650920637491037,0.8976748345353875,0.8743321989277151,4.614405209745013,-4.3904737084034995,3.747396624046227,-24.814421240247093,0.9439872590189777,0.8292529930367174,4.646173043276362,-4.618673079178281,2.6035055956123743,-20.7983592536647,0.9905599247040716,0.7820951618870996,4.666431581497272,-4.805956669537501,1.446494356875567,-16.637055739188398,1.0372771785095498,0.7332745433224647,4.67507840602017,-4.951046961752327,0.2821268366102028,-12.365601375253732,1.0840226319852855,0.6832179855680351,4.672068913260319,-5.053020337908293,-0.8838019389285372,-8.01965124405831,1.1306797406144926,0.6323597834324706,4.657416505244457,-5.111311697876499,-2.045489879243519,-3.6352196183328487,1.177132383822498,0.5811380785907659,4.631192540086994,-5.125717025152924,-3.1971518628348927,0.7515252518859871,1.2232654432886185,0.5299912444693239,4.593526042133884,-5.096393900565196,-4.33304377043908,5.1044663524904585,1.268965377157806,0.4793542762546376,4.54460317177399,-5.023859963847437,-5.447486518267774,9.387743118524378,1.3141207877487473,0.42965520654697026,4.484666454918242,-4.908989323082432,-6.534890091247346,13.565956647417467,1.3586229803551055,0.38131156718014475,4.414013772146194,-4.753006912011491,-7.589777576257596,17.60437491221139,1.4023665107365395,0.33472691772897234,4.332997107520344,-4.557480795212528,-8.606809195370811,21.469137974791764,1.4452497188962319,0.29028746122557125,4.242021057068046,-4.324312421144933,-9.580806339090971,25.12746319911507,1.487175246741556,0.2483587676058882,4.14154109693091,-4.055724823063343,-10.506775599592999,28.547850464437452,1.5280505372245858,0.2092826254076422,4.032061611181973,-3.754248767798153,-11.379932803961355,31.700287378549863,1.567788312559101,0.1733740422413641,3.9141336793103902,-3.422706852404105,-12.195727047429497,34.556454490997204,1.6063070291107986,0.14091841455528803,3.7883526233737115,-3.0641955486762398,-12.949864726618978,37.08993050631939,1.6435313065573454,0.11216888721605535,3.655355314817878,-2.682065195534622,-13.638333572778356,39.27639749726707,1.6793923289149835,0.08734392342606191,3.515817240964659,-2.2798979392752985,-14.257426685021887,41.09384611804766,1.7138282150283302,0.06662510549896035,3.370449331166907,-1.8614836216900146,-14.80376656356959,42.52278081753627,1.7467843561200882,0.050155187014653844,3.2199945426312135,-1.4307936160531183,-15.27432914298543,43.5464250525208,1.7782137179973154,0.038036416875063254,3.0652242059083394,-0.9919526109764881,-15.666467825416687,44.15092650092151,1.808077105510923,0.030329155782243798,2.9069341300511455,-0.549208342132041,-15.977937513833039,44.325562275023024,1.8363433868651122,0.027050805659306607,2.7459404674402244,-0.10689927184194524,-16.2069186452659,44.062944134704864,1.8629896753733761,0.028175072536966748,2.583075338276959,0.3305797834636247,-16.352041224046978,43.359223700671585,1.8880014662578173,0.0336315834253954,2.419182214744527,0.7588140779208834,-16.412408855047598,42.21429766767522,1.9113727260883566,0.043305877694063695,2.2551110648361052,1.173407413038358,-16.387622776917944,40.63201301775329,1.9331059324586124,0.05703979347967721,2.0917132558510563,1.5700226666373982,-16.277805895325624,38.62037223345592,1.9532120614950266,0.07463226964507531,1.9298362175584174,1.9444243739221343,-16.08362681619567,36.1917385110701,1.971710520796053,0.09584058380837407,1.7703178650282663,2.292523360682779,-15.806323878948383,33.36304097385158,1.988629025397865,0.1203820469661105,1.6139807811304552,2.6104234286328962,-15.447729189739585,30.15597988525964,2.0040034143635137,0.14793617522886157,1.4616261587010833,2.8944700928764355,-15.010292654699205,26.597231862183,2.0178774055920248,0.17814735919380165,1.3140275023766066,3.1413013715088094,-14.497106013169358,22.718655088155717,2.0303022864441798,0.21062805147261782,1.1719240900955208,3.3479006273487384,-13.9119268709455,18.55749452661403,2.041336537781671,0.2449624928983686,1.036014194267616,3.5116514618040675,-13.259202733513987,14.1565871341003,2.0510453890162728,0.2807109979309823,0.9069480626107798,3.630394660867993,-12.54409503929086,9.564567073506549,2.059500301765718,0.31741481978354547,0.7853206586557315,3.7024871932517693,-11.772503192862978,4.836070927296191,2.066778379712947,0.3546016157913862,0.6716641619178049,3.7268632606413314,-10.951088598224384,0.031942910741429395,2.0729617022654945,0.3917915335427345,0.5664402277371027,3.703097400096724,-10.08729869201751,-4.780559914856339,2.0781365796114435,0.4285039382954522,0.4700320067852815,3.6314696385747554,-9.189390976770909,-9.52756242893439,2.0823927267690028,0.4642648021992626,0.3827359242410123,3.5130326995903545,-8.266457054139401,-14.128366238431827,2.0858223542259933,0.4986147758449629,0.3047532186320854,3.349681262006382,-7.328446658142044,-18.495244464575936,2.0885191727662034,0.5311179626627812,0.23618124034599286,3.144223270956521,-6.386191688402168,-22.53323652963245,2.0905773100791367,0.5613714166897066,0.17700450980741486,2.9004533009027402,-5.451430243385708,-26.139942943699268,2.0920901367498748,0.5890153842288289,0.12708553532357936,2.6232279708217097,-4.5368306536411485,-29.20532009145761,2.093148999225776,0.6137443099213599,0.08615539059727786,2.318543411524516,-3.6560155150377134,-31.61147501894973,2.093841857356598,0.6353186277513786,0.0538040519077162,1.9936147851109165,-2.8235857220044056,-33.232460220360245,2.094251824104777,0.6535773575072726,0.029470494958478796,1.6569578565540592,-2.0551445007702167,-33.93406842476353,2.0944556050225187,0.6684515272185015,0.012432551393051798,1.3184726174154604,-1.3673214426021763,-33.573627382916115,2.0945218350924106,0.6799784420906354,0.001796524979068825,0.9895289616964092,-0.777796537043781,-31.999794654023095,2.094509310528174,0.6883168204601564,-0.003513432541781792,0.6830544138195226,-0.30532420515690417,-29.052352392489627,2.094465113132302,0.6937628172878852,-0.004766185933816639,0.4136239087420327,0.030242667242778118,-24.562002134724814,2.0944226248071893,0.6967669557165866,-0.0034347212821214447,0.1975516242022604,0.20792869634394684,-18.35015958587902,2.09439942981646,0.697951987209969,-0.0012074911385820454,0.05298486509729146,0.2056119671025777,-10.228749406648005,2.0943951023931993,0.6981317007974894,1.1857807700676095e-13,-3.0695227959813627e-12,1.1466399629299433e-12,-7.958073572620836e-12
