Type,0
T,101
nz,6
Mod,1.0,1.0,1.0,1.0,0.5,0.5,0.5,0.5
w,0.5,0.5
Sstart,0.003849571687637437,-0.00639658300660203,-0.008123220968368216,0.014900128803195408,-0.0020355298114060677,-0.005627360657721561,-0.02013817843174289,-0.023104359019691958,0.0007196181878228979,-0.022876837620571557,-0.019676793512426252,-0.012938409152985978,-0.016345941055564996,-0.0033099388432218796,-0.03631344567073549,-0.03153615556906639,-0.06957790958786178,-0.06111512687298833,-0.06371259265646045,-0.05999613483760467,-0.08120273627666462,-0.08152771984919865,-0.10197132998781801,-0.10036213313325495,-0.08940631608627936,-0.10303879773408568,-0.10581343907780792,-0.09782321570389331,-0.10498663301005937,-0.11190610069640804,-0.12025855615298306,-0.12068015097087256,-0.11191899273243372,-0.09891554945933403,-0.09169271728360132,-0.11264357669162275,-0.08271035050833729,-0.058449629688574214,-0.03962302442988318,-0.025132607825006863,-0.01761815334558649,0.019567352207704024,0.02263477599602378,0.03990532692158806,0.048190930534138095,0.10337390416204956,0.13323199966298974,0.1629654359954004,0.20658068322849815,0.24371783126209032,0.2659196545508595,0.3328428982179211,0.34726278537307564,0.40262350328856655,0.45045430996953334,0.4852242253529319,0.5451158995521879,0.5788524855373444,0.6293840693288222,0.6924031500346058,0.7493218091515956,0.7963959570107595,0.8574135559225439,0.9089239072917275,0.9694527405746327,1.0288213454578596,1.0581759846004137,1.1446330573814107,1.1792114260203517,1.2405516368447294,1.2953447091039036,1.3531431875166515,1.4273593353730265,1.4444781030527853,1.4876361172643702,1.5617962572203972,1.586734242086098,1.6301076789043012,1.6882920496443123,1.73803029246714,1.7833690870312093,1.7956537388828469,1.8425694317942956,1.8861807258651329,1.8996683693933043,1.9419976019576994,1.964073494381414,1.975018923098711,1.9999711527468411,2.0198253755360542,2.037265084175357,2.0488935764534872,2.069286439240756,2.0710711393664263,2.078772884664611,2.082748298769935,2.1017266121280427,2.1126537143389745,2.105914000028996,2.0877795099406296,2.132751624600098
Sgoal,0.010702703672246619,7.303385473829019,13.733711671884409,19.34718538310403,24.196314882921232,28.311695083175135,31.72906001108093,34.49243105810463,36.63792854201371,38.216894904727695,39.25949833584485,39.78570761139311,39.86709585242385,39.48101071650469,38.727894251137975,37.58206756673672,36.11686388761203,34.33937320523983,32.27163162833879,29.965277338488054,27.441663506576784,24.742580875356616,21.854819540511674,18.853691741513703,15.727407703614453,12.496330244842255,9.21176390260755,5.892891618073582,2.521027657433809,-0.8365150798808636,-4.149159896179775,-7.496835869845768,-10.737412237383491,-13.934945390424344,-17.05391113820678,-20.048693335133372,-22.94785821553335,-25.71253638135961,-28.337758875627124,-30.807094418650664,-33.12896252960725,-35.28434895008161,-37.258815869030926,-39.03228615197937,-40.617833216714246,-42.00762654846461,-43.1901681557973,-44.150348830893535,-44.891787549902524,-45.43442643331981,-45.782511062420106,-45.86824356707267,-45.763483811214726,-45.417822750754254,-44.864591638660364,-44.086441001517116,-43.093422788938234,-41.89959319854303,-40.50838251397776,-38.93714797991009,-37.1461767303922,-35.215634894230405,-33.07152334762257,-30.781810114440212,-28.34302563462512,-25.756581276122738,-23.04420869056949,-20.23761000803148,-17.30109090182956,-14.298851183100133,-11.201408771315652,-8.064144709944927,-4.911394634250109,-1.6951420624771207,1.4920753484408258,4.6694141473447255,7.777362430894587,10.853268340376959,13.81703439855468,16.685005409401924,19.414691743488422,22.005691419276015,24.352620632394203,26.540964634767786,28.45529158496537,30.11873453545639,31.44811026460957,32.49544363523793,33.14651960120359,33.390994186217384,33.24227051289234,32.613557890509654,31.47977302671708,29.814110265471086,27.57514072716956,24.739929432216535,21.255400065412793,17.066411927902607,12.151920618565015,6.503014305601407,-0.017966788629921255
X,0.003849571687637437,-0.014065022881512767,0.0019692510898924325,0.003130722704065318,-0.009850165068642223,0.010702703672246619,-0.00639658300660203,-0.010874641141113415,-0.01236372505507077,0.038008987030706536,-1.549421587063896,7.303385473829019,-0.008123220968368216,-0.006018048408793164,-0.016614612319774624,0.13532276894055656,-2.85115209478095,13.733711671884409,0.014900128803195408,0.004576441102510436,-0.07145089923667496,0.29948929137214,-3.9020627933531893,19.34718538310403,-0.0020355298114060677,0.02504114381119402,-0.10975522529288392,0.5287579299414441,-4.710566569728578,24.196314882921232,-0.005627360657721561,0.010487283956578334,-0.16685510083732857,0.7764192356528963,-5.328149926276409,28.311695083175135,-0.02013817843174289,0.027974859756286906,-0.22732687499443277,1.0902227940192668,-5.711034593830297,31.72906001108093,-0.023104359019691958,0.04013524470981256,-0.263898289314824,1.4317812390401843,-5.93101985167368,34.49243105810463,0.0007196181878228979,0.05005747156391196,-0.34151733717629446,1.777736094092853,-5.96510357563967,36.63792854201371,-0.022876837620571557,0.07326455680954391,-0.3888567767712152,2.1506794852879008,-5.831437264161626,38.216894904727695,-0.019676793512426252,0.08295073654255028,-0.45005972730925037,2.5457446526806553,-5.5707432651967315,39.25949833584485,-0.012938409152985978,0.10576965813966266,-0.4923314087730922,2.940743772779127,-5.152504800805596,39.78570761139311,-0.016345941055564996,0.15824443139621383,-0.5450813716430691,3.3402032138691253,-4.623777638627868,39.86709585242385,-0.0033099388432218796,0.18260596769957893,-0.6015913680467312,3.729129566927556,-3.98862847030142,39.48101071650469,-0.03631344567073549,0.25005340692826944,-0.6243912223322535,4.13412584519948,-3.2767113611507352,38.727894251137975,-0.03153615556906639,0.27000667132436684,-0.6623195276082936,4.508006770150083,-2.423122526862703,37.58206756673672,-0.06957790958786178,0.3296562069823004,-0.6701691299214247,4.880639662256694,-1.531679455518218,36.11686388761203,-0.06111512687298833,0.34768729052993513,-0.6934948515938268,5.233475493155397,-0.5493593279988677,34.33937320523983,-0.06371259265646045,0.4157956165244374,-0.6787873807532924,5.562208476290203,0.45915844365945724,32.27163162833879,-0.05999613483760467,0.4668290711667397,-0.6677215017125593,5.877684499947007,1.5038829801424711,29.965277338488054,-0.08120273627666462,0.5264710837323072,-0.6374835750114426,6.159728309516276,2.617624876337459,27.441663506576784,-0.08152771984919865,0.6099981031607278,-0.6217490761770189,6.432326041207077,3.740679260539162,24.742580875356616,-0.10197132998781801,0.6853298145609183,-0.5808299802403876,6.638917131794444,4.862745891286359,21.854819540511674,-0.10036213313325495,0.728652626998071,-0.5254208432656413,6.8689859123537556,6.03566580746792,18.853691741513703,-0.08940631608627936,0.7935769422047437,-0.4345853582735102,7.034195508801673,7.179993477614074,15.727407703614453,-0.10303879773408568,0.8662121437002133,-0.38387249673288765,7.172215451680713,8.320735235779104,12.496330244842255,-0.10581343907780792,0.9581161111703149,-0.31168315026811194,7.287015035234105,9.463533266076935,9.21176390260755,-0.09782321570389331,1.0182526100156954,-0.18797865689984408,7.363322483228395,10.557185492448648,5.892891618073582,-0.10498663301005937,1.0948845043965743,-0.08657842087008895,7.393725098449671,11.628153001812489,2.521027657433809,-0.11190610069640804,1.1625933856763626,0.022486630645136427,7.404405944766627,12.652579073643366,-0.8365150798808636,-0.12025855615298306,1.2427169217868692,0.17254649432646232,7.389360102043528,13.641219527555464,-4.149159896179775,-0.12068015097087256,1.3162629345296983,0.32786180355597055,7.3066784575091,14.60143358044663,-7.496835869845768,-0.11191899273243372,1.3945707409230044,0.45711212366716303,7.238019123031198,15.507496336214684,-10.737412237383491,-0.09891554945933403,1.4527201708819262,0.6344141980314496,7.1184697871136375,16.345894421847646,-13.934945390424344,-0.09169271728360132,1.522051768064759,0.8023314301297944,6.953846566026281,17.109857422890425,-17.05391113820678,-0.11264357669162275,1.588568746680446,0.9710753404941375,6.752958220015791,17.7773307329428,-20.048693335133372,-0.08271035050833729,1.6802905446816458,1.1491941146583158,6.55844831636267,18.45528413501035,-22.94785821553335,-0.058449629688574214,1.7372018162939664,1.333527966570237,6.304547417012448,18.989579034531957,-25.71253638135961,-0.03962302442988318,1.7797275891515885,1.4999399345099513,6.027616451366525,19.48222697923188,-28.337758875627124,-0.025132607825006863,1.8503619439725376,1.715653596945212,5.758837601129557,19.89071588347265,-30.807094418650664,-0.01761815334558649,1.900945293086396,1.8992053467971683,5.424554276027468,20.20590946688917,-33.12896252960725,0.019567352207704024,1.955425065689667,2.1200719287305754,5.069538978310858,20.437433798942,-35.28434895008161,0.02263477599602378,1.9816213453793876,2.3323869482718447,4.720955327249307,20.565750557493807,-37.258815869030926,0.03990532692158806,2.034996072554029,2.5379387768731143,4.348956282615759,20.624328993364212,-39.03228615197937,0.048190930534138095,2.0905049141531147,2.738345674846189,3.9402779366165013,20.586678047128235,-40.617833216714246,0.10337390416204956,2.1277298115029053,2.9407830214113893,3.5372364645758494,20.45913613912233,-42.00762654846461,0.13323199966298974,2.17559497357079,3.15219424803769,3.1024269106615727,20.238949394145905,-43.1901681557973,0.1629654359954004,2.1991999151983617,3.3622948909676733,2.6706560912311916,19.93063164594127,-44.150348830893535,0.20658068322849815,2.236607837346359,3.5422944448338045,2.2199148706661367,19.51039723465103,-44.891787549902524,0.24371783126209032,2.246935443121789,3.7283694684340714,1.7525416947468355,19.02857535967845,-45.43442643331981,0.2659196545508595,2.2585879917539033,3.930734336516356,1.3149164267716489,18.452554170082802,-45.782511062420106,0.3328428982179211,2.2451854727531213,4.108983330455415,0.8526455209101986,17.77120874800122,-45.86824356707267,0.34726278537307564,2.2783295386399542,4.292091720105348,0.38964812206697325,17.035114606007916,-45.763483811214726,0.40262350328856655,2.271565144448011,4.437458063373669,-0.06959380303816505,16.180940022281803,-45.417822750754254,0.45045430996953334,2.263344793099246,4.598318316925217,-0.516588275342801,15.247913731153657,-44.864591638660364,0.4852242253529319,2.2683402518441937,4.754689425705434,-0.9631609730705254,14.224154811086422,-44.086441001517116,0.5451158995521879,2.235432109417927,4.891134907437976,-1.4032228795511188,13.171906561627043,-43.093422788938234,0.5788524855373444,2.235609530549834,5.0084644994326,-1.8119711331391983,12.01371497959125,-41.89959319854303,0.6293840693288222,2.204732509779396,5.120756030854858,-2.2361515310805307,10.785096188797796,-40.50838251397776,0.6924031500346058,2.1824945818210244,5.229662164693994,-2.6370510565294385,9.493984846497378,-38.93714797991009,0.7493218091515956,2.158694601144148,5.331862109418565,-2.996943884974816,8.134201948450915,-37.1461767303922,0.7963959570107595,2.144634070654623,5.402909877122365,-3.362962475442539,6.741810074048765,-35.215634894230405,0.8574135559225439,2.10493367871121,5.464525603850034,-3.7147055580235593,5.282719236128889,-33.07152334762257,0.9089239072917275,2.054150936698362,5.506977617425747,-4.03430950766574,3.7544554615704846,-30.781810114440212,0.9694527405746327,2.0000582599647987,5.543793402868732,-4.3267343286718525,2.2245781968034795,-28.34302563462512,1.0288213454578596,1.9667661588492464,5.555507118781074,-4.592475086535334,0.6647900562615148,-25.756581276122738,1.0581759846004137,1.9203453408706075,5.538824879243433,-4.8430337855075685,-0.9376778993408617,-23.04420869056949,1.1446330573814107,1.8691192328260964,5.521660580724743,-5.0566055754931964,-2.5632739296693416,-20.23761000803148,1.1792114260203517,1.8170776499904564,5.499028219193438,-5.238902639303932,-4.1931699318527755,-17.30109090182956,1.2405516368447294,1.7651109615216984,5.4570026862644,-5.400198045350372,-5.826947637949961,-14.298851183100133,1.2953447091039036,1.7252537510153627,5.385554196072579,-5.527981602330198,-7.43494180546337,-11.201408771315652,1.3531431875166515,1.6519749965201063,5.3000663849544045,-5.634855437644224,-9.060867900224563,-8.064144709944927,1.4273593353730265,1.622535598864736,5.195452198501662,-5.685550865894817,-10.673755001805473,-4.911394634250109,1.4444781030527853,1.5551654517428584,5.064785284958024,-5.741490468456995,-12.229192608576826,-1.6951420624771207,1.4876361172643702,1.503473077238134,4.9569097939590305,-5.738937236138796,-13.765627467715381,1.4920753484408258,1.5617962572203972,1.4500131578443114,4.802766869811447,-5.705413952116033,-15.233194647692818,4.6694141473447255,1.586734242086098,1.379135002780725,4.621140964553196,-5.637353992042362,-16.660394264653466,7.777362430894587,1.6301076789043012,1.3209462705226502,4.4607976006082035,-5.563670971615575,-18.0008744968234,10.853268340376959,1.6882920496443123,1.265777538047739,4.282188861676339,-5.426728944303241,-19.27866391593933,13.81703439855468,1.73803029246714,1.2040215403739565,4.098974324329356,-5.2700222097875935,-20.450158640566066,16.685005409401924,1.7833690870312093,1.1430681232620494,3.8794847589949297,-5.088241230899917,-21.493247821033524,19.414691743488422,1.7956537388828469,1.1081612804955527,3.6523161739984644,-4.8797897417294935,-22.472076335231712,22.005691419276015,1.8425694317942956,1.0500626959204071,3.4208745943167984,-4.651229477042603,-23.28064078427744,24.352620632394203,1.8861807258651329,1.00187721224121,3.1741194328048756,-4.402286890119986,-23.954417217556614,26.540964634767786,1.8996683693933043,0.9931586952171803,2.9458117968419297,-4.119683923836001,-24.506941521374642,28.45529158496537,1.9419976019576994,0.9358058528682507,2.698293898823289,-3.822508317790766,-24.854464670598436,30.11873453545639,1.964073494381414,0.888460912288256,2.4578223786520366,-3.5148921223015686,-25.03287542276973,31.44811026460957,1.975018923098711,0.863069701278517,2.199654046631034,-3.1675208228629312,-25.016378483242317,32.49544363523793,1.9999711527468411,0.8424717725982505,1.9516912453576225,-2.8732093921748745,-24.79806827599752,33.14651960120359,2.0198253755360542,0.8117750885788851,1.7011926677099918,-2.548091494775858,-24.359411679877326,33.390994186217384,2.037265084175357,0.7770895174990522,1.4766582911813357,-2.194551462268263,-23.65798414924958,33.24227051289234,2.0488935764534872,0.7517676639928799,1.2254583545634499,-1.8618266301897313,-22.715183099288918,32.613557890509654,2.069286439240756,0.7452880622487679,1.0170989812608071,-1.5499009145594134,-21.50904752509637,31.47977302671708,2.0710711393664263,0.7297595434138822,0.8134974431124449,-1.2543794196354814,-19.999934669608553,29.814110265471086,2.078772884664611,0.7219241767178344,0.5879787693336127,-0.9513806008505034,-18.188361032230272,27.57514072716956,2.082748298769935,0.7100187131509185,0.4544541373288235,-0.7099195229798593,-16.07075028023177,24.739929432216535,2.1017266121280427,0.6957935540840176,0.27489418722175035,-0.4819145912369921,-13.606174447870846,21.255400065412793,2.1126537143389745,0.7151364707110196,0.16738924470583494,-0.2745132243766858,-10.802693592490774,17.066411927902607,2.105914000028996,0.6915071703920909,0.07386484236271633,-0.13209351183332582,-7.58760709253524,12.151920618565015,2.0877795099406296,0.7067980481631522,0.010139041167080913,-0.04556920083139642,-3.9843770656225743,6.503014305601407,2.132751624600098,0.7135628025468755,0.004205127935841623,-0.0011654858517864534,0.010291925884314107,-0.017966788629921255
