0.319259575
0.433484643
0.383287864
0.122766504
0.254664333
0.450612647
0.495659874
0.349734833
0.097160198
0.198996506
0.374255989
0.440583904
0.250609608
0.232881526
0.215908818
0.10461168
0.05860243
0.154679608
0.269985653
0.386048715
0.424883179
0.152620608
0.116909392
0.167771808
0.230055686
0.288717418
0.430446772
0.354231765
0.080573607
0.127362122
0.238637456
0.535749937
0.460661552
0.340858459
0.138804771
0.10048507
0.16827431
0.219988126
0.337405948
0.459416629
0.467961577
0.258206769
0.105019297
0.169400992
0.313478286
0.412055375
0.297716734
0.330223325
0.168841603
0.279817678
0.472295618
0.436909013
0.316414287
0.378332631
0.481778575
0.354991954
0.06514582
0.041389049
0.130190103
0.311534968
0.34605348
0.517200875
0.359188131
0.113823236
0.226647793
0.284304164
0.245193044
0.314857643
0.411279464
0.144591063
0.060363887
0.098263736
0.233182731
0.365630008
0.534461037
0.342843264
0.060448088
0.043893922
0.121935081
0.356601617
0.414362116
0.372842644
0.265199567
0.088870407
0.051959488
0.092262505
0.289484489
0.339572749
0.195223938
0.271556027
0.205222543
0.075624032
0.037003
0.08941815
0.320150493
0.383831552
0.381529525
0.455004632
0.085747897
0.061647836
0.138415807
0.345938817
0.418125701
0.324878533
0.361410112
0.183352568
0.202849372
0.073882186
0.071616951
