<?xml version="1.0" encoding ="UTF-8"?>

<X3D profile="Immersive" version="3.0">
  <head>
    <meta name="filename" content="D:/Cloud/Thesis_Chang/Travail de Juin/FullBodyModel/Geometry/clavicle_l.x3d"/>
    <meta name="generator" content="Visualization ToolKit X3D exporter v0.9.1"/>
    <meta name="numberofelements" content="73"/>
  </head>
  <Scene>
    <Background skyColor="0.32 0.34 0.43"/>
    <Viewpoint fieldOfView="0.523599" position="-0.046026 0.69166 -0.21261" description="Default View" orientation="0.974456 0.206781 0.0876236 -1.97495" centerOfRotation="-0.0202789 0.358351 -0.0741957"/>
    <NavigationInfo type='"EXAMINE" "FLY" "ANY"' speed="4" headlight="true"/>
    <DirectionalLight ambientIntensity="1" intensity="0" color="1 1 1"/>
    <Transform DEF="ROOT" translation="0 0 0">
      <DirectionalLight direction="-0.111619 -0.766044 -0.633022" color="1 0.97232 0.90222" intensity="0.75" on="true"/>
      <DirectionalLight direction="0.0449435 0.965926 -0.254887" color="0.90824 0.93314 1" intensity="0.25" on="true"/>
      <DirectionalLight direction="-0.939693 0 0.34202" color="0.9998 0.9998 0.9998" intensity="0.214286" on="true"/>
      <DirectionalLight direction="0.939693 0 0.34202" color="0.9998 0.9998 0.9998" intensity="0.214286" on="true"/>
      <Transform translation="0 0 0" rotation="0 0 1 -0" scale="1 1 1">
        <Shape>
          <Appearance>
            <Material ambientIntensity="0" emissiveColor="0 0 0" diffuseColor="1 1 1" specularColor="0 0 0" shininess="0.78125" transparency="0"/>
          </Appearance>
          <IndexedFaceSet solid="false" colorPerVertex="false" normalPerVertex="true" coordIndex="
            0 1 2 -1 
            2 3 0 -1 
            1 0 4 -1 
            0 5 4 -1 
            3 5 0 -1 
            6 2 1 -1 
            7 1 8 -1 
            1 9 10 -1 
            1 10 8 -1 
            1 4 9 -1 
            11 1 7 -1 
            11 6 1 -1 
            12 13 2 -1 
            14 12 2 -1 
            3 2 13 -1 
            2 6 14 -1 
            15 5 3 -1 
            13 15 3 -1 
            4 16 9 -1 
            4 5 17 -1 
            4 18 16 -1 
            4 19 18 -1 
            4 20 19 -1 
            4 17 20 -1 
            21 17 5 -1 
            21 5 22 -1 
            15 22 5 -1 
            14 6 23 -1 
            24 23 6 -1 
            6 25 24 -1 
            6 26 25 -1 
            6 27 26 -1 
            28 27 6 -1 
            6 11 28 -1 
            8 29 7 -1 
            11 7 29 -1 
            29 8 30 -1 
            8 10 31 -1 
            8 31 30 -1 
            10 9 32 -1 
            9 33 32 -1 
            34 9 16 -1 
            33 9 34 -1 
            31 10 32 -1 
            28 11 35 -1 
            35 11 36 -1 
            11 29 36 -1 
            12 37 13 -1 
            14 23 12 -1 
            12 23 38 -1 
            39 37 12 -1 
            39 12 38 -1 
            15 13 40 -1 
            37 40 13 -1 
            15 41 42 -1 
            43 22 15 -1 
            41 15 40 -1 
            44 15 42 -1 
            43 15 44 -1 
            34 16 45 -1 
            16 18 45 -1 
            17 46 20 -1 
            17 47 46 -1 
            47 17 21 -1 
            48 18 49 -1 
            18 19 50 -1 
            50 51 18 -1 
            18 51 49 -1 
            52 18 48 -1 
            18 52 45 -1 
            50 19 20 -1 
            53 20 46 -1 
            54 50 20 -1 
            54 20 55 -1 
            20 53 56 -1 
            55 20 56 -1 
            57 21 22 -1 
            47 21 57 -1 
            58 22 43 -1 
            22 58 57 -1 
            59 23 24 -1 
            38 23 59 -1 
            24 60 59 -1 
            61 24 62 -1 
            60 24 61 -1 
            25 62 24 -1 
            26 62 25 -1 
            26 63 64 -1 
            64 65 26 -1 
            62 26 65 -1 
            66 67 26 -1 
            68 66 26 -1 
            68 26 27 -1 
            63 26 67 -1 
            68 27 69 -1 
            70 69 27 -1 
            27 71 70 -1 
            28 71 27 -1 
            37 72 28 -1 
            28 35 37 -1 
            28 70 71 -1 
            72 70 28 -1 
            73 29 30 -1 
            73 74 29 -1 
            36 29 74 -1 
            75 73 30 -1 
            30 31 75 -1 
            33 75 31 -1 
            33 31 32 -1 
            75 33 34 -1 
            45 75 34 -1 
            40 37 35 -1 
            41 40 35 -1 
            36 76 35 -1 
            35 77 78 -1 
            77 35 76 -1 
            35 79 41 -1 
            78 79 35 -1 
            74 76 36 -1 
            80 37 39 -1 
            37 80 72 -1 
            81 39 38 -1 
            38 82 83 -1 
            82 38 59 -1 
            38 84 85 -1 
            83 84 38 -1 
            86 81 38 -1 
            38 85 86 -1 
            80 39 81 -1 
            41 79 42 -1 
            42 87 44 -1 
            88 42 79 -1 
            87 42 88 -1 
            43 44 89 -1 
            90 43 89 -1 
            90 91 43 -1 
            91 58 43 -1 
            44 92 93 -1 
            87 92 44 -1 
            89 44 93 -1 
            75 45 94 -1 
            52 95 45 -1 
            45 95 94 -1 
            53 46 96 -1 
            46 47 97 -1 
            46 97 98 -1 
            96 46 98 -1 
            57 58 47 -1 
            97 47 58 -1 
            48 49 54 -1 
            99 48 100 -1 
            54 100 48 -1 
            52 48 99 -1 
            49 51 54 -1 
            50 54 51 -1 
            52 99 101 -1 
            102 103 52 -1 
            102 52 101 -1 
            103 95 52 -1 
            104 53 96 -1 
            56 53 104 -1 
            105 54 106 -1 
            54 105 100 -1 
            54 107 106 -1 
            55 107 54 -1 
            107 55 108 -1 
            55 109 108 -1 
            104 55 56 -1 
            110 55 104 -1 
            109 55 110 -1 
            58 111 97 -1 
            111 58 91 -1 
            59 112 113 -1 
            112 59 60 -1 
            59 113 114 -1 
            59 114 82 -1 
            60 115 116 -1 
            117 112 60 -1 
            118 119 60 -1 
            115 60 119 -1 
            116 117 60 -1 
            118 60 120 -1 
            61 120 60 -1 
            61 62 121 -1 
            121 120 61 -1 
            62 122 123 -1 
            124 62 123 -1 
            121 62 124 -1 
            62 65 122 -1 
            63 125 64 -1 
            125 63 126 -1 
            63 67 126 -1 
            64 125 127 -1 
            127 65 64 -1 
            127 122 65 -1 
            126 67 66 -1 
            66 128 126 -1 
            66 68 129 -1 
            70 66 129 -1 
            130 128 66 -1 
            130 66 70 -1 
            68 69 129 -1 
            129 69 70 -1 
            70 72 130 -1 
            86 72 80 -1 
            131 72 86 -1 
            72 131 130 -1 
            74 73 132 -1 
            73 75 132 -1 
            74 133 76 -1 
            133 74 132 -1 
            134 75 94 -1 
            132 75 134 -1 
            133 135 76 -1 
            136 137 76 -1 
            138 139 76 -1 
            76 140 77 -1 
            135 136 76 -1 
            137 138 76 -1 
            76 141 140 -1 
            139 141 76 -1 
            77 142 78 -1 
            77 143 142 -1 
            140 143 77 -1 
            144 78 142 -1 
            79 78 144 -1 
            79 145 88 -1 
            145 79 146 -1 
            146 79 147 -1 
            79 144 147 -1 
            81 86 80 -1 
            82 84 83 -1 
            82 114 148 -1 
            82 148 84 -1 
            85 84 149 -1 
            84 148 150 -1 
            84 150 149 -1 
            151 152 85 -1 
            86 85 153 -1 
            152 153 85 -1 
            85 149 151 -1 
            86 153 131 -1 
            145 87 88 -1 
            87 145 92 -1 
            90 89 154 -1 
            93 154 89 -1 
            155 90 156 -1 
            90 155 91 -1 
            90 154 156 -1 
            155 111 91 -1 
            93 92 157 -1 
            92 145 158 -1 
            92 158 157 -1 
            93 159 154 -1 
            157 159 93 -1 
            94 95 134 -1 
            103 134 95 -1 
            96 98 104 -1 
            98 97 160 -1 
            111 161 97 -1 
            97 161 160 -1 
            104 98 162 -1 
            160 162 98 -1 
            163 99 100 -1 
            101 99 163 -1 
            100 141 163 -1 
            100 164 141 -1 
            105 164 100 -1 
            163 102 101 -1 
            102 139 103 -1 
            102 163 139 -1 
            165 134 103 -1 
            103 138 137 -1 
            103 137 165 -1 
            103 139 138 -1 
            104 162 166 -1 
            104 167 110 -1 
            166 167 104 -1 
            168 105 106 -1 
            168 164 105 -1 
            108 106 107 -1 
            168 106 108 -1 
            108 110 169 -1 
            170 168 108 -1 
            108 109 110 -1 
            169 170 108 -1 
            167 171 110 -1 
            171 172 110 -1 
            110 172 169 -1 
            111 155 161 -1 
            173 113 112 -1 
            112 174 175 -1 
            112 175 173 -1 
            174 112 117 -1 
            113 176 177 -1 
            176 113 173 -1 
            177 178 113 -1 
            114 113 178 -1 
            148 114 179 -1 
            114 178 179 -1 
            180 116 115 -1 
            119 181 115 -1 
            181 182 115 -1 
            115 182 180 -1 
            117 116 174 -1 
            116 180 174 -1 
            118 183 119 -1 
            184 118 120 -1 
            185 183 118 -1 
            185 118 184 -1 
            186 181 119 -1 
            187 186 119 -1 
            119 183 187 -1 
            120 121 184 -1 
            121 124 127 -1 
            121 127 188 -1 
            121 188 184 -1 
            127 123 122 -1 
            124 123 127 -1 
            188 127 125 -1 
            188 125 189 -1 
            126 190 125 -1 
            125 191 189 -1 
            191 125 190 -1 
            126 128 190 -1 
            128 130 192 -1 
            193 191 128 -1 
            194 195 128 -1 
            196 197 128 -1 
            196 128 195 -1 
            192 194 128 -1 
            128 198 199 -1 
            200 198 128 -1 
            200 128 197 -1 
            201 193 128 -1 
            201 128 199 -1 
            191 190 128 -1 
            130 131 192 -1 
            152 131 153 -1 
            131 152 151 -1 
            192 131 151 -1 
            134 133 132 -1 
            135 133 134 -1 
            134 165 135 -1 
            135 165 136 -1 
            165 137 136 -1 
            139 163 141 -1 
            141 164 140 -1 
            140 202 203 -1 
            140 164 202 -1 
            140 204 143 -1 
            140 203 204 -1 
            143 204 142 -1 
            144 142 204 -1 
            205 147 144 -1 
            204 206 144 -1 
            205 144 206 -1 
            145 146 207 -1 
            207 158 145 -1 
            207 146 208 -1 
            208 146 205 -1 
            146 147 205 -1 
            179 150 148 -1 
            192 151 149 -1 
            149 150 194 -1 
            194 192 149 -1 
            194 150 179 -1 
            156 154 159 -1 
            156 209 155 -1 
            155 210 160 -1 
            160 161 155 -1 
            209 210 155 -1 
            211 209 156 -1 
            159 211 156 -1 
            212 157 213 -1 
            211 159 157 -1 
            211 157 212 -1 
            157 158 213 -1 
            213 158 207 -1 
            210 162 160 -1 
            162 214 166 -1 
            162 210 209 -1 
            162 209 214 -1 
            202 164 168 -1 
            214 167 166 -1 
            167 214 171 -1 
            168 170 202 -1 
            169 172 215 -1 
            215 216 169 -1 
            216 170 169 -1 
            216 202 170 -1 
            214 172 171 -1 
            214 215 172 -1 
            197 176 173 -1 
            173 175 197 -1 
            217 175 174 -1 
            174 218 217 -1 
            218 174 219 -1 
            174 220 219 -1 
            174 180 220 -1 
            217 197 175 -1 
            176 197 177 -1 
            197 196 177 -1 
            196 178 177 -1 
            196 195 178 -1 
            179 178 195 -1 
            195 194 179 -1 
            221 218 180 -1 
            222 180 182 -1 
            222 221 180 -1 
            218 220 180 -1 
            181 186 223 -1 
            181 224 182 -1 
            223 224 181 -1 
            224 222 182 -1 
            183 185 225 -1 
            187 183 225 -1 
            184 188 226 -1 
            226 185 184 -1 
            225 185 226 -1 
            186 227 223 -1 
            186 187 227 -1 
            225 228 187 -1 
            227 187 228 -1 
            226 188 189 -1 
            189 229 226 -1 
            191 229 189 -1 
            191 193 229 -1 
            193 201 230 -1 
            230 229 193 -1 
            197 231 200 -1 
            217 231 197 -1 
            198 232 199 -1 
            233 198 217 -1 
            217 198 234 -1 
            233 232 198 -1 
            198 200 231 -1 
            198 231 234 -1 
            235 201 199 -1 
            236 199 232 -1 
            235 199 236 -1 
            201 235 237 -1 
            201 237 230 -1 
            203 202 206 -1 
            202 216 238 -1 
            238 206 202 -1 
            203 206 204 -1 
            238 208 205 -1 
            238 205 206 -1 
            208 213 207 -1 
            238 213 208 -1 
            209 211 212 -1 
            212 214 209 -1 
            212 213 238 -1 
            212 238 214 -1 
            214 239 215 -1 
            214 238 239 -1 
            216 215 239 -1 
            216 239 238 -1 
            240 217 218 -1 
            240 233 217 -1 
            234 231 217 -1 
            218 219 220 -1 
            218 221 240 -1 
            222 241 221 -1 
            233 221 241 -1 
            233 240 221 -1 
            241 222 242 -1 
            224 243 222 -1 
            222 243 242 -1 
            244 223 237 -1 
            245 223 246 -1 
            247 224 223 -1 
            223 228 248 -1 
            227 228 223 -1 
            223 248 237 -1 
            223 244 246 -1 
            223 245 247 -1 
            224 247 243 -1 
            249 228 225 -1 
            226 249 225 -1 
            249 226 229 -1 
            249 248 228 -1 
            249 229 230 -1 
            248 249 230 -1 
            230 237 248 -1 
            250 232 233 -1 
            250 236 232 -1 
            241 251 233 -1 
            252 250 233 -1 
            252 233 251 -1 
            235 253 254 -1 
            253 235 255 -1 
            255 235 256 -1 
            256 235 250 -1 
            236 250 235 -1 
            235 254 237 -1 
            237 254 244 -1 
            242 257 241 -1 
            251 241 257 -1 
            242 243 258 -1 
            258 257 242 -1 
            247 259 243 -1 
            243 259 258 -1 
            244 260 246 -1 
            254 260 244 -1 
            246 261 245 -1 
            261 247 245 -1 
            260 261 246 -1 
            259 247 261 -1 
            262 256 250 -1 
            252 262 250 -1 
            257 262 251 -1 
            252 251 262 -1 
            253 260 254 -1 
            260 253 261 -1 
            261 253 263 -1 
            255 263 253 -1 
            256 263 255 -1 
            256 262 259 -1 
            256 259 263 -1 
            259 257 258 -1 
            262 257 259 -1 
            261 263 259 -1 
            ">
            <Coordinate DEF="VTKcoordinates0000" point="
              0.013844 0.380988 -0.0501489,
              0.0144881 0.38961 -0.0526208,
              0.0127339 0.382894 -0.0560145,
              0.0145839 0.378828 -0.0485054,
              0.0133479 0.383828 -0.0381807,
              0.0127828 0.375666 -0.0374194,
              0.00506838 0.395055 -0.0780054,
              0.0174706 0.388224 -0.0381121,
              0.0166396 0.387529 -0.0378511,
              0.0144681 0.38619 -0.0363309,
              0.0156636 0.386823 -0.037204,
              0.0199694 0.390767 -0.0502907,
              0.00845829 0.385545 -0.0713691,
              0.0145203 0.380898 -0.0577604,
              0.00748791 0.387909 -0.070106,
              0.0192872 0.372642 -0.0296347,
              0.0136141 0.385178 -0.0315797,
              0.00821394 0.375435 -0.0281202,
              0.0129737 0.384653 -0.0283456,
              0.0120222 0.384138 -0.024399,
              0.00971218 0.382459 -0.0145045,
              0.00878795 0.373425 -0.0288005,
              0.0100658 0.371904 -0.0290908,
              0.000829989 0.389844 -0.083611,
              -0.00741426 0.399764 -0.0941444,
              -0.00468666 0.402626 -0.0937374,
              0.000671551 0.40075 -0.0993863,
              0.00494669 0.397414 -0.0890558,
              0.0170627 0.392964 -0.0739749,
              0.0179981 0.388212 -0.0368196,
              0.0173158 0.387384 -0.035389,
              0.0164384 0.386748 -0.0352704,
              0.0154316 0.386355 -0.0355684,
              0.0153661 0.386088 -0.0342268,
              0.0145495 0.385534 -0.0327958,
              0.0254182 0.385441 -0.038594,
              0.0221549 0.388868 -0.0372769,
              0.0170589 0.389122 -0.0756423,
              0.00470904 0.389869 -0.0886789,
              0.00788303 0.388555 -0.0845503,
              0.022189 0.378214 -0.0458365,
              0.0245616 0.378335 -0.0289618,
              0.0230149 0.372744 -0.0208464,
              0.0135159 0.369706 -0.0262242,
              0.0189124 0.36923 -0.0214479,
              0.0162738 0.384341 -0.0277479,
              0.00631745 0.374077 -0.0253296,
              0.00643675 0.372689 -0.0264919,
              0.0159204 0.385223 -0.0224882,
              0.014259 0.385051 -0.0208098,
              0.0125124 0.384343 -0.0225905,
              0.0132436 0.384769 -0.0217618,
              0.0165131 0.383866 -0.0247867,
              0.00813855 0.378753 -0.0177438,
              0.013362 0.385383 -0.0149677,
              0.00982461 0.382486 -0.0132859,
              0.00904031 0.3805 -0.0154126,
              0.00787115 0.372262 -0.0277342,
              0.00723425 0.371714 -0.026569,
              -0.00302755 0.391929 -0.0914724,
              -0.00937621 0.397402 -0.103566,
              -0.00735821 0.403367 -0.101318,
              -0.00602614 0.404058 -0.0954273,
              0.000647427 0.401006 -0.101967,
              -0.0015139 0.402171 -0.101625,
              -0.00145018 0.402134 -0.100175,
              0.0063504 0.397709 -0.095568,
              0.00213802 0.399929 -0.100251,
              0.00597111 0.397534 -0.0906473,
              0.00848928 0.396875 -0.0883923,
              0.0109805 0.396247 -0.0861387,
              0.0118094 0.396336 -0.082704,
              0.00946468 0.394635 -0.0919151,
              0.0176999 0.387196 -0.0340562,
              0.0193185 0.387506 -0.0324778,
              0.0165518 0.386404 -0.0335886,
              0.0234108 0.385577 -0.0264195,
              0.0253589 0.380522 -0.0192303,
              0.0250957 0.376961 -0.0173023,
              0.0246 0.375463 -0.0172082,
              0.00919905 0.389658 -0.0855146,
              0.00684737 0.389167 -0.0864776,
              -0.00107531 0.392767 -0.0988232,
              0.000399421 0.392266 -0.0975485,
              0.0013405 0.392547 -0.0982695,
              0.00436376 0.392641 -0.09547,
              0.0075935 0.390138 -0.0878836,
              0.0216932 0.371158 -0.0193636,
              0.0230003 0.372764 -0.0190705,
              0.0168915 0.368934 -0.0205144,
              0.0139119 0.369077 -0.0217583,
              0.010365 0.36979 -0.0242418,
              0.0200523 0.370218 -0.0187199,
              0.0184931 0.36921 -0.0197721,
              0.0172762 0.38576 -0.0305338,
              0.0172303 0.384826 -0.0278958,
              0.00727665 0.37701 -0.0193645,
              0.00632173 0.372558 -0.0253765,
              0.00674983 0.373559 -0.0217783,
              0.0170506 0.385252 -0.0216892,
              0.0165496 0.385678 -0.0159033,
              0.017066 0.384554 -0.0230326,
              0.0180004 0.384715 -0.0228294,
              0.017906 0.384777 -0.0259481,
              0.00787393 0.376259 -0.0176217,
              0.014783 0.385207 -0.0129421,
              0.0132975 0.384885 -0.012492,
              0.0119418 0.384271 -0.0123285,
              0.0123444 0.38328 -0.0114479,
              0.0109452 0.382173 -0.0120464,
              0.0118126 0.378194 -0.0115962,
              0.00856948 0.370619 -0.0249034,
              -0.00764692 0.395382 -0.104527,
              -0.00300363 0.394822 -0.104742,
              -0.00226771 0.394202 -0.102876,
              -0.0109844 0.400777 -0.11301,
              -0.00959317 0.3987 -0.113856,
              -0.00916196 0.397701 -0.110569,
              -0.00715428 0.403348 -0.106323,
              -0.00831334 0.404072 -0.113743,
              -0.00725449 0.403265 -0.103331,
              -0.00590053 0.403613 -0.101475,
              -0.00294381 0.403046 -0.100384,
              -0.00393158 0.403475 -0.100394,
              -0.00475418 0.40373 -0.101432,
              0.000671712 0.401273 -0.104345,
              0.00192274 0.400274 -0.102773,
              -0.00399821 0.403462 -0.102974,
              0.00546505 0.39849 -0.112729,
              0.00728274 0.397364 -0.0914438,
              0.00743586 0.39601 -0.0973162,
              0.00654471 0.392806 -0.0948219,
              0.0186046 0.386957 -0.0324902,
              0.0198159 0.387085 -0.0307577,
              0.0183533 0.385648 -0.0291445,
              0.0198931 0.38661 -0.0290027,
              0.0198338 0.386134 -0.0271866,
              0.0197686 0.385731 -0.0252677,
              0.0195826 0.385416 -0.0234515,
              0.0189694 0.385297 -0.02214,
              0.0229666 0.383388 -0.0185395,
              0.0194061 0.385113 -0.019535,
              0.0249132 0.380297 -0.0181637,
              0.0240258 0.381469 -0.0181994,
              0.0241679 0.37707 -0.0167823,
              0.022861 0.372768 -0.0175955,
              0.0225604 0.374058 -0.0169497,
              0.0234843 0.375565 -0.0167162,
              -0.00148315 0.393597 -0.101307,
              0.00157103 0.393562 -0.100184,
              0.000317988 0.394098 -0.101844,
              0.00606894 0.393338 -0.0952285,
              0.00569785 0.392934 -0.0950985,
              0.00522223 0.392486 -0.0949493,
              0.0160172 0.369332 -0.0201416,
              0.00900753 0.370603 -0.0232,
              0.0144603 0.369618 -0.0205687,
              0.0175357 0.370894 -0.0183905,
              0.02011 0.371572 -0.0176742,
              0.0165337 0.369979 -0.0191327,
              0.00764797 0.37209 -0.0224503,
              0.00746772 0.371526 -0.0238362,
              0.00793386 0.372768 -0.0211496,
              0.0181273 0.385258 -0.0213742,
              0.0182169 0.384938 -0.0148744,
              0.0187966 0.385597 -0.0274513,
              0.00939311 0.375626 -0.0163707,
              0.0102011 0.376434 -0.0142303,
              0.0150495 0.383761 -0.0118503,
              0.0137636 0.380479 -0.0109956,
              0.015287 0.382254 -0.011086,
              0.0116857 0.376869 -0.0126431,
              0.0130996 0.378378 -0.0115156,
              -0.00480029 0.395141 -0.107736,
              -0.00698358 0.397234 -0.114013,
              -0.00445317 0.395666 -0.110571,
              -0.00316261 0.395334 -0.107969,
              -0.00161444 0.395605 -0.108164,
              -0.00116364 0.39516 -0.105662,
              -0.000571397 0.394565 -0.103665,
              -0.00837665 0.398935 -0.117719,
              -0.0100092 0.405155 -0.118136,
              -0.00977777 0.405326 -0.125123,
              -0.00729788 0.404685 -0.113533,
              -0.00544829 0.40361 -0.106198,
              -0.00567924 0.40391 -0.109704,
              -0.00855646 0.405526 -0.117493,
              -0.00739085 0.405386 -0.11577,
              -0.00372182 0.403559 -0.105792,
              -0.00127357 0.402614 -0.106775,
              0.00202208 0.400489 -0.105345,
              0.00119271 0.401469 -0.107538,
              0.00640632 0.39411 -0.0966885,
              0.00208283 0.401526 -0.110974,
              0.00131913 0.395043 -0.103967,
              0.000638929 0.39546 -0.105972,
              0.00014831 0.395877 -0.108403,
              -0.0030152 0.395719 -0.110791,
              0.00348725 0.397047 -0.120274,
              0.00899868 0.399071 -0.1218,
              0.00231791 0.397016 -0.117162,
              0.00324053 0.40199 -0.115551,
              0.020693 0.381591 -0.0151824,
              0.0218353 0.38219 -0.0166205,
              0.0229251 0.380361 -0.0170897,
              0.0219358 0.375625 -0.0165688,
              0.0216057 0.379786 -0.0157851,
              0.0212732 0.372649 -0.0172797,
              0.0207599 0.374165 -0.016854,
              0.0110148 0.370614 -0.0215913,
              0.00920508 0.371327 -0.0217581,
              0.0151788 0.370462 -0.0194576,
              0.0162164 0.371526 -0.0186007,
              0.0186384 0.371984 -0.0176776,
              0.0117474 0.375437 -0.0139741,
              0.0146124 0.378518 -0.0117305,
              0.0162983 0.380301 -0.0119455,
              0.00123715 0.396562 -0.123088,
              0.000286849 0.397023 -0.125856,
              -0.00596049 0.397666 -0.117683,
              -0.00705742 0.398391 -0.118195,
              0.00115088 0.397171 -0.128169,
              -0.000511584 0.402027 -0.135725,
              -0.00604983 0.408916 -0.124969,
              -0.00744481 0.408896 -0.125447,
              -0.00536806 0.404935 -0.113771,
              -0.0035359 0.403903 -0.109484,
              -0.00583201 0.407155 -0.120833,
              -0.00447627 0.405952 -0.118311,
              -0.000649378 0.402898 -0.110415,
              0.000305115 0.403506 -0.115025,
              0.000629756 0.39669 -0.117297,
              0.00913194 0.396584 -0.126192,
              0.00548777 0.395972 -0.128742,
              0.00182253 0.396751 -0.120268,
              0.0108363 0.40122 -0.129594,
              0.0115697 0.398518 -0.128156,
              0.00161852 0.40392 -0.119364,
              0.0179469 0.375349 -0.0160458,
              0.015853 0.378414 -0.0124475,
              0.00297258 0.396317 -0.12754,
              0.000549973 0.401163 -0.136098,
              0.000186874 0.403143 -0.136316,
              -0.00316757 0.409327 -0.131726,
              0.00140082 0.40603 -0.12555,
              -0.00039466 0.409185 -0.129006,
              0.000130701 0.407842 -0.127359,
              -0.00218504 0.41019 -0.131047,
              -0.00158928 0.4054 -0.118934,
              -0.00265433 0.40463 -0.114351,
              0.0111686 0.397734 -0.132807,
              0.00343254 0.398657 -0.136183,
              0.00570023 0.398162 -0.13618,
              0.0023297 0.407286 -0.130114,
              0.00338695 0.405556 -0.127497,
              0.00364415 0.406402 -0.131585,
              0.0047983 0.404966 -0.133241,
              0.00193873 0.401831 -0.137396,
              0.000483969 0.405443 -0.135636,
              0.0022945 0.408126 -0.132913,
              0.00180978 0.40684 -0.128127,
              0.000953972 0.408928 -0.13109,
              0.00474785 0.399475 -0.13729,
              0.00243304 0.407761 -0.131597,
              "/>
            <Normal DEF="VTKnormals0000" vector="
              -0.994721 -0.101859 -0.0124284,
              -0.740003 0.639331 0.208928,
              -0.948119 -0.260616 0.182069,
              -0.681584 -0.710384 -0.175492,
              -0.922628 0.371293 -0.104399,
              -0.760552 -0.502957 -0.410603,
              -0.472822 0.754041 0.455918,
              -0.441571 0.878504 0.182334,
              -0.541348 0.814396 0.209049,
              -0.498937 0.853768 0.148801,
              -0.409333 0.889237 0.204217,
              0.091292 0.987794 0.126211,
              -0.388213 -0.918389 -0.0765007,
              -0.247236 -0.936446 -0.248885,
              -0.920531 -0.167276 0.353047,
              0.252785 -0.903413 -0.346331,
              -0.420851 0.900879 0.106307,
              -0.881793 0.222071 -0.416083,
              -0.280467 0.959576 -0.0234928,
              -0.62782 0.777665 -0.0328439,
              -0.815898 0.577871 -0.0193823,
              -0.730636 -0.211725 -0.64911,
              -0.345095 -0.73675 -0.581472,
              -0.788553 -0.543754 0.287257,
              -0.881254 0.116231 0.458128,
              -0.0446738 0.824474 0.564134,
              0.449889 0.885481 0.116288,
              0.103259 0.974584 0.198804,
              0.657506 0.751483 -0.0543965,
              -0.381033 0.899542 0.213632,
              -0.526072 0.820569 0.223417,
              -0.459702 0.86538 0.199478,
              -0.35888 0.914484 0.186879,
              -0.341763 0.922769 0.178031,
              -0.223204 0.949949 0.21858,
              0.9825 0.175864 -0.061361,
              0.271504 0.948034 0.165882,
              0.677855 -0.618486 -0.397477,
              -0.0106443 -0.960246 -0.278953,
              0.190928 -0.926766 -0.323497,
              0.689158 -0.677312 -0.257506,
              0.883677 -0.447026 -0.138862,
              0.775656 -0.61497 -0.142022,
              -0.0430245 -0.946101 -0.321002,
              0.415463 -0.902267 -0.115346,
              -0.211302 0.947433 0.240254,
              -0.952651 0.286049 -0.103111,
              -0.851531 -0.16723 -0.49692,
              0.0688989 0.981811 -0.17692,
              -0.193888 0.979675 -0.051421,
              -0.500678 0.86556 -0.0112866,
              -0.35377 0.934469 -0.0401796,
              -0.0397337 0.989182 -0.141211,
              -0.945585 0.294579 0.138175,
              -0.352991 0.935459 0.0177095,
              -0.840022 0.357958 0.407713,
              -0.960672 0.200844 0.191757,
              -0.59769 -0.411572 -0.688022,
              -0.504837 -0.78465 -0.35981,
              -0.509387 -0.859822 -0.0350774,
              -0.991858 -0.088663 0.0914162,
              -0.733142 0.679702 0.0225314,
              0.0705545 0.979577 0.188284,
              0.512457 0.854328 0.08667,
              0.483042 0.874284 0.0479369,
              0.510219 0.859111 0.0400645,
              0.482693 0.875783 -0.00333341,
              0.479933 0.875473 0.0566739,
              0.225045 0.967648 0.114069,
              0.146972 0.982213 0.116865,
              0.563403 0.816653 -0.125117,
              0.245725 0.964517 0.0965729,
              0.851586 -0.279709 -0.443356,
              -0.474555 0.820682 0.318242,
              -0.260983 0.916807 0.302246,
              -0.388889 0.88273 0.263728,
              0.300676 0.93189 0.202917,
              0.873334 0.392154 0.288969,
              0.886715 -0.025298 0.461623,
              0.808514 -0.385612 0.444533,
              0.448918 -0.772646 -0.448877,
              0.230156 -0.880522 -0.414379,
              -0.155396 -0.954256 -0.255435,
              -0.0382159 -0.959571 -0.27886,
              0.164443 -0.912063 -0.375632,
              0.300596 -0.815232 -0.495014,
              0.33668 -0.845375 -0.414714,
              0.671133 -0.738778 0.061541,
              0.809567 -0.585288 0.0451531,
              -0.0235661 -0.988154 0.151647,
              -0.237219 -0.938389 0.251303,
              -0.301459 -0.947326 -0.108145,
              0.306586 -0.797959 0.518909,
              0.0571712 -0.859376 0.508138,
              -0.341531 0.894599 0.288182,
              -0.402795 0.88628 0.228612,
              -0.969977 0.169077 0.174809,
              -0.868908 -0.490625 0.0654616,
              -0.894058 -0.312937 0.320516,
              0.160633 0.939957 -0.301128,
              0.0885014 0.995104 0.0440043,
              0.0715157 0.914004 -0.399352,
              -0.322771 0.926906 -0.191479,
              -0.468105 0.877984 0.100107,
              -0.871044 -0.191373 0.452392,
              0.121581 0.885815 0.447829,
              -0.12804 0.788791 0.601178,
              -0.508435 0.734955 0.448704,
              -0.283297 0.337154 0.897814,
              -0.616476 0.12098 0.778024,
              -0.499766 -0.225619 0.83626,
              -0.531282 -0.846863 -0.0237118,
              -0.429738 -0.894461 -0.12355,
              -0.025546 -0.982297 -0.185579,
              -0.118717 -0.950473 -0.287242,
              -0.999695 -0.006099 0.0239428,
              -0.727866 -0.665775 -0.164177,
              -0.668581 -0.732797 -0.126524,
              -0.498418 0.858942 0.117468,
              -0.604612 0.735461 0.305846,
              -0.555023 0.831163 -0.0334162,
              -0.0884441 0.994425 -0.0574092,
              0.459165 0.887966 0.0261382,
              0.349007 0.937066 0.010045,
              0.104182 0.991702 -0.0753242,
              0.487545 0.866462 0.107439,
              0.522351 0.84929 0.0765197,
              0.332953 0.942763 -0.0184718,
              0.961965 -0.273167 -0.00153847,
              0.189914 0.979831 0.0621585,
              0.948597 -0.02935 -0.315124,
              0.39245 -0.690731 -0.60735,
              -0.491398 0.79757 0.349871,
              -0.281878 0.917522 0.280531,
              -0.434549 0.8682 0.239575,
              -0.286948 0.928258 0.23664,
              -0.203172 0.954499 0.218295,
              -0.264186 0.94897 0.172227,
              -0.163252 0.982583 0.08877,
              -0.186139 0.982439 -0.0128564,
              0.614909 0.600036 0.511706,
              0.216445 0.970349 0.107586,
              0.636147 0.330631 0.697137,
              0.599606 0.462121 0.653389,
              0.403642 0.057578 0.913103,
              0.505113 -0.609911 0.610631,
              0.180878 -0.301311 0.936213,
              0.234597 -0.175849 0.956055,
              0.030918 -0.937412 -0.346846,
              0.303006 -0.86931 -0.390495,
              0.15399 -0.913597 -0.376335,
              0.19189 -0.754744 -0.627328,
              0.271362 -0.531111 -0.802673,
              0.214363 -0.770632 -0.600146,
              -0.213761 -0.811496 0.543856,
              -0.458474 -0.817502 0.348556,
              -0.355947 -0.722733 0.592418,
              -0.175915 -0.492716 0.852224,
              0.0363987 -0.501056 0.864649,
              -0.234983 -0.639661 0.731858,
              -0.662966 -0.640299 0.387934,
              -0.671254 -0.713739 0.199988,
              -0.556455 -0.622745 0.550042,
              -0.015838 0.980433 -0.196213,
              0.471737 0.744689 0.472126,
              -0.50382 0.846405 0.172522,
              -0.608661 -0.614484 0.501937,
              -0.632764 -0.514315 0.57887,
              0.305126 0.516945 0.799791,
              0.0714696 -0.143657 0.987043,
              0.321116 0.162117 0.933061,
              -0.236257 -0.62703 0.742305,
              0.0974671 -0.511756 0.853584,
              -0.0478969 -0.988288 -0.14489,
              -0.395224 -0.896871 -0.198546,
              -0.178673 -0.968428 -0.173848,
              0.124375 -0.98166 -0.144478,
              0.13018 -0.978879 -0.157637,
              0.086329 -0.963695 -0.252665,
              0.122922 -0.940553 -0.316623,
              -0.601525 -0.744293 -0.290165,
              -0.620518 0.739349 0.261382,
              -0.944129 -0.0033 -0.32956,
              -0.251244 0.93783 0.239483,
              -0.0839888 0.995388 0.0463525,
              -0.0480413 0.984447 0.168984,
              -0.29687 0.895993 0.33025,
              -0.19928 0.932125 0.302374,
              0.237784 0.96781 0.0824753,
              0.415191 0.899539 0.135819,
              0.601758 0.791791 0.104664,
              0.554363 0.820121 0.141715,
              0.387601 -0.833146 -0.394503,
              0.575456 0.792614 0.201528,
              0.210412 -0.926894 -0.310797,
              0.185772 -0.949878 -0.251436,
              0.183785 -0.962938 -0.197419,
              0.173458 -0.980999 -0.0869059,
              0.2194 -0.966258 0.134944,
              0.888329 -0.137091 0.438266,
              0.251608 -0.966449 0.0516686,
              0.594507 0.760813 0.260239,
              0.600546 0.170124 0.781282,
              0.676397 0.296513 0.674216,
              0.562868 0.300211 0.770099,
              0.11763 -0.178167 0.976944,
              0.448768 0.016045 0.893504,
              0.0608331 -0.353387 0.933497,
              0.0463246 -0.300154 0.952765,
              -0.365011 -0.681917 0.633843,
              -0.446699 -0.71242 0.541219,
              -0.37897 -0.442951 0.812512,
              -0.214284 -0.499345 0.839486,
              -0.121469 -0.369913 0.921092,
              -0.125047 -0.734388 0.667112,
              0.292079 -0.460707 0.838116,
              0.508922 -0.256348 0.821757,
              -0.0197531 -0.999641 -0.0181282,
              -0.357571 -0.914566 -0.188974,
              -0.423066 -0.874781 -0.236164,
              -0.448156 -0.85745 -0.252855,
              -0.430477 -0.847799 -0.30972,
              -0.731285 -0.284755 -0.619788,
              0.128209 0.923303 0.362041,
              -0.631067 0.748909 -0.202211,
              0.0174392 0.971217 0.237556,
              0.184071 0.971266 0.150862,
              -0.0215437 0.935442 0.352824,
              0.146313 0.943565 0.297117,
              0.42149 0.890406 0.171821,
              0.440795 0.871119 0.216452,
              0.209979 -0.97714 0.0332711,
              0.450501 -0.870762 0.197034,
              -0.134391 -0.98016 -0.145692,
              0.164052 -0.985686 0.0388505,
              0.714779 0.695578 0.0725442,
              0.959069 -0.21621 0.182865,
              0.459056 0.854823 0.241962,
              0.243763 -0.41851 0.874888,
              0.424052 -0.534065 0.731406,
              -0.273264 -0.949455 -0.154471,
              -0.572722 -0.579603 -0.579698,
              -0.551531 0.069834 -0.831226,
              -0.496285 0.486918 -0.718757,
              0.459891 0.814484 0.353716,
              0.397742 0.853776 0.335959,
              0.511073 0.749736 0.420357,
              0.058715 0.991711 -0.11429,
              0.348593 0.905358 0.242507,
              0.284041 0.93473 0.213545,
              0.773462 -0.37833 -0.50855,
              -0.396237 -0.725744 -0.562398,
              0.0597616 -0.815793 -0.575248,
              0.611457 0.750278 0.251403,
              0.516817 0.802166 0.299047,
              0.677713 0.735325 -0.00145041,
              0.690309 0.625913 -0.362914,
              -0.196313 0.033436 -0.979971,
              -0.127878 0.500307 -0.856353,
              0.447126 0.735803 -0.508598,
              0.568264 0.754679 0.327926,
              0.571846 0.79384 0.206908,
              0.328619 -0.009627 -0.944414,
              0.716187 0.683477 0.141195,
              "/>
          </IndexedFaceSet>
        </Shape>
      </Transform>
      <Transform translation="0 0 0" rotation="0 0 1 -0" scale="1 1 1"/>
    </Transform>
  </Scene>
</X3D>
