0.133915067	0.107193233	792.4041675
0.133935593	0.107135147	792.4727639
0.13400692	0.107063347	791.9667353
0.1341859	0.106985793	792.2905801
0.134555987	0.106903853	793.0503914
0.1352052	0.106831407	793.4419423
0.136189813	0.106774547	793.1983384
0.13746436	0.106759873	792.4925052
0.13895312	0.10683106	793.1724427
0.140589873	0.107015207	793.5447522
0.142355947	0.107319433	802.7571466
0.144192253	0.10783196	816.4221374
0.145932353	0.108686987	829.6105442
0.147400867	0.11007842	836.6585381
0.148960467	0.112218493	823.3965272
0.151359713	0.115575147	811.5074539
0.15403112	0.12044362	787.2229572
0.156719247	0.126873233	695.3312665
0.15944456	0.134906387	560.8311863
0.1620627	0.144821433	510.4429976
0.164529333	0.157100133	500.2902435
0.16678668	0.172175413	428.7844516
0.16881634	0.189989127	681.5984664
0.17069868	0.2101493	833.1735073
0.172437913	0.232049953	893.1706993
0.174006	0.25511362	991.5903129
0.175413207	0.27878172	1148.4908
0.1767612	0.302383707	1286.969509
0.178187547	0.325118267	1419.65584
0.179353633	0.3462887	1514.243953
0.179624413	0.365040487	1493.314895
0.179808927	0.3806598	1369.192084
0.180412107	0.39293422	1154.386994
0.181547587	0.401581393	932.154062
0.183273493	0.406101047	761.1527695
0.186063247	0.40596052	569.7855782
0.189906827	0.4008618	315.1145296
0.195166073	0.390969373	61.50385001
0.202180727	0.37682262	-1.591124415
0.21129466	0.35978922	1.168717525
0.222810747	0.340896207	-1.774562088
0.23706422	0.320586593	4.892407885
0.254306347	0.299610007	129.1415593
0.27433354	0.2786707	338.8808028
0.296795393	0.258412213	780.1525641
0.321262607	0.239104987	1132.077706
0.347056987	0.220968013	1358.178215
0.373425893	0.20441928	1745.932105
0.399813107	0.190097427	2123.875628
0.42587042	0.178153227	1798.758153
0.450847047	0.168393107	1434.90828
0.474741713	0.160554593	1092.621365
0.496830513	0.15470684	545.6472601
0.51624626	0.15100382	34.25745016
0.532215467	0.149130973	-3.991525865
0.54389216	0.149030273	6.354047477
0.550763127	0.151082067	-12.7540772
0.55279722	0.155719047	56.21800166
0.5503918	0.16369706	348.497305
0.543896513	0.175589067	759.5976107
0.533578867	0.192080607	1291.402439
0.519855347	0.213488813	1547.830331
0.503261947	0.23849938	1666.257646
0.484285187	0.267070713	1547.291119
0.463161633	0.298937647	1294.98254
0.440325147	0.334018607	961.9787078
0.41606942	0.37147164	487.2874535
0.39114108	0.410120513	47.81998612
0.366343447	0.448630853	7.50200945
0.342511267	0.485585733	-16.64369608
0.320375787	0.519874747	87.52767595
0.300222133	0.551020153	418.7099851
0.281966773	0.578640307	879.7452153
0.265439893	0.601994993	1307.973949
0.25062978	0.620592227	1577.217737
0.23768752	0.6339572	1930.120773
0.22665432	0.641752973	2004.093348
0.217488367	0.644745647	1698.014578
0.210064767	0.642334147	1338.158847
0.204829927	0.63483166	875.7636042
0.2017675	0.622390073	272.4866706
0.200760653	0.605838767	-12.76660801
0.20171824	0.58598658	8.822425738
0.2047706	0.563770693	-6.034544734
0.2098573	0.5400134	4.313567461
0.217360267	0.515466	-4.725308586
0.22759446	0.490323953	23.79400927
0.2406946	0.46451354	341.1123874
0.25661126	0.438513567	718.7696215
0.27507382	0.411947547	1196.662329
0.295657453	0.384911693	1556.823134
0.318257427	0.358206553	1835.246339
0.342518273	0.331649867	1813.633363
0.36818604	0.30604734	1554.579728
0.394400947	0.281948413	1252.207466
0.42050084	0.259733173	900.3100562
0.445853173	0.2393158	448.1806122
0.470321153	0.220768847	47.01442468
0.493409553	0.204312133	-0.106327562
0.51472634	0.19017642	-2.478998208
0.53357632	0.178361193	11.92441499
0.54926654	0.168709593	179.2656613
0.561422907	0.161195027	433.0271993
0.56989316	0.155771547	758.1987794
0.57463258	0.15302064	1065.181735
0.575555473	0.152858093	1405.506852
0.572582773	0.154944247	1791.179415
0.56607786	0.16040756	1854.347956
0.55616992	0.16933954	1584.202826
0.54323422	0.1821521	1317.879893
0.527727233	0.199203853	1051.805119
0.510258007	0.22079442	783.5991525
0.4909094	0.24655842	483.5906873
0.469927347	0.276494007	185.9130343
0.447524467	0.310207933	22.96147537
0.423633247	0.34700364	-6.787435466
0.39950264	0.3861882	11.70651957
0.374471227	0.426137493	-22.7850607
0.349118307	0.465005287	161.4708277
0.324417047	0.501565513	403.836886
