subject01_walk1_grf.mot																		
version=1																		
nRows=1501																		
nColumns=19																		
inDegrees=yes																		
endheader																		
time	ground_force_vx	ground_force_vy	ground_force_vz	ground_force_px	ground_force_py	ground_force_pz	1_ground_force_vx	1_ground_force_vy	1_ground_force_vz	1_ground_force_px	1_ground_force_py	1_ground_force_pz	ground_torque_x	ground_torque_y	ground_torque_z	1_ground_torque_x	1_ground_torque_y	1_ground_torque_z
0	-0.606356946	0.718250381	792.4041675	0	0	0	-1.034816563	6.400948047	0.107380568	0	0	0	0	0	0	0	0	0
0.01666667	-0.768353063	0.240355378	792.4727639	0	0	0	-1.509537743	6.426035718	0.146779137	0	0	0	0	0	0	0	0	0
0.03333333	-0.616583347	-0.209924043	791.9667353	0	0	0	-1.843124507	6.442570523	0.148719575	0	0	0	0	0	0	0	0	0
0.05	-0.943819475	-0.38833197	792.2905801	0	0	0	-1.817819569	6.457228697	0.181561844	0	0	0	0	0	0	0	0	0
0.06666667	-1.444933389	-0.3021084	793.0503914	0	0	0	-1.899517746	6.507216555	0.21118041	0	0	0	0	0	0	0	0	0
0.08333333	-1.948165452	-0.685280003	793.4419423	0	0	0	-2.345816767	6.617231341	0.175516319	0	0	0	0	0	0	0	0	0
0.1	-2.555270926	-1.527184051	793.1983384	0	0	0	-3.208968067	6.794039155	0.157643874	0	0	0	0	0	0	0	0	0
0.11666667	-2.832270351	-2.568107738	792.4925052	0	0	0	-4.315267968	6.8473011	0.202214935	0	0	0	0	0	0	0	0	0
0.13333333	-3.868615067	-3.912180219	793.1724427	0	0	0	-6.038892565	6.965096613	0.226492949	0	0	0	0	0	0	0	0	0
0.15	-5.244037876	-6.100424947	793.5447522	0	0	0	-8.089975702	7.037098609	0.243586468	0	0	0	0	0	0	0	0	0
0.16666667	-7.953832509	-9.337457731	802.7571466	0	0	0	-12.08467242	7.43637331	0.294425405	0	0	0	0	0	0	0	0	0
0.18333333	-11.87820381	-16.21225411	816.4221374	0	0	0	-20.359052	7.907656077	0.741008802	0	0	0	0	0	0	0	0	0
0.2	-15.71995245	-27.6367062	829.6105442	0	0	0	-35.50101368	8.132280567	1.062719242	0	0	0	0	0	0	0	0	0
0.21666667	-20.39164292	-47.83024644	836.6585381	0	0	0	-55.93298993	5.847879296	1.749857343	0	0	0	0	0	0	0	0	0
0.23333333	-21.28735067	-63.98758207	823.3965272	0	0	0	-74.84798674	-0.10639732	1.921705726	0	0	0	0	0	0	0	0	0
0.25	-14.61889243	-68.84115246	811.5074539	0	0	0	-88.85665491	-7.994608217	1.314642906	0	0	0	0	0	0	0	0	0
0.26666667	-12.68757935	-68.60461664	787.2229572	0	0	0	-92.1182743	-14.98367783	0.956729217	0	0	0	0	0	0	0	0	0
0.28333333	-3.416517575	-60.36694362	695.3312665	0	0	0	-86.01736346	-24.47458277	-0.314235026	0	0	0	0	0	0	0	0	0
0.3	7.606589035	-43.20302984	560.8311863	0	0	0	-74.28999918	-35.29506162	1.304693525	0	0	0	0	0	0	0	0	0
0.31666667	29.23722604	-25.5274931	510.4429976	0	0	0	-70.83318724	-44.58335728	1.59579407	0	0	0	0	0	0	0	0	0
0.33333333	-8.169287867	-13.50172447	500.2902435	0	0	0	-63.55061294	-44.3961423	2.172704611	0	0	0	0	0	0	0	0	0
0.35	-9.794786724	17.48823467	428.7844516	0	0	0	-38.22537318	-37.48545642	-1.172128751	0	0	0	0	0	0	0	0	0
0.36666667	-96.6274644	70.33968945	681.5984664	0	0	0	40.98401592	12.68162415	3.591017704	0	0	0	0	0	0	0	0	0
0.38333333	-154.8070216	30.52394751	833.1735073	0	0	0	85.51508128	44.98514899	13.42576069	0	0	0	0	0	0	0	0	0
0.4	-34.30818736	43.21250365	893.1706993	0	0	0	93.95460307	36.96762436	1.788401323	0	0	0	0	0	0	0	0	0
0.41666667	2.171969914	79.34116678	991.5903129	0	0	0	107.1231981	31.72700344	-3.919240639	0	0	0	0	0	0	0	0	0
0.43333333	23.22207244	92.83023248	1148.4908	0	0	0	123.9854819	32.08157701	-5.547058427	0	0	0	0	0	0	0	0	0
0.45	20.480765	94.39294268	1286.969509	0	0	0	138.6390537	33.65197444	-4.995497123	0	0	0	0	0	0	0	0	0
0.46666667	28.20837952	88.12874654	1419.65584	0	0	0	151.6993463	32.57254498	-4.661956743	0	0	0	0	0	0	0	0	0
0.48333333	42.90574175	79.96758082	1514.243953	0	0	0	161.1253037	24.87466531	-5.363838239	0	0	0	0	0	0	0	0	0
0.5	74.46747631	75.81292184	1493.314895	0	0	0	159.113481	6.344302831	-7.973470074	0	0	0	0	0	0	0	0	0
0.51666667	95.75698096	69.57736273	1369.192084	0	0	0	146.8711424	-17.27860505	-10.0408413	0	0	0	0	0	0	0	0	0
0.53333333	113.9326846	56.43208192	1154.386994	0	0	0	124.9790766	-42.38161173	-11.79794332	0	0	0	0	0	0	0	0	0
0.55	95.28614521	33.91380086	932.154062	0	0	0	101.4358177	-57.27677903	-9.603641785	0	0	0	0	0	0	0	0	0
0.56666667	40.20582488	7.504943571	761.1527695	0	0	0	81.56692752	-54.83624361	-3.915701723	0	0	0	0	0	0	0	0	0
0.58333333	-9.399666589	-7.173548567	569.7855782	0	0	0	59.39436823	-42.34466994	0.163354144	0	0	0	0	0	0	0	0	0
0.6	-29.48248903	-11.26452784	315.1145296	0	0	0	31.9453681	-23.85503525	2.273036023	0	0	0	0	0	0	0	0	0
0.61666667	0	0	0	0	0	0	0	0	0	-24.61179558	-5.258962614	61.50385001	0	0	0	6.197101719	-5.533458677	1.743879222
0.63333333	0	0	0	0	0	0	0	0	0	0.124705736	-0.043590645	-1.591124415	0	0	0	-0.065363576	-0.10319756	0.425801124
0.65	0	0	0	0	0	0	0	0	0	-3.411547178	-0.03135619	1.168717525	0	0	0	-0.013140615	0.042922592	-0.353007494
0.66666667	0	0	0	0	0	0	0	0	0	5.552277594	-0.224156951	-1.774562088	0	0	0	-0.055559971	-0.080245044	0.544833169
0.68333333	0	0	0	0	0	0	0	0	0	-9.828969394	0.246752004	4.892407885	0	0	0	-0.387564714	-0.034446965	-0.889037897
0.7	0	0	0	0	0	0	0	0	0	2.974622222	15.91913541	129.1415593	0	0	0	-9.921189963	-7.051194748	1.551467077
0.71666667	0	0	0	0	0	0	0	0	0	-144.390285	30.33781216	338.8808028	0	0	0	-29.640994	-11.69367042	-11.13859807
0.73333333	0	0	0	0	0	0	0	0	0	-132.9201318	-24.97915496	780.1525641	0	0	0	-73.24446296	-23.3925849	-9.116110055
0.75	0	0	0	0	0	0	0	0	0	8.230821548	-95.27012097	1132.077706	0	0	0	-107.6819278	-30.43821006	5.965198563
0.76666667	0	0	0	0	0	0	0	0	0	94.23844415	-131.7949941	1358.178215	0	0	0	-128.7518578	-37.50075126	13.24813576
0.78333333	0	0	0	0	0	0	0	0	0	119.7337355	-107.6364039	1745.932105	0	0	0	-156.1804123	-28.89207224	9.802109409
0.8	0	0	0	0	0	0	0	0	0	4.516544721	-29.61828137	2123.875628	0	0	0	-173.6797603	2.95099947	-3.882184105
0.81666667	0	0	0	0	0	0	0	0	0	157.4844714	-46.12510177	1798.758153	0	0	0	-150.4166647	-33.71577475	10.52212137
0.83333333	0	0	0	0	0	0	0	0	0	116.9133715	-35.3892255	1434.90828	0	0	0	-123.2540425	-50.78046965	9.784153145
0.85	0	0	0	0	0	0	0	0	0	22.62656504	20.86296138	1092.621365	0	0	0	-91.66427189	-44.59229595	4.012777001
0.86666667	0	0	0	0	0	0	0	0	0	-64.42729043	52.80608237	545.6472601	0	0	0	-45.28805703	-23.92949393	-2.843477757
0.88333333	0	0	0	0	0	0	0	0	0	-30.79029847	12.39919174	34.25745016	0	0	0	-2.504111207	-1.1408064	-2.124329417
0.9	0	0	0	0	0	0	0	0	0	6.339460867	-2.306579204	-3.991525865	0	0	0	-0.460722673	-0.18772179	0.510209718
0.91666667	0	0	0	0	0	0	0	0	0	-2.736173925	0.973212068	6.354047477	0	0	0	0.726284955	0.264790626	-0.299854898
0.93333333	0	0	0	0	0	0	0	0	0	0.805573213	-0.687769125	-12.7540772	0	0	0	-1.279316085	-0.194817476	0.303944801
0.95	2.275627928	-0.616509457	56.21800166	0	0	0	4.950894559	0.253933584	-0.450312468	0	0	0	0	0	0	0	0	0
0.96666667	29.74164781	-17.72214094	348.497305	0	0	0	30.06347507	1.453960785	-2.476021074	0	0	0	0	0	0	0	0	0
0.98333333	-154.3996959	-11.63005106	759.5976107	0	0	0	69.33508531	10.87616198	13.13041644	0	0	0	0	0	0	0	0	0
1	-19.12459883	49.23336606	1291.402439	0	0	0	119.3621206	19.54950894	-1.711292494	0	0	0	0	0	0	0	0	0
1.01666667	-6.47682526	82.83583858	1547.830331	0	0	0	141.8755279	29.26425356	-4.402854813	0	0	0	0	0	0	0	0	0
1.03333333	35.35766873	56.67211659	1666.257646	0	0	0	147.1125107	29.50381104	-4.395293513	0	0	0	0	0	0	0	0	0
1.05	90.2196169	7.164297186	1547.291119	0	0	0	131.0835712	14.75595488	-5.811069637	0	0	0	0	0	0	0	0	0
1.06666667	57.31324161	-23.80282526	1294.98254	0	0	0	106.6333801	3.288836439	-3.501526665	0	0	0	0	0	0	0	0	0
1.08333333	-12.10257975	-35.87648644	961.9787078	0	0	0	78.16039905	-0.340038557	-0.474082575	0	0	0	0	0	0	0	0	0
1.1	-85.83295495	-23.28546917	487.2874535	0	0	0	38.62757923	-0.708613049	5.332526304	0	0	0	0	0	0	0	0	0
1.11666667	-38.38411184	2.612295742	47.81998612	0	0	0	4.666142	-0.981784577	1.690762446	0	0	0	0	0	0	0	0	0
1.13333333	11.89644339	-0.375464296	7.50200945	0	0	0	-0.652675018	-0.277847766	0.51853702	0	0	0	0	0	0	0	0	0
1.15	-14.42290327	0.293972313	-16.64369608	0	0	0	1.09800846	0.510078304	-1.018387968	0	0	0	0	0	0	0	0	0
1.16666667	19.49436171	3.454282452	87.52767595	0	0	0	-6.31455489	-2.191402908	1.855022408	0	0	0	0	0	0	0	0	0
1.18333333	-115.2041503	36.93440688	418.7099851	0	0	0	-34.74830794	-3.672339333	-8.912198854	0	0	0	0	0	0	0	0	0
1.2	-200.5284874	-27.91560921	879.7452153	0	0	0	-82.09187703	0.367874563	-13.62986319	0	0	0	0	0	0	0	0	0
1.21666667	-52.3395544	-103.591227	1307.973949	0	0	0	-123.38134	4.354901889	4.347615624	0	0	0	0	0	0	0	0	0
1.23333333	11.52205637	-91.37148456	1577.217737	0	0	0	-145.5322929	3.746646666	4.611039837	0	0	0	0	0	0	0	0	0
1.25	49.51794783	-52.16396892	1930.120773	0	0	0	-168.8746694	19.30674284	0.214192804	0	0	0	0	0	0	0	0	0
1.26666667	15.33646929	-41.18507763	2004.093348	0	0	0	-170.0806611	28.0296503	-2.046955089	0	0	0	0	0	0	0	0	0
1.28333333	62.65248401	-25.69947258	1698.014578	0	0	0	-145.0711597	-3.471052703	3.31238584	0	0	0	0	0	0	0	0	0
1.3	-7.43442799	20.20810661	1338.158847	0	0	0	-111.5281861	-13.67613637	-1.53071985	0	0	0	0	0	0	0	0	0
1.31666667	-101.0501311	67.9986014	875.7636042	0	0	0	-69.85899552	-14.10284659	-7.799284574	0	0	0	0	0	0	0	0	0
1.33333333	-101.680503	49.57707093	272.4866706	0	0	0	-20.95464374	-5.506140267	-7.416438257	0	0	0	0	0	0	0	0	0
1.35	1.693549876	-1.875788788	-12.76660801	0	0	0	0.720881972	-0.297113107	0.156274219	0	0	0	0	0	0	0	0	0
1.36666667	-3.564506822	1.880734759	8.822425738	0	0	0	-0.649374792	0.048731919	-0.163384128	0	0	0	0	0	0	0	0	0
1.38333333	3.1789405	-1.397929956	-6.034544734	0	0	0	0.295681979	0.041267634	0.043601205	0	0	0	0	0	0	0	0	0
1.4	-3.313769751	1.343153538	4.313567461	0	0	0	-0.178984339	-0.081448681	0.097429842	0	0	0	0	0	0	0	0	0
1.41666667	3.73009615	-1.387980921	-4.725308586	0	0	0	-0.074789806	0.262794801	-0.197390684	0	0	0	0	0	0	0	0	0
1.43333333	0	0	0	0	0	0	0	0	0	-3.301061262	1.804890953	23.79400927	0	0	0	1.282903891	-1.980280779	0.224390554
1.45	0	0	0	0	0	0	0	0	0	78.25459249	-23.05178868	341.1123874	0	0	0	20.53815557	-22.39370021	-5.974949563
1.46666667	0	0	0	0	0	0	0	0	0	-93.44236264	-38.13645174	718.7696215	0	0	0	48.60057318	-36.40443134	4.339776527
1.48333333	0	0	0	0	0	0	0	0	0	-17.93702924	50.40583065	1196.662329	0	0	0	85.53593279	-53.63645127	3.313106646
1.5	0	0	0	0	0	0	0	0	0	70.56169232	66.50238249	1556.823134	0	0	0	107.2706492	-63.20166926	3.896247061
1.51666667	0	0	0	0	0	0	0	0	0	102.340966	-26.84688778	1835.246339	0	0	0	113.7364286	-65.44149339	11.60080576
1.53333333	0	0	0	0	0	0	0	0	0	174.2608788	-14.45619021	1813.633363	0	0	0	109.2648266	-74.94044591	3.456475049
1.55	0	0	0	0	0	0	0	0	0	164.6860069	-0.751105828	1554.579728	0	0	0	96.02966605	-83.03336805	-3.168002902
1.56666667	0	0	0	0	0	0	0	0	0	91.77561956	-29.43131321	1252.207466	0	0	0	76.54632035	-75.86228534	-3.978921939
1.58333333	0	0	0	0	0	0	0	0	0	8.802489798	-46.90765638	900.3100562	0	0	0	54.11185896	-58.22773901	-2.893487443
1.6	0	0	0	0	0	0	0	0	0	-67.78519648	-49.46457514	448.1806122	0	0	0	25.90276933	-28.92776688	0.622503278
1.61666667	0	0	0	0	0	0	0	0	0	-32.72352397	-7.832547659	47.01442468	0	0	0	3.009880693	-3.845282003	1.264208848
1.63333333	0	0	0	0	0	0	0	0	0	2.462259611	0.268577793	-0.106327562	0	0	0	-0.202880658	0.19291963	-0.169114307
1.65	0	0	0	0	0	0	0	0	0	0.697582538	0.105667318	-2.478998208	0	0	0	0.12851993	0.10125735	0.23125293
1.66666667	0	0	0	0	0	0	0	0	0	-5.080192335	-0.700214662	11.92441499	0	0	0	-0.524404851	-0.594497116	-0.315089773
1.68333333	0	0	0	0	0	0	0	0	0	-38.82563016	11.21652071	179.2656613	0	0	0	-6.992452393	-9.829573678	-0.498406856
1.7	0	0	0	0	0	0	0	0	0	-175.8349126	14.53896573	433.0271993	0	0	0	-19.71770249	-16.51890508	-6.929978832
1.71666667	0	0	0	0	0	0	0	0	0	-108.4305005	6.188094541	758.1987794	0	0	0	-36.59691717	-27.18205308	-3.676551093
1.73333333	0	0	0	0	0	0	0	0	0	-27.01324456	-13.89304117	1065.181735	0	0	0	-52.25625178	-34.49003755	0.49869206
1.75	0	0	0	0	0	0	0	0	0	45.18029222	-44.28260861	1405.506852	0	0	0	-67.8999007	-40.54963497	2.602329361
1.76666667	0	0	0	0	0	0	0	0	0	50.88347867	10.43809337	1791.179415	0	0	0	-77.89728292	-28.78189733	-5.554140979
1.78333333	0	0	0	0	0	0	0	0	0	52.84557949	13.14495954	1854.347956	0	0	0	-76.67573391	-25.18190757	-5.644175571
1.8	0	0	0	0	0	0	0	0	0	107.2495695	-9.330467385	1584.202826	0	0	0	-67.40606145	-43.07619768	0.560986414
1.81666667	0	0	0	0	0	0	0	0	0	51.91322051	12.18609269	1317.879893	0	0	0	-56.37243811	-48.50445682	1.095887506
1.83333333	0	0	0	0	0	0	0	0	0	18.29469079	29.81596406	1051.805119	0	0	0	-43.98500434	-46.23758457	1.843894242
1.85	0	0	0	0	0	0	0	0	0	19.0898315	39.38243535	783.5991525	0	0	0	-31.29496345	-37.83458175	2.448610629
1.86666667	0	0	0	0	0	0	0	0	0	5.808113366	30.67575805	483.5906873	0	0	0	-18.22710579	-25.05320452	1.691634744
1.88333333	0	0	0	0	0	0	0	0	0	-10.45367328	12.28347721	185.9130343	0	0	0	-7.222126641	-10.4151039	0.377011363
1.9	0	0	0	0	0	0	0	0	0	2.59376075	-2.784103046	22.96147537	0	0	0	-0.207527557	-1.884811078	-0.685617647
1.91666667	-5.190136968	-1.145862546	-6.787435466	0	0	0	-0.714996064	0.571629775	0.511987333	0	0	0	0	0	0	0	0	0
1.93333333	8.599891555	1.302836707	11.70651957	0	0	0	1.125375833	-0.697768989	-0.771036744	0	0	0	0	0	0	0	0	0
1.95	-14.96788737	-2.197482857	-22.7850607	0	0	0	-2.213306048	1.499223249	1.329460032	0	0	0	0	0	0	0	0	0
1.96666667	35.25097252	-0.898717918	161.4708277	0	0	0	15.79478579	-10.74247833	-3.502536926	0	0	0	0	0	0	0	0	0
1.98333333	-74.36416287	-62.69237763	403.836886	0	0	0	39.37161316	-22.53019401	4.371703657	0	0	0	0	0	0	0	0	0
