<?xml version="1.0"?>
<VTKFile type="PolyData" version="0.1" byte_order="LittleEndian" compressor="vtkZLibDataCompressor">
	<PolyData>
		<Piece NumberOfPoints="454" NumberOfVerts="0" NumberOfLines="0" NumberOfStrips="0" NumberOfPolys="968">
		<PointData Normals="Normals">
		<DataArray type="Float32" Name="Normals" NumberOfComponents="3" format="ascii">
			-0.679126 0.050095 0.732310
			-0.465753 0.609349 0.641691
			-0.286593 0.946711 -0.146977
			-0.319850 -0.521297 0.791167
			0.037450 -0.909184 0.414707
			-0.421505 -0.200430 0.884399
			0.102596 0.949298 -0.297165
			-0.433728 0.229018 0.871453
			0.545206 0.516023 -0.660660
			0.626993 0.178535 -0.758291
			0.198921 -0.739939 0.642589
			-0.107575 -0.751698 0.650675
			0.677928 -0.628411 -0.381461
			0.980797 -0.063989 -0.184237
			-0.179096 0.942928 0.280734
			-0.338774 -0.598965 0.725585
			-0.405851 0.176513 0.896732
			0.724787 0.359930 -0.587481
			0.511478 0.548590 -0.661392
			0.131103 0.937180 -0.323272
			-0.624815 0.722856 0.295103
			0.253608 -0.732656 0.631583
			0.420152 0.560884 -0.713359
			0.229619 -0.838743 -0.493747
			-0.000000 -0.000000 1.000000
			-0.220317 -0.686196 0.693250
			0.201506 -0.940080 0.275035
			0.666401 -0.662878 -0.341326
			-0.594310 0.192181 0.780936
			-0.347238 -0.461178 0.816542
			-0.210736 -0.628003 0.749135
			-0.370232 0.838358 0.400105
			-0.068979 0.992945 0.096448
			0.310338 0.730808 -0.607955
			0.793545 -0.182015 -0.580652
			0.106517 0.914967 -0.389216
			-0.179087 0.976580 0.119248
			-0.448347 0.888400 0.098645
			-0.470044 -0.282270 0.836291
			-0.268101 -0.927102 -0.261922
			0.819032 0.263557 -0.509631
			-0.047003 0.704498 -0.708148
			-0.079390 -0.861449 0.501600
			0.402519 -0.879462 0.254019
			-0.171732 -0.749923 0.638846
			-0.289358 -0.755889 0.587286
			-0.634184 0.268121 0.725205
			-0.898866 -0.107212 0.424907
			0.090383 0.828035 -0.553344
			0.361532 0.569788 -0.737995
			0.734611 -0.053022 -0.676414
			0.087010 0.822093 -0.562665
			-0.417202 0.878757 0.231794
			-0.362364 0.865550 -0.345710
			-0.570011 0.776034 0.269922
			0.119757 -0.452308 -0.883785
			-0.437968 -0.767634 0.467892
			0.326460 -0.944653 -0.032463
			-0.207419 -0.762206 0.613205
			0.660713 -0.220809 -0.717427
			0.288293 0.175316 -0.941356
			0.161311 -0.976103 -0.145606
			0.281748 -0.869522 0.405648
			0.004517 -0.961959 -0.273155
			-0.744270 -0.237963 0.624049
			0.146369 -0.975248 -0.165734
			0.055856 -0.994072 -0.093278
			-0.677524 -0.118917 0.725824
			-0.525854 0.763731 -0.374422
			0.052154 0.763723 -0.643433
			0.489448 -0.368457 -0.790368
			0.354924 -0.110830 -0.928303
			0.728982 -0.061825 -0.681735
			-0.053981 0.753329 -0.655424
			-0.321133 0.663760 -0.675497
			0.073911 0.780397 -0.620901
			-0.562873 -0.753495 -0.339735
			-0.349161 0.359309 0.865439
			-0.929753 -0.367094 -0.028310
			-0.968911 0.242380 -0.049640
			-0.215077 -0.670911 0.709662
			-0.233481 -0.646480 0.726326
			-0.252665 -0.898048 0.360098
			0.538983 -0.456310 -0.708010
			0.526363 -0.789208 -0.316374
			0.243666 -0.301346 -0.921855
			0.003841 -0.967951 0.251111
			0.409499 0.808350 -0.422944
			0.180290 -0.595816 -0.782623
			0.235010 0.127737 -0.963563
			-0.611915 -0.594088 0.522130
			-0.415483 0.727682 -0.545759
			-0.063882 0.682824 -0.727785
			-0.540279 -0.721114 0.433696
			0.680782 0.314935 -0.661326
			0.169725 -0.860592 0.480183
			-0.328515 -0.281896 -0.901450
			-0.749488 -0.235619 -0.618670
			0.352131 0.221370 -0.909395
			-0.499296 -0.863831 -0.067082
			-0.144952 -0.987247 0.065816
			-0.222970 -0.964806 -0.139405
			-0.389449 -0.902830 0.182284
			-0.222415 -0.765423 -0.603870
			0.314819 -0.025972 -0.948796
			0.333676 0.463794 -0.820705
			0.334880 0.127241 -0.933630
			0.399166 -0.010888 -0.916814
			-0.056808 -0.997528 -0.041360
			0.119740 -0.992781 0.006891
			-0.060913 -0.883347 0.464744
			-0.515167 -0.746121 -0.421789
			-0.447627 -0.607915 -0.655797
			0.167905 0.735682 -0.656186
			-0.000000 -0.000000 1.000000
			0.890660 0.023633 0.454056
			-0.000000 -0.000000 1.000000
			-0.386141 -0.894341 -0.225942
			-0.431114 -0.841810 0.324803
			-0.201764 -0.842486 0.499508
			-0.026991 -0.957560 0.286969
			-0.298648 -0.764329 0.571499
			0.322908 -0.746004 -0.582417
			-0.089621 0.447467 -0.889799
			0.196885 0.636668 -0.745580
			0.394448 0.429153 -0.812551
			0.417411 -0.676296 -0.606953
			0.563080 -0.047668 -0.825026
			0.344168 -0.929848 -0.130116
			-0.451964 -0.877104 -0.162532
			-0.326069 -0.186231 -0.926821
			0.057461 0.425775 -0.903003
			0.634632 0.716140 0.290491
			0.484821 0.221577 0.846080
			0.794676 0.597266 -0.108461
			0.810914 -0.171767 0.559388
			0.602269 -0.042954 0.797136
			0.860800 0.421250 0.285607
			-0.785545 -0.618656 0.013599
			-0.522212 -0.790513 0.319975
			-0.695842 -0.678338 0.235927
			-0.502742 -0.731304 0.460917
			-0.059332 -0.876118 0.478432
			-0.151037 -0.749641 0.644381
			0.231322 -0.966014 0.115354
			-0.437910 -0.637699 0.633700
			0.024932 0.773765 -0.632981
			0.057671 0.744665 -0.664942
			0.252159 0.542775 -0.801131
			0.152201 0.652165 -0.742641
			0.538243 0.144859 -0.830247
			0.413386 0.369963 -0.832009
			0.679839 -0.534018 -0.502636
			0.725829 -0.222430 -0.650920
			0.559488 -0.822776 -0.100062
			-0.828947 -0.074370 -0.554361
			-0.150877 0.607171 -0.780115
			0.692292 0.660896 0.289740
			0.781384 0.558789 0.277840
			0.825172 0.154152 0.543441
			0.760629 0.115912 0.638755
			0.707008 0.689867 0.155638
			0.779687 0.319206 0.538699
			0.533921 0.151378 0.831873
			0.574550 0.233684 0.784400
			0.710375 0.673881 0.203105
			0.657605 0.486173 0.575493
			0.642260 0.693251 0.326964
			-0.975827 0.105372 -0.191466
			-0.976958 -0.152889 0.148924
			-0.744735 -0.442549 0.499520
			-0.119017 -0.702912 0.701249
			0.041957 -0.844421 0.534034
			-0.230064 -0.711453 0.664007
			-0.075491 -0.749481 0.657707
			-0.116187 -0.769065 0.628522
			-0.056166 -0.759786 0.647742
			-0.404575 -0.529522 0.745605
			-0.692519 -0.316221 0.648400
			-0.583563 -0.309407 0.750814
			-0.398666 0.664202 -0.632378
			-0.602036 0.690831 -0.400381
			-0.041816 0.870084 -0.491127
			0.068682 0.761332 -0.644714
			-0.041872 0.860090 -0.508421
			0.162160 0.674022 -0.720693
			0.265315 0.562389 -0.783152
			0.339494 0.498628 -0.797567
			0.724111 -0.267704 -0.635608
			0.545117 0.078375 -0.834688
			0.611297 -0.025238 -0.790999
			0.430629 0.336172 -0.837584
			0.350292 0.537442 -0.767106
			0.584305 -0.730630 -0.353225
			0.536791 -0.842795 0.039400
			0.874034 0.092912 0.476898
			0.873653 0.178645 0.452566
			0.906841 0.105579 0.408035
			0.439167 -0.495901 0.749142
			0.410250 -0.419058 0.809991
			0.957263 0.141524 0.252228
			0.933639 0.227432 0.276755
			0.956676 0.284096 0.063714
			0.989170 0.116178 0.089694
			0.842113 0.533518 -0.078771
			0.413214 0.583366 0.699241
			0.542965 0.358369 0.759448
			0.204219 -0.465486 0.861172
			0.431077 0.403951 0.806844
			0.519588 0.486833 0.702155
			0.377948 0.429999 0.819912
			0.533193 0.816436 0.221670
			0.317046 0.863658 -0.391889
			0.374683 0.813727 -0.444366
			0.462492 0.757858 -0.460166
			0.528039 0.505595 0.682311
			0.354783 0.409798 0.840354
			-0.947425 0.153299 0.280867
			-0.090663 -0.843842 0.528877
			0.233607 -0.952588 0.194945
			-0.120524 -0.730608 0.672076
			-0.212954 -0.624515 0.751420
			-0.183005 -0.771216 0.609700
			-0.506628 -0.234905 0.829547
			-0.332089 -0.366253 0.869239
			-0.682120 0.022314 0.730900
			-0.791850 0.299741 0.532099
			-0.585175 0.416924 0.695518
			-0.490797 0.865605 -0.099229
			-0.055072 0.951948 -0.301267
			-0.185335 0.979331 -0.081001
			0.113585 0.774485 -0.622312
			-0.075340 0.887847 -0.453930
			-0.127583 0.938588 -0.320585
			0.248760 0.656308 -0.712305
			0.645328 -0.361051 -0.673196
			0.504884 0.154025 -0.849334
			0.511878 -0.003305 -0.859052
			0.416712 0.285281 -0.863114
			0.327987 0.528129 -0.783265
			0.245466 0.665839 -0.704560
			0.513440 -0.813897 -0.271939
			0.537254 -0.475782 0.696412
			0.460126 -0.547560 0.698901
			0.922734 0.012969 0.385219
			0.648345 -0.325505 0.688255
			0.040518 -0.684025 0.728332
			-0.063922 -0.719287 0.691766
			0.835401 0.391221 -0.386072
			0.919536 0.331803 -0.210617
			0.977331 -0.141433 -0.157548
			0.827952 0.166124 -0.535629
			0.663501 0.390687 -0.638068
			0.514768 0.623387 -0.588560
			0.096370 -0.352223 0.930941
			0.097579 -0.272870 0.957090
			-0.071056 -0.665644 0.742879
			0.289578 0.917041 0.274191
			0.344430 0.524497 0.778634
			0.332202 0.740751 0.583892
			0.206858 0.765678 0.609054
			0.222576 0.922813 0.314445
			0.249553 0.908938 -0.333998
			-0.000314 0.758800 -0.651324
			0.134888 0.754395 -0.642412
			0.181185 0.710947 -0.679504
			0.237690 0.624261 -0.744179
			0.301497 0.113859 0.946645
			0.001224 0.103392 0.994640
			-0.038296 -0.295833 0.954472
			-0.054576 -0.907636 0.416194
			-0.180349 -0.812820 0.553894
			0.130037 -0.981915 0.137596
			0.432038 -0.869630 -0.238929
			-0.236962 -0.433271 0.869555
			-0.203249 -0.683019 0.701552
			-0.186799 -0.688368 0.700896
			-0.344748 -0.525547 0.777785
			-0.356597 -0.645436 0.675463
			-0.312468 -0.046633 0.948783
			-0.469405 0.206622 0.858468
			-0.575957 0.644543 0.502830
			-0.515200 0.799332 0.309254
			-0.288327 0.952379 0.099210
			-0.353620 0.442638 0.824029
			-0.321864 0.874401 0.363079
			-0.156488 0.973337 -0.167711
			-0.088838 0.919084 -0.383916
			0.135401 0.784800 -0.604777
			-0.193474 0.943251 -0.269898
			-0.170682 0.946364 -0.274341
			0.431596 -0.808257 -0.400557
			0.484288 -0.335063 -0.808207
			0.458442 0.080184 -0.885100
			0.262953 0.638334 -0.723454
			0.133098 0.775122 -0.617633
			0.505847 -0.017402 -0.862447
			0.231061 0.510325 -0.828360
			0.299114 0.254856 -0.919554
			0.193356 -0.638807 0.744674
			0.654067 -0.617040 0.437560
			0.637853 -0.350987 0.685531
			0.251996 -0.646000 0.720543
			-0.145908 -0.682203 0.716457
			0.017001 -0.753418 0.657322
			-0.119484 -0.711280 0.692679
			-0.145887 -0.816852 0.558094
			-0.152203 -0.805365 0.572906
			-0.251126 -0.651228 0.716127
			0.618816 0.348010 -0.704241
			0.421941 0.506977 -0.751625
			0.852512 0.161086 -0.497267
			0.693823 -0.033357 -0.719372
			0.588393 -0.807856 0.034105
			0.810953 -0.424319 -0.402876
			0.320972 0.206586 -0.924283
			0.439573 0.212265 -0.872765
			0.284725 0.426013 -0.858746
			0.386941 0.210941 -0.897653
			0.190666 0.508072 -0.839946
			-0.084427 -0.704184 0.704981
			-0.173402 -0.726105 0.665359
			-0.103501 -0.627475 0.771727
			-0.004467 0.938436 -0.345425
			0.102852 0.901515 -0.420348
			0.139464 0.858491 0.493501
			-0.165978 0.413028 0.895466
			-0.007932 0.000636 0.999968
			-0.107389 0.986737 0.121728
			-0.026827 0.999244 0.028127
			-0.029086 0.924695 -0.379597
			-0.138120 0.792856 -0.593550
			-0.072396 0.603711 -0.793909
			-0.258363 0.655996 -0.709167
			0.031320 -0.244286 0.969197
			-0.093593 -0.395689 0.913603
			-0.013175 -0.929294 0.369106
			-0.375731 -0.636734 0.673347
			-0.087377 -0.888407 0.450664
			-0.248730 -0.753742 0.608281
			0.049894 -0.986725 0.154545
			-0.556718 0.212022 0.803188
			-0.473106 -0.438904 0.763894
			-0.452997 -0.516489 0.726659
			-0.349679 0.935968 0.041086
			-0.085683 0.963831 -0.252366
			-0.220923 0.946326 -0.235925
			-0.379909 0.923997 0.043579
			0.023183 0.983604 -0.178845
			0.306018 -0.871062 -0.384192
			0.360026 -0.654815 -0.664529
			0.381500 0.005723 -0.924351
			0.349763 -0.456495 -0.818094
			-0.191164 0.902305 -0.386397
			-0.020157 0.785141 -0.618989
			0.060611 0.574941 -0.815947
			0.152034 0.175601 -0.972651
			0.142996 0.303716 -0.941971
			0.264458 -0.905900 0.330767
			0.292572 -0.792547 0.535044
			0.058842 -0.888067 0.455932
			-0.300215 -0.726458 0.618166
			-0.068789 -0.891911 0.446948
			-0.192443 -0.846718 0.496018
			-0.062639 -0.980852 0.184407
			-0.282347 -0.696516 0.659656
			-0.281756 -0.731999 0.620316
			-0.221087 -0.811837 0.540408
			-0.243358 -0.757827 0.605372
			0.544722 -0.271433 -0.793475
			0.151576 -0.017749 -0.988286
			0.061671 -0.996656 -0.053613
			0.519340 -0.636085 -0.570685
			0.257144 -0.893116 -0.369082
			0.075677 0.286246 -0.955163
			0.078254 0.238805 -0.967909
			0.117490 0.247921 -0.961630
			0.018578 0.362628 -0.931749
			-0.016823 0.440262 -0.897712
			-0.317881 -0.685415 0.655102
			-0.280375 -0.749067 0.600240
			-0.257338 -0.809649 0.527490
			-0.294331 -0.743018 0.601077
			-0.230928 -0.655072 0.719412
			-0.227685 -0.460620 0.857898
			-0.302388 0.857362 -0.416523
			-0.250565 0.854295 0.455409
			-0.051750 0.967906 0.245926
			-0.111629 0.979216 -0.169337
			-0.555221 0.388711 0.735278
			-0.222386 -0.182456 0.957734
			-0.437721 -0.109025 0.892476
			-0.342661 0.736583 -0.583120
			-0.334067 0.656883 -0.675947
			-0.197332 0.681853 -0.704370
			-0.363129 0.692365 -0.623513
			-0.277391 0.718006 -0.638374
			-0.588068 -0.394650 0.705994
			-0.540388 -0.520565 0.661055
			-0.300270 -0.704892 0.642624
			-0.191332 -0.822827 0.535115
			0.033964 -0.994949 0.094458
			-0.195322 -0.898581 0.392939
			-0.611743 -0.176623 0.771086
			-0.641243 0.510902 0.572526
			-0.584942 0.691032 0.424638
			-0.366325 0.930487 0.000341
			-0.211340 0.958395 -0.191872
			-0.549616 0.796338 0.252523
			0.235271 -0.885576 -0.400503
			0.116463 -0.278288 -0.953411
			0.120135 -0.803661 -0.582834
			-0.458796 0.885813 0.069585
			-0.544001 0.838707 -0.025153
			-0.368793 0.877477 -0.306637
			-0.200040 0.798212 -0.568191
			-0.381352 0.844789 -0.375370
			-0.059903 0.754799 -0.653215
			0.019048 0.059197 -0.998065
			-0.096521 -0.981313 0.166457
			-0.083332 -0.964584 -0.250266
			0.245790 -0.365317 -0.897848
			0.037156 -0.240841 -0.969853
			0.047406 -0.654641 -0.754452
			-0.081025 -0.882063 -0.464112
			-0.616120 -0.612743 0.494916
			-0.422533 -0.634495 0.647211
			-0.436696 -0.482352 0.759363
			-0.751877 0.600308 0.272602
			-0.306340 0.949706 -0.064913
			-0.551219 0.828411 0.099465
			-0.413832 0.720675 -0.556210
			-0.565640 -0.171256 0.806674
			-0.729266 0.074706 0.680140
			-0.459261 0.641207 -0.614762
			-0.603366 -0.211487 0.768910
			-0.692561 -0.239436 0.680463
			-0.799603 0.158465 0.579244
			-0.838306 -0.119782 0.531880
			-0.750557 -0.386740 0.535814
			0.048246 -0.997848 -0.044403
			-0.703218 0.519201 0.485710
			-0.577490 0.766528 0.280961
			-0.533510 0.839546 0.102609
			-0.670154 0.742133 -0.011495
			-0.688667 0.667515 -0.283127
			-0.671364 -0.572567 0.470572
			-0.800563 -0.366719 0.473937
			-0.978312 0.165100 0.125088
			-0.842747 0.496765 -0.207370
			-0.674399 0.643647 -0.361808
			-0.841839 0.456757 0.287540
			-0.979895 0.089809 0.178157
			-0.865883 0.356988 -0.350437
		</DataArray>
	</PointData>
	<Points>
		<DataArray type="Float32" NumberOfComponents="3" format="ascii">
			0.008791 -0.070596 0.051399
			0.009385 -0.070090 0.051827
			0.009093 -0.070136 0.051377
			0.009658 -0.070538 0.051805
			0.009456 -0.070824 0.051419
			0.008360 -0.070729 0.051076
			0.008572 -0.070499 0.050603
			0.009870 -0.070142 0.052087
			0.010245 -0.070181 0.051603
			0.009492 -0.070446 0.051070
			0.010209 -0.070556 0.051948
			0.008705 -0.071076 0.050874
			0.010009 -0.070823 0.051546
			0.009259 -0.071057 0.050983
			0.009795 -0.070885 0.051000
			0.008155 -0.071050 0.050723
			0.007820 -0.070601 0.050831
			0.008914 -0.070864 0.050418
			0.008252 -0.070987 0.049836
			0.007827 -0.070685 0.049999
			0.011071 -0.069686 0.052742
			0.010794 -0.070059 0.052527
			0.010405 -0.069873 0.052028
			0.010770 -0.070459 0.051985
			0.010535 -0.070598 0.051530
			0.007575 -0.071483 0.050084
			0.008127 -0.071487 0.050215
			0.008694 -0.071350 0.050216
			0.006548 -0.070892 0.050146
			0.005925 -0.071414 0.049638
			0.006478 -0.071407 0.049760
			0.006934 -0.070597 0.050272
			0.007382 -0.070518 0.050482
			0.007264 -0.070960 0.049216
			0.008010 -0.071332 0.049368
			0.006906 -0.070741 0.049534
			0.006172 -0.070670 0.049603
			0.011808 -0.069396 0.053275
			0.011550 -0.069750 0.053019
			0.011526 -0.070155 0.052483
			0.011290 -0.070322 0.052051
			0.011758 -0.069566 0.052590
			0.006995 -0.071932 0.049461
			0.007550 -0.071904 0.049562
			0.006443 -0.071925 0.049326
			0.005520 -0.072002 0.048882
			0.005208 -0.071153 0.049530
			0.005009 -0.071421 0.049130
			0.006712 -0.070944 0.049073
			0.007058 -0.071271 0.048851
			0.007771 -0.071577 0.049002
			0.005973 -0.070916 0.049180
			0.005619 -0.070666 0.049471
			0.005424 -0.070881 0.049020
			0.012305 -0.069195 0.053319
			0.011981 -0.069068 0.053706
			0.012517 -0.069060 0.053808
			0.012230 -0.069912 0.053098
			0.012471 -0.069695 0.053484
			0.012042 -0.070043 0.052575
			0.012308 -0.069579 0.052728
			0.006244 -0.072183 0.048916
			0.007358 -0.072091 0.049085
			0.006802 -0.072124 0.048989
			0.004977 -0.071902 0.048662
			0.005879 -0.072203 0.048545
			0.005324 -0.072223 0.048436
			0.004566 -0.071955 0.048380
			0.005223 -0.071163 0.048631
			0.006133 -0.071378 0.048435
			0.006847 -0.071658 0.048559
			0.006482 -0.071678 0.048189
			0.007726 -0.072200 0.048664
			0.005575 -0.071433 0.048358
			0.012999 -0.068869 0.053883
			0.012894 -0.069089 0.053315
			0.012564 -0.068431 0.054141
			0.011959 -0.068801 0.054335
			0.012012 -0.068413 0.053995
			0.011558 -0.068656 0.053759
			0.013234 -0.069325 0.053921
			0.012708 -0.068891 0.054301
			0.013266 -0.068846 0.054389
			0.012761 -0.069575 0.052991
			0.013148 -0.069609 0.053373
			0.005929 -0.071682 0.048066
			0.007163 -0.072313 0.048642
			0.006828 -0.072287 0.048258
			0.004697 -0.072374 0.047921
			0.005363 -0.071824 0.048070
			0.004025 -0.072435 0.047729
			0.004155 -0.071901 0.048015
			0.004812 -0.071809 0.047929
			0.006585 -0.072570 0.047862
			0.006326 -0.072027 0.047791
			0.007524 -0.072449 0.048248
			0.013119 -0.068358 0.054195
			0.013485 -0.068526 0.053834
			0.013448 -0.069073 0.053428
			0.012910 -0.068607 0.054690
			0.012234 -0.068081 0.053429
			0.012878 -0.068155 0.053730
			0.012222 -0.068059 0.054319
			0.012392 -0.068285 0.054733
			0.012219 -0.068872 0.054962
			0.011442 -0.069744 0.054054
			0.011218 -0.068779 0.054488
			0.011537 -0.068428 0.054663
			0.011406 -0.067954 0.053582
			0.013788 -0.069307 0.054031
			0.013593 -0.069530 0.053588
			0.013727 -0.068993 0.054569
			0.013400 -0.068838 0.054988
			0.007243 -0.072503 0.047792
			0.003526 -0.072445 0.047532
			0.003197 -0.072861 0.047279
			0.006385 -0.072369 0.047405
			0.013919 -0.069019 0.053626
			0.013136 -0.068376 0.053307
			0.012043 -0.068256 0.052942
			0.011188 -0.068061 0.053079
			0.013445 -0.069062 0.052489
			0.011211 -0.068153 0.054260
			0.013216 -0.069349 0.054851
			0.012247 -0.070055 0.054076
			0.010809 -0.069588 0.053912
			0.010634 -0.068253 0.053992
			0.010227 -0.068529 0.053883
			0.010314 -0.068112 0.053433
			0.014340 -0.069307 0.054158
			0.014022 -0.069387 0.054825
			0.013549 -0.069692 0.054663
			0.003117 -0.072352 0.047135
			0.002689 -0.072626 0.047422
			0.003070 -0.072642 0.046540
			0.002951 -0.073361 0.047269
			0.002602 -0.074072 0.047421
			0.003355 -0.073078 0.046744
			0.014551 -0.069450 0.053604
			0.013487 -0.068656 0.053044
			0.014367 -0.069191 0.053142
			0.014072 -0.069273 0.052725
			0.010387 -0.068238 0.052542
			0.011844 -0.068517 0.052533
			0.009976 -0.068119 0.053016
			0.013473 -0.069473 0.052013
			0.013703 -0.070343 0.054076
			0.012769 -0.070524 0.053725
			0.010387 -0.070357 0.053323
			0.012013 -0.070416 0.053733
			0.009513 -0.069765 0.053171
			0.009317 -0.070235 0.052923
			0.009813 -0.068473 0.053520
			0.009533 -0.068856 0.053317
			0.009159 -0.068506 0.052669
			0.014655 -0.069639 0.054372
			0.014003 -0.069960 0.054467
			0.002465 -0.072207 0.047216
			0.002580 -0.072294 0.046502
			0.001914 -0.072361 0.048175
			0.002148 -0.073911 0.047697
			0.003319 -0.073009 0.046173
			0.002840 -0.072473 0.046038
			0.003705 -0.074163 0.046842
			0.002887 -0.074481 0.047218
			0.002419 -0.074524 0.047688
			0.004038 -0.073814 0.046377
			0.003635 -0.073396 0.046444
			0.014779 -0.069869 0.053813
			0.014715 -0.070011 0.053309
			0.014373 -0.069687 0.052637
			0.010841 -0.068757 0.052170
			0.009628 -0.068574 0.052076
			0.012892 -0.069411 0.051792
			0.011640 -0.068820 0.052163
			0.010325 -0.069189 0.051598
			0.011086 -0.069088 0.051845
			0.013235 -0.069779 0.051609
			0.014140 -0.069883 0.052221
			0.013706 -0.069954 0.051829
			0.014262 -0.070265 0.054130
			0.014562 -0.070450 0.053715
			0.013483 -0.070974 0.053098
			0.011628 -0.071055 0.053050
			0.012185 -0.071003 0.053130
			0.010696 -0.071226 0.052692
			0.010177 -0.070724 0.053012
			0.009629 -0.070675 0.052839
			0.008858 -0.069198 0.052740
			0.008007 -0.070309 0.052119
			0.008607 -0.069657 0.052557
			0.007791 -0.070743 0.051871
			0.008890 -0.070948 0.052295
			0.008507 -0.069194 0.052332
			0.009064 -0.068690 0.052054
			0.002095 -0.071630 0.047156
			0.001895 -0.071429 0.047662
			0.002287 -0.071980 0.046794
			0.002629 -0.071678 0.046387
			0.002983 -0.071930 0.046099
			0.001816 -0.073402 0.048209
			0.001430 -0.071406 0.048529
			0.001624 -0.072193 0.048617
			0.001679 -0.072790 0.048572
			0.001981 -0.073985 0.048208
			0.003949 -0.073263 0.045718
			0.003419 -0.072891 0.045697
			0.003333 -0.072232 0.045855
			0.003540 -0.074872 0.046929
			0.004877 -0.074493 0.046118
			0.004281 -0.074729 0.046649
			0.003082 -0.074974 0.047469
			0.003263 -0.074903 0.048053
			0.002913 -0.074617 0.048311
			0.002564 -0.074311 0.048551
			0.005186 -0.074152 0.045637
			0.004700 -0.073619 0.045496
			0.014715 -0.070377 0.052878
			0.009222 -0.069176 0.051332
			0.008486 -0.069118 0.051412
			0.011613 -0.069262 0.051661
			0.012688 -0.069721 0.051429
			0.010049 -0.069469 0.051127
			0.013126 -0.070295 0.051277
			0.012650 -0.070272 0.051027
			0.014007 -0.070452 0.051965
			0.014383 -0.070476 0.052355
			0.013320 -0.070783 0.051396
			0.014175 -0.070957 0.053018
			0.012611 -0.071173 0.052678
			0.013288 -0.071184 0.052642
			0.010493 -0.071525 0.052318
			0.011049 -0.071483 0.052407
			0.011990 -0.071233 0.052692
			0.009593 -0.071200 0.052413
			0.007830 -0.069698 0.051884
			0.007256 -0.070615 0.051619
			0.006721 -0.070386 0.051288
			0.006277 -0.071372 0.050897
			0.007745 -0.071370 0.051537
			0.009390 -0.071505 0.052044
			0.008194 -0.069223 0.051895
			0.002197 -0.071090 0.047175
			0.002658 -0.071225 0.046880
			0.001334 -0.070904 0.048452
			0.001909 -0.070921 0.047620
			0.003246 -0.070707 0.047441
			0.004157 -0.070912 0.047235
			0.001885 -0.073452 0.048809
			0.001452 -0.071836 0.048993
			0.001295 -0.070679 0.049029
			0.001776 -0.072524 0.049118
			0.001730 -0.071763 0.049471
			0.002222 -0.073938 0.048729
			0.003857 -0.072683 0.045489
			0.004583 -0.072803 0.045462
			0.005036 -0.071600 0.046566
			0.003825 -0.075270 0.047177
			0.005874 -0.074531 0.045371
			0.005357 -0.074884 0.046105
			0.005059 -0.075220 0.046594
			0.004429 -0.075323 0.046951
			0.003618 -0.075148 0.047757
			0.004192 -0.074775 0.048451
			0.003459 -0.074680 0.048496
			0.003109 -0.074381 0.048742
			0.002763 -0.074052 0.048961
			0.005294 -0.073675 0.045263
			0.004926 -0.073202 0.045312
			0.005373 -0.073005 0.045430
			0.008101 -0.069494 0.050461
			0.008562 -0.069869 0.049949
			0.007625 -0.069327 0.050983
			0.007908 -0.069273 0.051440
			0.011544 -0.070280 0.050778
			0.011028 -0.069753 0.051076
			0.010544 -0.069788 0.050879
			0.010619 -0.070382 0.050357
			0.009905 -0.070089 0.050220
			0.012424 -0.070810 0.050873
			0.012892 -0.070715 0.051042
			0.013689 -0.070803 0.051789
			0.014035 -0.070965 0.052331
			0.013105 -0.071258 0.052065
			0.011966 -0.071012 0.050774
			0.012323 -0.071347 0.051436
			0.012433 -0.071314 0.052145
			0.010294 -0.071783 0.051908
			0.009739 -0.071804 0.051798
			0.011724 -0.071429 0.052146
			0.010854 -0.071709 0.051967
			0.007086 -0.069493 0.050969
			0.006262 -0.070364 0.051013
			0.005955 -0.070781 0.050874
			0.008464 -0.071611 0.051627
			0.006954 -0.072201 0.050618
			0.005304 -0.071829 0.050325
			0.005852 -0.072165 0.050329
			0.004750 -0.072133 0.050045
			0.002508 -0.070668 0.047538
			0.001523 -0.070221 0.048342
			0.001669 -0.070589 0.047948
			0.002547 -0.070109 0.047933
			0.004460 -0.070242 0.047799
			0.003110 -0.069996 0.047956
			0.005244 -0.071251 0.046892
			0.005446 -0.070971 0.047284
			0.005640 -0.070752 0.047731
			0.004915 -0.070582 0.047707
			0.002039 -0.073127 0.049232
			0.002325 -0.073529 0.049154
			0.001488 -0.071234 0.049389
			0.001718 -0.070973 0.049756
			0.001814 -0.069865 0.048750
			0.001556 -0.070226 0.049308
			0.002529 -0.072247 0.049640
			0.002222 -0.072664 0.049504
			0.002194 -0.071805 0.049755
			0.002200 -0.071087 0.050068
			0.002802 -0.073496 0.049358
			0.005561 -0.072052 0.046200
			0.005764 -0.071754 0.046575
			0.005741 -0.072442 0.045867
			0.004530 -0.075352 0.047552
			0.004167 -0.075183 0.047917
			0.005889 -0.074963 0.045830
			0.006696 -0.074504 0.045296
			0.006120 -0.073955 0.045149
			0.005656 -0.075289 0.046840
			0.004901 -0.075417 0.047090
			0.005213 -0.075323 0.047477
			0.004726 -0.075119 0.047986
			0.004511 -0.074322 0.048791
			0.005079 -0.074389 0.048540
			0.005802 -0.073553 0.045218
			0.006196 -0.073262 0.045342
			0.007443 -0.069463 0.050455
			0.008955 -0.070604 0.049270
			0.007355 -0.069704 0.049878
			0.008035 -0.070646 0.048793
			0.006744 -0.069496 0.050555
			0.011481 -0.071095 0.050620
			0.010409 -0.070746 0.050043
			0.009533 -0.070754 0.049481
			0.011281 -0.071710 0.051380
			0.009165 -0.072188 0.051116
			0.010150 -0.071999 0.051386
			0.010518 -0.071979 0.050864
			0.008610 -0.072207 0.051006
			0.006295 -0.069574 0.050347
			0.005776 -0.069757 0.050317
			0.005420 -0.070615 0.050595
			0.004992 -0.070372 0.050351
			0.007844 -0.072777 0.049846
			0.006889 -0.072865 0.049840
			0.005432 -0.072908 0.049715
			0.004145 -0.071477 0.050116
			0.003701 -0.072143 0.049860
			0.002387 -0.069658 0.048688
			0.002188 -0.069921 0.048282
			0.002753 -0.069785 0.048284
			0.005496 -0.070139 0.048338
			0.004045 -0.069806 0.048298
			0.004774 -0.069931 0.048279
			0.003458 -0.069595 0.048941
			0.005795 -0.071270 0.047038
			0.005996 -0.071001 0.047440
			0.006192 -0.070766 0.047873
			0.006214 -0.070382 0.048427
			0.001968 -0.070402 0.049851
			0.002596 -0.070801 0.050186
			0.002646 -0.069534 0.049122
			0.001932 -0.069882 0.049489
			0.002399 -0.069655 0.049557
			0.002920 -0.071961 0.049765
			0.003248 -0.072477 0.049718
			0.002850 -0.072843 0.049666
			0.002652 -0.071541 0.049973
			0.004098 -0.073469 0.049328
			0.006408 -0.071356 0.047318
			0.007060 -0.071573 0.047312
			0.006863 -0.071803 0.046874
			0.006668 -0.072024 0.046429
			0.006639 -0.072484 0.045943
			0.006602 -0.073015 0.045523
			0.005777 -0.075178 0.047472
			0.006883 -0.074957 0.045774
			0.006402 -0.075131 0.046087
			0.006211 -0.075254 0.046934
			0.007390 -0.074600 0.045684
			0.006550 -0.073713 0.045256
			0.007229 -0.073976 0.045414
			0.006234 -0.074863 0.047483
			0.005407 -0.074899 0.048025
			0.005328 -0.073730 0.049058
			0.006085 -0.074288 0.048125
			0.005927 -0.073996 0.048581
			0.008766 -0.071413 0.048507
			0.008147 -0.071757 0.047736
			0.007807 -0.071363 0.047895
			0.006416 -0.070094 0.048812
			0.005796 -0.069622 0.049517
			0.005515 -0.069791 0.048927
			0.010202 -0.071098 0.049719
			0.010744 -0.071514 0.050187
			0.011131 -0.071548 0.050568
			0.009745 -0.072239 0.050357
			0.008969 -0.072371 0.050641
			0.010329 -0.071948 0.050210
			0.005355 -0.069695 0.049960
			0.004361 -0.070394 0.050162
			0.004069 -0.069853 0.049759
			0.009270 -0.072422 0.049377
			0.008709 -0.072729 0.048870
			0.007782 -0.073028 0.049239
			0.006396 -0.073556 0.048899
			0.007254 -0.073476 0.048542
			0.006343 -0.073117 0.049515
			0.003924 -0.070891 0.050204
			0.004604 -0.069704 0.048790
			0.003913 -0.069686 0.049274
			0.002436 -0.070340 0.050044
			0.003098 -0.070439 0.050100
			0.002840 -0.069965 0.049949
			0.003224 -0.069597 0.049520
			0.007210 -0.072133 0.046657
			0.007052 -0.072432 0.046221
			0.007149 -0.073083 0.045713
			0.007713 -0.074580 0.046113
			0.006974 -0.075070 0.046629
			0.007240 -0.074966 0.046178
			0.006983 -0.074794 0.047288
			0.007476 -0.073600 0.045666
			0.007684 -0.074065 0.045748
			0.006843 -0.074117 0.047833
			0.009503 -0.071346 0.049098
			0.008545 -0.071742 0.048063
			0.008795 -0.072441 0.048268
			0.008198 -0.072398 0.047521
			0.007797 -0.072610 0.046847
			0.004992 -0.069681 0.049560
			0.009711 -0.072010 0.049334
			0.010026 -0.071984 0.049768
			0.009548 -0.072297 0.049786
			0.008488 -0.072875 0.048319
			0.007583 -0.073710 0.047744
			0.007545 -0.072767 0.046275
			0.007772 -0.073250 0.046088
			0.007966 -0.074011 0.046206
			0.007755 -0.074342 0.046725
			0.007427 -0.074832 0.046705
			0.008273 -0.073019 0.047774
			0.008070 -0.073029 0.047067
			0.007696 -0.073943 0.047178
		</DataArray>
	</Points>
			<Polys>
				<DataArray type="Int32" Name="connectivity" format="ascii">
					0 1 2 
					1 0 3 
					3 0 4 
					0 5 4 
					6 5 0 
					0 2 6 
					7 1 3 
					8 1 7 
					8 2 1 
					9 2 8 
					6 2 9 
					10 3 4 
					7 3 10 
					4 5 11 
					10 4 12 
					13 12 4 
					4 11 13 
					8 4 9 
					4 13 9 
					12 4 8 
					12 14 4 
					14 13 4 
					5 15 11 
					15 5 16 
					6 16 5 
					6 17 18 
					18 19 6 
					13 17 6 
					19 16 6 
					9 13 6 
					20 7 21 
					7 22 21 
					22 7 10 
					20 22 7 
					8 7 22 
					22 10 8 
					12 8 10 
					10 21 22 
					23 21 10 
					24 23 10 
					10 12 24 
					23 10 22 
					24 12 10 
					23 24 10 
					11 25 26 
					11 15 25 
					13 11 12 
					11 26 27 
					14 12 11 
					11 13 14 
					11 27 13 
					17 13 27 
					25 15 16 
					16 28 29 
					25 16 30 
					16 31 28 
					16 29 30 
					32 31 16 
					32 16 19 
					27 18 17 
					18 33 19 
					18 34 33 
					34 18 27 
					35 19 33 
					31 32 19 
					31 19 36 
					35 36 19 
					37 38 20 
					37 20 38 
					38 20 39 
					40 39 20 
					20 21 40 
					21 22 20 
					20 40 21 
					41 20 38 
					40 20 39 
					20 41 39 
					21 23 40 
					40 22 21 
					23 22 40 
					25 42 43 
					43 26 25 
					30 44 25 
					25 44 42 
					27 26 34 
					43 34 26 
					29 28 36 
					36 28 31 
					30 29 44 
					45 44 29 
					46 29 36 
					46 47 29 
					45 29 47 
					33 48 35 
					48 33 49 
					34 50 33 
					33 50 49 
					34 43 50 
					36 35 48 
					36 48 51 
					52 46 36 
					51 53 36 
					36 53 52 
					54 37 38 
					41 38 37 
					37 54 55 
					56 37 55 
					56 54 37 
					41 37 54 
					39 57 38 
					54 38 58 
					58 38 57 
					59 57 39 
					59 39 41 
					59 41 57 
					60 41 54 
					57 41 60 
					61 42 44 
					42 61 44 
					62 43 42 
					63 42 44 
					42 63 62 
					62 50 43 
					45 61 44 
					63 44 61 
					47 64 45 
					45 65 61 
					45 66 65 
					45 64 67 
					45 67 66 
					46 52 53 
					47 46 53 
					47 53 68 
					68 64 47 
					48 49 69 
					51 48 69 
					50 70 49 
					69 49 71 
					71 49 70 
					50 62 72 
					63 70 50 
					72 63 50 
					51 69 73 
					73 68 51 
					51 68 53 
					58 56 54 
					55 54 56 
					56 74 54 
					75 60 54 
					75 54 74 
					56 55 74 
					74 55 76 
					77 55 56 
					78 76 55 
					55 79 78 
					79 55 77 
					80 56 58 
					74 56 80 
					77 56 81 
					82 81 56 
					82 56 74 
					83 57 60 
					58 57 83 
					58 57 84 
					58 84 57 
					80 58 84 
					58 83 84 
					75 83 60 
					62 63 61 
					61 63 62 
					70 63 61 
					71 70 61 
					71 61 85 
					85 61 65 
					86 72 62 
					62 63 86 
					71 70 63 
					70 71 63 
					86 63 72 
					63 86 87 
					87 86 63 
					67 64 88 
					67 88 64 
					68 67 64 
					66 85 65 
					88 66 67 
					89 85 66 
					66 88 89 
					67 68 73 
					67 90 88 
					91 90 67 
					92 67 73 
					92 91 67 
					69 71 85 
					85 89 69 
					89 73 69 
					70 85 71 
					70 71 85 
					71 93 87 
					94 71 87 
					93 71 94 
					95 72 86 
					72 95 86 
					73 89 92 
					82 74 80 
					74 76 96 
					97 98 74 
					75 74 98 
					97 74 96 
					98 83 75 
					77 76 78 
					76 77 81 
					81 99 76 
					100 101 76 
					76 101 96 
					78 76 102 
					100 76 78 
					76 103 102 
					103 76 99 
					77 78 79 
					77 104 105 
					77 105 106 
					106 107 77 
					107 104 77 
					78 108 100 
					102 108 78 
					109 80 110 
					84 110 80 
					80 109 82 
					81 82 99 
					82 109 111 
					99 82 112 
					112 82 111 
					84 83 98 
					109 110 84 
					98 109 84 
					86 87 95 
					95 87 86 
					87 93 95 
					95 113 87 
					93 87 113 
					94 87 93 
					93 94 87 
					87 94 93 
					91 88 90 
					92 89 88 
					92 88 91 
					91 114 90 
					115 90 114 
					90 115 114 
					90 114 91 
					95 93 113 
					93 94 116 
					116 94 93 
					101 97 96 
					117 98 97 
					118 97 101 
					118 117 97 
					109 98 117 
					104 103 99 
					112 104 99 
					119 100 120 
					100 108 120 
					118 101 100 
					118 100 121 
					121 100 119 
					122 108 102 
					103 122 102 
					107 122 103 
					103 104 107 
					105 104 123 
					104 112 123 
					105 123 124 
					106 105 125 
					125 105 124 
					106 122 107 
					122 106 126 
					125 127 106 
					127 126 106 
					108 122 126 
					108 126 128 
					128 120 108 
					109 129 111 
					117 129 109 
					123 112 111 
					130 111 129 
					123 111 131 
					130 131 111 
					132 115 114 
					114 115 132 
					115 132 133 
					115 134 132 
					135 115 136 
					136 115 135 
					135 137 115 
					136 115 133 
					136 135 115 
					115 137 134 
					117 138 129 
					139 117 118 
					140 138 117 
					141 140 117 
					117 139 141 
					121 139 118 
					120 142 119 
					119 143 121 
					143 119 142 
					128 120 144 
					120 128 144 
					120 128 142 
					145 121 143 
					141 139 121 
					145 141 121 
					126 122 127 
					122 126 127 
					131 124 123 
					131 146 124 
					124 146 147 
					148 124 149 
					149 124 147 
					124 148 125 
					150 127 125 
					125 151 150 
					125 148 151 
					127 152 126 
					128 126 152 
					152 127 153 
					153 127 150 
					142 128 144 
					152 153 128 
					153 154 128 
					154 144 128 
					138 155 129 
					130 129 155 
					131 130 156 
					130 155 156 
					146 131 156 
					132 157 133 
					158 157 132 
					158 132 134 
					133 157 159 
					160 136 133 
					133 159 160 
					134 137 161 
					162 158 134 
					161 162 134 
					163 135 136 
					137 135 163 
					163 136 164 
					164 136 165 
					165 136 160 
					163 166 137 
					166 167 137 
					137 167 161 
					155 138 168 
					168 138 169 
					169 138 140 
					170 140 141 
					169 140 170 
					170 141 145 
					142 171 143 
					142 144 172 
					171 142 172 
					173 143 174 
					143 173 145 
					175 143 171 
					176 174 143 
					143 175 176 
					154 172 144 
					173 177 145 
					170 145 178 
					179 145 177 
					178 145 179 
					146 156 180 
					180 181 146 
					182 147 146 
					146 181 182 
					147 183 149 
					184 147 182 
					184 183 147 
					148 149 185 
					185 186 148 
					187 186 148 
					148 186 187 
					148 186 151 
					149 183 185 
					188 153 150 
					150 151 189 
					190 188 150 
					150 189 190 
					151 191 189 
					191 151 192 
					151 186 187 
					192 151 187 
					188 152 153 
					152 154 153 
					188 154 152 
					152 193 188 
					188 193 152 
					172 154 194 
					194 154 188 
					169 155 168 
					168 155 169 
					156 155 180 
					180 155 168 
					157 195 196 
					159 157 196 
					157 197 195 
					157 158 197 
					198 197 158 
					198 158 199 
					199 158 162 
					159 200 160 
					159 196 201 
					201 202 159 
					159 202 203 
					203 200 159 
					204 160 200 
					165 160 204 
					205 161 167 
					205 206 161 
					206 162 161 
					199 162 207 
					207 162 206 
					163 164 208 
					209 166 163 
					209 163 210 
					208 210 163 
					164 165 211 
					208 164 211 
					165 212 211 
					165 213 212 
					214 165 204 
					165 214 213 
					215 167 166 
					209 215 166 
					216 205 167 
					167 215 216 
					169 181 168 
					181 180 168 
					169 217 181 
					217 169 170 
					170 178 217 
					175 171 172 
					218 175 172 
					194 219 172 
					219 218 172 
					173 174 220 
					177 173 221 
					221 173 220 
					220 174 176 
					175 222 220 
					220 176 175 
					222 175 218 
					223 179 177 
					224 223 177 
					224 177 221 
					225 178 179 
					226 217 178 
					225 226 178 
					227 225 179 
					227 179 223 
					181 217 228 
					182 181 228 
					184 182 229 
					229 182 230 
					230 182 228 
					185 183 231 
					183 232 231 
					183 184 232 
					233 184 229 
					233 232 184 
					186 185 234 
					234 185 231 
					187 186 192 
					186 234 192 
					193 188 235 
					235 188 190 
					193 194 188 
					236 237 189 
					189 191 236 
					189 235 190 
					189 237 235 
					236 191 238 
					191 192 239 
					238 191 239 
					192 234 240 
					239 192 240 
					194 193 219 
					241 219 193 
					241 193 235 
					195 242 196 
					243 195 197 
					242 195 243 
					196 244 201 
					244 196 245 
					245 196 242 
					243 197 198 
					246 198 247 
					243 198 246 
					247 198 199 
					199 207 247 
					200 203 248 
					204 200 248 
					202 201 249 
					201 244 250 
					201 250 249 
					251 203 202 
					252 251 202 
					252 202 249 
					251 248 203 
					248 253 204 
					204 253 214 
					254 206 205 
					255 254 205 
					216 255 205 
					206 254 207 
					247 207 256 
					207 254 256 
					210 208 257 
					257 208 211 
					258 215 209 
					209 259 258 
					209 210 260 
					259 209 260 
					261 210 257 
					260 210 261 
					262 257 211 
					211 212 262 
					262 212 263 
					264 212 213 
					212 264 263 
					265 213 214 
					213 265 264 
					253 266 214 
					214 266 265 
					267 216 215 
					258 267 215 
					255 216 268 
					268 216 269 
					269 216 267 
					228 217 226 
					218 270 271 
					271 222 218 
					218 219 272 
					270 218 272 
					219 273 272 
					241 273 219 
					221 220 274 
					222 275 220 
					220 275 274 
					274 224 221 
					276 275 222 
					276 222 277 
					222 278 277 
					278 222 271 
					223 224 279 
					279 280 223 
					223 280 227 
					279 224 274 
					225 227 281 
					281 226 225 
					282 228 226 
					282 226 281 
					281 227 283 
					284 285 227 
					284 227 280 
					285 283 227 
					228 282 230 
					286 233 229 
					283 229 230 
					229 283 286 
					282 281 230 
					230 281 283 
					231 232 287 
					231 287 288 
					240 234 231 
					231 288 240 
					289 290 232 
					232 233 289 
					232 290 287 
					289 233 286 
					273 241 235 
					235 291 273 
					235 292 291 
					235 237 292 
					238 237 236 
					292 237 293 
					238 293 237 
					294 295 238 
					239 294 238 
					293 238 296 
					295 297 238 
					296 238 298 
					298 238 297 
					239 240 294 
					294 240 288 
					246 242 243 
					242 299 245 
					246 299 242 
					300 244 301 
					245 301 244 
					244 300 250 
					302 301 245 
					245 299 302 
					303 246 247 
					246 304 299 
					303 304 246 
					247 305 306 
					307 308 247 
					247 306 307 
					256 305 247 
					247 308 303 
					309 248 251 
					248 309 310 
					248 310 253 
					249 250 311 
					252 249 311 
					250 311 312 
					250 312 311 
					312 311 250 
					300 313 250 
					312 250 314 
					250 313 314 
					315 316 251 
					315 251 252 
					251 316 309 
					311 312 252 
					252 317 315 
					318 317 252 
					312 318 252 
					253 310 319 
					266 253 319 
					320 321 254 
					254 255 320 
					254 321 256 
					269 255 268 
					255 322 320 
					255 269 322 
					321 305 256 
					323 261 257 
					257 262 324 
					323 257 324 
					259 325 258 
					325 326 258 
					258 326 327 
					327 267 258 
					328 259 260 
					325 259 328 
					329 260 261 
					329 328 260 
					261 330 329 
					261 323 330 
					324 262 263 
					263 331 324 
					263 264 332 
					333 331 263 
					263 332 333 
					332 264 265 
					265 266 332 
					266 319 332 
					327 334 267 
					269 267 334 
					269 335 322 
					269 334 335 
					271 270 336 
					272 336 270 
					271 337 278 
					271 336 338 
					271 339 337 
					339 271 338 
					291 272 273 
					272 291 340 
					340 336 272 
					274 275 276 
					277 274 276 
					274 284 279 
					274 341 284 
					341 274 277 
					278 342 277 
					342 341 277 
					342 278 343 
					337 343 278 
					280 279 284 
					285 286 283 
					284 341 285 
					344 286 285 
					285 341 344 
					289 286 344 
					288 287 345 
					346 345 287 
					287 290 344 
					347 346 287 
					347 287 344 
					288 345 348 
					294 288 295 
					295 288 348 
					344 290 289 
					291 349 340 
					349 291 292 
					292 350 349 
					351 352 292 
					292 293 351 
					352 350 292 
					351 293 296 
					348 345 295 
					295 345 353 
					353 354 295 
					297 295 355 
					354 355 295 
					296 298 351 
					298 297 355 
					356 351 298 
					298 357 356 
					298 355 357 
					299 304 302 
					300 358 313 
					300 359 358 
					359 300 302 
					302 300 301 
					359 302 360 
					302 304 360 
					303 308 361 
					362 304 303 
					363 303 361 
					363 362 303 
					364 304 362 
					364 360 304 
					305 365 306 
					365 305 321 
					365 366 306 
					367 307 306 
					367 306 366 
					308 307 368 
					368 307 367 
					368 361 308 
					309 316 310 
					316 319 310 
					312 314 369 
					370 318 312 
					369 370 312 
					358 371 313 
					314 313 372 
					371 373 313 
					313 373 372 
					372 369 314 
					374 375 315 
					375 376 315 
					316 315 376 
					317 374 315 
					316 376 319 
					377 317 318 
					317 377 374 
					377 318 370 
					319 376 378 
					319 378 332 
					321 320 322 
					379 321 380 
					321 379 365 
					381 380 321 
					382 381 321 
					322 383 321 
					382 321 383 
					335 384 322 
					384 383 322 
					323 324 331 
					385 330 323 
					323 331 385 
					386 325 387 
					386 326 325 
					387 325 388 
					325 328 388 
					389 326 386 
					326 390 327 
					391 390 326 
					389 391 326 
					390 335 327 
					327 335 334 
					385 392 328 
					392 388 328 
					329 385 328 
					392 385 329 
					329 330 385 
					392 329 385 
					331 393 385 
					331 333 393 
					333 332 394 
					378 355 332 
					332 355 394 
					395 393 333 
					333 396 395 
					394 396 333 
					335 390 384 
					336 340 338 
					397 343 337 
					398 397 337 
					399 337 339 
					337 399 398 
					400 338 340 
					400 339 338 
					399 339 400 
					340 349 401 
					400 340 402 
					401 402 340 
					341 342 403 
					341 403 404 
					341 404 405 
					341 405 344 
					403 342 343 
					397 403 343 
					347 344 405 
					345 346 347 
					347 406 345 
					407 345 406 
					345 407 353 
					405 404 347 
					404 408 347 
					406 347 408 
					401 349 409 
					349 350 409 
					409 350 352 
					410 352 351 
					351 356 410 
					409 352 411 
					352 410 411 
					412 353 407 
					413 414 353 
					412 413 353 
					354 353 415 
					353 416 415 
					353 414 416 
					354 415 417 
					355 354 417 
					355 375 357 
					375 355 378 
					355 417 394 
					356 357 374 
					418 356 374 
					356 418 410 
					374 357 375 
					360 358 359 
					371 358 360 
					371 360 364 
					368 402 361 
					361 402 363 
					419 362 363 
					362 419 364 
					419 363 402 
					420 371 364 
					364 419 420 
					379 366 365 
					366 379 399 
					399 367 366 
					368 367 399 
					399 400 368 
					368 400 402 
					372 421 369 
					370 369 421 
					370 421 422 
					370 422 418 
					374 377 370 
					370 418 374 
					423 373 371 
					423 371 424 
					424 371 420 
					423 421 372 
					373 423 372 
					378 376 375 
					379 380 399 
					398 399 380 
					380 381 398 
					398 381 382 
					382 425 398 
					426 425 382 
					383 426 382 
					427 383 384 
					426 383 427 
					391 384 390 
					427 384 391 
					393 392 385 
					428 389 386 
					429 386 387 
					430 386 429 
					428 386 430 
					388 429 387 
					431 429 388 
					392 431 388 
					389 432 391 
					432 389 433 
					433 389 428 
					391 432 427 
					431 392 434 
					392 395 434 
					393 395 392 
					394 417 415 
					394 415 396 
					395 416 434 
					415 416 395 
					395 396 415 
					435 403 397 
					397 398 436 
					435 397 437 
					437 397 436 
					436 398 437 
					438 437 398 
					439 438 398 
					439 398 425 
					440 402 401 
					401 409 440 
					440 419 402 
					437 403 435 
					404 403 441 
					403 437 441 
					404 441 442 
					404 405 408 
					408 405 404 
					442 408 404 
					406 408 442 
					443 406 442 
					406 443 412 
					407 406 412 
					440 409 411 
					423 410 422 
					422 410 418 
					410 423 411 
					440 411 420 
					411 423 420 
					441 413 412 
					412 442 441 
					412 443 442 
					413 441 437 
					437 444 413 
					416 413 444 
					416 414 413 
					434 416 445 
					444 445 416 
					420 419 440 
					420 423 424 
					422 421 423 
					425 426 446 
					447 439 425 
					446 447 425 
					427 446 426 
					432 447 427 
					446 427 447 
					433 428 448 
					448 428 449 
					430 449 428 
					429 450 430 
					429 431 450 
					449 430 450 
					450 431 434 
					432 433 447 
					433 448 447 
					450 434 445 
					444 437 451 
					438 451 437 
					438 439 452 
					451 438 452 
					447 452 439 
					444 451 445 
					450 445 453 
					451 452 445 
					452 453 445 
					447 448 452 
					452 448 453 
					453 448 449 
					453 449 450 
				</DataArray>
				<DataArray type="Int32" Name="offsets" format="ascii">
					3 6 9 12 15 18 21 24 27 30 33 36 39 42 45 48 51 54 57 60 63 66 69 72 75 78 81 84 87 90 93 96 99 102 105 108 111 114 117 120 123 126 129 132 135 138 141 144 147 150 153 156 159 162 165 168 171 174 177 180 183 186 189 192 195 198 201 204 207 210 213 216 219 222 225 228 231 234 237 240 243 246 249 252 255 258 261 264 267 270 273 276 279 282 285 288 291 294 297 300 303 306 309 312 315 318 321 324 327 330 333 336 339 342 345 348 351 354 357 360 363 366 369 372 375 378 381 384 387 390 393 396 399 402 405 408 411 414 417 420 423 426 429 432 435 438 441 444 447 450 453 456 459 462 465 468 471 474 477 480 483 486 489 492 495 498 501 504 507 510 513 516 519 522 525 528 531 534 537 540 543 546 549 552 555 558 561 564 567 570 573 576 579 582 585 588 591 594 597 600 603 606 609 612 615 618 621 624 627 630 633 636 639 642 645 648 651 654 657 660 663 666 669 672 675 678 681 684 687 690 693 696 699 702 705 708 711 714 717 720 723 726 729 732 735 738 741 744 747 750 753 756 759 762 765 768 771 774 777 780 783 786 789 792 795 798 801 804 807 810 813 816 819 822 825 828 831 834 837 840 843 846 849 852 855 858 861 864 867 870 873 876 879 882 885 888 891 894 897 900 903 906 909 912 915 918 921 924 927 930 933 936 939 942 945 948 951 954 957 960 963 966 969 972 975 978 981 984 987 990 993 996 999 1002 1005 1008 1011 1014 1017 1020 1023 1026 1029 1032 1035 1038 1041 1044 1047 1050 1053 1056 1059 1062 1065 1068 1071 1074 1077 1080 1083 1086 1089 1092 1095 1098 1101 1104 1107 1110 1113 1116 1119 1122 1125 1128 1131 1134 1137 1140 1143 1146 1149 1152 1155 1158 1161 1164 1167 1170 1173 1176 1179 1182 1185 1188 1191 1194 1197 1200 1203 1206 1209 1212 1215 1218 1221 1224 1227 1230 1233 1236 1239 1242 1245 1248 1251 1254 1257 1260 1263 1266 1269 1272 1275 1278 1281 1284 1287 1290 1293 1296 1299 1302 1305 1308 1311 1314 1317 1320 1323 1326 1329 1332 1335 1338 1341 1344 1347 1350 1353 1356 1359 1362 1365 1368 1371 1374 1377 1380 1383 1386 1389 1392 1395 1398 1401 1404 1407 1410 1413 1416 1419 1422 1425 1428 1431 1434 1437 1440 1443 1446 1449 1452 1455 1458 1461 1464 1467 1470 1473 1476 1479 1482 1485 1488 1491 1494 1497 1500 1503 1506 1509 1512 1515 1518 1521 1524 1527 1530 1533 1536 1539 1542 1545 1548 1551 1554 1557 1560 1563 1566 1569 1572 1575 1578 1581 1584 1587 1590 1593 1596 1599 1602 1605 1608 1611 1614 1617 1620 1623 1626 1629 1632 1635 1638 1641 1644 1647 1650 1653 1656 1659 1662 1665 1668 1671 1674 1677 1680 1683 1686 1689 1692 1695 1698 1701 1704 1707 1710 1713 1716 1719 1722 1725 1728 1731 1734 1737 1740 1743 1746 1749 1752 1755 1758 1761 1764 1767 1770 1773 1776 1779 1782 1785 1788 1791 1794 1797 1800 1803 1806 1809 1812 1815 1818 1821 1824 1827 1830 1833 1836 1839 1842 1845 1848 1851 1854 1857 1860 1863 1866 1869 1872 1875 1878 1881 1884 1887 1890 1893 1896 1899 1902 1905 1908 1911 1914 1917 1920 1923 1926 1929 1932 1935 1938 1941 1944 1947 1950 1953 1956 1959 1962 1965 1968 1971 1974 1977 1980 1983 1986 1989 1992 1995 1998 2001 2004 2007 2010 2013 2016 2019 2022 2025 2028 2031 2034 2037 2040 2043 2046 2049 2052 2055 2058 2061 2064 2067 2070 2073 2076 2079 2082 2085 2088 2091 2094 2097 2100 2103 2106 2109 2112 2115 2118 2121 2124 2127 2130 2133 2136 2139 2142 2145 2148 2151 2154 2157 2160 2163 2166 2169 2172 2175 2178 2181 2184 2187 2190 2193 2196 2199 2202 2205 2208 2211 2214 2217 2220 2223 2226 2229 2232 2235 2238 2241 2244 2247 2250 2253 2256 2259 2262 2265 2268 2271 2274 2277 2280 2283 2286 2289 2292 2295 2298 2301 2304 2307 2310 2313 2316 2319 2322 2325 2328 2331 2334 2337 2340 2343 2346 2349 2352 2355 2358 2361 2364 2367 2370 2373 2376 2379 2382 2385 2388 2391 2394 2397 2400 2403 2406 2409 2412 2415 2418 2421 2424 2427 2430 2433 2436 2439 2442 2445 2448 2451 2454 2457 2460 2463 2466 2469 2472 2475 2478 2481 2484 2487 2490 2493 2496 2499 2502 2505 2508 2511 2514 2517 2520 2523 2526 2529 2532 2535 2538 2541 2544 2547 2550 2553 2556 2559 2562 2565 2568 2571 2574 2577 2580 2583 2586 2589 2592 2595 2598 2601 2604 2607 2610 2613 2616 2619 2622 2625 2628 2631 2634 2637 2640 2643 2646 2649 2652 2655 2658 2661 2664 2667 2670 2673 2676 2679 2682 2685 2688 2691 2694 2697 2700 2703 2706 2709 2712 2715 2718 2721 2724 2727 2730 2733 2736 2739 2742 2745 2748 2751 2754 2757 2760 2763 2766 2769 2772 2775 2778 2781 2784 2787 2790 2793 2796 2799 2802 2805 2808 2811 2814 2817 2820 2823 2826 2829 2832 2835 2838 2841 2844 2847 2850 2853 2856 2859 2862 2865 2868 2871 2874 2877 2880 2883 2886 2889 2892 2895 2898 2901 2904 
				</DataArray>
			</Polys>
		</Piece>
	</PolyData>
</VTKFile>
