<?xml version="1.0"?>
<VTKFile type="PolyData" version="0.1" byte_order="LittleEndian" compressor="vtkZLibDataCompressor">
	<PolyData>
		<Piece NumberOfPoints="776" NumberOfVerts="0" NumberOfLines="0" NumberOfStrips="0" NumberOfPolys="1564">
		<PointData Normals="Normals">
		<DataArray type="Float32" Name="Normals" NumberOfComponents="3" format="ascii">
			-0.216178 -0.924951 0.312621
			-0.159308 -0.941121 0.298182
			-0.202290 -0.936326 0.287006
			-0.065748 -0.941354 0.330954
			-0.116284 -0.937522 0.327920
			-0.256507 -0.896150 0.362104
			-0.178418 -0.949414 0.258419
			-0.066142 -0.968379 0.240558
			-0.035799 -0.953980 0.297726
			-0.059664 -0.955063 0.290336
			-0.240960 -0.907983 0.342790
			-0.232245 -0.946432 0.224339
			-0.186501 -0.959166 0.212644
			-0.133477 -0.948726 0.286536
			-0.154853 -0.912023 0.379782
			0.029218 -0.949545 0.312268
			-0.135845 -0.924325 0.356609
			0.124779 -0.961825 0.243562
			-0.030980 -0.941407 0.335848
			-0.027354 -0.933557 0.357384
			-0.130869 -0.969643 0.206559
			-0.040509 -0.982513 0.181735
			0.054105 -0.979790 0.192571
			-0.367799 -0.856354 0.362466
			-0.296337 -0.881301 0.368094
			-0.168898 -0.959166 0.226879
			-0.171267 -0.967482 0.186134
			-0.309790 -0.926130 0.215204
			-0.367165 -0.881455 0.297032
			-0.117747 -0.925273 0.360562
			-0.273961 -0.863944 0.422548
			-0.075939 -0.949582 0.304183
			-0.225733 -0.923688 0.309588
			-0.029971 -0.941498 0.335683
			-0.113165 -0.933222 0.341014
			-0.287686 -0.892284 0.347944
			0.193953 -0.950172 0.244039
			0.118316 -0.963122 0.241657
			0.192718 -0.963126 0.187746
			0.226944 -0.943477 0.241553
			0.192830 -0.925822 0.325071
			-0.027781 -0.927505 0.372776
			-0.223901 -0.878876 0.421242
			0.219874 -0.948075 0.229804
			0.343349 -0.900888 0.265540
			-0.137807 -0.964360 0.225874
			0.032625 -0.980289 0.194859
			-0.094731 -0.964493 0.246536
			0.124348 -0.972250 0.198162
			0.135061 -0.973500 0.184542
			0.058225 -0.979308 0.193820
			0.162600 -0.973215 0.162521
			-0.696044 -0.668064 0.263084
			-0.738178 -0.595665 0.316663
			-0.714932 -0.575704 0.396784
			-0.141802 -0.953723 0.265150
			-0.199025 -0.952793 0.229290
			-0.419610 -0.871925 0.252338
			-0.627911 -0.737875 0.247525
			-0.267542 -0.882252 0.387366
			-0.336506 -0.838158 0.429250
			-0.631459 -0.717248 0.294642
			-0.547622 -0.801207 0.241200
			-0.477941 -0.768649 0.425149
			-0.769519 -0.597615 0.225159
			-0.124458 -0.937514 0.324926
			-0.840023 -0.498068 0.215151
			0.085778 -0.965965 0.244037
			0.179991 -0.955626 0.233199
			0.050815 -0.961447 0.270256
			0.059929 -0.966307 0.250320
			0.143868 -0.958753 0.245144
			0.176883 -0.928472 0.326575
			0.379792 -0.881612 0.280210
			-0.157606 -0.898215 0.410330
			-0.002081 -0.968850 0.247642
			0.264684 -0.929662 0.256266
			0.111060 -0.958114 0.263976
			0.416614 -0.874756 0.247455
			0.242914 -0.940207 0.238753
			0.121535 -0.966120 0.227686
			0.083288 -0.968398 0.235093
			0.001913 -0.927544 0.373709
			-0.168392 -0.942544 0.288539
			0.221951 -0.965607 0.135424
			0.186935 -0.940258 0.284554
			0.229719 -0.904762 0.358656
			0.185276 -0.970836 0.152154
			0.167147 -0.931513 0.323025
			0.128531 -0.956385 0.262314
			0.154260 -0.964562 0.214064
			0.199539 -0.952489 0.230106
			0.217667 -0.961998 0.164869
			-0.866266 -0.462654 0.188507
			-0.901739 -0.394491 0.176757
			-0.936089 -0.255649 0.241623
			-0.941600 -0.226399 0.249264
			-0.939158 -0.274165 0.206921
			-0.071016 -0.900111 0.429833
			-0.151548 -0.873012 0.463556
			-0.355167 -0.902617 0.243185
			-0.240917 -0.910969 0.334805
			-0.542567 -0.789053 0.288126
			-0.514595 -0.785222 0.344410
			-0.783065 -0.529352 0.326489
			-0.333463 -0.804957 0.490761
			-0.354793 -0.818955 0.451037
			-0.913802 -0.284940 0.289439
			-0.988280 -0.113484 0.102096
			-0.984183 0.005510 0.177070
			-0.968290 -0.179974 0.173275
			-0.603751 -0.638284 0.477576
			-0.887370 -0.318073 0.333774
			-0.961857 -0.192723 0.194136
			-0.991807 -0.095409 0.084950
			0.042665 -0.966659 0.252489
			0.060454 -0.963871 0.259420
			0.109422 -0.922189 0.370937
			0.334920 -0.878639 0.340326
			0.297342 -0.922427 0.246405
			0.394313 -0.870556 0.294361
			-0.288971 -0.838594 0.461797
			-0.056227 -0.909692 0.411460
			0.484644 -0.871136 0.079009
			0.054523 -0.971701 0.229837
			0.202647 -0.966493 0.157560
			-0.080796 -0.948755 0.305511
			0.537044 -0.839110 -0.086481
			0.191647 -0.827551 0.527665
			0.084121 -0.762963 0.640945
			-0.147201 -0.870504 0.469633
			-0.219709 -0.669842 0.709253
			0.296268 -0.818498 0.492226
			0.253200 -0.924323 0.285510
			0.301650 -0.714885 0.630830
			0.287279 -0.951005 0.114283
			0.126524 -0.949339 0.287657
			0.368897 -0.911176 0.183506
			0.187282 -0.955980 0.225892
			0.242345 -0.934814 0.259597
			0.509175 -0.856414 0.085409
			0.498892 -0.859809 0.108790
			0.523054 -0.841781 0.133490
			0.471507 -0.876262 0.099224
			-0.967839 -0.213917 0.132393
			-0.902659 -0.338125 0.266231
			-0.994812 -0.080008 0.062830
			-0.997993 0.058519 0.024179
			-0.996974 0.037250 0.068236
			-0.067782 -0.537799 0.840344
			-0.281888 -0.788748 0.546275
			-0.086076 -0.629391 0.772307
			-0.116681 -0.568920 0.814074
			-0.449849 -0.806617 0.383412
			-0.705491 -0.564959 0.427907
			-0.886919 -0.289515 0.359938
			-0.952985 -0.184879 0.240083
			-0.232715 -0.812954 0.533806
			-0.104382 -0.861698 0.496569
			-0.394916 -0.730770 0.556791
			-0.964929 0.262487 0.003546
			-0.993992 0.108313 0.015759
			-0.975787 0.217812 -0.019928
			-0.984391 0.126710 0.122141
			-0.959167 0.280762 0.034232
			-0.887927 -0.275195 0.368584
			-0.875802 -0.234664 0.421787
			-0.975286 0.173297 0.137057
			-0.987777 0.089863 0.127362
			0.199083 -0.898061 0.392240
			0.418547 -0.837056 0.352357
			0.395058 -0.827767 0.398411
			0.552085 -0.832767 0.041245
			0.611040 -0.745921 0.265013
			0.604187 -0.768528 0.210530
			0.579522 -0.803837 0.134166
			0.149282 -0.888169 0.434592
			0.616085 -0.785261 -0.061676
			0.815627 -0.565190 -0.123747
			0.888340 -0.358020 -0.287531
			0.933547 -0.266669 -0.239536
			0.901281 -0.291933 -0.320106
			0.907524 -0.242243 -0.343102
			0.194812 -0.545289 0.815296
			-0.192355 -0.469473 0.861739
			-0.093368 -0.265094 0.959691
			0.386510 -0.621251 0.681658
			0.412749 -0.761867 0.499196
			0.401622 -0.904539 0.143210
			0.546730 -0.801561 0.242045
			0.308690 -0.314985 0.897494
			0.420794 -0.335614 0.842791
			0.519036 -0.849239 0.096923
			0.693666 -0.717986 -0.057659
			0.863307 -0.452282 -0.223924
			0.749755 -0.657584 -0.073833
			0.847159 -0.529221 -0.047404
			0.749583 -0.651771 -0.115417
			0.821936 -0.540440 -0.179851
			0.738230 -0.673311 0.040866
			-0.980391 0.127590 0.150177
			-0.974952 0.222343 -0.005681
			-0.971698 0.217578 -0.091995
			-0.970124 0.241798 -0.019810
			-0.955339 0.278340 -0.099272
			-0.884827 0.447225 -0.130659
			-0.009517 -0.152943 0.988189
			-0.145894 -0.128634 0.980902
			0.010166 -0.184335 0.982811
			-0.289495 -0.534669 0.793928
			-0.582172 -0.608014 0.539810
			-0.438190 -0.493450 0.751330
			-0.122775 -0.127241 0.984244
			-0.815232 -0.171051 0.553297
			-0.943520 0.070538 0.323720
			-0.848684 0.231987 0.475308
			-0.141340 -0.820730 0.553557
			-0.205764 -0.805791 0.555303
			0.079218 -0.885966 0.456934
			0.097790 -0.876713 0.470968
			-0.311441 -0.755177 0.576812
			-0.544040 -0.617019 0.568602
			-0.853735 0.509223 -0.108760
			-0.905016 0.417076 -0.083625
			-0.884495 0.435486 -0.167392
			-0.950127 0.300222 -0.084412
			-0.939603 0.341730 0.019172
			-0.672125 -0.499398 0.546672
			-0.956624 0.241858 0.162404
			-0.909187 0.415490 -0.027341
			-0.857386 0.509977 -0.069374
			0.283099 -0.867619 0.408770
			0.665989 -0.668160 0.331694
			0.553188 -0.713699 0.429672
			0.312331 -0.843682 0.436634
			0.846043 -0.526250 -0.085272
			0.852448 -0.502280 0.145077
			0.799974 -0.599514 0.024989
			0.890360 -0.455238 0.004231
			0.223075 -0.836456 0.500578
			0.889143 -0.245401 -0.386268
			0.865249 -0.433084 -0.252551
			0.898199 0.105820 -0.426661
			0.924606 0.022973 -0.380232
			0.950464 -0.089600 -0.297639
			0.888911 0.173644 -0.423893
			-0.209392 0.103392 0.972350
			0.120754 0.244292 0.962154
			0.203250 -0.170989 0.964081
			0.455090 -0.432314 0.778459
			0.527643 -0.135795 0.838542
			0.639771 -0.636290 0.431078
			0.790417 -0.597391 0.135515
			0.414935 0.018858 0.909656
			0.540160 0.081932 0.837565
			0.892009 -0.016576 -0.451713
			0.912854 -0.211486 -0.349245
			0.890041 -0.140237 -0.433775
			0.878593 0.045820 -0.475369
			0.958725 -0.218451 -0.182007
			0.872000 -0.480958 -0.091076
			0.908094 -0.357673 -0.217795
			0.967182 -0.252378 -0.029396
			-0.903001 0.425261 0.061172
			-0.886047 0.388320 0.253235
			-0.908588 0.398354 -0.125626
			-0.859800 0.505890 -0.069419
			-0.841799 0.510787 -0.174560
			-0.850889 0.499461 -0.162871
			-0.677341 0.670946 -0.301730
			-0.680178 0.691635 -0.242898
			-0.050231 0.265113 0.962908
			-0.275623 0.440368 0.854464
			-0.029902 0.162722 0.986219
			-0.322169 -0.147624 0.935101
			-0.676378 -0.337085 0.654894
			-0.458498 -0.053358 0.887092
			0.002553 0.512980 0.858397
			-0.241888 0.148937 0.958806
			-0.689509 0.147749 0.709047
			-0.610138 0.368801 0.701225
			-0.677997 0.181966 0.712186
			-0.848460 0.428070 0.311243
			-0.735279 0.407290 0.541737
			-0.618696 0.420650 0.663528
			0.048243 -0.853629 0.518642
			-0.169573 -0.763859 0.622707
			-0.362559 -0.671691 0.646052
			-0.745758 0.636436 -0.196961
			-0.702042 0.669905 -0.241588
			-0.632587 0.724492 -0.273760
			-0.705776 0.679624 -0.199981
			-0.688987 0.695738 -0.203091
			-0.702825 0.683809 -0.196065
			-0.760850 0.607453 -0.228271
			-0.869061 -0.128426 0.477745
			-0.936815 0.347021 0.044207
			-0.757578 0.618112 -0.209796
			-0.771872 0.625396 -0.114427
			-0.795483 0.592931 -0.125061
			-0.695247 0.683350 -0.222854
			0.933957 -0.342600 0.101731
			0.449497 -0.697483 0.558096
			0.918495 -0.335041 0.210032
			0.984279 -0.150446 -0.092524
			0.968012 -0.219582 -0.121392
			0.938251 0.138128 -0.317185
			0.110473 -0.811675 0.573567
			0.195388 -0.752134 0.629379
			0.257729 -0.764826 0.590438
			0.829903 0.216467 -0.514202
			0.765299 0.394548 -0.508576
			0.865077 0.236427 -0.442429
			0.715237 0.492182 -0.496179
			0.779202 0.392188 -0.488910
			0.872054 0.290499 -0.393868
			0.814293 0.336224 -0.473159
			0.732092 0.470774 -0.492355
			-0.124521 0.694945 0.708199
			0.494838 0.553048 0.670278
			0.270427 0.758078 0.593453
			0.576840 -0.354966 0.735700
			0.395137 0.319036 0.861442
			0.432051 0.097518 0.896561
			0.497605 0.535810 0.682127
			0.863387 -0.427929 0.267282
			0.782947 -0.362152 0.505807
			0.982072 -0.165157 0.090869
			0.818269 0.250631 -0.517320
			0.930096 0.019544 -0.366797
			0.904496 -0.033493 -0.425165
			0.861579 0.096002 -0.498463
			0.882858 0.026327 -0.468901
			0.848067 0.162937 -0.504216
			0.873386 0.098962 -0.476867
			0.977321 0.191834 -0.089682
			0.932505 0.225285 -0.282277
			0.973752 0.217839 0.065975
			-0.821390 0.556529 0.124877
			-0.794624 0.570012 -0.208949
			-0.760088 0.635581 -0.135292
			-0.668083 0.701926 -0.246911
			-0.594680 0.737147 -0.320891
			-0.588446 0.722396 -0.363146
			-0.603917 0.709876 -0.362437
			-0.693449 0.648759 -0.313433
			-0.573443 0.766546 -0.289085
			-0.100784 0.727571 0.678589
			-0.253393 0.725872 0.639455
			-0.296627 0.409222 0.862873
			0.120515 0.682845 0.720555
			0.140758 0.651989 0.745049
			-0.824705 0.502219 0.260072
			-0.771070 0.450455 0.450046
			-0.358938 0.496102 0.790599
			0.077670 -0.850001 0.521023
			0.003251 -0.806886 0.590698
			-0.138717 -0.718090 0.681986
			-0.356947 -0.631135 0.688664
			-0.541199 0.785766 -0.299459
			-0.539691 0.793426 -0.281440
			-0.363248 0.866906 -0.341358
			-0.515125 0.798785 -0.310787
			-0.472252 0.813801 -0.338683
			-0.489302 0.820842 -0.294622
			-0.897719 0.152799 0.413223
			-0.524351 -0.459550 0.716847
			-0.815925 0.551123 0.174729
			-0.785046 0.619061 -0.021591
			-0.778888 0.620173 -0.093374
			-0.529940 0.781488 -0.329303
			-0.538784 0.772810 -0.335376
			-0.605113 0.740809 -0.291616
			-0.617624 0.752164 -0.229760
			-0.439297 0.832902 -0.336588
			0.995309 0.013087 -0.095859
			0.975613 -0.024356 -0.218141
			0.926943 0.193473 -0.321474
			0.858520 -0.387814 0.335474
			0.268446 -0.691966 0.670164
			0.577517 -0.600059 0.553537
			0.985692 0.150855 -0.075188
			0.966804 0.221831 -0.126808
			0.924509 0.221895 -0.309911
			0.768902 0.470365 -0.433067
			0.754135 0.453951 -0.474561
			0.771431 0.425619 -0.473016
			0.072930 -0.824599 0.560998
			0.076301 -0.757759 0.648058
			0.735599 0.421046 -0.530673
			0.608783 0.588979 -0.531495
			0.580435 0.632634 -0.512708
			0.657958 0.554370 -0.509671
			0.500241 0.701115 -0.508131
			0.469093 0.708571 -0.527142
			0.697547 0.519415 -0.493595
			0.647602 0.551118 -0.526195
			0.670852 0.535042 -0.513505
			0.563416 0.665198 -0.489973
			0.032699 0.777740 0.627735
			0.394788 0.722757 0.567243
			0.439583 0.733770 0.518023
			0.525104 0.726032 0.444008
			0.669681 0.237734 0.703569
			0.295082 0.639820 0.709617
			0.250253 0.757266 0.603259
			0.923201 0.075082 0.376912
			0.683113 0.459905 -0.567313
			0.704909 0.406308 -0.581392
			0.802044 0.336315 -0.493577
			0.782500 0.284386 -0.553912
			0.928383 0.356048 -0.106465
			0.915218 0.394769 -0.080828
			0.873138 0.454745 -0.175606
			0.753045 0.531724 -0.387548
			0.957287 0.282328 0.062392
			0.725554 0.445812 0.524236
			-0.754553 0.643424 0.129059
			-0.650076 0.701444 -0.292193
			-0.674581 0.704975 -0.218974
			-0.692447 0.719501 -0.053254
			-0.464973 0.777962 -0.422581
			-0.412513 0.827452 -0.380993
			-0.603827 0.740213 -0.295767
			-0.461921 0.824219 -0.327555
			-0.111303 0.663543 0.739813
			-0.203882 0.514171 0.833103
			0.102728 0.559759 0.822263
			0.032655 0.560491 0.827517
			0.120898 0.476608 0.870763
			-0.478953 0.581469 0.657646
			0.111745 -0.800394 0.588967
			-0.262339 -0.615894 0.742868
			0.068656 -0.753102 0.654312
			-0.097441 -0.640826 0.761477
			-0.406067 0.846160 -0.345142
			-0.165508 0.906597 -0.388188
			-0.204538 0.900175 -0.384511
			-0.371403 0.854810 -0.362436
			-0.101138 0.900992 -0.421882
			-0.234408 0.872299 -0.429124
			-0.193185 0.901346 -0.387629
			-0.299993 0.887823 -0.348961
			-0.218296 0.879487 -0.422907
			-0.299789 0.858120 -0.416842
			-0.243469 0.875038 -0.418368
			-0.693922 -0.297202 0.655853
			-0.908484 0.375840 0.182757
			-0.958824 0.231364 0.164705
			-0.623892 0.773219 -0.113537
			-0.874199 0.485255 0.017404
			-0.420392 0.856715 -0.298847
			-0.291682 0.855824 -0.427184
			-0.372820 0.834956 -0.404788
			-0.229010 0.855993 -0.463499
			-0.333738 0.826445 -0.453439
			-0.380246 0.825683 -0.416727
			0.869502 0.343217 -0.355201
			0.754867 0.487063 -0.439255
			0.981484 -0.145822 0.124194
			0.885138 -0.413835 0.212771
			0.086364 -0.670164 0.737172
			0.339107 -0.613245 0.713399
			0.576347 -0.644527 0.502402
			0.994514 -0.009790 -0.104149
			0.908963 0.265728 -0.321210
			0.877107 0.419231 -0.234368
			0.905996 0.388870 -0.167186
			0.829696 0.465350 -0.308310
			0.678664 0.554133 -0.482029
			0.635985 0.589366 -0.498167
			0.539869 0.684227 -0.490280
			0.523983 0.670997 -0.524601
			0.034231 -0.780268 0.624508
			-0.009775 -0.772905 0.634446
			-0.114634 -0.752337 0.648728
			0.607691 0.576636 -0.546079
			0.417074 0.752295 -0.510001
			0.381865 0.773777 -0.505419
			0.334261 0.785343 -0.521063
			0.334266 0.779276 -0.530090
			0.331491 0.798347 -0.502749
			0.479734 0.658144 -0.580260
			0.301548 0.754899 -0.582406
			0.458850 0.672350 -0.580863
			0.522474 0.634333 -0.569775
			0.479335 0.694363 -0.536747
			0.458846 0.701112 -0.545805
			0.517460 0.668925 -0.533644
			0.460091 0.592494 0.661262
			0.439562 0.540602 0.717310
			0.223377 0.702129 0.676105
			0.748788 0.398052 0.529973
			0.185069 0.543670 0.818640
			0.525431 0.624302 -0.578074
			0.528328 0.607641 -0.592995
			0.641773 0.538270 -0.546254
			0.828715 0.475915 -0.294509
			0.911115 0.306495 -0.275556
			0.954121 0.284722 -0.092664
			0.580456 0.622874 -0.524499
			0.889549 0.342063 0.302811
			0.456495 0.473625 0.753188
			-0.642977 0.761598 -0.080923
			-0.557224 0.827341 -0.070773
			-0.604597 0.779541 0.163641
			-0.340296 0.813781 -0.471125
			-0.212210 0.841999 -0.495988
			-0.345229 0.848421 -0.401246
			-0.464668 0.842004 -0.274066
			-0.191159 0.386682 0.902183
			-0.223981 0.198273 0.954212
			0.246674 0.006082 0.969079
			0.413651 0.345895 0.842170
			0.115700 0.348370 0.930189
			0.137698 0.252259 0.957812
			-0.492461 0.845369 0.206960
			-0.336191 0.625497 0.704081
			0.193064 -0.778723 0.596923
			0.117144 -0.793049 0.597788
			-0.397407 -0.506756 0.765027
			0.157849 -0.748589 0.643970
			-0.143601 -0.611691 0.777954
			0.061513 -0.722413 0.688720
			-0.050314 0.897770 -0.437581
			0.035727 0.895581 -0.443463
			-0.247115 0.885753 -0.392908
			-0.104258 0.876665 -0.469668
			0.033803 0.854876 -0.517730
			0.136164 0.848692 -0.511060
			-0.093363 0.892563 -0.441151
			-0.033427 0.870466 -0.491093
			0.035872 0.873537 -0.485435
			-0.062284 0.867430 -0.493645
			-0.717820 -0.373658 0.587464
			-0.896963 -0.029885 0.441094
			-0.944741 0.323754 -0.051460
			-0.942126 0.334421 0.023671
			-0.703170 0.689014 -0.175533
			-0.967103 -0.040780 0.251093
			-0.310486 0.886050 -0.344259
			-0.172718 0.853909 -0.490926
			-0.223930 0.896937 -0.381262
			0.006859 0.870335 -0.492412
			0.035537 0.844698 -0.534062
			-0.126479 0.835726 -0.534383
			-0.277076 0.833288 -0.478393
			-0.104475 0.832062 -0.544755
			-0.095856 0.820487 -0.563571
			0.719039 0.558955 -0.412980
			0.977441 -0.145905 -0.152711
			0.820156 -0.529195 0.217480
			0.944903 -0.309243 -0.107366
			0.157365 -0.746033 0.647048
			0.346540 -0.699427 0.625070
			0.386609 -0.759220 0.523563
			0.914280 0.133308 -0.382520
			0.826739 0.263133 -0.497256
			0.827769 0.420642 -0.371293
			0.819078 0.531828 -0.215104
			0.589653 0.732205 -0.340858
			0.692905 0.650895 -0.310191
			0.421990 0.701391 -0.574434
			0.384100 0.826938 -0.410658
			0.191937 0.846589 -0.496435
			0.189852 0.779370 -0.597109
			0.295098 0.787475 -0.541110
			0.220694 0.820694 -0.527025
			-0.011660 -0.812864 0.582337
			-0.205031 -0.856339 0.473969
			-0.114905 -0.829890 0.545967
			0.179732 0.853450 -0.489203
			0.282560 0.822455 -0.493688
			0.260776 0.802951 -0.535972
			0.143952 0.862697 -0.484800
			0.246702 0.829641 -0.500834
			0.265524 0.820537 -0.506179
			0.239269 0.827580 -0.507801
			0.176535 0.868807 -0.462612
			0.533184 0.591206 -0.605137
			0.482508 0.611227 -0.627366
			0.083362 0.796183 -0.599286
			0.174944 0.735014 -0.655094
			0.567651 0.621170 -0.540296
			0.327779 0.712137 -0.620823
			0.536288 0.593197 -0.600427
			0.315251 0.485073 0.815672
			0.805983 0.544903 -0.231239
			0.795560 0.583225 0.164114
			0.538143 0.616113 -0.575159
			0.615753 0.636814 -0.464021
			0.650674 0.664534 0.367449
			0.315897 0.263140 0.911574
			0.340965 0.354801 0.870551
			-0.337021 0.921700 -0.192056
			-0.333016 0.941934 0.043142
			-0.171142 0.807729 -0.564167
			-0.310178 0.875709 -0.370031
			-0.164473 0.796367 -0.582020
			-0.184555 0.860352 -0.475115
			-0.052644 0.831328 -0.553283
			-0.267868 -0.015173 0.963336
			-0.099413 0.127886 0.986794
			-0.134370 0.036955 0.990242
			0.409865 0.099480 0.906705
			0.492161 -0.154010 0.856772
			0.427424 -0.216267 0.877803
			0.217394 -0.002329 0.976081
			0.175159 0.235650 0.955923
			-0.012526 0.189798 0.981743
			0.169793 0.080600 0.982178
			-0.319008 0.622318 0.714810
			-0.371157 0.843833 0.387542
			0.141954 -0.837219 0.528122
			-0.294115 -0.684890 0.666650
			0.110696 -0.867402 0.485139
			0.083831 0.879402 -0.468641
			-0.601452 -0.656338 0.455495
			-0.864006 0.490873 -0.111972
			-0.830075 0.533743 -0.161538
			-0.995778 0.085860 -0.032468
			-0.994574 0.013854 0.103107
			-0.916786 0.399376 -0.001763
			-0.970130 0.228356 -0.081865
			-0.500738 0.767277 -0.400683
			-0.313565 0.828203 -0.464497
			-0.315561 0.879174 -0.357037
			-0.702262 -0.662605 0.260350
			-0.120504 0.890952 -0.437817
			-0.124433 0.874562 -0.468677
			-0.040254 0.865421 -0.499426
			-0.072194 0.829645 -0.553604
			-0.082723 0.833951 -0.545603
			0.138196 0.829258 -0.541510
			0.012473 0.819445 -0.573023
			0.254456 0.769974 -0.585143
			-0.034603 0.814256 -0.579473
			-0.004302 0.824486 -0.565866
			0.915919 -0.088975 -0.391378
			0.875984 -0.420645 -0.236027
			0.524901 -0.801273 0.287125
			0.008580 -0.934380 0.356173
			0.855550 0.119935 -0.503636
			0.426725 0.780157 -0.457451
			0.855501 0.068663 -0.513228
			0.738568 0.334374 -0.585416
			0.501199 0.671758 -0.545473
			0.264767 0.869612 -0.416740
			0.164118 0.868444 -0.467836
			0.057090 0.814727 -0.577028
			0.038333 0.852083 -0.522001
			-0.040408 -0.899891 0.434240
			-0.287293 -0.885020 0.366337
			-0.232681 -0.943882 0.234407
			-0.044745 0.803584 -0.593507
			-0.071707 0.789927 -0.608993
			0.004592 0.767821 -0.640648
			0.087866 0.748066 -0.657782
			0.550779 0.713048 -0.433826
			0.683794 0.724738 -0.084732
			0.633059 0.733295 -0.248022
			0.162176 0.804327 -0.571627
			0.237512 0.838191 -0.490942
			0.632691 0.692628 0.346364
			0.332038 0.048502 0.942018
			0.591848 0.184359 0.784683
			-0.199404 0.939522 -0.278454
			-0.307302 0.834149 0.457997
			-0.214865 0.950405 0.224864
			-0.160245 0.984157 -0.075870
			-0.017486 0.806754 -0.590629
			0.010156 0.856905 -0.515373
			0.001563 0.913843 -0.406065
			-0.311325 0.323071 0.893701
			-0.158170 0.093825 0.982944
			-0.205012 0.486993 0.849004
			0.011864 0.717627 0.696327
			0.433223 0.474618 0.766195
			0.639342 0.125425 0.758624
			0.057301 -0.946301 0.318167
			-0.081478 -0.953932 0.288746
			0.098444 -0.977916 0.184360
			-0.803418 0.475552 -0.358287
			-0.946172 -0.230308 -0.227412
			-0.849711 -0.526868 0.020034
			-0.944543 0.043663 -0.325472
			-0.402743 0.711167 -0.576228
			-0.159929 0.723268 -0.671794
			-0.089690 0.803459 -0.588565
			-0.096839 0.878746 -0.467361
			-0.255769 -0.964501 0.065721
			0.009236 0.847101 -0.531352
			0.009639 0.820568 -0.571467
			0.345697 -0.901513 -0.260322
			0.803089 -0.415619 -0.426976
			0.470953 -0.868822 0.152813
			0.461732 -0.884541 -0.066261
			0.924338 0.001030 -0.381573
			0.080187 -0.968924 0.233999
			0.131324 0.833221 -0.537118
			0.084566 0.824650 -0.559287
			0.860317 0.137344 -0.490908
			0.414998 0.587431 -0.694767
			-0.176122 -0.956620 0.232075
			-0.068386 -0.957963 0.278623
			0.027715 -0.999585 -0.007852
			-0.193693 -0.980768 0.024033
			-0.326480 -0.940284 -0.096318
			0.537129 0.817014 -0.209714
			0.203270 0.891672 -0.404478
			0.464023 0.885814 0.003960
			0.611337 0.779153 0.138518
			0.688981 0.634391 0.350504
			0.603689 0.681944 0.412931
			-0.004869 0.972600 -0.232432
			0.000788 0.989935 0.141523
			0.313347 0.874899 0.369278
			0.211418 0.895983 0.390534
			0.263245 0.952558 0.152757
			-0.117369 -0.991476 0.056563
			0.035340 -0.997846 0.055258
			0.009717 -0.986679 -0.162387
			-0.680001 0.226795 -0.697254
			-0.356565 0.555266 -0.751359
			-0.623724 -0.678325 -0.388386
			-0.622959 -0.316185 -0.715506
			-0.444945 -0.881827 -0.156223
			-0.126633 0.514290 -0.848216
			-0.035591 0.679247 -0.733046
			-0.026639 -0.988693 -0.147566
			-0.145691 -0.973753 -0.174871
			0.018947 0.793869 -0.607793
			0.057790 0.790038 -0.610328
			0.005538 0.754873 -0.655847
			-0.062891 0.680987 -0.729590
			0.326066 -0.807847 -0.490982
			-0.256994 -0.941233 -0.219170
			0.723570 -0.436158 -0.534989
			0.912574 -0.007499 -0.408843
			0.780852 0.231939 -0.580065
			0.211072 0.354944 -0.910749
			0.073970 0.660227 -0.747415
			-0.315806 -0.948664 0.017427
			-0.254830 -0.955273 -0.150051
			-0.196694 -0.908012 -0.369900
			-0.214516 -0.725521 -0.653913
			-0.446312 -0.619059 -0.646197
			-0.015003 0.887037 -0.461454
			0.170553 0.982605 -0.073474
			0.154682 0.985744 0.066193
			-0.111030 -0.935177 -0.336328
			-0.168134 -0.916336 -0.363399
			-0.023886 -0.912658 -0.408026
			-0.051508 -0.917601 -0.394151
			-0.232204 0.093297 -0.968182
			-0.194106 -0.750529 -0.631687
			-0.158516 -0.358229 -0.920079
			-0.146216 0.339873 -0.929036
			-0.093480 0.636048 -0.765967
			-0.131207 0.536980 -0.833329
			-0.098221 0.592415 -0.799623
			0.099643 -0.602369 -0.791974
			0.618891 -0.397848 -0.677267
			0.818658 -0.284413 -0.498907
			0.650318 0.033905 -0.758905
			-0.077887 0.571059 -0.817206
			0.053393 -0.232191 -0.971204
			-0.289270 0.017716 -0.957083
			-0.190803 0.365801 -0.910925
			-0.396317 -0.296079 -0.869063
			-0.077704 -0.150341 -0.985576
			-0.387523 -0.030859 -0.921344
			-0.337837 -0.160787 -0.927369
			-0.139490 0.301862 -0.943092
			-0.325182 0.174941 -0.929329
			-0.000000 -0.000000 1.000000
		</DataArray>
	</PointData>
	<Points>
		<DataArray type="Float32" NumberOfComponents="3" format="ascii">
			0.016331 -0.086997 0.034660
			0.015484 -0.087264 0.033163
			0.016471 -0.088003 0.031662
			0.016855 -0.086948 0.035141
			0.014882 -0.086821 0.034186
			0.016172 -0.086754 0.035213
			0.015288 -0.087692 0.031657
			0.014563 -0.087682 0.031422
			0.014770 -0.087107 0.033351
			0.014090 -0.087546 0.031764
			0.017074 -0.087767 0.032616
			0.015751 -0.087943 0.031138
			0.016622 -0.088307 0.030705
			0.017433 -0.088161 0.031697
			0.016728 -0.086624 0.035937
			0.017553 -0.086568 0.035994
			0.017210 -0.087425 0.033582
			0.014225 -0.087140 0.033291
			0.015518 -0.086365 0.035598
			0.015731 -0.085829 0.037030
			0.014774 -0.087865 0.030647
			0.013979 -0.087985 0.029650
			0.013232 -0.087801 0.030863
			0.017134 -0.087608 0.033108
			0.018082 -0.087866 0.032511
			0.014962 -0.088150 0.029337
			0.015632 -0.088438 0.028669
			0.017336 -0.088589 0.029479
			0.017813 -0.088540 0.030617
			0.017416 -0.086211 0.037199
			0.016715 -0.086076 0.037025
			0.018444 -0.086300 0.036882
			0.018810 -0.086005 0.037947
			0.017580 -0.086909 0.035001
			0.018320 -0.086625 0.035903
			0.018630 -0.087171 0.034390
			0.014571 -0.086569 0.035283
			0.013333 -0.087269 0.033520
			0.013603 -0.087338 0.032917
			0.015149 -0.086017 0.036643
			0.015685 -0.085469 0.038015
			0.016377 -0.085098 0.038869
			0.016528 -0.085343 0.038398
			0.014216 -0.086275 0.036962
			0.015039 -0.085671 0.037935
			0.014462 -0.088134 0.029061
			0.013168 -0.088086 0.029045
			0.013906 -0.088299 0.028053
			0.013116 -0.087515 0.032508
			0.012399 -0.087941 0.029884
			0.012408 -0.087664 0.032057
			0.012094 -0.087754 0.031624
			0.018275 -0.088590 0.031133
			0.018405 -0.088517 0.031667
			0.018676 -0.088186 0.032617
			0.014608 -0.088444 0.028121
			0.016006 -0.088601 0.027898
			0.017640 -0.088905 0.029026
			0.018357 -0.089007 0.030180
			0.017371 -0.085710 0.038333
			0.016887 -0.085679 0.037950
			0.018676 -0.087021 0.034999
			0.019042 -0.085819 0.038888
			0.019205 -0.085555 0.039898
			0.019345 -0.086452 0.037810
			0.018345 -0.086820 0.035420
			0.018921 -0.087611 0.034021
			0.013430 -0.087000 0.034452
			0.014026 -0.086703 0.035459
			0.012868 -0.087096 0.034092
			0.012664 -0.087410 0.033119
			0.013926 -0.086575 0.035996
			0.015984 -0.084744 0.039915
			0.015381 -0.085054 0.039609
			0.016784 -0.084752 0.039787
			0.012498 -0.086574 0.036232
			0.014323 -0.085976 0.037960
			0.013964 -0.086158 0.037532
			0.014827 -0.085399 0.039467
			0.014597 -0.085634 0.038903
			0.012509 -0.088452 0.027779
			0.013078 -0.088409 0.027595
			0.013306 -0.088531 0.027095
			0.014088 -0.088497 0.027545
			0.011463 -0.088165 0.029973
			0.011089 -0.088567 0.028133
			0.011526 -0.088685 0.027488
			0.010849 -0.088356 0.029550
			0.012184 -0.088606 0.027327
			0.011940 -0.087411 0.033316
			0.010915 -0.087957 0.031949
			0.011533 -0.087753 0.032426
			0.010587 -0.088183 0.030941
			0.018647 -0.089585 0.029898
			0.018664 -0.089306 0.030766
			0.018924 -0.088935 0.032452
			0.018949 -0.088585 0.032827
			0.018996 -0.087971 0.033633
			0.015671 -0.088709 0.027418
			0.014998 -0.088801 0.027083
			0.016778 -0.088832 0.027857
			0.016298 -0.088797 0.027447
			0.017855 -0.089157 0.028549
			0.017597 -0.089209 0.028022
			0.018151 -0.089591 0.028173
			0.018352 -0.085199 0.040020
			0.017493 -0.085439 0.038901
			0.019203 -0.086845 0.036500
			0.019207 -0.087812 0.035698
			0.019471 -0.087415 0.037423
			0.019608 -0.086774 0.038801
			0.019828 -0.084752 0.041642
			0.019751 -0.085947 0.040057
			0.019377 -0.086938 0.037133
			0.019135 -0.088323 0.034438
			0.013227 -0.086823 0.035065
			0.012629 -0.086985 0.034663
			0.016785 -0.084140 0.041205
			0.015498 -0.084533 0.041067
			0.014198 -0.085489 0.040082
			0.014356 -0.085280 0.040527
			0.017899 -0.085094 0.039821
			0.017236 -0.083972 0.041627
			0.012587 -0.086236 0.037811
			0.012216 -0.086663 0.035732
			0.012266 -0.086459 0.036801
			0.012136 -0.086826 0.035248
			0.013253 -0.085690 0.039764
			0.012369 -0.088799 0.026817
			0.012930 -0.088763 0.026700
			0.014036 -0.088644 0.027046
			0.013435 -0.088810 0.026648
			0.010936 -0.088895 0.027509
			0.010378 -0.088632 0.028248
			0.011747 -0.088946 0.026874
			0.010340 -0.088388 0.029907
			0.011353 -0.087497 0.033392
			0.011197 -0.087191 0.034428
			0.011596 -0.086890 0.035083
			0.010732 -0.087693 0.033017
			0.010330 -0.088098 0.031532
			0.010367 -0.087907 0.032611
			0.010218 -0.088024 0.032107
			0.009553 -0.088686 0.030056
			0.018835 -0.090188 0.029648
			0.018631 -0.090016 0.028969
			0.018945 -0.090167 0.030677
			0.018965 -0.089672 0.032311
			0.019050 -0.089354 0.033301
			0.015205 -0.089420 0.026381
			0.016206 -0.089014 0.026922
			0.015824 -0.089254 0.026536
			0.014513 -0.089246 0.026416
			0.016946 -0.089044 0.027421
			0.018057 -0.089800 0.027718
			0.018339 -0.090188 0.027920
			0.018798 -0.090613 0.028994
			0.019655 -0.084058 0.042488
			0.017898 -0.083826 0.042029
			0.019769 -0.084360 0.042059
			0.019307 -0.088042 0.037245
			0.019133 -0.088748 0.034710
			0.019152 -0.088684 0.035268
			0.019707 -0.086817 0.039414
			0.019473 -0.087455 0.038652
			0.020060 -0.085276 0.041387
			0.020252 -0.085168 0.041891
			0.019931 -0.086500 0.040983
			0.019792 -0.086574 0.039849
			0.016319 -0.083965 0.041776
			0.015184 -0.084435 0.041660
			0.015215 -0.083801 0.043059
			0.013611 -0.085557 0.040301
			0.014562 -0.084453 0.042376
			0.014149 -0.085019 0.041601
			0.013989 -0.085277 0.041072
			0.016445 -0.083322 0.043154
			0.011796 -0.086708 0.036433
			0.012648 -0.086153 0.038955
			0.012023 -0.087161 0.037892
			0.012210 -0.086920 0.038309
			0.012999 -0.086564 0.040362
			0.012753 -0.086348 0.039664
			0.012444 -0.089161 0.026433
			0.013229 -0.089189 0.026322
			0.012990 -0.090062 0.025998
			0.010703 -0.089331 0.027097
			0.009745 -0.089007 0.027988
			0.009784 -0.088665 0.028969
			0.009400 -0.088960 0.028617
			0.011715 -0.089947 0.026279
			0.011111 -0.089584 0.026673
			0.009552 -0.088752 0.029514
			0.011104 -0.087199 0.035053
			0.010572 -0.087703 0.034255
			0.009471 -0.088731 0.030806
			0.009766 -0.088635 0.032570
			0.009550 -0.088667 0.031422
			0.009600 -0.088833 0.032122
			0.009087 -0.089089 0.029469
			0.018786 -0.091165 0.029071
			0.018890 -0.091071 0.030202
			0.018895 -0.090611 0.031321
			0.018907 -0.089922 0.033231
			0.018770 -0.090690 0.032390
			0.018731 -0.090612 0.032950
			0.014723 -0.089793 0.026269
			0.014024 -0.090087 0.026158
			0.015399 -0.090002 0.026167
			0.016487 -0.089469 0.026562
			0.017443 -0.089578 0.027076
			0.017091 -0.089773 0.026657
			0.015912 -0.090029 0.026174
			0.018229 -0.090422 0.027484
			0.018599 -0.090712 0.028211
			0.018452 -0.091134 0.027902
			0.018211 -0.083334 0.042868
			0.019777 -0.083807 0.042910
			0.017387 -0.082826 0.043888
			0.017183 -0.083292 0.043013
			0.020134 -0.083603 0.043324
			0.020443 -0.084017 0.042933
			0.019074 -0.088557 0.037612
			0.019083 -0.088711 0.036504
			0.018770 -0.090021 0.034296
			0.018912 -0.089847 0.033792
			0.019491 -0.087416 0.039228
			0.020741 -0.083904 0.043415
			0.020608 -0.084784 0.042794
			0.020087 -0.086222 0.041987
			0.019472 -0.087469 0.040471
			0.016226 -0.083564 0.042740
			0.014588 -0.083816 0.043776
			0.014664 -0.082992 0.045048
			0.015549 -0.083237 0.043850
			0.013414 -0.085840 0.041040
			0.014327 -0.084465 0.043026
			0.013985 -0.085070 0.042264
			0.014077 -0.084928 0.042760
			0.015814 -0.082698 0.044668
			0.011374 -0.087195 0.036212
			0.011148 -0.087362 0.035752
			0.011897 -0.087754 0.037688
			0.012411 -0.086844 0.038830
			0.013640 -0.085767 0.041810
			0.012800 -0.087408 0.039728
			0.013409 -0.090695 0.025926
			0.012749 -0.090919 0.025859
			0.012522 -0.090406 0.025940
			0.009826 -0.089424 0.027459
			0.010692 -0.089821 0.026819
			0.009332 -0.089292 0.028069
			0.008899 -0.089330 0.028937
			0.011926 -0.090492 0.026135
			0.011011 -0.090200 0.026574
			0.010974 -0.088277 0.035762
			0.009288 -0.089593 0.032056
			0.010327 -0.088241 0.034036
			0.010245 -0.089248 0.034089
			0.008710 -0.089932 0.030559
			0.008884 -0.089386 0.030181
			0.008821 -0.089918 0.031133
			0.008634 -0.089967 0.029989
			0.018667 -0.091741 0.029459
			0.018559 -0.091758 0.028884
			0.018789 -0.091305 0.030656
			0.018584 -0.091835 0.030135
			0.018509 -0.091645 0.031233
			0.018720 -0.090532 0.033503
			0.017496 -0.092434 0.031791
			0.017918 -0.091530 0.033066
			0.014697 -0.090718 0.026238
			0.014039 -0.090936 0.026181
			0.015330 -0.090551 0.026195
			0.016443 -0.090010 0.026311
			0.017679 -0.090087 0.026895
			0.017471 -0.090468 0.026588
			0.015907 -0.090841 0.026328
			0.016373 -0.090568 0.026280
			0.018161 -0.090983 0.027395
			0.017645 -0.091429 0.027143
			0.017782 -0.090798 0.026853
			0.018316 -0.091914 0.028422
			0.017892 -0.092235 0.027994
			0.017636 -0.091851 0.027414
			0.018261 -0.082582 0.044190
			0.019402 -0.083018 0.043675
			0.020402 -0.083383 0.043741
			0.018250 -0.090119 0.036333
			0.018190 -0.090011 0.036878
			0.018098 -0.089887 0.037417
			0.018407 -0.089190 0.038729
			0.018503 -0.088954 0.039167
			0.018301 -0.089421 0.038292
			0.018339 -0.090679 0.034264
			0.020916 -0.083659 0.043834
			0.020876 -0.084497 0.043916
			0.019464 -0.086953 0.042556
			0.020133 -0.085734 0.044080
			0.019792 -0.086340 0.043316
			0.019131 -0.087564 0.041794
			0.014488 -0.083687 0.044314
			0.015068 -0.082542 0.045297
			0.014522 -0.082842 0.045577
			0.014183 -0.084739 0.043829
			0.014092 -0.084978 0.043393
			0.013976 -0.085417 0.043089
			0.017551 -0.082338 0.044755
			0.016371 -0.082146 0.045241
			0.015750 -0.082436 0.045115
			0.011328 -0.088961 0.036139
			0.012389 -0.088724 0.038089
			0.012602 -0.087984 0.038924
			0.012146 -0.089214 0.037371
			0.011713 -0.089447 0.036385
			0.014002 -0.086399 0.042506
			0.013744 -0.086871 0.041643
			0.013105 -0.088234 0.039603
			0.013478 -0.091415 0.026283
			0.011887 -0.090978 0.026285
			0.012654 -0.091457 0.026323
			0.009396 -0.089685 0.027558
			0.010516 -0.090536 0.026949
			0.009754 -0.090446 0.027241
			0.010988 -0.090651 0.026789
			0.008788 -0.089691 0.028583
			0.008993 -0.089743 0.027980
			0.008600 -0.090097 0.028872
			0.010774 -0.089599 0.034829
			0.008833 -0.090351 0.031408
			0.009546 -0.089697 0.032682
			0.009386 -0.090890 0.032263
			0.009775 -0.089492 0.033117
			0.010243 -0.089883 0.033891
			0.010044 -0.090064 0.033436
			0.008601 -0.090675 0.030267
			0.008861 -0.091008 0.031218
			0.008642 -0.090760 0.029289
			0.018003 -0.092600 0.028911
			0.018502 -0.091774 0.030713
			0.017881 -0.092812 0.030271
			0.017999 -0.091286 0.033500
			0.017472 -0.092004 0.032841
			0.016740 -0.093114 0.031860
			0.016691 -0.093371 0.031429
			0.017810 -0.092698 0.030815
			0.017372 -0.091876 0.033377
			0.014887 -0.091145 0.026691
			0.014287 -0.091337 0.026729
			0.016963 -0.091298 0.026679
			0.015764 -0.091486 0.027038
			0.016251 -0.091568 0.026941
			0.017684 -0.092953 0.028535
			0.017474 -0.092937 0.027910
			0.017374 -0.092284 0.027425
			0.018311 -0.082320 0.044619
			0.019063 -0.082651 0.044100
			0.019869 -0.082107 0.044827
			0.020649 -0.083093 0.044120
			0.017725 -0.090477 0.036648
			0.017301 -0.091400 0.034895
			0.017167 -0.090891 0.036401
			0.017953 -0.089297 0.039477
			0.018313 -0.088742 0.040269
			0.018582 -0.088270 0.041130
			0.021387 -0.083336 0.044756
			0.021380 -0.082662 0.044930
			0.021558 -0.083920 0.046305
			0.020775 -0.084714 0.045735
			0.020248 -0.085508 0.044520
			0.018848 -0.087550 0.042436
			0.019122 -0.086833 0.043742
			0.019476 -0.086234 0.044508
			0.020208 -0.085412 0.045069
			0.018469 -0.088135 0.041665
			0.014426 -0.083610 0.045259
			0.014273 -0.084713 0.044399
			0.014414 -0.084554 0.044878
			0.014614 -0.082101 0.046297
			0.015556 -0.081755 0.045920
			0.014898 -0.081326 0.046804
			0.014492 -0.082602 0.047238
			0.014546 -0.082919 0.046828
			0.014289 -0.085223 0.044119
			0.014689 -0.085364 0.044746
			0.014644 -0.086036 0.043977
			0.014367 -0.086117 0.043471
			0.018012 -0.082075 0.045114
			0.016628 -0.081667 0.045685
			0.011512 -0.089627 0.035930
			0.012613 -0.089252 0.037920
			0.013372 -0.089114 0.038913
			0.011982 -0.090074 0.036137
			0.013025 -0.090458 0.036812
			0.012795 -0.090942 0.035952
			0.014215 -0.087433 0.041923
			0.013808 -0.087778 0.041005
			0.013558 -0.088293 0.040168
			0.013802 -0.088806 0.039851
			0.013073 -0.091737 0.026765
			0.012345 -0.091861 0.027225
			0.011422 -0.091185 0.027323
			0.012050 -0.091496 0.027026
			0.009197 -0.090449 0.027595
			0.010029 -0.090854 0.027359
			0.010977 -0.090962 0.027220
			0.008712 -0.090296 0.028245
			0.010895 -0.090298 0.034651
			0.010470 -0.090656 0.033878
			0.009364 -0.091398 0.031988
			0.009975 -0.090676 0.033235
			0.009060 -0.091839 0.029908
			0.008915 -0.091473 0.030300
			0.009128 -0.091726 0.031030
			0.009255 -0.091631 0.031552
			0.009050 -0.091908 0.029350
			0.009029 -0.091483 0.028608
			0.017273 -0.093636 0.028486
			0.016925 -0.093652 0.030363
			0.016680 -0.094021 0.030036
			0.017136 -0.093804 0.029004
			0.016414 -0.092775 0.032903
			0.016559 -0.092291 0.033778
			0.016176 -0.094390 0.030355
			0.016942 -0.091708 0.034548
			0.014851 -0.091657 0.027252
			0.014306 -0.092099 0.027425
			0.013136 -0.092290 0.027362
			0.015367 -0.092078 0.027582
			0.016168 -0.092084 0.027449
			0.017083 -0.093582 0.027935
			0.018751 -0.081768 0.045399
			0.020956 -0.082018 0.045191
			0.019706 -0.081404 0.045611
			0.020427 -0.081532 0.045573
			0.017176 -0.091258 0.035428
			0.015682 -0.091377 0.036354
			0.016032 -0.091133 0.036744
			0.017615 -0.089617 0.039134
			0.015288 -0.091810 0.035491
			0.015647 -0.092441 0.034024
			0.016283 -0.090692 0.037628
			0.016852 -0.090633 0.037368
			0.017075 -0.089535 0.039775
			0.017372 -0.089049 0.040620
			0.017314 -0.088367 0.042004
			0.021574 -0.082301 0.045271
			0.021755 -0.083386 0.045932
			0.021979 -0.082791 0.046120
			0.021193 -0.084363 0.046649
			0.021631 -0.083884 0.046874
			0.020398 -0.084863 0.046497
			0.018121 -0.087798 0.042714
			0.018308 -0.087530 0.043114
			0.018128 -0.087329 0.043621
			0.019518 -0.085318 0.046329
			0.018955 -0.086669 0.044268
			0.014659 -0.084521 0.045419
			0.015056 -0.084666 0.046050
			0.014524 -0.081978 0.046836
			0.014733 -0.081083 0.047447
			0.016400 -0.081085 0.046366
			0.015603 -0.081072 0.046513
			0.015219 -0.080767 0.047034
			0.014475 -0.082091 0.047518
			0.014728 -0.082789 0.047923
			0.014891 -0.083424 0.047696
			0.014713 -0.083355 0.047080
			0.014901 -0.083990 0.046504
			0.015027 -0.084970 0.045645
			0.014867 -0.086579 0.043682
			0.015680 -0.084872 0.046681
			0.014816 -0.087199 0.042881
			0.017948 -0.081156 0.046348
			0.017528 -0.081454 0.046004
			0.017307 -0.080366 0.047155
			0.011381 -0.090306 0.035178
			0.013645 -0.090197 0.037748
			0.014561 -0.089315 0.039764
			0.013898 -0.090838 0.036909
			0.013208 -0.091672 0.035144
			0.013729 -0.091322 0.036041
			0.010639 -0.091838 0.032661
			0.012729 -0.092669 0.033446
			0.012108 -0.092390 0.033372
			0.011438 -0.092235 0.032956
			0.014547 -0.088286 0.041205
			0.014425 -0.088539 0.040784
			0.014107 -0.088682 0.040326
			0.011438 -0.091551 0.027699
			0.011714 -0.091957 0.027818
			0.010968 -0.091432 0.027866
			0.009068 -0.090926 0.028117
			0.010365 -0.091934 0.028344
			0.010951 -0.090686 0.034296
			0.010472 -0.091142 0.033450
			0.009782 -0.091537 0.032380
			0.009448 -0.092288 0.030731
			0.009367 -0.092479 0.030263
			0.009155 -0.092391 0.029641
			0.009951 -0.092205 0.031801
			0.009206 -0.092281 0.028957
			0.009698 -0.092976 0.028865
			0.016547 -0.094275 0.029538
			0.015903 -0.094819 0.029466
			0.016602 -0.094289 0.028676
			0.015713 -0.094568 0.030544
			0.015201 -0.092987 0.033239
			0.016464 -0.092088 0.034266
			0.015873 -0.094728 0.030017
			0.014501 -0.092613 0.027757
			0.014034 -0.092955 0.027704
			0.013072 -0.093230 0.027719
			0.012813 -0.092789 0.027664
			0.015661 -0.092446 0.027775
			0.016350 -0.093495 0.027803
			0.015972 -0.094717 0.028788
			0.016410 -0.094235 0.028124
			0.019033 -0.081137 0.046155
			0.018659 -0.080814 0.046700
			0.021739 -0.081504 0.045976
			0.019692 -0.081058 0.045997
			0.020953 -0.081064 0.045860
			0.020323 -0.080756 0.046151
			0.015404 -0.090934 0.037325
			0.015050 -0.091591 0.035993
			0.016960 -0.089979 0.038870
			0.015018 -0.092249 0.034609
			0.014529 -0.092479 0.034234
			0.013354 -0.092561 0.033877
			0.016037 -0.090485 0.038140
			0.016689 -0.088630 0.041674
			0.015841 -0.089306 0.040435
			0.016996 -0.088121 0.042503
			0.022246 -0.081011 0.046734
			0.022139 -0.081949 0.046159
			0.021929 -0.083042 0.047493
			0.022044 -0.082471 0.048317
			0.021635 -0.083812 0.047430
			0.022551 -0.081094 0.047354
			0.020333 -0.084526 0.047497
			0.019248 -0.085088 0.046830
			0.019966 -0.084769 0.047111
			0.016791 -0.087865 0.042978
			0.017033 -0.087363 0.043823
			0.017824 -0.086841 0.044566
			0.018972 -0.086183 0.045161
			0.018278 -0.085406 0.046591
			0.018083 -0.085795 0.046041
			0.015240 -0.084508 0.046521
			0.014543 -0.081626 0.047815
			0.015047 -0.080254 0.048062
			0.014744 -0.081019 0.047997
			0.016193 -0.080092 0.047166
			0.015663 -0.080476 0.046991
			0.015763 -0.079792 0.047648
			0.014722 -0.082324 0.048228
			0.015223 -0.082717 0.049001
			0.015228 -0.083658 0.048394
			0.015056 -0.083833 0.047327
			0.015319 -0.083996 0.047991
			0.015402 -0.084413 0.047038
			0.015479 -0.086329 0.044627
			0.015667 -0.084350 0.047557
			0.016430 -0.084573 0.047572
			0.016726 -0.086461 0.045108
			0.015991 -0.086855 0.044275
			0.015953 -0.087983 0.042589
			0.018223 -0.080622 0.047005
			0.017655 -0.080176 0.047581
			0.016311 -0.079774 0.047545
			0.014750 -0.091097 0.036934
			0.014389 -0.090219 0.038244
			0.015710 -0.088488 0.041744
			0.015402 -0.090243 0.038693
			0.015262 -0.089440 0.040013
			0.014178 -0.091218 0.036502
			0.013308 -0.091995 0.034730
			0.014304 -0.091501 0.036060
			0.011311 -0.092989 0.032076
			0.010599 -0.092917 0.031545
			0.013962 -0.092963 0.033430
			0.013189 -0.093802 0.032284
			0.011260 -0.094084 0.030975
			0.011831 -0.094438 0.031105
			0.011633 -0.092839 0.032531
			0.010972 -0.091825 0.028192
			0.009528 -0.093117 0.030040
			0.009337 -0.092991 0.029389
			0.010450 -0.093210 0.031155
			0.010160 -0.093311 0.030664
			0.009687 -0.093402 0.029127
			0.011216 -0.092702 0.028489
			0.010575 -0.093286 0.028809
			0.015209 -0.095086 0.029752
			0.014938 -0.095227 0.029284
			0.014834 -0.093294 0.032893
			0.015328 -0.094897 0.030214
			0.014392 -0.094555 0.031358
			0.014223 -0.094832 0.030960
			0.014462 -0.093018 0.033383
			0.014315 -0.093350 0.027845
			0.014732 -0.093086 0.027953
			0.013521 -0.094263 0.027540
			0.011461 -0.093174 0.028485
			0.011955 -0.093696 0.028199
			0.012802 -0.093680 0.027697
			0.013003 -0.094247 0.027512
			0.015616 -0.092943 0.027901
			0.015793 -0.093963 0.027928
			0.015867 -0.093398 0.027964
			0.015975 -0.094506 0.028205
			0.015457 -0.094891 0.028487
			0.019014 -0.080544 0.046987
			0.021543 -0.080448 0.046507
			0.020232 -0.080403 0.046696
			0.015298 -0.090468 0.038252
			0.022075 -0.080387 0.046983
			0.021925 -0.082816 0.049159
			0.021567 -0.083701 0.047973
			0.022628 -0.080986 0.048479
			0.022626 -0.081060 0.047922
			0.022213 -0.082255 0.049358
			0.022428 -0.081657 0.049542
			0.021462 -0.083206 0.049485
			0.021046 -0.083582 0.049189
			0.020818 -0.084062 0.048328
			0.022330 -0.080340 0.047512
			0.020432 -0.084308 0.047946
			0.019726 -0.084566 0.047624
			0.019335 -0.084365 0.047988
			0.018693 -0.085115 0.046940
			0.018902 -0.084549 0.047749
			0.016417 -0.087551 0.043443
			0.017255 -0.086532 0.045065
			0.016317 -0.086686 0.044716
			0.017695 -0.086268 0.045427
			0.017989 -0.084402 0.047979
			0.014757 -0.081367 0.048396
			0.015304 -0.079817 0.048947
			0.015379 -0.079718 0.048267
			0.016195 -0.079518 0.048005
			0.015254 -0.082195 0.049265
			0.015492 -0.083598 0.048915
			0.015742 -0.081759 0.050113
			0.015936 -0.082721 0.050091
			0.015800 -0.083470 0.049386
			0.016191 -0.084301 0.048040
			0.016170 -0.084070 0.048500
			0.017052 -0.084690 0.047544
			0.017071 -0.084417 0.047968
			0.018390 -0.080283 0.047526
			0.016852 -0.079700 0.048013
			0.016736 -0.079334 0.049005
			0.014228 -0.093312 0.033004
			0.014089 -0.093608 0.032614
			0.013742 -0.093922 0.032269
			0.013490 -0.094228 0.031903
			0.011305 -0.094491 0.030622
			0.010913 -0.094360 0.029805
			0.010049 -0.093557 0.030143
			0.012866 -0.094742 0.031127
			0.012366 -0.094916 0.030718
			0.010585 -0.094068 0.029468
			0.011045 -0.093405 0.028642
			0.011440 -0.094087 0.028476
			0.014637 -0.095200 0.029920
			0.014546 -0.095123 0.028166
			0.014392 -0.095322 0.028623
			0.014303 -0.095384 0.029339
			0.013573 -0.094577 0.031507
			0.013442 -0.094843 0.031096
			0.013584 -0.095102 0.030634
			0.014872 -0.094618 0.027875
			0.015349 -0.094256 0.027967
			0.014189 -0.094890 0.027716
			0.013249 -0.095119 0.027819
			0.012466 -0.094672 0.027716
			0.011866 -0.094300 0.028128
			0.019205 -0.080237 0.047618
			0.021219 -0.080163 0.046981
			0.020091 -0.080061 0.047831
			0.022204 -0.082176 0.049911
			0.022528 -0.080677 0.049279
			0.022518 -0.080394 0.048121
			0.022440 -0.081202 0.049770
			0.021374 -0.082947 0.049936
			0.020837 -0.083009 0.050065
			0.020354 -0.083343 0.049755
			0.020361 -0.083875 0.048887
			0.021952 -0.079981 0.048398
			0.018204 -0.083959 0.048696
			0.018918 -0.083554 0.049525
			0.016130 -0.079342 0.049985
			0.015774 -0.079707 0.050004
			0.015637 -0.079441 0.048653
			0.015782 -0.079359 0.049179
			0.015750 -0.080831 0.050123
			0.016249 -0.079282 0.048846
			0.016150 -0.083278 0.049807
			0.016381 -0.083608 0.049375
			0.016030 -0.081628 0.050584
			0.016251 -0.082583 0.050554
			0.018284 -0.079894 0.048572
			0.018727 -0.080110 0.047963
			0.016240 -0.079235 0.049353
			0.016967 -0.079335 0.049459
			0.018064 -0.079702 0.049533
			0.011429 -0.094784 0.030130
			0.012278 -0.095117 0.030258
			0.011819 -0.095075 0.029634
			0.011483 -0.094797 0.029269
			0.011174 -0.094463 0.029012
			0.011774 -0.094836 0.028599
			0.013765 -0.095344 0.029775
			0.013779 -0.095445 0.028748
			0.012674 -0.095160 0.028100
			0.012223 -0.095000 0.028345
			0.012300 -0.095218 0.029112
			0.019017 -0.079942 0.049014
			0.020648 -0.079928 0.048562
			0.020320 -0.079969 0.049079
			0.022085 -0.081705 0.050482
			0.021348 -0.082493 0.050415
			0.022205 -0.080306 0.049508
			0.022139 -0.081186 0.050397
			0.022128 -0.080069 0.048886
			0.020885 -0.082360 0.050610
			0.020001 -0.083000 0.050167
			0.021135 -0.079945 0.049005
			0.021647 -0.079975 0.049007
			0.018693 -0.083210 0.049945
			0.016846 -0.083069 0.050161
			0.017280 -0.082800 0.050522
			0.018745 -0.082867 0.050323
			0.016768 -0.079501 0.050814
			0.017128 -0.079390 0.050428
			0.016058 -0.079832 0.050542
			0.015876 -0.080572 0.050540
			0.016292 -0.081570 0.051108
			0.016840 -0.081485 0.051565
			0.016866 -0.082395 0.050935
			0.017413 -0.079442 0.049732
			0.018746 -0.079899 0.049454
			0.019115 -0.080106 0.049955
			0.018882 -0.080420 0.050548
			0.017604 -0.080235 0.051442
			0.012989 -0.095286 0.030005
			0.012487 -0.095273 0.029721
			0.013050 -0.095349 0.028633
			0.019608 -0.080174 0.049885
			0.021733 -0.080191 0.049668
			0.020419 -0.080158 0.049794
			0.020935 -0.080179 0.049813
			0.021326 -0.081608 0.050788
			0.021487 -0.080522 0.050290
			0.020879 -0.081038 0.050741
			0.020227 -0.082113 0.050783
			0.018179 -0.082438 0.050744
			0.018598 -0.082159 0.050937
			0.018957 -0.082478 0.050641
			0.016822 -0.079786 0.051343
			0.016434 -0.080126 0.051369
			0.016119 -0.080458 0.051029
			0.016304 -0.080985 0.051335
			0.017330 -0.082031 0.051229
			0.017033 -0.080267 0.051741
			0.017743 -0.080869 0.051545
			0.017814 -0.081651 0.051369
			0.019060 -0.080962 0.050889
			0.020326 -0.081498 0.050880
			0.018213 -0.080990 0.051375
			0.019887 -0.081778 0.050943
			0.019224 -0.082005 0.050898
			0.018424 -0.081535 0.051230
			0.016565 -0.080613 0.051657
		</DataArray>
	</Points>
			<Polys>
				<DataArray type="Int32" Name="connectivity" format="ascii">
					0 1 2 
					2 3 0 
					4 1 0 
					0 5 4 
					3 5 0 
					1 6 2 
					6 1 7 
					4 8 1 
					9 1 8 
					9 7 1 
					10 3 2 
					11 2 6 
					12 2 11 
					2 13 10 
					13 2 12 
					14 3 15 
					14 5 3 
					3 10 16 
					15 3 16 
					17 8 4 
					18 17 4 
					5 18 4 
					14 19 5 
					18 5 19 
					11 6 20 
					20 6 7 
					7 21 20 
					7 9 22 
					22 21 7 
					9 8 22 
					22 8 17 
					23 10 24 
					10 13 24 
					10 23 16 
					11 20 25 
					25 26 11 
					12 11 26 
					27 13 12 
					26 27 12 
					28 24 13 
					28 13 27 
					15 29 14 
					14 29 30 
					19 14 30 
					31 32 15 
					29 15 32 
					33 15 16 
					34 15 33 
					34 31 15 
					35 16 23 
					16 35 33 
					17 36 37 
					17 18 36 
					37 38 17 
					17 38 22 
					18 39 36 
					18 19 39 
					40 19 41 
					42 41 19 
					30 42 19 
					43 39 19 
					19 40 44 
					19 44 43 
					20 21 45 
					45 25 20 
					21 22 46 
					47 21 46 
					45 21 47 
					22 38 48 
					49 46 22 
					22 48 50 
					50 51 22 
					49 22 51 
					23 24 35 
					24 52 53 
					53 54 24 
					54 35 24 
					52 24 28 
					26 25 55 
					25 45 55 
					56 26 55 
					27 26 56 
					56 57 27 
					58 27 57 
					58 28 27 
					58 52 28 
					32 59 29 
					29 59 30 
					30 59 60 
					60 42 30 
					32 31 34 
					34 61 32 
					59 32 62 
					62 32 63 
					63 32 62 
					62 32 64 
					64 32 61 
					33 65 34 
					35 65 33 
					34 65 61 
					35 61 65 
					35 66 61 
					66 35 54 
					36 67 37 
					68 36 39 
					36 68 67 
					37 67 69 
					38 37 48 
					37 69 70 
					70 48 37 
					39 71 68 
					39 43 71 
					41 72 40 
					40 72 73 
					44 40 73 
					41 74 72 
					42 74 41 
					60 74 42 
					75 71 43 
					43 76 77 
					44 76 43 
					43 77 75 
					44 73 78 
					79 76 44 
					44 78 79 
					47 55 45 
					80 46 49 
					46 81 47 
					81 46 80 
					81 82 47 
					47 83 55 
					82 83 47 
					50 48 70 
					49 51 84 
					49 85 86 
					49 84 87 
					86 88 49 
					49 87 85 
					49 88 80 
					70 89 50 
					89 51 50 
					90 51 91 
					89 91 51 
					92 87 51 
					51 90 92 
					51 87 84 
					52 93 94 
					94 53 52 
					52 58 93 
					95 54 53 
					95 53 94 
					54 96 97 
					54 97 66 
					95 96 54 
					98 56 55 
					55 99 98 
					99 55 83 
					57 56 100 
					101 56 98 
					100 56 101 
					102 57 103 
					57 102 58 
					100 103 57 
					93 58 104 
					104 58 102 
					62 63 59 
					63 105 59 
					106 59 105 
					59 106 60 
					74 60 106 
					61 107 64 
					61 66 108 
					109 61 108 
					107 61 109 
					63 62 110 
					64 110 62 
					105 63 111 
					112 111 63 
					110 112 63 
					113 110 64 
					64 107 113 
					114 108 66 
					66 97 114 
					68 115 67 
					69 67 115 
					68 71 115 
					89 70 69 
					69 115 116 
					69 116 89 
					75 115 71 
					74 117 72 
					118 73 72 
					72 117 118 
					78 73 119 
					120 73 118 
					73 120 119 
					106 121 74 
					122 74 121 
					74 122 117 
					75 116 115 
					77 123 75 
					124 75 125 
					75 123 125 
					75 126 116 
					124 126 75 
					77 76 79 
					79 123 77 
					79 78 119 
					79 119 127 
					127 123 79 
					81 80 88 
					88 82 81 
					82 88 128 
					128 129 82 
					130 82 131 
					131 82 129 
					130 83 82 
					83 130 99 
					85 132 86 
					85 87 133 
					133 132 85 
					86 134 88 
					134 86 132 
					87 92 135 
					135 133 87 
					134 128 88 
					91 89 136 
					136 89 137 
					138 137 89 
					138 89 116 
					90 91 136 
					136 137 90 
					90 137 139 
					90 140 92 
					139 141 90 
					141 142 90 
					140 90 142 
					140 143 92 
					135 92 143 
					144 94 93 
					104 145 93 
					145 144 93 
					144 146 94 
					147 95 94 
					94 146 147 
					96 95 148 
					147 148 95 
					97 96 148 
					148 114 97 
					99 149 98 
					150 101 98 
					151 150 98 
					98 149 151 
					149 99 152 
					152 99 130 
					103 100 153 
					153 100 101 
					153 101 150 
					104 102 103 
					103 154 104 
					153 154 103 
					104 155 156 
					156 145 104 
					104 154 155 
					105 157 158 
					159 157 105 
					158 121 105 
					105 111 159 
					105 121 106 
					109 113 107 
					108 160 109 
					108 114 161 
					161 162 108 
					162 160 108 
					113 109 110 
					160 110 109 
					112 110 163 
					164 163 110 
					164 110 160 
					112 165 111 
					159 111 166 
					165 166 111 
					167 165 112 
					112 168 167 
					163 168 112 
					148 161 114 
					116 126 138 
					117 122 169 
					118 117 169 
					170 118 171 
					169 171 118 
					118 170 120 
					119 172 127 
					172 119 120 
					173 174 120 
					173 120 170 
					120 175 172 
					174 175 120 
					121 158 122 
					122 158 176 
					122 176 169 
					177 125 123 
					123 127 178 
					177 123 179 
					178 180 123 
					123 180 179 
					124 125 177 
					177 138 124 
					126 124 138 
					127 172 178 
					181 127 172 
					178 172 127 
					178 127 182 
					127 181 182 
					129 128 183 
					134 183 128 
					131 129 184 
					183 184 129 
					131 152 130 
					131 185 152 
					131 184 185 
					132 186 134 
					187 132 133 
					186 132 187 
					135 188 133 
					133 188 189 
					189 187 133 
					134 190 183 
					191 190 134 
					191 134 186 
					135 143 192 
					188 135 192 
					137 141 139 
					138 177 137 
					193 137 177 
					137 194 141 
					137 193 194 
					143 140 195 
					140 142 196 
					197 140 198 
					196 198 140 
					140 197 195 
					196 142 141 
					141 194 196 
					199 192 143 
					199 143 195 
					144 156 200 
					156 144 145 
					200 146 144 
					146 200 201 
					146 202 147 
					201 202 146 
					148 147 203 
					147 202 204 
					147 205 203 
					204 205 147 
					203 161 148 
					206 149 207 
					149 152 207 
					149 206 208 
					208 151 149 
					209 150 151 
					210 153 150 
					211 210 150 
					150 209 211 
					151 212 209 
					208 212 151 
					185 207 152 
					154 153 210 
					213 154 210 
					213 155 154 
					155 214 156 
					156 213 155 
					155 213 156 
					215 155 213 
					215 214 155 
					200 156 214 
					157 216 158 
					159 217 157 
					157 217 216 
					216 218 158 
					218 219 158 
					158 219 176 
					159 220 217 
					221 220 159 
					221 159 166 
					222 160 223 
					160 222 164 
					223 160 162 
					203 162 161 
					224 223 162 
					162 225 224 
					162 203 225 
					168 163 226 
					164 226 163 
					222 226 164 
					167 166 165 
					166 227 221 
					227 166 228 
					229 166 167 
					229 228 166 
					226 167 168 
					230 229 167 
					167 226 230 
					169 231 171 
					176 231 169 
					170 171 173 
					232 171 233 
					171 234 233 
					171 231 234 
					232 173 171 
					172 175 235 
					172 235 181 
					173 232 236 
					174 173 237 
					238 237 173 
					173 236 238 
					175 174 237 
					175 237 235 
					176 219 239 
					234 176 239 
					231 176 234 
					240 177 179 
					177 240 241 
					177 241 193 
					178 182 180 
					242 179 180 
					240 179 242 
					182 243 180 
					180 243 242 
					244 181 235 
					245 182 181 
					244 245 181 
					243 182 245 
					185 184 183 
					185 183 190 
					185 246 207 
					247 246 185 
					247 185 248 
					248 185 190 
					187 249 186 
					186 249 250 
					191 186 250 
					189 251 187 
					187 251 249 
					188 192 189 
					189 192 252 
					251 189 252 
					248 190 253 
					253 190 191 
					254 191 250 
					253 191 254 
					192 199 252 
					194 193 241 
					241 255 194 
					196 194 256 
					256 194 257 
					255 258 194 
					257 194 258 
					259 260 195 
					195 261 259 
					195 197 261 
					260 199 195 
					198 196 256 
					197 198 261 
					198 256 261 
					199 260 262 
					262 252 199 
					263 200 264 
					200 263 201 
					214 264 200 
					265 202 201 
					201 266 265 
					263 266 201 
					204 202 267 
					267 202 265 
					268 225 203 
					205 268 203 
					205 204 267 
					269 270 205 
					270 268 205 
					269 205 267 
					207 271 206 
					206 271 208 
					272 207 246 
					272 271 207 
					273 212 208 
					271 273 208 
					209 212 274 
					274 211 209 
					210 211 275 
					213 210 275 
					276 211 274 
					211 276 275 
					277 278 212 
					278 274 212 
					277 212 273 
					215 213 279 
					280 279 213 
					275 281 213 
					213 281 280 
					282 264 214 
					214 215 282 
					280 215 279 
					283 282 215 
					284 283 215 
					215 280 284 
					285 218 216 
					216 217 220 
					216 220 286 
					216 286 285 
					218 239 219 
					218 285 239 
					221 227 220 
					227 287 220 
					286 220 287 
					288 222 223 
					230 226 222 
					289 290 222 
					222 291 292 
					292 230 222 
					222 290 293 
					222 293 291 
					222 288 289 
					288 223 224 
					268 224 225 
					294 224 268 
					288 224 294 
					287 227 295 
					228 295 227 
					228 296 295 
					297 228 229 
					296 228 298 
					299 298 228 
					297 299 228 
					300 229 230 
					300 297 229 
					300 230 292 
					233 301 232 
					236 232 301 
					234 239 233 
					302 233 239 
					302 303 233 
					233 303 301 
					244 235 237 
					304 305 236 
					305 238 236 
					236 301 304 
					237 238 244 
					238 305 306 
					244 238 306 
					239 285 307 
					307 308 239 
					308 309 239 
					239 309 302 
					241 240 255 
					240 242 310 
					310 255 240 
					311 242 312 
					242 243 312 
					242 311 313 
					242 313 314 
					314 310 242 
					243 245 312 
					244 306 315 
					244 315 316 
					245 244 316 
					317 312 245 
					316 317 245 
					246 318 272 
					247 318 246 
					253 247 248 
					319 247 253 
					247 320 318 
					319 320 247 
					251 321 249 
					322 249 323 
					250 249 322 
					249 321 323 
					324 254 250 
					322 324 250 
					252 325 251 
					326 251 325 
					321 251 326 
					252 262 327 
					325 252 327 
					254 319 253 
					319 254 324 
					258 255 328 
					255 310 328 
					256 329 261 
					257 330 256 
					331 329 256 
					256 330 331 
					257 258 332 
					332 330 257 
					328 333 258 
					258 333 334 
					258 334 332 
					260 259 262 
					262 259 335 
					329 259 261 
					259 329 336 
					335 259 336 
					337 262 335 
					327 262 337 
					338 263 264 
					266 263 338 
					338 264 282 
					339 265 266 
					339 267 265 
					340 266 338 
					340 339 266 
					269 267 339 
					341 294 268 
					270 341 268 
					342 270 269 
					342 269 343 
					344 343 269 
					269 345 344 
					339 345 269 
					270 346 341 
					346 270 342 
					272 347 271 
					277 273 271 
					347 277 271 
					318 348 272 
					348 347 272 
					274 278 349 
					276 274 349 
					281 275 276 
					349 281 276 
					278 277 349 
					347 350 277 
					277 351 349 
					350 351 277 
					280 281 349 
					349 284 280 
					282 352 338 
					283 353 282 
					353 352 282 
					353 283 354 
					354 283 284 
					284 349 354 
					355 285 356 
					285 355 307 
					286 356 285 
					287 357 286 
					357 356 286 
					358 287 295 
					357 287 358 
					341 288 294 
					359 289 288 
					341 360 288 
					360 359 288 
					359 290 289 
					290 359 361 
					362 293 290 
					361 362 290 
					362 292 291 
					362 291 293 
					362 363 292 
					364 300 292 
					292 363 364 
					295 365 366 
					295 366 358 
					365 295 367 
					368 295 296 
					368 367 295 
					368 296 369 
					296 298 369 
					370 297 300 
					371 299 297 
					371 297 370 
					298 299 371 
					371 372 298 
					298 373 369 
					373 298 372 
					300 364 374 
					374 370 300 
					303 375 301 
					301 376 304 
					301 375 377 
					377 376 301 
					302 378 303 
					309 379 302 
					302 379 380 
					302 380 378 
					381 303 378 
					303 381 382 
					375 303 382 
					383 305 304 
					304 376 383 
					305 383 306 
					384 306 383 
					385 386 306 
					306 384 385 
					315 306 386 
					307 355 387 
					307 388 308 
					388 307 387 
					379 309 308 
					379 308 388 
					314 389 310 
					310 389 328 
					390 313 311 
					317 311 312 
					311 317 391 
					390 311 391 
					313 392 314 
					313 390 393 
					313 393 394 
					392 313 394 
					392 389 314 
					315 386 395 
					395 316 315 
					316 395 396 
					316 397 317 
					316 396 397 
					317 398 391 
					317 397 398 
					318 399 348 
					400 318 320 
					399 318 400 
					401 319 324 
					401 402 319 
					319 402 320 
					320 402 400 
					321 326 403 
					321 403 323 
					404 322 323 
					322 405 324 
					405 322 404 
					403 404 323 
					324 405 401 
					327 406 325 
					325 406 326 
					403 326 406 
					327 337 406 
					328 389 407 
					328 407 408 
					333 328 408 
					336 329 409 
					329 331 409 
					330 332 331 
					331 334 410 
					331 332 334 
					410 409 331 
					334 333 410 
					333 408 410 
					337 335 411 
					335 412 411 
					413 335 336 
					412 335 413 
					409 414 336 
					336 414 413 
					415 416 337 
					337 411 415 
					416 406 337 
					417 340 338 
					417 338 352 
					340 345 339 
					418 345 340 
					419 340 420 
					340 419 418 
					420 340 417 
					341 346 360 
					343 421 342 
					342 421 422 
					422 346 342 
					421 343 344 
					345 418 344 
					344 423 421 
					423 344 418 
					424 360 346 
					422 424 346 
					347 425 350 
					348 425 347 
					426 348 427 
					426 425 348 
					399 427 348 
					349 351 354 
					425 428 350 
					428 351 350 
					351 429 354 
					428 429 351 
					353 417 352 
					430 417 353 
					353 354 430 
					430 354 429 
					356 431 355 
					387 355 431 
					356 357 431 
					357 366 432 
					357 433 431 
					358 366 357 
					433 357 434 
					357 432 434 
					361 359 435 
					359 360 435 
					435 360 424 
					436 437 361 
					438 362 361 
					439 361 440 
					437 441 361 
					361 439 436 
					441 442 361 
					438 361 442 
					440 361 435 
					443 444 362 
					362 438 443 
					444 363 362 
					363 444 445 
					364 363 445 
					445 374 364 
					446 366 365 
					367 447 365 
					447 448 365 
					446 365 448 
					366 446 432 
					449 450 367 
					447 367 450 
					449 367 368 
					369 373 368 
					449 368 451 
					451 368 373 
					452 453 370 
					370 453 371 
					370 374 452 
					371 453 454 
					372 371 455 
					454 456 371 
					455 371 456 
					455 373 372 
					455 451 373 
					445 452 374 
					457 375 382 
					377 375 457 
					383 376 377 
					458 377 457 
					377 458 384 
					383 377 384 
					378 459 381 
					459 378 460 
					380 460 378 
					388 461 379 
					380 379 462 
					462 379 461 
					463 460 380 
					463 380 462 
					381 464 465 
					381 465 466 
					467 382 381 
					459 464 381 
					381 466 467 
					382 467 468 
					457 382 468 
					458 469 384 
					385 384 469 
					386 385 470 
					471 470 385 
					469 471 385 
					386 470 472 
					395 386 472 
					387 431 473 
					388 387 474 
					387 473 474 
					474 475 388 
					388 475 461 
					476 389 392 
					389 476 407 
					390 391 477 
					390 477 393 
					391 398 478 
					477 391 478 
					476 392 394 
					477 479 393 
					394 393 479 
					480 394 481 
					479 481 394 
					476 394 482 
					483 394 480 
					484 394 483 
					394 485 482 
					394 484 485 
					472 486 395 
					396 395 486 
					396 486 487 
					487 488 396 
					488 397 396 
					397 488 398 
					398 488 478 
					427 399 400 
					401 400 402 
					401 489 400 
					400 489 490 
					490 427 400 
					491 489 401 
					491 401 405 
					406 492 403 
					416 404 403 
					403 492 416 
					491 405 404 
					493 491 404 
					416 493 404 
					492 406 416 
					407 476 494 
					408 407 494 
					408 494 495 
					408 495 410 
					496 409 410 
					414 409 496 
					410 495 496 
					411 412 413 
					413 497 411 
					497 498 411 
					499 415 411 
					499 411 498 
					497 413 414 
					496 500 414 
					497 414 500 
					416 415 501 
					501 415 499 
					493 416 502 
					502 416 501 
					503 420 417 
					504 417 505 
					417 504 503 
					505 417 430 
					418 419 423 
					423 419 503 
					420 503 419 
					421 423 506 
					507 422 421 
					506 507 421 
					508 424 422 
					440 508 422 
					422 507 440 
					504 423 503 
					506 423 509 
					504 509 423 
					435 424 508 
					425 426 428 
					428 426 510 
					427 511 426 
					511 510 426 
					427 512 511 
					513 512 427 
					490 513 427 
					510 514 428 
					514 429 428 
					429 515 430 
					429 514 515 
					505 430 516 
					516 430 517 
					430 515 517 
					518 431 433 
					473 431 519 
					518 519 431 
					432 446 520 
					520 434 432 
					434 521 433 
					433 521 518 
					520 522 434 
					522 523 434 
					434 523 521 
					508 440 435 
					524 437 436 
					525 524 436 
					436 439 525 
					437 524 441 
					443 438 526 
					442 526 438 
					440 527 439 
					439 527 528 
					529 525 439 
					528 529 439 
					527 440 507 
					441 530 526 
					526 442 441 
					524 530 441 
					444 443 531 
					532 531 443 
					443 530 532 
					443 526 530 
					531 445 444 
					531 533 445 
					452 445 533 
					520 446 534 
					534 446 535 
					446 448 535 
					450 448 447 
					448 536 537 
					538 536 448 
					450 538 448 
					539 535 448 
					539 448 537 
					538 450 449 
					540 538 449 
					540 449 451 
					455 541 451 
					542 540 451 
					451 541 542 
					454 453 452 
					452 533 454 
					533 543 454 
					544 545 454 
					454 546 456 
					543 544 454 
					546 454 545 
					541 455 547 
					548 455 545 
					547 455 548 
					456 546 455 
					455 546 545 
					468 458 457 
					468 549 458 
					469 458 549 
					460 464 459 
					459 464 550 
					550 464 459 
					551 552 460 
					552 550 460 
					460 550 464 
					551 460 463 
					475 553 461 
					461 553 554 
					461 554 462 
					462 554 463 
					463 554 553 
					551 463 555 
					553 555 463 
					556 465 464 
					550 556 464 
					557 465 556 
					466 465 558 
					558 465 557 
					467 466 559 
					560 559 466 
					466 558 560 
					559 468 467 
					468 559 561 
					468 561 549 
					469 549 471 
					472 470 562 
					470 471 562 
					549 561 471 
					561 563 471 
					471 563 564 
					565 562 471 
					471 564 565 
					566 472 562 
					472 566 567 
					486 472 567 
					519 568 473 
					475 474 473 
					473 568 475 
					475 569 570 
					475 570 553 
					568 569 475 
					494 476 482 
					571 477 572 
					571 479 477 
					477 478 572 
					478 488 487 
					487 573 478 
					478 574 572 
					575 574 478 
					478 573 575 
					576 479 571 
					479 576 481 
					481 577 480 
					480 577 483 
					578 577 481 
					481 576 578 
					482 495 494 
					482 485 579 
					482 500 495 
					500 482 580 
					482 579 580 
					577 529 483 
					483 529 581 
					483 581 582 
					583 484 483 
					582 584 483 
					584 583 483 
					585 484 583 
					485 484 585 
					485 585 579 
					487 486 573 
					486 567 573 
					491 586 489 
					586 490 489 
					490 586 513 
					493 586 491 
					502 586 493 
					500 496 495 
					497 500 587 
					498 497 587 
					587 499 498 
					499 588 501 
					588 499 587 
					500 580 589 
					589 590 500 
					500 590 587 
					501 591 502 
					501 502 591 
					588 502 501 
					502 592 586 
					502 593 592 
					593 502 591 
					588 587 502 
					591 502 587 
					509 504 594 
					505 516 504 
					595 594 504 
					504 516 595 
					596 507 506 
					506 509 597 
					506 598 596 
					599 598 506 
					599 506 597 
					507 600 527 
					507 596 600 
					594 597 509 
					601 510 511 
					510 602 514 
					510 601 511 
					510 511 602 
					512 603 511 
					603 601 511 
					602 511 601 
					604 512 513 
					605 606 512 
					512 604 605 
					607 512 606 
					607 603 512 
					513 586 592 
					513 592 604 
					514 608 515 
					602 608 514 
					609 517 515 
					608 610 515 
					609 515 610 
					516 517 611 
					516 612 595 
					612 516 611 
					609 611 517 
					518 521 613 
					613 519 518 
					519 613 568 
					520 614 522 
					520 534 614 
					521 615 613 
					521 523 615 
					523 522 615 
					522 614 615 
					530 524 616 
					525 571 524 
					571 616 524 
					578 571 525 
					577 578 525 
					525 529 577 
					528 527 600 
					528 581 529 
					581 528 600 
					530 574 532 
					616 574 530 
					531 573 567 
					533 531 567 
					532 573 531 
					575 573 532 
					532 574 575 
					567 543 533 
					535 539 534 
					534 617 614 
					534 539 617 
					537 536 618 
					536 538 619 
					619 618 536 
					620 621 537 
					622 623 537 
					537 623 620 
					537 618 622 
					537 621 539 
					619 538 624 
					625 624 538 
					538 626 625 
					540 626 538 
					617 539 627 
					621 627 539 
					540 628 626 
					629 628 540 
					540 542 629 
					630 629 541 
					541 631 632 
					629 542 541 
					541 632 630 
					547 631 541 
					543 567 633 
					633 544 543 
					544 634 545 
					544 565 634 
					635 565 544 
					566 544 633 
					566 635 544 
					545 634 636 
					545 636 548 
					631 547 637 
					637 547 548 
					548 636 637 
					550 552 638 
					638 556 550 
					552 551 639 
					640 639 551 
					640 551 555 
					639 638 552 
					570 555 553 
					555 570 641 
					555 641 640 
					642 556 638 
					556 642 557 
					557 643 558 
					642 644 557 
					645 557 644 
					557 645 646 
					557 646 643 
					560 558 643 
					560 643 558 
					558 643 646 
					560 558 643 
					558 646 643 
					559 560 561 
					560 563 561 
					647 563 560 
					560 643 648 
					560 648 647 
					565 635 562 
					562 635 566 
					647 564 563 
					565 564 649 
					647 648 564 
					650 649 564 
					564 648 650 
					649 634 565 
					566 633 567 
					568 651 569 
					568 613 651 
					569 652 570 
					653 652 569 
					569 651 653 
					652 641 570 
					572 616 571 
					578 576 571 
					574 616 572 
					579 583 589 
					583 579 585 
					589 580 579 
					600 654 581 
					655 656 581 
					581 654 655 
					582 581 656 
					582 656 657 
					582 657 584 
					590 589 583 
					658 583 584 
					659 583 658 
					583 659 660 
					660 590 583 
					657 661 584 
					662 658 584 
					584 661 662 
					590 660 587 
					591 587 660 
					660 663 591 
					593 591 663 
					664 592 593 
					604 592 664 
					664 593 665 
					593 663 665 
					666 597 594 
					666 594 595 
					595 612 667 
					667 668 595 
					666 595 669 
					669 595 668 
					654 600 596 
					655 654 596 
					655 596 598 
					666 599 597 
					670 598 599 
					598 670 657 
					598 656 655 
					657 656 598 
					599 671 670 
					671 599 672 
					672 599 666 
					601 603 673 
					673 674 601 
					674 602 601 
					602 609 610 
					602 674 609 
					610 608 602 
					673 603 675 
					676 675 603 
					676 603 607 
					665 604 664 
					604 665 605 
					606 605 607 
					677 607 605 
					677 605 678 
					665 678 605 
					677 676 607 
					611 609 674 
					674 673 611 
					611 673 612 
					667 612 673 
					679 613 615 
					651 613 679 
					615 614 680 
					617 680 614 
					615 680 681 
					681 679 615 
					617 627 680 
					618 682 622 
					624 682 618 
					624 618 619 
					620 683 684 
					621 620 684 
					620 623 683 
					684 627 621 
					622 682 623 
					682 685 623 
					623 685 683 
					682 624 686 
					686 624 625 
					686 625 687 
					688 625 689 
					625 688 687 
					626 689 625 
					689 626 628 
					627 684 690 
					690 680 627 
					628 629 630 
					689 628 630 
					630 691 692 
					689 630 692 
					691 630 632 
					691 632 631 
					637 691 631 
					636 634 649 
					649 637 636 
					649 650 637 
					691 637 650 
					638 639 644 
					638 644 642 
					639 693 694 
					640 695 639 
					696 693 639 
					695 696 639 
					697 644 639 
					639 694 697 
					640 641 698 
					698 695 640 
					641 652 653 
					641 653 698 
					643 646 699 
					700 643 699 
					648 643 700 
					697 701 644 
					644 701 645 
					701 702 645 
					699 645 702 
					645 699 646 
					691 650 648 
					648 700 691 
					653 651 703 
					651 704 703 
					679 704 651 
					705 653 706 
					706 653 707 
					698 653 705 
					707 653 703 
					657 670 661 
					658 708 659 
					658 662 709 
					708 658 709 
					710 659 708 
					659 710 711 
					712 659 711 
					663 659 712 
					660 659 663 
					670 671 661 
					661 671 672 
					672 662 661 
					709 662 672 
					663 712 665 
					678 665 713 
					712 713 665 
					666 669 714 
					666 714 672 
					676 668 667 
					667 673 675 
					667 675 676 
					668 715 669 
					668 676 715 
					714 669 715 
					672 714 709 
					716 715 676 
					677 716 676 
					677 678 713 
					713 717 677 
					677 718 716 
					677 717 718 
					679 681 719 
					719 704 679 
					680 720 681 
					680 690 720 
					721 719 681 
					681 720 721 
					682 722 685 
					686 723 682 
					682 723 722 
					683 724 684 
					685 725 683 
					725 724 683 
					684 726 690 
					726 684 724 
					722 725 685 
					687 723 686 
					727 723 687 
					727 687 728 
					688 728 687 
					692 688 689 
					692 728 688 
					729 720 690 
					690 726 730 
					690 730 729 
					731 692 691 
					691 700 732 
					732 733 691 
					691 733 731 
					692 734 728 
					731 734 692 
					706 693 705 
					705 693 696 
					735 694 693 
					706 736 693 
					693 736 735 
					737 694 735 
					694 738 697 
					694 737 738 
					696 695 698 
					698 705 696 
					697 738 701 
					700 699 702 
					702 732 700 
					738 739 701 
					701 739 702 
					739 740 702 
					702 733 732 
					741 733 702 
					741 702 740 
					707 703 719 
					719 703 704 
					707 742 706 
					742 736 706 
					707 743 744 
					719 743 707 
					736 742 707 
					744 745 707 
					746 736 707 
					707 745 746 
					709 710 708 
					709 714 747 
					748 709 747 
					710 709 748 
					710 718 713 
					713 711 710 
					718 710 748 
					713 712 711 
					713 718 717 
					749 714 715 
					747 714 748 
					714 749 718 
					718 748 714 
					716 749 715 
					718 749 716 
					719 721 750 
					743 719 750 
					720 729 721 
					721 729 751 
					752 750 721 
					753 752 721 
					721 751 753 
					754 725 722 
					754 722 723 
					754 723 727 
					751 724 755 
					726 724 751 
					755 724 725 
					755 725 756 
					756 725 754 
					730 726 751 
					728 757 727 
					757 754 727 
					757 728 734 
					729 730 751 
					733 734 731 
					733 758 734 
					758 733 741 
					759 760 734 
					758 759 734 
					757 734 760 
					735 736 746 
					746 761 735 
					735 761 762 
					735 762 763 
					763 737 735 
					737 763 738 
					764 739 738 
					738 763 764 
					740 739 764 
					740 765 741 
					766 767 740 
					740 767 768 
					766 740 764 
					768 765 740 
					741 765 758 
					743 750 744 
					744 750 745 
					755 745 750 
					745 769 746 
					755 756 745 
					770 745 756 
					770 769 745 
					746 766 761 
					767 766 746 
					771 746 769 
					771 767 746 
					755 750 752 
					753 751 755 
					755 752 753 
					754 757 770 
					756 754 770 
					772 757 773 
					760 773 757 
					770 757 769 
					769 757 772 
					758 768 759 
					765 768 758 
					760 759 773 
					773 759 774 
					768 774 759 
					762 761 764 
					764 761 766 
					763 762 764 
					775 766 764 
					766 775 764 
					767 771 768 
					774 768 771 
					769 774 771 
					769 772 773 
					769 773 774 
				</DataArray>
				<DataArray type="Int32" Name="offsets" format="ascii">
					3 6 9 12 15 18 21 24 27 30 33 36 39 42 45 48 51 54 57 60 63 66 69 72 75 78 81 84 87 90 93 96 99 102 105 108 111 114 117 120 123 126 129 132 135 138 141 144 147 150 153 156 159 162 165 168 171 174 177 180 183 186 189 192 195 198 201 204 207 210 213 216 219 222 225 228 231 234 237 240 243 246 249 252 255 258 261 264 267 270 273 276 279 282 285 288 291 294 297 300 303 306 309 312 315 318 321 324 327 330 333 336 339 342 345 348 351 354 357 360 363 366 369 372 375 378 381 384 387 390 393 396 399 402 405 408 411 414 417 420 423 426 429 432 435 438 441 444 447 450 453 456 459 462 465 468 471 474 477 480 483 486 489 492 495 498 501 504 507 510 513 516 519 522 525 528 531 534 537 540 543 546 549 552 555 558 561 564 567 570 573 576 579 582 585 588 591 594 597 600 603 606 609 612 615 618 621 624 627 630 633 636 639 642 645 648 651 654 657 660 663 666 669 672 675 678 681 684 687 690 693 696 699 702 705 708 711 714 717 720 723 726 729 732 735 738 741 744 747 750 753 756 759 762 765 768 771 774 777 780 783 786 789 792 795 798 801 804 807 810 813 816 819 822 825 828 831 834 837 840 843 846 849 852 855 858 861 864 867 870 873 876 879 882 885 888 891 894 897 900 903 906 909 912 915 918 921 924 927 930 933 936 939 942 945 948 951 954 957 960 963 966 969 972 975 978 981 984 987 990 993 996 999 1002 1005 1008 1011 1014 1017 1020 1023 1026 1029 1032 1035 1038 1041 1044 1047 1050 1053 1056 1059 1062 1065 1068 1071 1074 1077 1080 1083 1086 1089 1092 1095 1098 1101 1104 1107 1110 1113 1116 1119 1122 1125 1128 1131 1134 1137 1140 1143 1146 1149 1152 1155 1158 1161 1164 1167 1170 1173 1176 1179 1182 1185 1188 1191 1194 1197 1200 1203 1206 1209 1212 1215 1218 1221 1224 1227 1230 1233 1236 1239 1242 1245 1248 1251 1254 1257 1260 1263 1266 1269 1272 1275 1278 1281 1284 1287 1290 1293 1296 1299 1302 1305 1308 1311 1314 1317 1320 1323 1326 1329 1332 1335 1338 1341 1344 1347 1350 1353 1356 1359 1362 1365 1368 1371 1374 1377 1380 1383 1386 1389 1392 1395 1398 1401 1404 1407 1410 1413 1416 1419 1422 1425 1428 1431 1434 1437 1440 1443 1446 1449 1452 1455 1458 1461 1464 1467 1470 1473 1476 1479 1482 1485 1488 1491 1494 1497 1500 1503 1506 1509 1512 1515 1518 1521 1524 1527 1530 1533 1536 1539 1542 1545 1548 1551 1554 1557 1560 1563 1566 1569 1572 1575 1578 1581 1584 1587 1590 1593 1596 1599 1602 1605 1608 1611 1614 1617 1620 1623 1626 1629 1632 1635 1638 1641 1644 1647 1650 1653 1656 1659 1662 1665 1668 1671 1674 1677 1680 1683 1686 1689 1692 1695 1698 1701 1704 1707 1710 1713 1716 1719 1722 1725 1728 1731 1734 1737 1740 1743 1746 1749 1752 1755 1758 1761 1764 1767 1770 1773 1776 1779 1782 1785 1788 1791 1794 1797 1800 1803 1806 1809 1812 1815 1818 1821 1824 1827 1830 1833 1836 1839 1842 1845 1848 1851 1854 1857 1860 1863 1866 1869 1872 1875 1878 1881 1884 1887 1890 1893 1896 1899 1902 1905 1908 1911 1914 1917 1920 1923 1926 1929 1932 1935 1938 1941 1944 1947 1950 1953 1956 1959 1962 1965 1968 1971 1974 1977 1980 1983 1986 1989 1992 1995 1998 2001 2004 2007 2010 2013 2016 2019 2022 2025 2028 2031 2034 2037 2040 2043 2046 2049 2052 2055 2058 2061 2064 2067 2070 2073 2076 2079 2082 2085 2088 2091 2094 2097 2100 2103 2106 2109 2112 2115 2118 2121 2124 2127 2130 2133 2136 2139 2142 2145 2148 2151 2154 2157 2160 2163 2166 2169 2172 2175 2178 2181 2184 2187 2190 2193 2196 2199 2202 2205 2208 2211 2214 2217 2220 2223 2226 2229 2232 2235 2238 2241 2244 2247 2250 2253 2256 2259 2262 2265 2268 2271 2274 2277 2280 2283 2286 2289 2292 2295 2298 2301 2304 2307 2310 2313 2316 2319 2322 2325 2328 2331 2334 2337 2340 2343 2346 2349 2352 2355 2358 2361 2364 2367 2370 2373 2376 2379 2382 2385 2388 2391 2394 2397 2400 2403 2406 2409 2412 2415 2418 2421 2424 2427 2430 2433 2436 2439 2442 2445 2448 2451 2454 2457 2460 2463 2466 2469 2472 2475 2478 2481 2484 2487 2490 2493 2496 2499 2502 2505 2508 2511 2514 2517 2520 2523 2526 2529 2532 2535 2538 2541 2544 2547 2550 2553 2556 2559 2562 2565 2568 2571 2574 2577 2580 2583 2586 2589 2592 2595 2598 2601 2604 2607 2610 2613 2616 2619 2622 2625 2628 2631 2634 2637 2640 2643 2646 2649 2652 2655 2658 2661 2664 2667 2670 2673 2676 2679 2682 2685 2688 2691 2694 2697 2700 2703 2706 2709 2712 2715 2718 2721 2724 2727 2730 2733 2736 2739 2742 2745 2748 2751 2754 2757 2760 2763 2766 2769 2772 2775 2778 2781 2784 2787 2790 2793 2796 2799 2802 2805 2808 2811 2814 2817 2820 2823 2826 2829 2832 2835 2838 2841 2844 2847 2850 2853 2856 2859 2862 2865 2868 2871 2874 2877 2880 2883 2886 2889 2892 2895 2898 2901 2904 2907 2910 2913 2916 2919 2922 2925 2928 2931 2934 2937 2940 2943 2946 2949 2952 2955 2958 2961 2964 2967 2970 2973 2976 2979 2982 2985 2988 2991 2994 2997 3000 3003 3006 3009 3012 3015 3018 3021 3024 3027 3030 3033 3036 3039 3042 3045 3048 3051 3054 3057 3060 3063 3066 3069 3072 3075 3078 3081 3084 3087 3090 3093 3096 3099 3102 3105 3108 3111 3114 3117 3120 3123 3126 3129 3132 3135 3138 3141 3144 3147 3150 3153 3156 3159 3162 3165 3168 3171 3174 3177 3180 3183 3186 3189 3192 3195 3198 3201 3204 3207 3210 3213 3216 3219 3222 3225 3228 3231 3234 3237 3240 3243 3246 3249 3252 3255 3258 3261 3264 3267 3270 3273 3276 3279 3282 3285 3288 3291 3294 3297 3300 3303 3306 3309 3312 3315 3318 3321 3324 3327 3330 3333 3336 3339 3342 3345 3348 3351 3354 3357 3360 3363 3366 3369 3372 3375 3378 3381 3384 3387 3390 3393 3396 3399 3402 3405 3408 3411 3414 3417 3420 3423 3426 3429 3432 3435 3438 3441 3444 3447 3450 3453 3456 3459 3462 3465 3468 3471 3474 3477 3480 3483 3486 3489 3492 3495 3498 3501 3504 3507 3510 3513 3516 3519 3522 3525 3528 3531 3534 3537 3540 3543 3546 3549 3552 3555 3558 3561 3564 3567 3570 3573 3576 3579 3582 3585 3588 3591 3594 3597 3600 3603 3606 3609 3612 3615 3618 3621 3624 3627 3630 3633 3636 3639 3642 3645 3648 3651 3654 3657 3660 3663 3666 3669 3672 3675 3678 3681 3684 3687 3690 3693 3696 3699 3702 3705 3708 3711 3714 3717 3720 3723 3726 3729 3732 3735 3738 3741 3744 3747 3750 3753 3756 3759 3762 3765 3768 3771 3774 3777 3780 3783 3786 3789 3792 3795 3798 3801 3804 3807 3810 3813 3816 3819 3822 3825 3828 3831 3834 3837 3840 3843 3846 3849 3852 3855 3858 3861 3864 3867 3870 3873 3876 3879 3882 3885 3888 3891 3894 3897 3900 3903 3906 3909 3912 3915 3918 3921 3924 3927 3930 3933 3936 3939 3942 3945 3948 3951 3954 3957 3960 3963 3966 3969 3972 3975 3978 3981 3984 3987 3990 3993 3996 3999 4002 4005 4008 4011 4014 4017 4020 4023 4026 4029 4032 4035 4038 4041 4044 4047 4050 4053 4056 4059 4062 4065 4068 4071 4074 4077 4080 4083 4086 4089 4092 4095 4098 4101 4104 4107 4110 4113 4116 4119 4122 4125 4128 4131 4134 4137 4140 4143 4146 4149 4152 4155 4158 4161 4164 4167 4170 4173 4176 4179 4182 4185 4188 4191 4194 4197 4200 4203 4206 4209 4212 4215 4218 4221 4224 4227 4230 4233 4236 4239 4242 4245 4248 4251 4254 4257 4260 4263 4266 4269 4272 4275 4278 4281 4284 4287 4290 4293 4296 4299 4302 4305 4308 4311 4314 4317 4320 4323 4326 4329 4332 4335 4338 4341 4344 4347 4350 4353 4356 4359 4362 4365 4368 4371 4374 4377 4380 4383 4386 4389 4392 4395 4398 4401 4404 4407 4410 4413 4416 4419 4422 4425 4428 4431 4434 4437 4440 4443 4446 4449 4452 4455 4458 4461 4464 4467 4470 4473 4476 4479 4482 4485 4488 4491 4494 4497 4500 4503 4506 4509 4512 4515 4518 4521 4524 4527 4530 4533 4536 4539 4542 4545 4548 4551 4554 4557 4560 4563 4566 4569 4572 4575 4578 4581 4584 4587 4590 4593 4596 4599 4602 4605 4608 4611 4614 4617 4620 4623 4626 4629 4632 4635 4638 4641 4644 4647 4650 4653 4656 4659 4662 4665 4668 4671 4674 4677 4680 4683 4686 4689 4692 
				</DataArray>
			</Polys>
		</Piece>
	</PolyData>
</VTKFile>
