####
#
# OBJ File Generated by Meshlab
#
####
# Object clavicle_l.obj
#
# Vertices: 264
# Faces: 524
#
####
vn -6.172182 -0.678995 0.185838
v 0.013844 0.380988 -0.050149 1.000000 1.000000 1.000000
vn -4.069500 3.467772 1.474917
v 0.014488 0.389610 -0.052621 1.000000 1.000000 1.000000
vn -5.516383 -1.703763 0.888075
v 0.012734 0.382894 -0.056015 1.000000 1.000000 1.000000
vn -3.795219 -4.459016 -1.343175
v 0.014584 0.378828 -0.048505 1.000000 1.000000 1.000000
vn -5.959141 1.639540 -0.480810
v 0.013348 0.383828 -0.038181 1.000000 1.000000 1.000000
vn -3.240945 -3.176222 -2.086992
v 0.012783 0.375666 -0.037419 1.000000 1.000000 1.000000
vn -2.326483 3.743110 2.223675
v 0.005068 0.395055 -0.078005 1.000000 1.000000 1.000000
vn -2.834438 5.382646 1.129119
v 0.017471 0.388224 -0.038112 1.000000 1.000000 1.000000
vn -3.354470 5.143137 1.290204
v 0.016640 0.387529 -0.037851 1.000000 1.000000 1.000000
vn -3.797381 4.394835 0.624920
v 0.014468 0.386190 -0.036331 1.000000 1.000000 1.000000
vn -2.564904 5.574655 1.281010
v 0.015664 0.386823 -0.037204 1.000000 1.000000 1.000000
vn 1.531282 5.152054 0.493209
v 0.019969 0.390767 -0.050291 1.000000 1.000000 1.000000
vn -2.049756 -4.581500 -0.278064
v 0.008458 0.385545 -0.071369 1.000000 1.000000 1.000000
vn -1.356936 -5.022608 -1.287715
v 0.014520 0.380898 -0.057760 1.000000 1.000000 1.000000
vn -5.585497 -1.001939 2.049838
v 0.007488 0.387909 -0.070106 1.000000 1.000000 1.000000
vn 2.468697 -5.018201 -1.965967
v 0.019287 0.372642 -0.029635 1.000000 1.000000 1.000000
vn -2.782196 4.767752 0.452870
v 0.013614 0.385178 -0.031580 1.000000 1.000000 1.000000
vn -5.397928 1.526209 -2.283931
v 0.008214 0.375435 -0.028120 1.000000 1.000000 1.000000
vn -2.183557 5.267237 -0.041903
v 0.012974 0.384653 -0.028346 1.000000 1.000000 1.000000
vn -3.896407 4.653948 -0.226667
v 0.012022 0.384138 -0.024399 1.000000 1.000000 1.000000
vn -4.908173 3.373375 0.105370
v 0.009712 0.382459 -0.014504 1.000000 1.000000 1.000000
vn -4.618966 -1.343170 -3.897065
v 0.008788 0.373425 -0.028801 1.000000 1.000000 1.000000
vn -2.032848 -4.519436 -3.150568
v 0.010066 0.371904 -0.029091 1.000000 1.000000 1.000000
vn -3.375791 -3.027599 1.167402
v 0.000830 0.389844 -0.083611 1.000000 1.000000 1.000000
vn -4.769273 0.493893 2.321029
v -0.007414 0.399764 -0.094144 1.000000 1.000000 1.000000
vn -0.221860 4.235533 2.857439
v -0.004687 0.402626 -0.093737 1.000000 1.000000 1.000000
vn 3.021817 5.469797 0.574918
v 0.000672 0.400750 -0.099386 1.000000 1.000000 1.000000
vn 1.172277 6.038747 1.181700
v 0.004947 0.397414 -0.089056 1.000000 1.000000 1.000000
vn 3.523866 3.275798 -0.580900
v 0.017063 0.392964 -0.073975 1.000000 1.000000 1.000000
vn -2.128055 5.588570 1.244023
v 0.017998 0.388212 -0.036820 1.000000 1.000000 1.000000
vn -3.258335 5.167442 1.434830
v 0.017316 0.387384 -0.035389 1.000000 1.000000 1.000000
vn -2.985327 5.355125 1.240065
v 0.016438 0.386748 -0.035270 1.000000 1.000000 1.000000
vn -2.222681 5.746861 1.154233
v 0.015432 0.386355 -0.035568 1.000000 1.000000 1.000000
vn -2.122480 5.803181 1.127282
v 0.015366 0.386088 -0.034227 1.000000 1.000000 1.000000
vn -1.222433 5.977672 1.417484
v 0.014550 0.385534 -0.032796 1.000000 1.000000 1.000000
vn 5.149559 1.285891 -0.319314
v 0.025418 0.385441 -0.038594 1.000000 1.000000 1.000000
vn 1.930179 5.066595 0.763020
v 0.022155 0.388868 -0.037277 1.000000 1.000000 1.000000
vn 3.827564 -2.253014 -1.904235
v 0.017059 0.389122 -0.075642 1.000000 1.000000 1.000000
vn -0.072617 -5.874511 -1.747714
v 0.004709 0.389869 -0.088679 1.000000 1.000000 1.000000
vn 0.965306 -5.597284 -1.897240
v 0.007883 0.388555 -0.084550 1.000000 1.000000 1.000000
vn 3.445479 -3.563355 -1.499674
v 0.022189 0.378214 -0.045837 1.000000 1.000000 1.000000
vn 5.505252 -2.483980 -0.726201
v 0.024562 0.378335 -0.028962 1.000000 1.000000 1.000000
vn 4.832752 -3.578514 -0.860936
v 0.023015 0.372744 -0.020846 1.000000 1.000000 1.000000
vn -0.070001 -5.457231 -2.261835
v 0.013516 0.369706 -0.026224 1.000000 1.000000 1.000000
vn 2.256229 -5.246651 -0.846692
v 0.018912 0.369230 -0.021448 1.000000 1.000000 1.000000
vn -1.172834 5.794618 1.272471
v 0.016274 0.384341 -0.027748 1.000000 1.000000 1.000000
vn -5.415489 1.614619 -0.826209
v 0.006317 0.374077 -0.025330 1.000000 1.000000 1.000000
vn -4.620311 -1.051121 -2.172710
v 0.006437 0.372689 -0.026492 1.000000 1.000000 1.000000
vn 0.588117 5.858614 -1.269129
v 0.015920 0.385223 -0.022488 1.000000 1.000000 1.000000
vn -1.182436 6.154507 -0.427800
v 0.014259 0.385051 -0.020810 1.000000 1.000000 1.000000
vn -3.144397 5.436172 0.034309
v 0.012512 0.384343 -0.022590 1.000000 1.000000 1.000000
vn -2.205607 5.848140 -0.254501
v 0.013244 0.384769 -0.021762 1.000000 1.000000 1.000000
vn -0.014760 5.056660 -0.668238
v 0.016513 0.383866 -0.024787 1.000000 1.000000 1.000000
vn -5.818659 1.743499 0.789067
v 0.008139 0.378753 -0.017744 1.000000 1.000000 1.000000
vn -2.063032 5.528456 0.211427
v 0.013362 0.385383 -0.014968 1.000000 1.000000 1.000000
vn -4.293722 1.908946 1.992099
v 0.009825 0.382486 -0.013286 1.000000 1.000000 1.000000
vn -6.026831 1.233654 1.250793
v 0.009040 0.380500 -0.015413 1.000000 1.000000 1.000000
vn -3.536674 -2.542369 -4.096056
v 0.007871 0.372262 -0.027734 1.000000 1.000000 1.000000
vn -3.308468 -4.216344 -1.875589
v 0.007234 0.371714 -0.026569 1.000000 1.000000 1.000000
vn -3.371861 -4.185602 0.442456
v -0.003028 0.391929 -0.091472 1.000000 1.000000 1.000000
vn -5.181768 -1.150297 0.536470
v -0.009376 0.397402 -0.103566 1.000000 1.000000 1.000000
vn -3.589878 3.839210 0.023619
v -0.007358 0.403367 -0.101318 1.000000 1.000000 1.000000
vn -1.073237 3.187165 1.399919
v -0.006026 0.404058 -0.095427 1.000000 1.000000 1.000000
vn 3.191850 5.381813 0.552148
v 0.000647 0.401006 -0.101967 1.000000 1.000000 1.000000
vn 2.958691 5.533976 0.246955
v -0.001514 0.402171 -0.101625 1.000000 1.000000 1.000000
vn 3.230217 5.350040 0.357311
v -0.001450 0.402134 -0.100175 1.000000 1.000000 1.000000
vn 3.535812 5.031618 -0.284660
v 0.006350 0.397709 -0.095568 1.000000 1.000000 1.000000
vn 2.853706 5.553912 0.344751
v 0.002138 0.399929 -0.100251 1.000000 1.000000 1.000000
vn 1.287134 6.079776 0.845270
v 0.005971 0.397534 -0.090647 1.000000 1.000000 1.000000
vn 0.909556 6.171652 0.725984
v 0.008489 0.396875 -0.088392 1.000000 1.000000 1.000000
vn 3.507405 4.213949 -1.171765
v 0.010980 0.396247 -0.086139 1.000000 1.000000 1.000000
vn 1.129098 4.504712 0.868649
v 0.011809 0.396336 -0.082704 1.000000 1.000000 1.000000
vn 5.124177 -1.202671 -2.260740
v 0.009465 0.394635 -0.091915 1.000000 1.000000 1.000000
vn -2.836942 5.263704 1.890933
v 0.017700 0.387196 -0.034056 1.000000 1.000000 1.000000
vn -1.676301 5.389522 1.908111
v 0.019319 0.387506 -0.032478 1.000000 1.000000 1.000000
vn -2.418399 5.539042 1.665953
v 0.016552 0.386404 -0.033589 1.000000 1.000000 1.000000
vn 3.054984 4.650928 1.122468
v 0.023411 0.385577 -0.026419 1.000000 1.000000 1.000000
vn 5.301908 1.543990 1.200458
v 0.025359 0.380522 -0.019230 1.000000 1.000000 1.000000
vn 4.232441 -0.416749 2.355224
v 0.025096 0.376961 -0.017302 1.000000 1.000000 1.000000
vn 3.865125 -1.787745 2.465316
v 0.024600 0.375463 -0.017208 1.000000 1.000000 1.000000
vn 2.938791 -4.704972 -2.805668
v 0.009199 0.389658 -0.085515 1.000000 1.000000 1.000000
vn 1.011461 -5.602670 -2.364500
v 0.006847 0.389167 -0.086478 1.000000 1.000000 1.000000
vn -1.248585 -5.827840 -1.548704
v -0.001075 0.392767 -0.098823 1.000000 1.000000 1.000000
vn -0.373272 -5.984170 -1.629368
v 0.000399 0.392266 -0.097548 1.000000 1.000000 1.000000
vn 1.228250 -5.572458 -2.276335
v 0.001340 0.392547 -0.098269 1.000000 1.000000 1.000000
vn 2.107741 -5.273897 -2.634674
v 0.004364 0.392641 -0.095470 1.000000 1.000000 1.000000
vn 2.454138 -4.935075 -2.785560
v 0.007593 0.390138 -0.087884 1.000000 1.000000 1.000000
vn 3.906390 -4.559891 0.398844
v 0.021693 0.371158 -0.019364 1.000000 1.000000 1.000000
vn 5.082191 -3.641495 0.255744
v 0.023000 0.372764 -0.019071 1.000000 1.000000 1.000000
vn -0.206681 -5.603517 1.241750
v 0.016891 0.368934 -0.020514 1.000000 1.000000 1.000000
vn -1.218122 -5.464772 1.168191
v 0.013912 0.369077 -0.021758 1.000000 1.000000 1.000000
vn -1.786671 -5.625414 -0.407388
v 0.010365 0.369790 -0.024242 1.000000 1.000000 1.000000
vn 1.571654 -4.407927 2.840885
v 0.020052 0.370218 -0.018720 1.000000 1.000000 1.000000
vn 0.918608 -4.963452 2.220579
v 0.018493 0.369210 -0.019772 1.000000 1.000000 1.000000
vn -2.053255 5.640381 1.719357
v 0.017276 0.385760 -0.030534 1.000000 1.000000 1.000000
vn -2.583006 5.530125 1.430747
v 0.017230 0.384826 -0.027896 1.000000 1.000000 1.000000
vn -5.565021 1.503956 0.679243
v 0.007277 0.377010 -0.019365 1.000000 1.000000 1.000000
vn -5.115392 -2.179648 0.139493
v 0.006322 0.372558 -0.025377 1.000000 1.000000 1.000000
vn -5.055832 -1.790494 1.817477
v 0.006750 0.373559 -0.021778 1.000000 1.000000 1.000000
vn 0.607082 5.941561 -1.522439
v 0.017051 0.385252 -0.021689 1.000000 1.000000 1.000000
vn 0.672150 5.961027 0.558915
v 0.016550 0.385678 -0.015903 1.000000 1.000000 1.000000
vn 0.743908 5.566805 -2.457836
v 0.017066 0.384554 -0.023033 1.000000 1.000000 1.000000
vn -1.988294 5.561636 -1.041905
v 0.018000 0.384715 -0.022829 1.000000 1.000000 1.000000
vn -2.950571 5.471353 0.785452
v 0.017906 0.384777 -0.025948 1.000000 1.000000 1.000000
vn -4.996790 -1.367800 2.708943
v 0.007874 0.376259 -0.017622 1.000000 1.000000 1.000000
vn 0.740867 4.728553 2.771764
v 0.014783 0.385207 -0.012942 1.000000 1.000000 1.000000
vn -0.862852 4.562305 3.022973
v 0.013298 0.384885 -0.012492 1.000000 1.000000 1.000000
vn -2.788411 3.796480 2.479947
v 0.011942 0.384271 -0.012328 1.000000 1.000000 1.000000
vn -1.636280 1.905831 5.014797
v 0.012344 0.383280 -0.011448 1.000000 1.000000 1.000000
vn -3.653846 0.793161 4.573483
v 0.010945 0.382173 -0.012046 1.000000 1.000000 1.000000
vn -2.060008 -1.758242 4.457172
v 0.011813 0.378194 -0.011596 1.000000 1.000000 1.000000
vn -2.735712 -5.263422 -0.701464
v 0.008569 0.370619 -0.024903 1.000000 1.000000 1.000000
vn -2.991882 -4.991958 -0.444288
v -0.007647 0.395382 -0.104527 1.000000 1.000000 1.000000
vn -0.233124 -6.125606 -1.268167
v -0.003004 0.394822 -0.104742 1.000000 1.000000 1.000000
vn -0.798764 -5.903054 -1.728653
v -0.002268 0.394202 -0.102876 1.000000 1.000000 1.000000
vn -4.698495 0.228857 0.467334
v -0.010984 0.400777 -0.113010 1.000000 1.000000 1.000000
vn -4.300201 -3.988739 -1.195576
v -0.009593 0.398700 -0.113856 1.000000 1.000000 1.000000
vn -4.226980 -4.310759 -0.756461
v -0.009162 0.397701 -0.110569 1.000000 1.000000 1.000000
vn -3.342087 4.484049 0.589423
v -0.007154 0.403348 -0.106323 1.000000 1.000000 1.000000
vn -3.851632 4.523493 1.905388
v -0.008313 0.404072 -0.113743 1.000000 1.000000 1.000000
vn -3.637035 4.173983 -0.212395
v -0.007254 0.403265 -0.103331 1.000000 1.000000 1.000000
vn -0.751556 6.211758 -0.437177
v -0.005901 0.403613 -0.101475 1.000000 1.000000 1.000000
vn 2.973478 5.465920 0.155576
v -0.002944 0.403046 -0.100384 1.000000 1.000000 1.000000
vn 2.211982 5.860433 0.102682
v -0.003932 0.403475 -0.100394 1.000000 1.000000 1.000000
vn 0.554482 6.047673 -0.543199
v -0.004754 0.403730 -0.101432 1.000000 1.000000 1.000000
vn 3.137413 5.390821 0.673540
v 0.000672 0.401273 -0.104345 1.000000 1.000000 1.000000
vn 3.233720 5.364297 0.395049
v 0.001923 0.400274 -0.102773 1.000000 1.000000 1.000000
vn 1.747898 5.952024 0.096875
v -0.003998 0.403462 -0.102974 1.000000 1.000000 1.000000
vn 3.531350 -0.839786 0.541913
v 0.005465 0.398490 -0.112729 1.000000 1.000000 1.000000
vn 1.301843 6.127955 0.292793
v 0.007283 0.397364 -0.091444 1.000000 1.000000 1.000000
vn 5.242332 0.234812 -1.254377
v 0.007436 0.396010 -0.097316 1.000000 1.000000 1.000000
vn 2.523922 -4.138663 -3.035821
v 0.006545 0.392806 -0.094822 1.000000 1.000000 1.000000
vn -3.068535 4.937349 2.224092
v 0.018605 0.386957 -0.032490 1.000000 1.000000 1.000000
vn -0.947897 5.617196 1.492435
v 0.019816 0.387085 -0.030758 1.000000 1.000000 1.000000
vn -2.704426 5.384118 1.527140
v 0.018353 0.385648 -0.029144 1.000000 1.000000 1.000000
vn -1.310393 5.634997 1.480643
v 0.019893 0.386610 -0.029003 1.000000 1.000000 1.000000
vn -1.230012 5.741438 1.320011
v 0.019834 0.386134 -0.027187 1.000000 1.000000 1.000000
vn -1.184711 5.810344 1.018106
v 0.019769 0.385731 -0.025268 1.000000 1.000000 1.000000
vn -0.786545 6.115901 0.419272
v 0.019583 0.385416 -0.023451 1.000000 1.000000 1.000000
vn -0.995131 6.068738 -0.170530
v 0.018969 0.385297 -0.022140 1.000000 1.000000 1.000000
vn 3.593682 3.831761 2.419859
v 0.022967 0.383388 -0.018539 1.000000 1.000000 1.000000
vn 1.555071 5.989428 0.651277
v 0.019406 0.385113 -0.019535 1.000000 1.000000 1.000000
vn 4.112010 1.960859 3.585519
v 0.024913 0.380297 -0.018164 1.000000 1.000000 1.000000
vn 3.612189 2.740868 4.115824
v 0.024026 0.381469 -0.018199 1.000000 1.000000 1.000000
vn 2.409806 0.188533 5.562180
v 0.024168 0.377070 -0.016782 1.000000 1.000000 1.000000
vn 3.076467 -3.123866 2.925191
v 0.022861 0.372768 -0.017595 1.000000 1.000000 1.000000
vn 1.175147 -1.876123 5.760062
v 0.022560 0.374058 -0.016950 1.000000 1.000000 1.000000
vn 1.440183 -1.063407 5.817313
v 0.023484 0.375565 -0.016716 1.000000 1.000000 1.000000
vn -0.109192 -5.860965 -2.094429
v -0.001483 0.393597 -0.101307 1.000000 1.000000 1.000000
vn 1.777411 -5.461904 -2.496672
v 0.001571 0.393562 -0.100184 1.000000 1.000000 1.000000
vn 0.851642 -5.766549 -2.314969
v 0.000318 0.394098 -0.101844 1.000000 1.000000 1.000000
vn 0.223959 -4.177254 -3.411786
v 0.006069 0.393338 -0.095229 1.000000 1.000000 1.000000
vn 1.684126 -3.294214 -5.053763
v 0.005698 0.392934 -0.095099 1.000000 1.000000 1.000000
vn 1.156190 -4.904397 -3.210132
v 0.005222 0.392486 -0.094949 1.000000 1.000000 1.000000
vn -1.419577 -5.024898 3.360076
v 0.016017 0.369332 -0.020142 1.000000 1.000000 1.000000
vn -2.894319 -5.049932 1.827119
v 0.009008 0.370603 -0.023200 1.000000 1.000000 1.000000
vn -2.162701 -4.448312 3.742512
v 0.014460 0.369618 -0.020569 1.000000 1.000000 1.000000
vn -1.112216 -2.924310 5.270120
v 0.017536 0.370894 -0.018391 1.000000 1.000000 1.000000
vn 0.237094 -2.915669 5.280232
v 0.020110 0.371572 -0.017674 1.000000 1.000000 1.000000
vn -1.297984 -3.591867 4.555669
v 0.016534 0.369979 -0.019133 1.000000 1.000000 1.000000
vn -4.087575 -4.001865 2.369035
v 0.007648 0.372090 -0.022450 1.000000 1.000000 1.000000
vn -4.217730 -4.101332 1.227839
v 0.007468 0.371526 -0.023836 1.000000 1.000000 1.000000
vn -3.546961 -3.972709 3.221873
v 0.007934 0.372768 -0.021150 1.000000 1.000000 1.000000
vn -0.062461 6.146057 -0.836403
v 0.018127 0.385258 -0.021374 1.000000 1.000000 1.000000
vn 2.705096 4.061388 2.713242
v 0.018217 0.384938 -0.014874 1.000000 1.000000 1.000000
vn -3.171368 5.316985 1.069345
v 0.018797 0.385597 -0.027451 1.000000 1.000000 1.000000
vn -3.878109 -3.781999 3.176630
v 0.009393 0.375626 -0.016371 1.000000 1.000000 1.000000
vn -4.077008 -2.529608 3.392069
v 0.010201 0.376434 -0.014230 1.000000 1.000000 1.000000
vn 1.796219 3.082900 4.807589
v 0.015050 0.383761 -0.011850 1.000000 1.000000 1.000000
vn 0.085956 -0.572868 5.859859
v 0.013764 0.380479 -0.010996 1.000000 1.000000 1.000000
vn 1.749440 0.974455 5.009978
v 0.015287 0.382254 -0.011086 1.000000 1.000000 1.000000
vn -1.403368 -3.631318 4.328268
v 0.011686 0.376869 -0.012643 1.000000 1.000000 1.000000
vn 0.523284 -2.781107 5.306307
v 0.013100 0.378378 -0.011516 1.000000 1.000000 1.000000
vn -0.739211 -6.014864 -0.944762
v -0.004800 0.395141 -0.107736 1.000000 1.000000 1.000000
vn -2.498815 -5.585178 -1.269241
v -0.006984 0.397234 -0.114013 1.000000 1.000000 1.000000
vn -1.005503 -6.031720 -1.099233
v -0.004453 0.395666 -0.110571 1.000000 1.000000 1.000000
vn 0.775029 -6.167098 -0.908362
v -0.003163 0.395334 -0.107969 1.000000 1.000000 1.000000
vn 0.846208 -6.147386 -0.951017
v -0.001614 0.395605 -0.108164 1.000000 1.000000 1.000000
vn 0.561939 -6.055176 -1.548996
v -0.001164 0.395160 -0.105662 1.000000 1.000000 1.000000
vn 0.759037 -5.908011 -1.971978
v -0.000571 0.394565 -0.103665 1.000000 1.000000 1.000000
vn -3.929224 -4.233532 -1.726646
v -0.008377 0.398935 -0.117719 1.000000 1.000000 1.000000
vn -4.143830 3.315310 0.985530
v -0.010009 0.405155 -0.118136 1.000000 1.000000 1.000000
vn -4.249250 0.103078 -1.819609
v -0.009778 0.405326 -0.125123 1.000000 1.000000 1.000000
vn -1.946736 5.626907 1.507994
v -0.007298 0.404685 -0.113533 1.000000 1.000000 1.000000
vn -0.450354 6.243510 0.322988
v -0.005448 0.403610 -0.106198 1.000000 1.000000 1.000000
vn -0.066204 6.170944 1.088547
v -0.005679 0.403910 -0.109704 1.000000 1.000000 1.000000
vn -2.026387 5.598218 1.938452
v -0.008556 0.405526 -0.117493 1.000000 1.000000 1.000000
vn -1.344707 5.683591 1.850237
v -0.007391 0.405386 -0.115770 1.000000 1.000000 1.000000
vn 1.433164 5.980797 0.483029
v -0.003722 0.403559 -0.105792 1.000000 1.000000 1.000000
vn 2.616100 5.640057 0.876276
v -0.001274 0.402614 -0.106775 1.000000 1.000000 1.000000
vn 3.816619 4.941905 0.655105
v 0.002022 0.400489 -0.105345 1.000000 1.000000 1.000000
vn 3.440493 5.146154 0.822834
v 0.001193 0.401469 -0.107538 1.000000 1.000000 1.000000
vn 3.418040 -4.495089 -2.328937
v 0.006406 0.394110 -0.096689 1.000000 1.000000 1.000000
vn 3.740795 4.815266 1.244120
v 0.002083 0.401526 -0.110974 1.000000 1.000000 1.000000
vn 1.317917 -5.857708 -1.839258
v 0.001319 0.395043 -0.103967 1.000000 1.000000 1.000000
vn 1.155962 -5.968818 -1.563788
v 0.000639 0.395460 -0.105972 1.000000 1.000000 1.000000
vn 1.339957 -5.970597 -1.330695
v 0.000148 0.395877 -0.108403 1.000000 1.000000 1.000000
vn 0.789571 -6.173923 -0.642370
v -0.003015 0.395719 -0.110791 1.000000 1.000000 1.000000
vn 1.467002 -6.022520 0.782284
v 0.003487 0.397047 -0.120274 1.000000 1.000000 1.000000
vn 3.751677 -0.474039 2.106158
v 0.008999 0.399071 -0.121800 1.000000 1.000000 1.000000
vn 1.608071 -6.049432 0.405562
v 0.002318 0.397016 -0.117162 1.000000 1.000000 1.000000
vn 3.632579 4.809602 1.571889
v 0.003241 0.401990 -0.115551 1.000000 1.000000 1.000000
vn 3.694887 0.682493 4.567225
v 0.020693 0.381591 -0.015182 1.000000 1.000000 1.000000
vn 3.981535 2.313882 4.100546
v 0.021835 0.382190 -0.016621 1.000000 1.000000 1.000000
vn 3.583391 1.781323 4.799668
v 0.022925 0.380361 -0.017090 1.000000 1.000000 1.000000
vn 0.755744 -1.171049 6.117481
v 0.021936 0.375625 -0.016569 1.000000 1.000000 1.000000
vn 2.568946 -0.017687 5.400723
v 0.021606 0.379786 -0.015785 1.000000 1.000000 1.000000
vn 0.541981 -2.410440 5.634032
v 0.021273 0.372649 -0.017280 1.000000 1.000000 1.000000
vn 0.371741 -1.915010 5.961097
v 0.020760 0.374165 -0.016854 1.000000 1.000000 1.000000
vn -2.234232 -4.814212 3.319592
v 0.011015 0.370614 -0.021591 1.000000 1.000000 1.000000
vn -2.486644 -4.259109 3.592819
v 0.009205 0.371327 -0.021758 1.000000 1.000000 1.000000
vn -2.494171 -2.664376 4.957798
v 0.015179 0.370462 -0.019458 1.000000 1.000000 1.000000
vn -1.244491 -3.297254 5.016012
v 0.016216 0.371526 -0.018601 1.000000 1.000000 1.000000
vn -0.830550 -2.567451 5.640683
v 0.018638 0.371984 -0.017678 1.000000 1.000000 1.000000
vn -1.066425 -4.174015 3.813944
v 0.011747 0.375437 -0.013974 1.000000 1.000000 1.000000
vn 1.723819 -2.862092 4.872893
v 0.014612 0.378518 -0.011730 1.000000 1.000000 1.000000
vn 3.205204 -1.335227 5.007715
v 0.016298 0.380301 -0.011946 1.000000 1.000000 1.000000
vn -0.439930 -6.196021 -0.029854
v 0.001237 0.396562 -0.123088 1.000000 1.000000 1.000000
vn -2.080178 -5.828732 -0.938925
v 0.000287 0.397023 -0.125856 1.000000 1.000000 1.000000
vn -2.599911 -5.518266 -1.456009
v -0.005960 0.397666 -0.117683 1.000000 1.000000 1.000000
vn -2.815975 -5.373287 -1.629032
v -0.007057 0.398391 -0.118195 1.000000 1.000000 1.000000
vn -2.535697 -5.258390 -2.010639
v 0.001151 0.397171 -0.128169 1.000000 1.000000 1.000000
vn -3.819731 -1.791447 -3.540176
v -0.000512 0.402027 -0.135725 1.000000 1.000000 1.000000
vn 0.336788 5.716416 1.960628
v -0.006050 0.408916 -0.124969 1.000000 1.000000 1.000000
vn -2.629342 3.764915 -0.558557
v -0.007445 0.408896 -0.125447 1.000000 1.000000 1.000000
vn 0.171885 6.072554 1.457503
v -0.005368 0.404935 -0.113771 1.000000 1.000000 1.000000
vn 1.208556 6.000385 0.970196
v -0.003536 0.403903 -0.109484 1.000000 1.000000 1.000000
vn 0.114624 5.789715 2.384485
v -0.005832 0.407155 -0.120833 1.000000 1.000000 1.000000
vn 1.085672 5.876514 1.904060
v -0.004476 0.405952 -0.118311 1.000000 1.000000 1.000000
vn 2.646309 5.588277 1.088575
v -0.000649 0.402898 -0.110415 1.000000 1.000000 1.000000
vn 2.749176 5.476748 1.363637
v 0.000305 0.403506 -0.115025 1.000000 1.000000 1.000000
vn 1.611309 -6.033279 0.160489
v 0.000630 0.396690 -0.117297 1.000000 1.000000 1.000000
vn 2.505229 -4.855481 1.130609
v 0.009132 0.396584 -0.126192 1.000000 1.000000 1.000000
vn -0.296114 -5.803759 -0.805511
v 0.005488 0.395972 -0.128742 1.000000 1.000000 1.000000
vn 1.016041 -6.194266 0.244290
v 0.001823 0.396751 -0.120268 1.000000 1.000000 1.000000
vn 4.247210 3.077309 -0.319838
v 0.010836 0.401220 -0.129594 1.000000 1.000000 1.000000
vn 4.661009 -0.951043 0.847524
v 0.011570 0.398518 -0.128156 1.000000 1.000000 1.000000
vn 2.885891 5.378905 1.470246
v 0.001619 0.403920 -0.119364 1.000000 1.000000 1.000000
vn 1.416242 -2.866993 5.294599
v 0.017947 0.375349 -0.016046 1.000000 1.000000 1.000000
vn 2.833154 -2.954777 4.433130
v 0.015853 0.378414 -0.012447 1.000000 1.000000 1.000000
vn -1.508263 -5.857158 -1.038332
v 0.002973 0.396317 -0.127540 1.000000 1.000000 1.000000
vn -3.501364 -3.171427 -3.358895
v 0.000550 0.401163 -0.136098 1.000000 1.000000 1.000000
vn -3.209977 0.707052 -4.967595
v 0.000187 0.403143 -0.136316 1.000000 1.000000 1.000000
vn -2.811177 2.606069 -3.288568
v -0.003168 0.409327 -0.131726 1.000000 1.000000 1.000000
vn 2.796349 5.210499 2.077197
v 0.001401 0.406030 -0.125550 1.000000 1.000000 1.000000
vn 2.528177 5.013571 2.004740
v -0.000395 0.409185 -0.129006 1.000000 1.000000 1.000000
vn 2.910860 4.724751 2.774486
v 0.000131 0.407842 -0.127359 1.000000 1.000000 1.000000
vn -0.104021 4.617935 -1.271710
v -0.002185 0.410190 -0.131047 1.000000 1.000000 1.000000
vn 2.246964 5.651225 1.464448
v -0.001589 0.405400 -0.118934 1.000000 1.000000 1.000000
vn 1.740786 5.847748 1.343639
v -0.002654 0.404630 -0.114351 1.000000 1.000000 1.000000
vn 2.418283 -1.176160 -1.587039
v 0.011169 0.397734 -0.132807 1.000000 1.000000 1.000000
vn -2.410341 -4.194607 -2.615141
v 0.003433 0.398657 -0.136183 1.000000 1.000000 1.000000
vn 0.783313 -3.971654 -3.342184
v 0.005700 0.398162 -0.136180 1.000000 1.000000 1.000000
vn 3.878030 4.636413 1.664446
v 0.002330 0.407286 -0.130114 1.000000 1.000000 1.000000
vn 3.304389 5.005599 1.867923
v 0.003387 0.405556 -0.127497 1.000000 1.000000 1.000000
vn 4.217019 4.617673 -0.100066
v 0.003644 0.406402 -0.131585 1.000000 1.000000 1.000000
vn 3.798762 3.738237 -2.896490
v 0.004798 0.404966 -0.133241 1.000000 1.000000 1.000000
vn -0.453207 0.304067 -4.412826
v 0.001939 0.401831 -0.137396 1.000000 1.000000 1.000000
vn -0.508335 2.773304 -4.733488
v 0.000484 0.405443 -0.135636 1.000000 1.000000 1.000000
vn 2.469795 3.858835 -1.949005
v 0.002294 0.408126 -0.132913 1.000000 1.000000 1.000000
vn 3.512402 4.777687 2.055068
v 0.001810 0.406840 -0.128127 1.000000 1.000000 1.000000
vn 3.070714 5.114140 0.642284
v 0.000954 0.408928 -0.131090 1.000000 1.000000 1.000000
vn 0.899535 -0.529976 -4.093534
v 0.004748 0.399475 -0.137290 1.000000 1.000000 1.000000
vn 4.397970 4.269683 1.074166
v 0.002433 0.407761 -0.131597 1.000000 1.000000 1.000000
# 264 vertices, 0 vertices normals

f 1//1 2//2 3//3
f 3//3 4//4 1//1
f 2//2 1//1 5//5
f 1//1 6//6 5//5
f 4//4 6//6 1//1
f 7//7 3//3 2//2
f 8//8 2//2 9//9
f 2//2 10//10 11//11
f 2//2 11//11 9//9
f 2//2 5//5 10//10
f 12//12 2//2 8//8
f 12//12 7//7 2//2
f 13//13 14//14 3//3
f 15//15 13//13 3//3
f 4//4 3//3 14//14
f 3//3 7//7 15//15
f 16//16 6//6 4//4
f 14//14 16//16 4//4
f 5//5 17//17 10//10
f 5//5 6//6 18//18
f 5//5 19//19 17//17
f 5//5 20//20 19//19
f 5//5 21//21 20//20
f 5//5 18//18 21//21
f 22//22 18//18 6//6
f 22//22 6//6 23//23
f 16//16 23//23 6//6
f 15//15 7//7 24//24
f 25//25 24//24 7//7
f 7//7 26//26 25//25
f 7//7 27//27 26//26
f 7//7 28//28 27//27
f 29//29 28//28 7//7
f 7//7 12//12 29//29
f 9//9 30//30 8//8
f 12//12 8//8 30//30
f 30//30 9//9 31//31
f 9//9 11//11 32//32
f 9//9 32//32 31//31
f 11//11 10//10 33//33
f 10//10 34//34 33//33
f 35//35 10//10 17//17
f 34//34 10//10 35//35
f 32//32 11//11 33//33
f 29//29 12//12 36//36
f 36//36 12//12 37//37
f 12//12 30//30 37//37
f 13//13 38//38 14//14
f 15//15 24//24 13//13
f 13//13 24//24 39//39
f 40//40 38//38 13//13
f 40//40 13//13 39//39
f 16//16 14//14 41//41
f 38//38 41//41 14//14
f 16//16 42//42 43//43
f 44//44 23//23 16//16
f 42//42 16//16 41//41
f 45//45 16//16 43//43
f 44//44 16//16 45//45
f 35//35 17//17 46//46
f 17//17 19//19 46//46
f 18//18 47//47 21//21
f 18//18 48//48 47//47
f 48//48 18//18 22//22
f 49//49 19//19 50//50
f 19//19 20//20 51//51
f 51//51 52//52 19//19
f 19//19 52//52 50//50
f 53//53 19//19 49//49
f 19//19 53//53 46//46
f 51//51 20//20 21//21
f 54//54 21//21 47//47
f 55//55 51//51 21//21
f 55//55 21//21 56//56
f 21//21 54//54 57//57
f 56//56 21//21 57//57
f 58//58 22//22 23//23
f 48//48 22//22 58//58
f 59//59 23//23 44//44
f 23//23 59//59 58//58
f 60//60 24//24 25//25
f 39//39 24//24 60//60
f 25//25 61//61 60//60
f 62//62 25//25 63//63
f 61//61 25//25 62//62
f 26//26 63//63 25//25
f 27//27 63//63 26//26
f 27//27 64//64 65//65
f 65//65 66//66 27//27
f 63//63 27//27 66//66
f 67//67 68//68 27//27
f 69//69 67//67 27//27
f 69//69 27//27 28//28
f 64//64 27//27 68//68
f 69//69 28//28 70//70
f 71//71 70//70 28//28
f 28//28 72//72 71//71
f 29//29 72//72 28//28
f 38//38 73//73 29//29
f 29//29 36//36 38//38
f 29//29 71//71 72//72
f 73//73 71//71 29//29
f 74//74 30//30 31//31
f 74//74 75//75 30//30
f 37//37 30//30 75//75
f 76//76 74//74 31//31
f 31//31 32//32 76//76
f 34//34 76//76 32//32
f 34//34 32//32 33//33
f 76//76 34//34 35//35
f 46//46 76//76 35//35
f 41//41 38//38 36//36
f 42//42 41//41 36//36
f 37//37 77//77 36//36
f 36//36 78//78 79//79
f 78//78 36//36 77//77
f 36//36 80//80 42//42
f 79//79 80//80 36//36
f 75//75 77//77 37//37
f 81//81 38//38 40//40
f 38//38 81//81 73//73
f 82//82 40//40 39//39
f 39//39 83//83 84//84
f 83//83 39//39 60//60
f 39//39 85//85 86//86
f 84//84 85//85 39//39
f 87//87 82//82 39//39
f 39//39 86//86 87//87
f 81//81 40//40 82//82
f 42//42 80//80 43//43
f 43//43 88//88 45//45
f 89//89 43//43 80//80
f 88//88 43//43 89//89
f 44//44 45//45 90//90
f 91//91 44//44 90//90
f 91//91 92//92 44//44
f 92//92 59//59 44//44
f 45//45 93//93 94//94
f 88//88 93//93 45//45
f 90//90 45//45 94//94
f 76//76 46//46 95//95
f 53//53 96//96 46//46
f 46//46 96//96 95//95
f 54//54 47//47 97//97
f 47//47 48//48 98//98
f 47//47 98//98 99//99
f 97//97 47//47 99//99
f 58//58 59//59 48//48
f 98//98 48//48 59//59
f 49//49 50//50 55//55
f 100//100 49//49 101//101
f 55//55 101//101 49//49
f 53//53 49//49 100//100
f 50//50 52//52 55//55
f 51//51 55//55 52//52
f 53//53 100//100 102//102
f 103//103 104//104 53//53
f 103//103 53//53 102//102
f 104//104 96//96 53//53
f 105//105 54//54 97//97
f 57//57 54//54 105//105
f 106//106 55//55 107//107
f 55//55 106//106 101//101
f 55//55 108//108 107//107
f 56//56 108//108 55//55
f 108//108 56//56 109//109
f 56//56 110//110 109//109
f 105//105 56//56 57//57
f 111//111 56//56 105//105
f 110//110 56//56 111//111
f 59//59 112//112 98//98
f 112//112 59//59 92//92
f 60//60 113//113 114//114
f 113//113 60//60 61//61
f 60//60 114//114 115//115
f 60//60 115//115 83//83
f 61//61 116//116 117//117
f 118//118 113//113 61//61
f 119//119 120//120 61//61
f 116//116 61//61 120//120
f 117//117 118//118 61//61
f 119//119 61//61 121//121
f 62//62 121//121 61//61
f 62//62 63//63 122//122
f 122//122 121//121 62//62
f 63//63 123//123 124//124
f 125//125 63//63 124//124
f 122//122 63//63 125//125
f 63//63 66//66 123//123
f 64//64 126//126 65//65
f 126//126 64//64 127//127
f 64//64 68//68 127//127
f 65//65 126//126 128//128
f 128//128 66//66 65//65
f 128//128 123//123 66//66
f 127//127 68//68 67//67
f 67//67 129//129 127//127
f 67//67 69//69 130//130
f 71//71 67//67 130//130
f 131//131 129//129 67//67
f 131//131 67//67 71//71
f 69//69 70//70 130//130
f 130//130 70//70 71//71
f 71//71 73//73 131//131
f 87//87 73//73 81//81
f 132//132 73//73 87//87
f 73//73 132//132 131//131
f 75//75 74//74 133//133
f 74//74 76//76 133//133
f 75//75 134//134 77//77
f 134//134 75//75 133//133
f 135//135 76//76 95//95
f 133//133 76//76 135//135
f 134//134 136//136 77//77
f 137//137 138//138 77//77
f 139//139 140//140 77//77
f 77//77 141//141 78//78
f 136//136 137//137 77//77
f 138//138 139//139 77//77
f 77//77 142//142 141//141
f 140//140 142//142 77//77
f 78//78 143//143 79//79
f 78//78 144//144 143//143
f 141//141 144//144 78//78
f 145//145 79//79 143//143
f 80//80 79//79 145//145
f 80//80 146//146 89//89
f 146//146 80//80 147//147
f 147//147 80//80 148//148
f 80//80 145//145 148//148
f 82//82 87//87 81//81
f 83//83 85//85 84//84
f 83//83 115//115 149//149
f 83//83 149//149 85//85
f 86//86 85//85 150//150
f 85//85 149//149 151//151
f 85//85 151//151 150//150
f 152//152 153//153 86//86
f 87//87 86//86 154//154
f 153//153 154//154 86//86
f 86//86 150//150 152//152
f 87//87 154//154 132//132
f 146//146 88//88 89//89
f 88//88 146//146 93//93
f 91//91 90//90 155//155
f 94//94 155//155 90//90
f 156//156 91//91 157//157
f 91//91 156//156 92//92
f 91//91 155//155 157//157
f 156//156 112//112 92//92
f 94//94 93//93 158//158
f 93//93 146//146 159//159
f 93//93 159//159 158//158
f 94//94 160//160 155//155
f 158//158 160//160 94//94
f 95//95 96//96 135//135
f 104//104 135//135 96//96
f 97//97 99//99 105//105
f 99//99 98//98 161//161
f 112//112 162//162 98//98
f 98//98 162//162 161//161
f 105//105 99//99 163//163
f 161//161 163//163 99//99
f 164//164 100//100 101//101
f 102//102 100//100 164//164
f 101//101 142//142 164//164
f 101//101 165//165 142//142
f 106//106 165//165 101//101
f 164//164 103//103 102//102
f 103//103 140//140 104//104
f 103//103 164//164 140//140
f 166//166 135//135 104//104
f 104//104 139//139 138//138
f 104//104 138//138 166//166
f 104//104 140//140 139//139
f 105//105 163//163 167//167
f 105//105 168//168 111//111
f 167//167 168//168 105//105
f 169//169 106//106 107//107
f 169//169 165//165 106//106
f 109//109 107//107 108//108
f 169//169 107//107 109//109
f 109//109 111//111 170//170
f 171//171 169//169 109//109
f 109//109 110//110 111//111
f 170//170 171//171 109//109
f 168//168 172//172 111//111
f 172//172 173//173 111//111
f 111//111 173//173 170//170
f 112//112 156//156 162//162
f 174//174 114//114 113//113
f 113//113 175//175 176//176
f 113//113 176//176 174//174
f 175//175 113//113 118//118
f 114//114 177//177 178//178
f 177//177 114//114 174//174
f 178//178 179//179 114//114
f 115//115 114//114 179//179
f 149//149 115//115 180//180
f 115//115 179//179 180//180
f 181//181 117//117 116//116
f 120//120 182//182 116//116
f 182//182 183//183 116//116
f 116//116 183//183 181//181
f 118//118 117//117 175//175
f 117//117 181//181 175//175
f 119//119 184//184 120//120
f 185//185 119//119 121//121
f 186//186 184//184 119//119
f 186//186 119//119 185//185
f 187//187 182//182 120//120
f 188//188 187//187 120//120
f 120//120 184//184 188//188
f 121//121 122//122 185//185
f 122//122 125//125 128//128
f 122//122 128//128 189//189
f 122//122 189//189 185//185
f 128//128 124//124 123//123
f 125//125 124//124 128//128
f 189//189 128//128 126//126
f 189//189 126//126 190//190
f 127//127 191//191 126//126
f 126//126 192//192 190//190
f 192//192 126//126 191//191
f 127//127 129//129 191//191
f 129//129 131//131 193//193
f 194//194 192//192 129//129
f 195//195 196//196 129//129
f 197//197 198//198 129//129
f 197//197 129//129 196//196
f 193//193 195//195 129//129
f 129//129 199//199 200//200
f 201//201 199//199 129//129
f 201//201 129//129 198//198
f 202//202 194//194 129//129
f 202//202 129//129 200//200
f 192//192 191//191 129//129
f 131//131 132//132 193//193
f 153//153 132//132 154//154
f 132//132 153//153 152//152
f 193//193 132//132 152//152
f 135//135 134//134 133//133
f 136//136 134//134 135//135
f 135//135 166//166 136//136
f 136//136 166//166 137//137
f 166//166 138//138 137//137
f 140//140 164//164 142//142
f 142//142 165//165 141//141
f 141//141 203//203 204//204
f 141//141 165//165 203//203
f 141//141 205//205 144//144
f 141//141 204//204 205//205
f 144//144 205//205 143//143
f 145//145 143//143 205//205
f 206//206 148//148 145//145
f 205//205 207//207 145//145
f 206//206 145//145 207//207
f 146//146 147//147 208//208
f 208//208 159//159 146//146
f 208//208 147//147 209//209
f 209//209 147//147 206//206
f 147//147 148//148 206//206
f 180//180 151//151 149//149
f 193//193 152//152 150//150
f 150//150 151//151 195//195
f 195//195 193//193 150//150
f 195//195 151//151 180//180
f 157//157 155//155 160//160
f 157//157 210//210 156//156
f 156//156 211//211 161//161
f 161//161 162//162 156//156
f 210//210 211//211 156//156
f 212//212 210//210 157//157
f 160//160 212//212 157//157
f 213//213 158//158 214//214
f 212//212 160//160 158//158
f 212//212 158//158 213//213
f 158//158 159//159 214//214
f 214//214 159//159 208//208
f 211//211 163//163 161//161
f 163//163 215//215 167//167
f 163//163 211//211 210//210
f 163//163 210//210 215//215
f 203//203 165//165 169//169
f 215//215 168//168 167//167
f 168//168 215//215 172//172
f 169//169 171//171 203//203
f 170//170 173//173 216//216
f 216//216 217//217 170//170
f 217//217 171//171 170//170
f 217//217 203//203 171//171
f 215//215 173//173 172//172
f 215//215 216//216 173//173
f 198//198 177//177 174//174
f 174//174 176//176 198//198
f 218//218 176//176 175//175
f 175//175 219//219 218//218
f 219//219 175//175 220//220
f 175//175 221//221 220//220
f 175//175 181//181 221//221
f 218//218 198//198 176//176
f 177//177 198//198 178//178
f 198//198 197//197 178//178
f 197//197 179//179 178//178
f 197//197 196//196 179//179
f 180//180 179//179 196//196
f 196//196 195//195 180//180
f 222//222 219//219 181//181
f 223//223 181//181 183//183
f 223//223 222//222 181//181
f 219//219 221//221 181//181
f 182//182 187//187 224//224
f 182//182 225//225 183//183
f 224//224 225//225 182//182
f 225//225 223//223 183//183
f 184//184 186//186 226//226
f 188//188 184//184 226//226
f 185//185 189//189 227//227
f 227//227 186//186 185//185
f 226//226 186//186 227//227
f 187//187 228//228 224//224
f 187//187 188//188 228//228
f 226//226 229//229 188//188
f 228//228 188//188 229//229
f 227//227 189//189 190//190
f 190//190 230//230 227//227
f 192//192 230//230 190//190
f 192//192 194//194 230//230
f 194//194 202//202 231//231
f 231//231 230//230 194//194
f 198//198 232//232 201//201
f 218//218 232//232 198//198
f 199//199 233//233 200//200
f 234//234 199//199 218//218
f 218//218 199//199 235//235
f 234//234 233//233 199//199
f 199//199 201//201 232//232
f 199//199 232//232 235//235
f 236//236 202//202 200//200
f 237//237 200//200 233//233
f 236//236 200//200 237//237
f 202//202 236//236 238//238
f 202//202 238//238 231//231
f 204//204 203//203 207//207
f 203//203 217//217 239//239
f 239//239 207//207 203//203
f 204//204 207//207 205//205
f 239//239 209//209 206//206
f 239//239 206//206 207//207
f 209//209 214//214 208//208
f 239//239 214//214 209//209
f 210//210 212//212 213//213
f 213//213 215//215 210//210
f 213//213 214//214 239//239
f 213//213 239//239 215//215
f 215//215 240//240 216//216
f 215//215 239//239 240//240
f 217//217 216//216 240//240
f 217//217 240//240 239//239
f 241//241 218//218 219//219
f 241//241 234//234 218//218
f 235//235 232//232 218//218
f 219//219 220//220 221//221
f 219//219 222//222 241//241
f 223//223 242//242 222//222
f 234//234 222//222 242//242
f 234//234 241//241 222//222
f 242//242 223//223 243//243
f 225//225 244//244 223//223
f 223//223 244//244 243//243
f 245//245 224//224 238//238
f 246//246 224//224 247//247
f 248//248 225//225 224//224
f 224//224 229//229 249//249
f 228//228 229//229 224//224
f 224//224 249//249 238//238
f 224//224 245//245 247//247
f 224//224 246//246 248//248
f 225//225 248//248 244//244
f 250//250 229//229 226//226
f 227//227 250//250 226//226
f 250//250 227//227 230//230
f 250//250 249//249 229//229
f 250//250 230//230 231//231
f 249//249 250//250 231//231
f 231//231 238//238 249//249
f 251//251 233//233 234//234
f 251//251 237//237 233//233
f 242//242 252//252 234//234
f 253//253 251//251 234//234
f 253//253 234//234 252//252
f 236//236 254//254 255//255
f 254//254 236//236 256//256
f 256//256 236//236 257//257
f 257//257 236//236 251//251
f 237//237 251//251 236//236
f 236//236 255//255 238//238
f 238//238 255//255 245//245
f 243//243 258//258 242//242
f 252//252 242//242 258//258
f 243//243 244//244 259//259
f 259//259 258//258 243//243
f 248//248 260//260 244//244
f 244//244 260//260 259//259
f 245//245 261//261 247//247
f 255//255 261//261 245//245
f 247//247 262//262 246//246
f 262//262 248//248 246//246
f 261//261 262//262 247//247
f 260//260 248//248 262//262
f 263//263 257//257 251//251
f 253//253 263//263 251//251
f 258//258 263//263 252//252
f 253//253 252//252 263//263
f 254//254 261//261 255//255
f 261//261 254//254 262//262
f 262//262 254//254 264//264
f 256//256 264//264 254//254
f 257//257 264//264 256//256
f 257//257 263//263 260//260
f 257//257 260//260 264//264
f 260//260 258//258 259//259
f 263//263 258//258 260//260
f 262//262 264//264 260//260
# 524 faces, 0 coords texture

# End of File
