[2021-08-06 15:43:21.543] [info] Updating Model file from 30000 to latest format...
[2021-08-06 15:43:21.676] [info] Loaded model Two-arms-only from file ./opensim_models/upper_body/bimanual/full_upper_body_marks.osim
[2021-08-06 15:43:21.678] [warning] GeometryPath 'geometrypath' has subcomponents with duplicate name 'DELT1-P3'. The duplicate is being renamed to 'DELT1-P3_0'.
[2021-08-06 15:43:21.678] [warning] GeometryPath 'geometrypath' has subcomponents with duplicate name 'DELT1-P3'. The duplicate is being renamed to 'DELT1-P3_0'.
