<?xml version="1.0" encoding="utf-8"?>

<robot name="wholebody"> 
    <link name="ground" /> 
 
    <link name="pelvis"> 
 
        <inertial> 
             <mass value="11.777"/> 
            <origin xyz="-0.00000000 -0.07070000  0.00000000" rpy="0 0 0" /> 
            <inertia ixx="0.1028" iyy="0.0871" izz="0.0579" ixy="0.0" ixz="0.0" iyz="0.0"/> 
        </inertial> 
 
        <visual name="sacrum"> 
            <origin xyz=" 0.00000000  0.00000000  0.00000000" rpy=" 1.57079633 -0.00000000  1.57079633" /> 
            <geometry> 
                <mesh filename="package://human_control/description/wholebody/stl/sacrum.stl" scale=" 1.00000000  1.00000000  1.00000000"/> 
            </geometry> 
        </visual> 
 
        <collision name="sacrum"> 
            <origin xyz="-0.00004511 -0.12491375  0.03655143" rpy=" 0.00000000 -0.00000000  0.00000000" /> 
            <geometry> 
                <sphere radius="0.05280533557136854" /> 
            </geometry> 
        </collision> 
 
        <visual name="pelvis"> 
            <origin xyz=" 0.00000000  0.00000000  0.00000000" rpy=" 1.57079633 -0.00000000  1.57079633" /> 
            <geometry> 
                <mesh filename="package://human_control/description/wholebody/stl/pelvis.stl" scale=" 1.00000000  1.00000000  1.00000000"/> 
            </geometry> 
        </visual> 
 
        <collision name="pelvis"> 
            <origin xyz=" 0.07386850 -0.07562926 -0.00743482" rpy=" 0.00000000 -0.00000000  0.00000000" /> 
            <geometry> 
                <cylinder radius="0.06901049986481667" length="0.21470201015472412" /> 
            </geometry> 
        </collision> 
 
        <visual name="l_pelvis"> 
            <origin xyz=" 0.00000000  0.00000000  0.00000000" rpy=" 1.57079633 -0.00000000  1.57079633" /> 
            <geometry> 
                <mesh filename="package://human_control/description/wholebody/stl/l_pelvis.stl" scale=" 1.00000000  1.00000000  1.00000000"/> 
            </geometry> 
        </visual> 
 
        <collision name="l_pelvis"> 
            <origin xyz="-0.07386850 -0.07562925 -0.00743482" rpy=" 0.00000000 -0.00000000  0.00000000" /> 
            <geometry> 
                <cylinder radius="0.06901049986481667" length="0.21470201015472412" /> 
            </geometry> 
        </collision> 
 
    </link> 
 
    <link name="femur_r"> 
 
        <inertial> 
             <mass value="9.3014"/> 
            <origin xyz=" 0.00000000 -0.00000000 -0.17000000" rpy="0 0 0" /> 
            <inertia ixx="0.1339" iyy="0.0351" izz="0.1412" ixy="0.0" ixz="0.0" iyz="0.0"/> 
        </inertial> 
 
        <visual name="femur_r"> 
            <origin xyz=" 0.00000000  0.00000000  0.00000000" rpy=" 1.57079633 -0.00000000  1.57079633" /> 
            <geometry> 
                <mesh filename="package://human_control/description/wholebody/stl/femur_r.stl" scale=" 1.00000000  1.00000000  1.00000000"/> 
            </geometry> 
        </visual> 
 
        <collision name="femur_r"> 
            <origin xyz=" 0.01594298  0.00497468 -0.20699716" rpy=" 0.00000000 -0.00000000  0.00000000" /> 
            <geometry> 
                <cylinder radius="0.04316299967467785" length="0.45261600613594055" /> 
            </geometry> 
        </collision> 
 
    </link> 
 
    <link name="tibia_r"> 
 
        <inertial> 
             <mass value="3.7075"/> 
            <origin xyz=" 0.00000000 -0.00000000 -0.18670000" rpy="0 0 0" /> 
            <inertia ixx="0.0504" iyy="0.0051" izz="0.0511" ixy="0.0" ixz="0.0" iyz="0.0"/> 
        </inertial> 
 
        <visual name="tibia_r"> 
            <origin xyz=" 0.00000000  0.00000000  0.00000000" rpy=" 1.57079633 -0.00000000  1.57079633" /> 
            <geometry> 
                <mesh filename="package://human_control/description/wholebody/stl/tibia_r.stl" scale=" 1.00000000  1.00000000  1.00000000"/> 
            </geometry> 
        </visual> 
 
        <collision name="tibia_r"> 
            <origin xyz="-0.00346711  0.00744511 -0.18540447" rpy=" 0.00000000 -0.00000000  0.00000000" /> 
            <geometry> 
                <cylinder radius="0.034585751593112946" length="0.3867489993572235" /> 
            </geometry> 
        </collision> 
 
        <visual name="fibula_r"> 
            <origin xyz=" 0.00000000  0.00000000  0.00000000" rpy=" 1.57079633 -0.00000000  1.57079633" /> 
            <geometry> 
                <mesh filename="package://human_control/description/wholebody/stl/fibula_r.stl" scale=" 1.00000000  1.00000000  1.00000000"/> 
            </geometry> 
        </visual> 
 
        <collision name="fibula_r"> 
            <origin xyz=" 0.03038767 -0.00397628 -0.22986803" rpy=" 0.00000000 -0.00000000  0.00000000" /> 
            <geometry> 
                <cylinder radius="0.014540750067681074" length="0.3752079904079437" /> 
            </geometry> 
        </collision> 
 
    </link> 
 
    <link name="talus_r"> 
 
        <inertial> 
             <mass value="0.1"/> 
            <origin xyz=" 0.00000000  0.00000000  0.00000000" rpy="0 0 0" /> 
            <inertia ixx="0.001" iyy="0.001" izz="0.001" ixy="0.0" ixz="0.0" iyz="0.0"/> 
        </inertial> 
 
        <visual name="talus_rv"> 
            <origin xyz=" 0.00000000  0.00000000  0.00000000" rpy=" 1.57079633 -0.00000000  1.57079633" /> 
            <geometry> 
                <mesh filename="package://human_control/description/wholebody/stl/talus_rv.stl" scale=" 1.00000000  1.00000000  1.00000000"/> 
            </geometry> 
        </visual> 
 
        <collision name="talus_rv"> 
            <origin xyz="-0.00071034  0.00505207  0.00186739" rpy=" 0.00000000 -0.00000000  0.00000000" /> 
            <geometry> 
                <box size=" 0.0319  0.0430  0.0254" /> 
            </geometry> 
        </collision> 
 
    </link> 
 
    <link name="calcn_r"> 
 
        <inertial> 
             <mass value="1.25"/> 
            <origin xyz=" 0.00000000  0.10000000  0.03000000" rpy="0 0 0" /> 
            <inertia ixx="0.0014" iyy="0.0039" izz="0.0041" ixy="0.0" ixz="0.0" iyz="0.0"/> 
        </inertial> 
 
        <visual name="foot"> 
            <origin xyz=" 0.00000000  0.00000000  0.00000000" rpy=" 1.57079633 -0.00000000  1.57079633" /> 
            <geometry> 
                <mesh filename="package://human_control/description/wholebody/stl/foot.stl" scale=" 1.00000000  1.00000000  1.00000000"/> 
            </geometry> 
        </visual> 
 
        <collision name="foot"> 
            <origin xyz="-0.00432606  0.07089331  0.01757956" rpy=" 0.00000000 -0.00000000  0.00000000" /> 
            <geometry> 
                <box size=" 0.0849  0.1927  0.0529" /> 
            </geometry> 
        </collision> 
 
    </link> 
 
    <link name="toes_r"> 
 
        <inertial> 
             <mass value="0.2166"/> 
            <origin xyz="-0.01750000  0.03460000  0.00600000" rpy="0 0 0" /> 
            <inertia ixx="0.0001" iyy="0.0002" izz="0.001" ixy="0.0" ixz="0.0" iyz="0.0"/> 
        </inertial> 
 
        <visual name="bofoot"> 
            <origin xyz=" 0.00000000  0.00000000  0.00000000" rpy=" 1.57079633 -0.00000000  1.57079633" /> 
            <geometry> 
                <mesh filename="package://human_control/description/wholebody/stl/bofoot.stl" scale=" 1.00000000  1.00000000  1.00000000"/> 
            </geometry> 
        </visual> 
 
        <collision name="bofoot"> 
            <origin xyz="-0.00004618  0.02500000 -0.00304539" rpy=" 0.00000000 -0.00000000  0.00000000" /> 
            <geometry> 
                <box size=" 0.0821  0.0755  0.0130" /> 
            </geometry> 
        </collision> 
 
    </link> 
 
    <link name="femur_l"> 
 
        <inertial> 
             <mass value="9.3014"/> 
            <origin xyz=" 0.00000000 -0.00000000 -0.17000000" rpy="0 0 0" /> 
            <inertia ixx="0.1339" iyy="0.0351" izz="0.1412" ixy="0.0" ixz="0.0" iyz="0.0"/> 
        </inertial> 
 
        <visual name="femur_l"> 
            <origin xyz=" 0.00000000  0.00000000  0.00000000" rpy=" 1.57079633 -0.00000000  1.57079633" /> 
            <geometry> 
                <mesh filename="package://human_control/description/wholebody/stl/femur_l.stl" scale=" 1.00000000  1.00000000  1.00000000"/> 
            </geometry> 
        </visual> 
 
        <collision name="femur_l"> 
            <origin xyz="-0.01594298  0.00497468 -0.20699716" rpy=" 0.00000000 -0.00000000  0.00000000" /> 
            <geometry> 
                <cylinder radius="0.04316299967467785" length="0.45261600613594055" /> 
            </geometry> 
        </collision> 
 
    </link> 
 
    <link name="tibia_l"> 
 
        <inertial> 
             <mass value="3.7075"/> 
            <origin xyz=" 0.00000000 -0.00000000 -0.18670000" rpy="0 0 0" /> 
            <inertia ixx="0.0504" iyy="0.0051" izz="0.0511" ixy="0.0" ixz="0.0" iyz="0.0"/> 
        </inertial> 
 
        <visual name="tibia_l"> 
            <origin xyz=" 0.00000000  0.00000000  0.00000000" rpy=" 1.57079633 -0.00000000  1.57079633" /> 
            <geometry> 
                <mesh filename="package://human_control/description/wholebody/stl/tibia_l.stl" scale=" 1.00000000  1.00000000  1.00000000"/> 
            </geometry> 
        </visual> 
 
        <collision name="tibia_l"> 
            <origin xyz=" 0.00346711  0.00744511 -0.18540447" rpy=" 0.00000000 -0.00000000  0.00000000" /> 
            <geometry> 
                <cylinder radius="0.034585751593112946" length="0.3867489993572235" /> 
            </geometry> 
        </collision> 
 
        <visual name="fibula_l"> 
            <origin xyz=" 0.00000000  0.00000000  0.00000000" rpy=" 1.57079633 -0.00000000  1.57079633" /> 
            <geometry> 
                <mesh filename="package://human_control/description/wholebody/stl/fibula_l.stl" scale=" 1.00000000  1.00000000  1.00000000"/> 
            </geometry> 
        </visual> 
 
        <collision name="fibula_l"> 
            <origin xyz="-0.03038766 -0.00397628 -0.22986804" rpy=" 0.00000000 -0.00000000  0.00000000" /> 
            <geometry> 
                <cylinder radius="0.014540750067681074" length="0.3752079904079437" /> 
            </geometry> 
        </collision> 
 
    </link> 
 
    <link name="talus_l"> 
 
        <inertial> 
             <mass value="0.1"/> 
            <origin xyz=" 0.00000000  0.00000000  0.00000000" rpy="0 0 0" /> 
            <inertia ixx="0.001" iyy="0.001" izz="0.001" ixy="0.0" ixz="0.0" iyz="0.0"/> 
        </inertial> 
 
        <visual name="talus_lv"> 
            <origin xyz=" 0.00000000  0.00000000  0.00000000" rpy=" 1.57079633 -0.00000000  1.57079633" /> 
            <geometry> 
                <mesh filename="package://human_control/description/wholebody/stl/talus_lv.stl" scale=" 1.00000000  1.00000000  1.00000000"/> 
            </geometry> 
        </visual> 
 
        <collision name="talus_lv"> 
            <origin xyz=" 0.00071034  0.00505207  0.00186739" rpy=" 0.00000000 -0.00000000  0.00000000" /> 
            <geometry> 
                <box size=" 0.0319  0.0430  0.0253" /> 
            </geometry> 
        </collision> 
 
    </link> 
 
    <link name="calcn_l"> 
 
        <inertial> 
             <mass value="1.25"/> 
            <origin xyz=" 0.00000000  0.10000000  0.03000000" rpy="0 0 0" /> 
            <inertia ixx="0.0014" iyy="0.0039" izz="0.0041" ixy="0.0" ixz="0.0" iyz="0.0"/> 
        </inertial> 
 
        <visual name="l_foot"> 
            <origin xyz=" 0.00000000  0.00000000  0.00000000" rpy=" 1.57079633 -0.00000000  1.57079633" /> 
            <geometry> 
                <mesh filename="package://human_control/description/wholebody/stl/l_foot.stl" scale=" 1.00000000  1.00000000  1.00000000"/> 
            </geometry> 
        </visual> 
 
        <collision name="l_foot"> 
            <origin xyz=" 0.00432460  0.07082788  0.01757249" rpy=" 0.00000000 -0.00000000  0.00000000" /> 
            <geometry> 
                <box size=" 0.0849  0.1936  0.0529" /> 
            </geometry> 
        </collision> 
 
    </link> 
 
    <link name="toes_l"> 
 
        <inertial> 
             <mass value="0.2166"/> 
            <origin xyz=" 0.01750000  0.03460000  0.00600000" rpy="0 0 0" /> 
            <inertia ixx="0.0001" iyy="0.0002" izz="0.001" ixy="0.0" ixz="0.0" iyz="0.0"/> 
        </inertial> 
 
        <visual name="bofoot"> 
            <origin xyz=" 0.00000000  0.00000000  0.00000000" rpy=" 1.57079633 -0.00000000  1.57079633" /> 
            <geometry> 
                <mesh filename="package://human_control/description/wholebody/stl/bofoot.stl" scale=" 1.00000000  1.00000000  1.00000000"/> 
            </geometry> 
        </visual> 
 
        <collision name="bofoot"> 
            <origin xyz="-0.00004618  0.02500000 -0.00304539" rpy=" 0.00000000 -0.00000000  0.00000000" /> 
            <geometry> 
                <box size=" 0.0821  0.0755  0.0130" /> 
            </geometry> 
        </collision> 
 
    </link> 
 
    <link name="torso"> 
 
        <inertial> 
             <mass value="21.28"/> 
            <origin xyz="-0.00000000  0.00300000  0.24600000" rpy="0 0 0" /> 
            <inertia ixx="0.6274994" iyy="0.6274994" izz="0.8455845" ixy="0.0" ixz="0.0" iyz="0.0"/> 
        </inertial> 
 
        <visual name="hat_spine"> 
            <origin xyz=" 0.00000000  0.00000000  0.00000000" rpy=" 1.57079633 -0.00000000  1.57079633" /> 
            <geometry> 
                <mesh filename="package://human_control/description/wholebody/stl/hat_spine.stl" scale=" 1.00000000  1.00000000  1.00000000"/> 
            </geometry> 
        </visual> 
 
        <collision name="hat_spine"> 
            <origin xyz=" 0.00011565 -0.00353864  0.26422478" rpy=" 0.00000000 -0.00000000  0.00000000" /> 
            <geometry> 
                <box size=" 0.0751  0.1291  0.5249" /> 
            </geometry> 
        </collision> 
 
        <visual name="hat_ribs_scap"> 
            <origin xyz=" 0.00000000  0.00000000  0.00000000" rpy=" 1.57079633 -0.00000000  1.57079633" /> 
            <geometry> 
                <mesh filename="package://human_control/description/wholebody/stl/hat_ribs_scap.stl" scale=" 1.00000000  1.00000000  1.00000000"/> 
            </geometry> 
        </visual> 
 
        <collision name="hat_ribs_scap"> 
            <origin xyz=" 0.00011565 -0.00353864  0.29422478" rpy=" 0.00000000 -0.00000000  0.00000000" /> 
            <geometry> 
                <box size=" 0.3336  0.1928  0.3097" /> 
            </geometry> 
        </collision> 
 
    </link> 
 
    <link name="head_and_neck"> 
 
        <inertial> 
             <mass value="4.69"/> 
            <origin xyz="-0.00000000 -0.00600000  0.14900000" rpy="0 0 0" /> 
            <inertia ixx="0.0268334" iyy="0.0174515" izz="0.0269334" ixy="0.000226171" ixz="0.000251301" iyz="0.00011169"/> 
        </inertial> 
 
        <visual name="jaw"> 
            <origin xyz=" 0.00000000  0.00000000  0.00000000" rpy=" 1.57079633  0.00000000  1.57079633" /> 
            <geometry> 
                <mesh filename="package://human_control/description/wholebody/stl/jaw.stl" scale=" 1.00000000  1.00000000  1.00000000"/> 
            </geometry> 
        </visual> 
 
        <collision name="jaw"> 
            <origin xyz=" 0.00007359  0.05567701  0.07865301" rpy=" 0.00000000 -0.00000000  0.00000000" /> 
            <geometry> 
                <sphere radius="0.051569497833649315" /> 
            </geometry> 
        </collision> 
 
        <visual name="skull"> 
            <origin xyz=" 0.00000000  0.00000000  0.00000000" rpy=" 1.57079633  0.00000000  1.57079633" /> 
            <geometry> 
                <mesh filename="package://human_control/description/wholebody/stl/skull.stl" scale=" 1.00000000  1.00000000  1.00000000"/> 
            </geometry> 
        </visual> 
 
        <collision name="skull"> 
            <origin xyz="-0.00000009  0.00154460  0.13767642" rpy=" 0.00000000 -0.00000000  0.00000000" /> 
            <geometry> 
                <sphere radius="0.09022133300701778" /> 
            </geometry> 
        </collision> 
 
    </link> 
 
    <link name="humerus_r"> 
 
        <inertial> 
             <mass value="2.0325"/> 
            <origin xyz=" 0.00000000 -0.00000000 -0.16450200" rpy="0 0 0" /> 
            <inertia ixx="0.011946" iyy="0.004121" izz="0.013409" ixy="0.0" ixz="0.0" iyz="0.0"/> 
        </inertial> 
 
        <visual name="humerus_rv"> 
            <origin xyz=" 0.00000000  0.00000000  0.00000000" rpy=" 1.57079633 -0.00000000  1.57079633" /> 
            <geometry> 
                <mesh filename="package://human_control/description/wholebody/stl/humerus_rv.stl" scale=" 1.00000000  1.00000000  1.00000000"/> 
            </geometry> 
        </visual> 
 
        <collision name="humerus_rv"> 
            <origin xyz="-0.00095287  0.00648708 -0.11484573" rpy=" 0.00000000 -0.00000000  0.00000000" /> 
            <geometry> 
                <cylinder radius="0.02503850031644106" length="0.31789201498031616" /> 
            </geometry> 
        </collision> 
 
    </link> 
 
    <link name="ulna_r"> 
 
        <inertial> 
             <mass value="0.6075"/> 
            <origin xyz=" 0.00000000 -0.00000000 -0.12052500" rpy="0 0 0" /> 
            <inertia ixx="0.002962" iyy="0.000618" izz="0.003213" ixy="0.0" ixz="0.0" iyz="0.0"/> 
        </inertial> 
 
        <visual name="ulna_rv"> 
            <origin xyz=" 0.00000000  0.00000000  0.00000000" rpy=" 1.57079633 -0.00000000  1.57079633" /> 
            <geometry> 
                <mesh filename="package://human_control/description/wholebody/stl/ulna_rv.stl" scale=" 1.00000000  1.00000000  1.00000000"/> 
            </geometry> 
        </visual> 
 
        <collision name="ulna_rv"> 
            <origin xyz=" 0.00850410 -0.02351724 -0.07896256" rpy=" 0.00000000 -0.00000000  0.00000000" /> 
            <geometry> 
                <cylinder radius="0.01956775039434433" length="0.25840499997138977" /> 
            </geometry> 
        </collision> 
 
    </link> 
 
    <link name="radius_r"> 
 
        <inertial> 
             <mass value="0.6075"/> 
            <origin xyz=" 0.00000000 -0.00000000 -0.12052500" rpy="0 0 0" /> 
            <inertia ixx="0.002962" iyy="0.000618" izz="0.003213" ixy="0.0" ixz="0.0" iyz="0.0"/> 
        </inertial> 
 
        <visual name="radius_rv"> 
            <origin xyz=" 0.00000000  0.00000000  0.00000000" rpy=" 1.57079633 -0.00000000  1.57079633" /> 
            <geometry> 
                <mesh filename="package://human_control/description/wholebody/stl/radius_rv.stl" scale=" 1.00000000  1.00000000  1.00000000"/> 
            </geometry> 
        </visual> 
 
        <collision name="radius_rv"> 
            <origin xyz=" 0.01629839 -0.00453670 -0.13081797" rpy=" 0.00000000 -0.00000000  0.00000000" /> 
            <geometry> 
                <cylinder radius="0.018947500735521317" length="0.24080900847911835" /> 
            </geometry> 
        </collision> 
 
    </link> 
 
    <link name="lunate_r"> 
 
        <inertial> 
             <mass value="0.01"/> 
            <origin xyz=" 0.00000000  0.00000000  0.00000000" rpy="0 0 0" /> 
            <inertia ixx="1e-05" iyy="1e-05" izz="1e-05" ixy="0.0" ixz="0.0" iyz="0.0"/> 
        </inertial> 
 
        <visual name="lunate_rvs"> 
            <origin xyz=" 0.00000000  0.00000000  0.00000000" rpy=" 1.57079633 -0.00000000  1.57079633" /> 
            <geometry> 
                <mesh filename="package://human_control/description/wholebody/stl/lunate_rvs.stl" scale=" 1.00000000  1.00000000  1.00000000"/> 
            </geometry> 
        </visual> 
 
        <collision name="lunate_rvs"> 
            <origin xyz="-0.00740587 -0.00099142 -0.00370128" rpy=" 0.00000000 -0.00000000  0.00000000" /> 
            <geometry> 
                <sphere radius="0.00891916686668992" /> 
            </geometry> 
        </collision> 
 
    </link> 
 
    <link name="hand_r"> 
 
        <inertial> 
             <mass value="0.4575"/> 
            <origin xyz=" 0.00000000 -0.00000000 -0.06809500" rpy="0 0 0" /> 
            <inertia ixx="0.000892" iyy="0.000547" izz="0.00134" ixy="0.0" ixz="0.0" iyz="0.0"/> 
        </inertial> 
 
        <visual name="pisiform_rvs"> 
            <origin xyz=" 0.00000000  0.00000000  0.00000000" rpy=" 1.57079633 -0.00000000  1.57079633" /> 
            <geometry> 
                <mesh filename="package://human_control/description/wholebody/stl/pisiform_rvs.stl" scale=" 1.00000000  1.00000000  1.00000000"/> 
            </geometry> 
        </visual> 
 
        <collision name="pisiform_rvs"> 
            <origin xyz="-0.02264340  0.00672396 -0.01242664" rpy=" 0.00000000 -0.00000000  0.00000000" /> 
            <geometry> 
                <cylinder radius="0.0050479997880756855" length="0.01401899941265583" /> 
            </geometry> 
        </collision> 
 
        <visual name="scaphoid_rvs"> 
            <origin xyz=" 0.00000000  0.00000000  0.00000000" rpy=" 1.57079633 -0.00000000  1.57079633" /> 
            <geometry> 
                <mesh filename="package://human_control/description/wholebody/stl/scaphoid_rvs.stl" scale=" 1.00000000  1.00000000  1.00000000"/> 
            </geometry> 
        </visual> 
 
        <collision name="scaphoid_rvs"> 
            <origin xyz=" 0.01055502 -0.00431960 -0.00639833" rpy=" 0.00000000 -0.00000000  0.00000000" /> 
            <geometry> 
                <box size=" 0.0232  0.0130  0.0220" /> 
            </geometry> 
        </collision> 
 
        <visual name="triquetrum_rvs"> 
            <origin xyz=" 0.00000000  0.00000000  0.00000000" rpy=" 1.57079633 -0.00000000  1.57079633" /> 
            <geometry> 
                <mesh filename="package://human_control/description/wholebody/stl/triquetrum_rvs.stl" scale=" 1.00000000  1.00000000  1.00000000"/> 
            </geometry> 
        </visual> 
 
        <collision name="triquetrum_rvs"> 
            <origin xyz="-0.02137365 -0.00253767 -0.01326291" rpy=" 0.00000000 -0.00000000  0.00000000" /> 
            <geometry> 
                <sphere radius="0.007884666478882233" /> 
            </geometry> 
        </collision> 
 
        <visual name="hamate_rvs"> 
            <origin xyz=" 0.00000000  0.00000000  0.00000000" rpy=" 1.57079633 -0.00000000  1.57079633" /> 
            <geometry> 
                <mesh filename="package://human_control/description/wholebody/stl/hamate_rvs.stl" scale=" 1.00000000  1.00000000  1.00000000"/> 
            </geometry> 
        </visual> 
 
        <collision name="hamate_rvs"> 
            <origin xyz="-0.01391004 -0.00201041 -0.02228295" rpy=" 0.00000000 -0.00000000  0.00000000" /> 
            <geometry> 
                <box size=" 0.0170  0.0250  0.0243" /> 
            </geometry> 
        </collision> 
 
        <visual name="capitate_rvs"> 
            <origin xyz=" 0.00000000  0.00000000  0.00000000" rpy=" 1.57079633 -0.00000000  1.57079633" /> 
            <geometry> 
                <mesh filename="package://human_control/description/wholebody/stl/capitate_rvs.stl" scale=" 1.00000000  1.00000000  1.00000000"/> 
            </geometry> 
        </visual> 
 
        <collision name="capitate_rvs"> 
            <origin xyz="-0.00018225 -0.00215341 -0.01805039" rpy=" 0.00000000 -0.00000000  0.00000000" /> 
            <geometry> 
                <cylinder radius="0.009557500015944242" length="0.024056999012827873" /> 
            </geometry> 
        </collision> 
 
        <visual name="trapezoid_rvs"> 
            <origin xyz=" 0.00000000  0.00000000  0.00000000" rpy=" 1.57079633 -0.00000000  1.57079633" /> 
            <geometry> 
                <mesh filename="package://human_control/description/wholebody/stl/trapezoid_rvs.stl" scale=" 1.00000000  1.00000000  1.00000000"/> 
            </geometry> 
        </visual> 
 
        <collision name="trapezoid_rvs"> 
            <origin xyz=" 0.01073235 -0.00639614 -0.02458632" rpy=" 0.00000000 -0.00000000  0.00000000" /> 
            <geometry> 
                <box size=" 0.0129  0.0183  0.0144" /> 
            </geometry> 
        </collision> 
 
        <visual name="trapezium_rvs"> 
            <origin xyz=" 0.00000000  0.00000000  0.00000000" rpy=" 1.57079633 -0.00000000  1.57079633" /> 
            <geometry> 
                <mesh filename="package://human_control/description/wholebody/stl/trapezium_rvs.stl" scale=" 1.00000000  1.00000000  1.00000000"/> 
            </geometry> 
        </visual> 
 
        <collision name="trapezium_rvs"> 
            <origin xyz=" 0.02315719 -0.00607738 -0.02206884" rpy=" 0.00000000 -0.00000000  0.00000000" /> 
            <geometry> 
                <cylinder radius="0.00875299982726574" length="0.021154001355171204" /> 
            </geometry> 
        </collision> 
 
        <visual name="metacarpal2_rvs"> 
            <origin xyz=" 0.00000000  0.00000000  0.00000000" rpy=" 1.57079633 -0.00000000  1.57079633" /> 
            <geometry> 
                <mesh filename="package://human_control/description/wholebody/stl/metacarpal2_rvs.stl" scale=" 1.00000000  1.00000000  1.00000000"/> 
            </geometry> 
        </visual> 
 
        <collision name="metacarpal2_rvs"> 
            <origin xyz=" 0.01564131 -0.00077968 -0.06371122" rpy=" 0.00000000 -0.00000000  0.00000000" /> 
            <geometry> 
                <cylinder radius="0.011795250233262777" length="0.0730929970741272" /> 
            </geometry> 
        </collision> 
 
        <visual name="metacarpal3_rvs"> 
            <origin xyz=" 0.00000000  0.00000000  0.00000000" rpy=" 1.57079633 -0.00000000  1.57079633" /> 
            <geometry> 
                <mesh filename="package://human_control/description/wholebody/stl/metacarpal3_rvs.stl" scale=" 1.00000000  1.00000000  1.00000000"/> 
            </geometry> 
        </visual> 
 
        <collision name="metacarpal3_rvs"> 
            <origin xyz="-0.00107448 -0.00555988 -0.06484496" rpy=" 0.00000000 -0.00000000  0.00000000" /> 
            <geometry> 
                <box size=" 0.0189  0.0270  0.0777" /> 
            </geometry> 
        </collision> 
 
        <visual name="metacarpal4_rvs"> 
            <origin xyz=" 0.00000000  0.00000000  0.00000000" rpy=" 1.57079633 -0.00000000  1.57079633" /> 
            <geometry> 
                <mesh filename="package://human_control/description/wholebody/stl/metacarpal4_rvs.stl" scale=" 1.00000000  1.00000000  1.00000000"/> 
            </geometry> 
        </visual> 
 
        <collision name="metacarpal4_rvs"> 
            <origin xyz="-0.01640473 -0.00496538 -0.06454174" rpy=" 0.00000000 -0.00000000  0.00000000" /> 
            <geometry> 
                <cylinder radius="0.009225999936461449" length="0.07210100442171097" /> 
            </geometry> 
        </collision> 
 
        <visual name="metacarpal5_rvs"> 
            <origin xyz=" 0.00000000  0.00000000  0.00000000" rpy=" 1.57079633 -0.00000000  1.57079633" /> 
            <geometry> 
                <mesh filename="package://human_control/description/wholebody/stl/metacarpal5_rvs.stl" scale=" 1.00000000  1.00000000  1.00000000"/> 
            </geometry> 
        </visual> 
 
        <collision name="metacarpal5_rvs"> 
            <origin xyz="-0.03005602 -0.00306699 -0.05570871" rpy=" 0.00000000 -0.00000000  0.00000000" /> 
            <geometry> 
                <box size=" 0.0248  0.0135  0.0592" /> 
            </geometry> 
        </collision> 
 
        <visual name="metacarpal1_rvs"> 
            <origin xyz=" 0.00000000  0.00000000  0.00000000" rpy=" 1.57079633 -0.00000000  1.57079633" /> 
            <geometry> 
                <mesh filename="package://human_control/description/wholebody/stl/metacarpal1_rvs.stl" scale=" 1.00000000  1.00000000  1.00000000"/> 
            </geometry> 
        </visual> 
 
        <collision name="metacarpal1_rvs"> 
            <origin xyz=" 0.04136169  0.00885674 -0.04079057" rpy=" 0.00000000 -0.00000000  0.00000000" /> 
            <geometry> 
                <box size=" 0.0371  0.0278  0.0418" /> 
            </geometry> 
        </collision> 
 
        <visual name="thumb_proximal_rvs"> 
            <origin xyz=" 0.00000000  0.00000000  0.00000000" rpy=" 1.57079633 -0.00000000  1.57079633" /> 
            <geometry> 
                <mesh filename="package://human_control/description/wholebody/stl/thumb_proximal_rvs.stl" scale=" 1.00000000  1.00000000  1.00000000"/> 
            </geometry> 
        </visual> 
 
        <collision name="thumb_proximal_rvs"> 
            <origin xyz=" 0.05288651  0.02056826 -0.07325302" rpy=" 0.00000000 -0.00000000  0.00000000" /> 
            <geometry> 
                <cylinder radius="0.008055999409407377" length="0.031102001667022705" /> 
            </geometry> 
        </collision> 
 
        <visual name="thumb_distal_rvs"> 
            <origin xyz=" 0.00000000  0.00000000  0.00000000" rpy=" 1.57079633 -0.00000000  1.57079633" /> 
            <geometry> 
                <mesh filename="package://human_control/description/wholebody/stl/thumb_distal_rvs.stl" scale=" 1.00000000  1.00000000  1.00000000"/> 
            </geometry> 
        </visual> 
 
        <collision name="thumb_distal_rvs"> 
            <origin xyz=" 0.05050837  0.02557639 -0.09757323" rpy=" 0.00000000 -0.00000000  0.00000000" /> 
            <geometry> 
                <cylinder radius="0.006700750440359116" length="0.022613994777202606" /> 
            </geometry> 
        </collision> 
 
    </link> 
 
    <link name="fingers_r"> 
 
        <inertial> 
             <mass value="0.1"/> 
            <origin xyz=" 0.00000000 -0.00000000 -0.06809500" rpy="0 0 0" /> 
            <inertia ixx="0.001" iyy="0.001" izz="0.001" ixy="0.0" ixz="0.0" iyz="0.0"/> 
        </inertial> 
 
        <visual name="index_proximal_rvs"> 
            <origin xyz=" 0.00000000  0.00000000  0.00000000" rpy=" 1.57079633  0.00000000  1.57079633" /> 
            <geometry> 
                <mesh filename="package://human_control/description/wholebody/stl/index_proximal_rvs.stl" scale=" 1.00000000  1.00000000  1.00000000"/> 
            </geometry> 
        </visual> 
 
        <collision name="index_proximal_rvs"> 
            <origin xyz=" 0.02970711  0.01197593 -0.02710152" rpy=" 0.00000000 -0.00000000  0.00000000" /> 
            <geometry> 
                <box size=" 0.0167  0.0243  0.0416" /> 
            </geometry> 
        </collision> 
 
        <visual name="index_medial_rvs"> 
            <origin xyz=" 0.00000000  0.00000000  0.00000000" rpy=" 1.57079633  0.00000000  1.57079633" /> 
            <geometry> 
                <mesh filename="package://human_control/description/wholebody/stl/index_medial_rvs.stl" scale=" 1.00000000  1.00000000  1.00000000"/> 
            </geometry> 
        </visual> 
 
        <collision name="index_medial_rvs"> 
            <origin xyz=" 0.02725475  0.03210190 -0.05945137" rpy=" 0.00000000 -0.00000000  0.00000000" /> 
            <geometry> 
                <box size=" 0.0155  0.0216  0.0217" /> 
            </geometry> 
        </collision> 
 
        <visual name="index_distal_rvs"> 
            <origin xyz=" 0.00000000  0.00000000  0.00000000" rpy=" 1.57079633  0.00000000  1.57079633" /> 
            <geometry> 
                <mesh filename="package://human_control/description/wholebody/stl/index_distal_rvs.stl" scale=" 1.00000000  1.00000000  1.00000000"/> 
            </geometry> 
        </visual> 
 
        <collision name="index_distal_rvs"> 
            <origin xyz=" 0.02347751  0.04819583 -0.07104889" rpy=" 0.00000000 -0.00000000  0.00000000" /> 
            <geometry> 
                <box size=" 0.0109  0.0162  0.0081" /> 
            </geometry> 
        </collision> 
 
        <visual name="middle_proximal_rvs"> 
            <origin xyz=" 0.00000000  0.00000000  0.00000000" rpy=" 1.57079633  0.00000000  1.57079633" /> 
            <geometry> 
                <mesh filename="package://human_control/description/wholebody/stl/middle_proximal_rvs.stl" scale=" 1.00000000  1.00000000  1.00000000"/> 
            </geometry> 
        </visual> 
 
        <collision name="middle_proximal_rvs"> 
            <origin xyz=" 0.00861476  0.00860884 -0.02974023" rpy=" 0.00000000 -0.00000000  0.00000000" /> 
            <geometry> 
                <box size=" 0.0192  0.0279  0.0466" /> 
            </geometry> 
        </collision> 
 
        <visual name="middle_medial_rvs"> 
            <origin xyz=" 0.00000000  0.00000000  0.00000000" rpy=" 1.57079633  0.00000000  1.57079633" /> 
            <geometry> 
                <mesh filename="package://human_control/description/wholebody/stl/middle_medial_rvs.stl" scale=" 1.00000000  1.00000000  1.00000000"/> 
            </geometry> 
        </visual> 
 
        <collision name="middle_medial_rvs"> 
            <origin xyz=" 0.00351720  0.03283559 -0.06421055" rpy=" 0.00000000 -0.00000000  0.00000000" /> 
            <geometry> 
                <box size=" 0.0176  0.0277  0.0246" /> 
            </geometry> 
        </collision> 
 
        <visual name="middle_distal_rvs"> 
            <origin xyz=" 0.00000000  0.00000000  0.00000000" rpy=" 1.57079633  0.00000000  1.57079633" /> 
            <geometry> 
                <mesh filename="package://human_control/description/wholebody/stl/middle_distal_rvs.stl" scale=" 1.00000000  1.00000000  1.00000000"/> 
            </geometry> 
        </visual> 
 
        <collision name="middle_distal_rvs"> 
            <origin xyz="-0.00080399  0.05209689 -0.07732214" rpy=" 0.00000000 -0.00000000  0.00000000" /> 
            <geometry> 
                <box size=" 0.0117  0.0187  0.0078" /> 
            </geometry> 
        </collision> 
 
        <visual name="ring_proximal_rvs"> 
            <origin xyz=" 0.00000000  0.00000000  0.00000000" rpy=" 1.57079633  0.00000000  1.57079633" /> 
            <geometry> 
                <mesh filename="package://human_control/description/wholebody/stl/ring_proximal_rvs.stl" scale=" 1.00000000  1.00000000  1.00000000"/> 
            </geometry> 
        </visual> 
 
        <collision name="ring_proximal_rvs"> 
            <origin xyz="-0.01332991  0.01119705 -0.02729735" rpy=" 0.00000000 -0.00000000  0.00000000" /> 
            <geometry> 
                <box size=" 0.0175  0.0267  0.0437" /> 
            </geometry> 
        </collision> 
 
        <visual name="ring_medial_rvs"> 
            <origin xyz=" 0.00000000  0.00000000  0.00000000" rpy=" 1.57079633  0.00000000  1.57079633" /> 
            <geometry> 
                <mesh filename="package://human_control/description/wholebody/stl/ring_medial_rvs.stl" scale=" 1.00000000  1.00000000  1.00000000"/> 
            </geometry> 
        </visual> 
 
        <collision name="ring_medial_rvs"> 
            <origin xyz="-0.01690511  0.03421991 -0.05842676" rpy=" 0.00000000 -0.00000000  0.00000000" /> 
            <geometry> 
                <box size=" 0.0141  0.0261  0.0216" /> 
            </geometry> 
        </collision> 
 
        <visual name="ring_distal_rvs"> 
            <origin xyz=" 0.00000000  0.00000000  0.00000000" rpy=" 1.57079633  0.00000000  1.57079633" /> 
            <geometry> 
                <mesh filename="package://human_control/description/wholebody/stl/ring_distal_rvs.stl" scale=" 1.00000000  1.00000000  1.00000000"/> 
            </geometry> 
        </visual> 
 
        <collision name="ring_distal_rvs"> 
            <origin xyz="-0.01849373  0.05314335 -0.06893583" rpy=" 0.00000000 -0.00000000  0.00000000" /> 
            <geometry> 
                <box size=" 0.0118  0.0188  0.0078" /> 
            </geometry> 
        </collision> 
 
        <visual name="little_proximal_rvs"> 
            <origin xyz=" 0.00000000  0.00000000  0.00000000" rpy=" 1.57079633  0.00000000  1.57079633" /> 
            <geometry> 
                <mesh filename="package://human_control/description/wholebody/stl/little_proximal_rvs.stl" scale=" 1.00000000  1.00000000  1.00000000"/> 
            </geometry> 
        </visual> 
 
        <collision name="little_proximal_rvs"> 
            <origin xyz="-0.03040754  0.00690476 -0.00823631" rpy=" 0.00000000 -0.00000000  0.00000000" /> 
            <geometry> 
                <cylinder radius="0.01007974985986948" length="0.03655900061130524" /> 
            </geometry> 
        </collision> 
 
        <visual name="little_medial_rvs"> 
            <origin xyz=" 0.00000000  0.00000000  0.00000000" rpy=" 1.57079633  0.00000000  1.57079633" /> 
            <geometry> 
                <mesh filename="package://human_control/description/wholebody/stl/little_medial_rvs.stl" scale=" 1.00000000  1.00000000  1.00000000"/> 
            </geometry> 
        </visual> 
 
        <collision name="little_medial_rvs"> 
            <origin xyz="-0.03615561  0.02523381 -0.03429079" rpy=" 0.00000000 -0.00000000  0.00000000" /> 
            <geometry> 
                <box size=" 0.0125  0.0188  0.0173" /> 
            </geometry> 
        </collision> 
 
        <visual name="little_distal_rvs"> 
            <origin xyz=" 0.00000000  0.00000000  0.00000000" rpy=" 1.57079633  0.00000000  1.57079633" /> 
            <geometry> 
                <mesh filename="package://human_control/description/wholebody/stl/little_distal_rvs.stl" scale=" 1.00000000  1.00000000  1.00000000"/> 
            </geometry> 
        </visual> 
 
        <collision name="little_distal_rvs"> 
            <origin xyz="-0.03891582  0.03988399 -0.04382447" rpy=" 0.00000000 -0.00000000  0.00000000" /> 
            <geometry> 
                <box size=" 0.0092  0.0157  0.0088" /> 
            </geometry> 
        </collision> 
 
    </link> 
 
    <link name="humerus_l"> 
 
        <inertial> 
             <mass value="2.0325"/> 
            <origin xyz=" 0.00000000 -0.00000000 -0.16450200" rpy="0 0 0" /> 
            <inertia ixx="0.011946" iyy="0.004121" izz="0.013409" ixy="0.0" ixz="0.0" iyz="0.0"/> 
        </inertial> 
 
        <visual name="humerus_lv"> 
            <origin xyz=" 0.00000000  0.00000000  0.00000000" rpy=" 1.57079633 -0.00000000  1.57079633" /> 
            <geometry> 
                <mesh filename="package://human_control/description/wholebody/stl/humerus_lv.stl" scale=" 1.00000000  1.00000000  1.00000000"/> 
            </geometry> 
        </visual> 
 
        <collision name="humerus_lv"> 
            <origin xyz=" 0.00095287  0.00648708 -0.11484574" rpy=" 0.00000000 -0.00000000  0.00000000" /> 
            <geometry> 
                <cylinder radius="0.02503850031644106" length="0.31772199273109436" /> 
            </geometry> 
        </collision> 
 
    </link> 
 
    <link name="ulna_l"> 
 
        <inertial> 
             <mass value="0.6075"/> 
            <origin xyz=" 0.00000000 -0.00000000 -0.12052500" rpy="0 0 0" /> 
            <inertia ixx="0.002962" iyy="0.000618" izz="0.003213" ixy="0.0" ixz="0.0" iyz="0.0"/> 
        </inertial> 
 
        <visual name="ulna_lv"> 
            <origin xyz=" 0.00000000  0.00000000  0.00000000" rpy=" 1.57079633 -0.00000000  1.57079633" /> 
            <geometry> 
                <mesh filename="package://human_control/description/wholebody/stl/ulna_lv.stl" scale=" 1.00000000  1.00000000  1.00000000"/> 
            </geometry> 
        </visual> 
 
        <collision name="ulna_lv"> 
            <origin xyz="-0.00850410 -0.02351724 -0.07896256" rpy=" 0.00000000 -0.00000000  0.00000000" /> 
            <geometry> 
                <cylinder radius="0.01956775039434433" length="0.2585639953613281" /> 
            </geometry> 
        </collision> 
 
    </link> 
 
    <link name="radius_l"> 
 
        <inertial> 
             <mass value="0.6075"/> 
            <origin xyz=" 0.00000000 -0.00000000 -0.12052500" rpy="0 0 0" /> 
            <inertia ixx="0.002962" iyy="0.000618" izz="0.003213" ixy="0.0" ixz="0.0" iyz="0.0"/> 
        </inertial> 
 
        <visual name="radius_lv"> 
            <origin xyz=" 0.00000000  0.00000000  0.00000000" rpy=" 1.57079633 -0.00000000  1.57079633" /> 
            <geometry> 
                <mesh filename="package://human_control/description/wholebody/stl/radius_lv.stl" scale=" 1.00000000  1.00000000  1.00000000"/> 
            </geometry> 
        </visual> 
 
        <collision name="radius_lv"> 
            <origin xyz="-0.01629839 -0.00453670 -0.13081796" rpy=" 0.00000000 -0.00000000  0.00000000" /> 
            <geometry> 
                <cylinder radius="0.018947500735521317" length="0.24069900810718536" /> 
            </geometry> 
        </collision> 
 
    </link> 
 
    <link name="lunate_l"> 
 
        <inertial> 
             <mass value="0.01"/> 
            <origin xyz=" 0.00000000  0.00000000  0.00000000" rpy="0 0 0" /> 
            <inertia ixx="1e-05" iyy="1e-05" izz="1e-05" ixy="0.0" ixz="0.0" iyz="0.0"/> 
        </inertial> 
 
        <visual name="lunate_lvs"> 
            <origin xyz=" 0.00000000  0.00000000  0.00000000" rpy=" 1.57079633 -0.00000000  1.57079633" /> 
            <geometry> 
                <mesh filename="package://human_control/description/wholebody/stl/lunate_lvs.stl" scale=" 1.00000000  1.00000000  1.00000000"/> 
            </geometry> 
        </visual> 
 
        <collision name="lunate_lvs"> 
            <origin xyz=" 0.00740587 -0.00099142 -0.00370128" rpy=" 0.00000000 -0.00000000  0.00000000" /> 
            <geometry> 
                <cylinder radius="0.009647250175476074" length="0.01548099983483553" /> 
            </geometry> 
        </collision> 
 
    </link> 
 
    <link name="hand_l"> 
 
        <inertial> 
             <mass value="0.4575"/> 
            <origin xyz=" 0.00000000 -0.00000000 -0.06809500" rpy="0 0 0" /> 
            <inertia ixx="0.000892" iyy="0.000547" izz="0.00134" ixy="0.0" ixz="0.0" iyz="0.0"/> 
        </inertial> 
 
        <visual name="pisiform_lvs"> 
            <origin xyz=" 0.00000000  0.00000000  0.00000000" rpy=" 1.57079633 -0.00000000  1.57079633" /> 
            <geometry> 
                <mesh filename="package://human_control/description/wholebody/stl/pisiform_lvs.stl" scale=" 1.00000000  1.00000000  1.00000000"/> 
            </geometry> 
        </visual> 
 
        <collision name="pisiform_lvs"> 
            <origin xyz=" 0.02264340  0.00672396 -0.01242664" rpy=" 0.00000000 -0.00000000  0.00000000" /> 
            <geometry> 
                <cylinder radius="0.0050479997880756855" length="0.01401899941265583" /> 
            </geometry> 
        </collision> 
 
        <visual name="scaphoid_lvs"> 
            <origin xyz=" 0.00000000  0.00000000  0.00000000" rpy=" 1.57079633 -0.00000000  1.57079633" /> 
            <geometry> 
                <mesh filename="package://human_control/description/wholebody/stl/scaphoid_lvs.stl" scale=" 1.00000000  1.00000000  1.00000000"/> 
            </geometry> 
        </visual> 
 
        <collision name="scaphoid_lvs"> 
            <origin xyz="-0.01055502 -0.00431960 -0.00639833" rpy=" 0.00000000 -0.00000000  0.00000000" /> 
            <geometry> 
                <box size=" 0.0231  0.0130  0.0220" /> 
            </geometry> 
        </collision> 
 
        <visual name="triquetrum_lvs"> 
            <origin xyz=" 0.00000000  0.00000000  0.00000000" rpy=" 1.57079633 -0.00000000  1.57079633" /> 
            <geometry> 
                <mesh filename="package://human_control/description/wholebody/stl/triquetrum_lvs.stl" scale=" 1.00000000  1.00000000  1.00000000"/> 
            </geometry> 
        </visual> 
 
        <collision name="triquetrum_lvs"> 
            <origin xyz=" 0.02137365 -0.00253767 -0.01326291" rpy=" 0.00000000 -0.00000000  0.00000000" /> 
            <geometry> 
                <sphere radius="0.007859166401127974" /> 
            </geometry> 
        </collision> 
 
        <visual name="hamate_lvs"> 
            <origin xyz=" 0.00000000  0.00000000  0.00000000" rpy=" 1.57079633 -0.00000000  1.57079633" /> 
            <geometry> 
                <mesh filename="package://human_control/description/wholebody/stl/hamate_lvs.stl" scale=" 1.00000000  1.00000000  1.00000000"/> 
            </geometry> 
        </visual> 
 
        <collision name="hamate_lvs"> 
            <origin xyz=" 0.01391004 -0.00201041 -0.02228295" rpy=" 0.00000000 -0.00000000  0.00000000" /> 
            <geometry> 
                <box size=" 0.0166  0.0250  0.0243" /> 
            </geometry> 
        </collision> 
 
        <visual name="capitate_lvs"> 
            <origin xyz=" 0.00000000  0.00000000  0.00000000" rpy=" 1.57079633 -0.00000000  1.57079633" /> 
            <geometry> 
                <mesh filename="package://human_control/description/wholebody/stl/capitate_lvs.stl" scale=" 1.00000000  1.00000000  1.00000000"/> 
            </geometry> 
        </visual> 
 
        <collision name="capitate_lvs"> 
            <origin xyz=" 0.00018225 -0.00215341 -0.01805039" rpy=" 0.00000000 -0.00000000  0.00000000" /> 
            <geometry> 
                <cylinder radius="0.009557500015944242" length="0.024056999012827873" /> 
            </geometry> 
        </collision> 
 
        <visual name="trapezoid_lvs"> 
            <origin xyz=" 0.00000000  0.00000000  0.00000000" rpy=" 1.57079633 -0.00000000  1.57079633" /> 
            <geometry> 
                <mesh filename="package://human_control/description/wholebody/stl/trapezoid_lvs.stl" scale=" 1.00000000  1.00000000  1.00000000"/> 
            </geometry> 
        </visual> 
 
        <collision name="trapezoid_lvs"> 
            <origin xyz="-0.01073235 -0.00639614 -0.02458632" rpy=" 0.00000000 -0.00000000  0.00000000" /> 
            <geometry> 
                <box size=" 0.0129  0.0183  0.0144" /> 
            </geometry> 
        </collision> 
 
        <visual name="trapezium_lvs"> 
            <origin xyz=" 0.00000000  0.00000000  0.00000000" rpy=" 1.57079633 -0.00000000  1.57079633" /> 
            <geometry> 
                <mesh filename="package://human_control/description/wholebody/stl/trapezium_lvs.stl" scale=" 1.00000000  1.00000000  1.00000000"/> 
            </geometry> 
        </visual> 
 
        <collision name="trapezium_lvs"> 
            <origin xyz="-0.02315719 -0.00607738 -0.02206884" rpy=" 0.00000000 -0.00000000  0.00000000" /> 
            <geometry> 
                <cylinder radius="0.00875299982726574" length="0.020844001322984695" /> 
            </geometry> 
        </collision> 
 
        <visual name="metacarpal2_lvs"> 
            <origin xyz=" 0.00000000  0.00000000  0.00000000" rpy=" 1.57079633 -0.00000000  1.57079633" /> 
            <geometry> 
                <mesh filename="package://human_control/description/wholebody/stl/metacarpal2_lvs.stl" scale=" 1.00000000  1.00000000  1.00000000"/> 
            </geometry> 
        </visual> 
 
        <collision name="metacarpal2_lvs"> 
            <origin xyz="-0.01564131 -0.00077968 -0.06371122" rpy=" 0.00000000 -0.00000000  0.00000000" /> 
            <geometry> 
                <cylinder radius="0.011795250233262777" length="0.07312200218439102" /> 
            </geometry> 
        </collision> 
 
        <visual name="metacarpal3_lvs"> 
            <origin xyz=" 0.00000000  0.00000000  0.00000000" rpy=" 1.57079633 -0.00000000  1.57079633" /> 
            <geometry> 
                <mesh filename="package://human_control/description/wholebody/stl/metacarpal3_lvs.stl" scale=" 1.00000000  1.00000000  1.00000000"/> 
            </geometry> 
        </visual> 
 
        <collision name="metacarpal3_lvs"> 
            <origin xyz=" 0.00107448 -0.00555988 -0.06484496" rpy=" 0.00000000 -0.00000000  0.00000000" /> 
            <geometry> 
                <box size=" 0.0186  0.0270  0.0777" /> 
            </geometry> 
        </collision> 
 
        <visual name="metacarpal4_lvs"> 
            <origin xyz=" 0.00000000  0.00000000  0.00000000" rpy=" 1.57079633 -0.00000000  1.57079633" /> 
            <geometry> 
                <mesh filename="package://human_control/description/wholebody/stl/metacarpal4_lvs.stl" scale=" 1.00000000  1.00000000  1.00000000"/> 
            </geometry> 
        </visual> 
 
        <collision name="metacarpal4_lvs"> 
            <origin xyz=" 0.01640473 -0.00496538 -0.06454174" rpy=" 0.00000000 -0.00000000  0.00000000" /> 
            <geometry> 
                <cylinder radius="0.009116999804973602" length="0.07210100442171097" /> 
            </geometry> 
        </collision> 
 
        <visual name="metacarpal5_lvs"> 
            <origin xyz=" 0.00000000  0.00000000  0.00000000" rpy=" 1.57079633 -0.00000000  1.57079633" /> 
            <geometry> 
                <mesh filename="package://human_control/description/wholebody/stl/metacarpal5_lvs.stl" scale=" 1.00000000  1.00000000  1.00000000"/> 
            </geometry> 
        </visual> 
 
        <collision name="metacarpal5_lvs"> 
            <origin xyz=" 0.03005602 -0.00306699 -0.05570871" rpy=" 0.00000000 -0.00000000  0.00000000" /> 
            <geometry> 
                <box size=" 0.0248  0.0135  0.0592" /> 
            </geometry> 
        </collision> 
 
        <visual name="metacarpal1_lvs"> 
            <origin xyz=" 0.00000000  0.00000000  0.00000000" rpy=" 1.57079633 -0.00000000  1.57079633" /> 
            <geometry> 
                <mesh filename="package://human_control/description/wholebody/stl/metacarpal1_lvs.stl" scale=" 1.00000000  1.00000000  1.00000000"/> 
            </geometry> 
        </visual> 
 
        <collision name="metacarpal1_lvs"> 
            <origin xyz="-0.04136169  0.00885674 -0.04079057" rpy=" 0.00000000 -0.00000000  0.00000000" /> 
            <geometry> 
                <box size=" 0.0371  0.0278  0.0418" /> 
            </geometry> 
        </collision> 
 
        <visual name="thumb_proximal_lvs"> 
            <origin xyz=" 0.00000000  0.00000000  0.00000000" rpy=" 1.57079633 -0.00000000  1.57079633" /> 
            <geometry> 
                <mesh filename="package://human_control/description/wholebody/stl/thumb_proximal_lvs.stl" scale=" 1.00000000  1.00000000  1.00000000"/> 
            </geometry> 
        </visual> 
 
        <collision name="thumb_proximal_lvs"> 
            <origin xyz="-0.05288652  0.02056826 -0.07325302" rpy=" 0.00000000 -0.00000000  0.00000000" /> 
            <geometry> 
                <cylinder radius="0.008091249503195286" length="0.030949998646974564" /> 
            </geometry> 
        </collision> 
 
        <visual name="thumb_distal_lvs"> 
            <origin xyz=" 0.00000000  0.00000000  0.00000000" rpy=" 1.57079633 -0.00000000  1.57079633" /> 
            <geometry> 
                <mesh filename="package://human_control/description/wholebody/stl/thumb_distal_lvs.stl" scale=" 1.00000000  1.00000000  1.00000000"/> 
            </geometry> 
        </visual> 
 
        <collision name="thumb_distal_lvs"> 
            <origin xyz="-0.05050836  0.02557639 -0.09757325" rpy=" 0.00000000 -0.00000000  0.00000000" /> 
            <geometry> 
                <cylinder radius="0.006754999980330467" length="0.022613994777202606" /> 
            </geometry> 
        </collision> 
 
    </link> 
 
    <link name="fingers_l"> 
 
        <inertial> 
             <mass value="0.1"/> 
            <origin xyz=" 0.00000000 -0.00000000 -0.06809500" rpy="0 0 0" /> 
            <inertia ixx="0.001" iyy="0.001" izz="0.001" ixy="0.0" ixz="0.0" iyz="0.0"/> 
        </inertial> 
 
        <visual name="index_proximal_lvs"> 
            <origin xyz=" 0.00000000  0.00000000  0.00000000" rpy=" 1.57079633  0.00000000  1.57079633" /> 
            <geometry> 
                <mesh filename="package://human_control/description/wholebody/stl/index_proximal_lvs.stl" scale=" 1.00000000  1.00000000  1.00000000"/> 
            </geometry> 
        </visual> 
 
        <collision name="index_proximal_lvs"> 
            <origin xyz="-0.02970711  0.01197593 -0.02710151" rpy=" 0.00000000 -0.00000000  0.00000000" /> 
            <geometry> 
                <box size=" 0.0167  0.0243  0.0416" /> 
            </geometry> 
        </collision> 
 
        <visual name="index_medial_lvs"> 
            <origin xyz=" 0.00000000  0.00000000  0.00000000" rpy=" 1.57079633  0.00000000  1.57079633" /> 
            <geometry> 
                <mesh filename="package://human_control/description/wholebody/stl/index_medial_lvs.stl" scale=" 1.00000000  1.00000000  1.00000000"/> 
            </geometry> 
        </visual> 
 
        <collision name="index_medial_lvs"> 
            <origin xyz="-0.02725475  0.03210189 -0.05945137" rpy=" 0.00000000 -0.00000000  0.00000000" /> 
            <geometry> 
                <box size=" 0.0155  0.0216  0.0217" /> 
            </geometry> 
        </collision> 
 
        <visual name="index_distal_lvs"> 
            <origin xyz=" 0.00000000  0.00000000  0.00000000" rpy=" 1.57079633  0.00000000  1.57079633" /> 
            <geometry> 
                <mesh filename="package://human_control/description/wholebody/stl/index_distal_lvs.stl" scale=" 1.00000000  1.00000000  1.00000000"/> 
            </geometry> 
        </visual> 
 
        <collision name="index_distal_lvs"> 
            <origin xyz="-0.02347751  0.04819582 -0.07104890" rpy=" 0.00000000 -0.00000000  0.00000000" /> 
            <geometry> 
                <box size=" 0.0108  0.0162  0.0081" /> 
            </geometry> 
        </collision> 
 
        <visual name="middle_proximal_lvs"> 
            <origin xyz=" 0.00000000  0.00000000  0.00000000" rpy=" 1.57079633  0.00000000  1.57079633" /> 
            <geometry> 
                <mesh filename="package://human_control/description/wholebody/stl/middle_proximal_lvs.stl" scale=" 1.00000000  1.00000000  1.00000000"/> 
            </geometry> 
        </visual> 
 
        <collision name="middle_proximal_lvs"> 
            <origin xyz="-0.00861476  0.00860884 -0.02974023" rpy=" 0.00000000 -0.00000000  0.00000000" /> 
            <geometry> 
                <box size=" 0.0192  0.0275  0.0466" /> 
            </geometry> 
        </collision> 
 
        <visual name="middle_medial_lvs"> 
            <origin xyz=" 0.00000000  0.00000000  0.00000000" rpy=" 1.57079633  0.00000000  1.57079633" /> 
            <geometry> 
                <mesh filename="package://human_control/description/wholebody/stl/middle_medial_lvs.stl" scale=" 1.00000000  1.00000000  1.00000000"/> 
            </geometry> 
        </visual> 
 
        <collision name="middle_medial_lvs"> 
            <origin xyz="-0.00333920  0.03283559 -0.06581254" rpy=" 0.00000000 -0.00000000  0.00000000" /> 
            <geometry> 
                <box size=" 0.0175  0.0279  0.0242" /> 
            </geometry> 
        </collision> 
 
        <visual name="middle_distal_lvs"> 
            <origin xyz=" 0.00000000  0.00000000  0.00000000" rpy=" 1.57079633  0.00000000  1.57079633" /> 
            <geometry> 
                <mesh filename="package://human_control/description/wholebody/stl/middle_distal_lvs.stl" scale=" 1.00000000  1.00000000  1.00000000"/> 
            </geometry> 
        </visual> 
 
        <collision name="middle_distal_lvs"> 
            <origin xyz=" 0.00080399  0.05209688 -0.07732210" rpy=" 0.00000000 -0.00000000  0.00000000" /> 
            <geometry> 
                <box size=" 0.0117  0.0187  0.0078" /> 
            </geometry> 
        </collision> 
 
        <visual name="ring_proximal_lvs"> 
            <origin xyz=" 0.00000000  0.00000000  0.00000000" rpy=" 1.57079633  0.00000000  1.57079633" /> 
            <geometry> 
                <mesh filename="package://human_control/description/wholebody/stl/ring_proximal_lvs.stl" scale=" 1.00000000  1.00000000  1.00000000"/> 
            </geometry> 
        </visual> 
 
        <collision name="ring_proximal_lvs"> 
            <origin xyz=" 0.01332991  0.01119705 -0.02729735" rpy=" 0.00000000 -0.00000000  0.00000000" /> 
            <geometry> 
                <box size=" 0.0175  0.0267  0.0439" /> 
            </geometry> 
        </collision> 
 
        <visual name="ring_medial_lvs"> 
            <origin xyz=" 0.00000000  0.00000000  0.00000000" rpy=" 1.57079633  0.00000000  1.57079633" /> 
            <geometry> 
                <mesh filename="package://human_control/description/wholebody/stl/ring_medial_lvs.stl" scale=" 1.00000000  1.00000000  1.00000000"/> 
            </geometry> 
        </visual> 
 
        <collision name="ring_medial_lvs"> 
            <origin xyz=" 0.01690512  0.03421991 -0.05842675" rpy=" 0.00000000 -0.00000000  0.00000000" /> 
            <geometry> 
                <box size=" 0.0139  0.0261  0.0216" /> 
            </geometry> 
        </collision> 
 
        <visual name="ring_distal_lvs"> 
            <origin xyz=" 0.00000000  0.00000000  0.00000000" rpy=" 1.57079633  0.00000000  1.57079633" /> 
            <geometry> 
                <mesh filename="package://human_control/description/wholebody/stl/ring_distal_lvs.stl" scale=" 1.00000000  1.00000000  1.00000000"/> 
            </geometry> 
        </visual> 
 
        <collision name="ring_distal_lvs"> 
            <origin xyz=" 0.01849373  0.05314334 -0.06893583" rpy=" 0.00000000 -0.00000000  0.00000000" /> 
            <geometry> 
                <box size=" 0.0118  0.0185  0.0078" /> 
            </geometry> 
        </collision> 
 
        <visual name="little_proximal_lvs"> 
            <origin xyz=" 0.00000000  0.00000000  0.00000000" rpy=" 1.57079633  0.00000000  1.57079633" /> 
            <geometry> 
                <mesh filename="package://human_control/description/wholebody/stl/little_proximal_lvs.stl" scale=" 1.00000000  1.00000000  1.00000000"/> 
            </geometry> 
        </visual> 
 
        <collision name="little_proximal_lvs"> 
            <origin xyz=" 0.03040753  0.00690476 -0.00823631" rpy=" 0.00000000 -0.00000000  0.00000000" /> 
            <geometry> 
                <cylinder radius="0.010060499887913465" length="0.03655900061130524" /> 
            </geometry> 
        </collision> 
 
        <visual name="little_medial_lvs"> 
            <origin xyz=" 0.00000000  0.00000000  0.00000000" rpy=" 1.57079633  0.00000000  1.57079633" /> 
            <geometry> 
                <mesh filename="package://human_control/description/wholebody/stl/little_medial_lvs.stl" scale=" 1.00000000  1.00000000  1.00000000"/> 
            </geometry> 
        </visual> 
 
        <collision name="little_medial_lvs"> 
            <origin xyz=" 0.03615562  0.02523381 -0.03429080" rpy=" 0.00000000 -0.00000000  0.00000000" /> 
            <geometry> 
                <box size=" 0.0125  0.0188  0.0173" /> 
            </geometry> 
        </collision> 
 
        <visual name="little_distal_lvs"> 
            <origin xyz=" 0.00000000  0.00000000  0.00000000" rpy=" 1.57079633  0.00000000  1.57079633" /> 
            <geometry> 
                <mesh filename="package://human_control/description/wholebody/stl/little_distal_lvs.stl" scale=" 1.00000000  1.00000000  1.00000000"/> 
            </geometry> 
        </visual> 
 
        <collision name="little_distal_lvs"> 
            <origin xyz=" 0.03897082  0.02993329 -0.04186653" rpy=" 0.00000000 -0.00000000  0.00000000" /> 
            <geometry> 
                <box size=" 0.0093  0.0157  0.0088" /> 
            </geometry> 
        </collision> 
 
    </link> 
 
    <joint name="ground_pelvis" type="floating"> 
 
        <origin xyz=" 0.00000000  0.00000000  0.00000000" rpy=" 0.00000000 -0.00000000  0.00000000" /> 
        <parent link="ground"/> 
        <child link="pelvis"/> 
 
    </joint> 
 
    <link name="femur_r_f1"> 
 
        <inertial>
            <mass value="0.0001"/> 
            <origin xyz=" 0.00000000  0.00000000  0.00000000" rpy="0 0 0" /> 
            <inertia ixx="0.0003" iyy="0.0003" izz="0.0003" ixy="0.0" ixz="0.0" iyz="0.0"/> 
        </inertial> 
 
    </link> 
 
    <joint name="hip_flexion_r" type="revolute"> 
 
        <origin xyz=" 0.08350000 -0.07070000 -0.06610000" rpy=" 0.00000000 -0.00000000  0.00000000" /> 
        <parent link="pelvis"/> 
        <child link="femur_r_f1"/> 
        <axis xyz=" 1.00000000  0.00000000  0.00000000"/> 
        <limit effort="49.02383333333333" velocity="1.0" lower="-2.618" upper="2.0943951" /> 
 
    </joint> 
 
    <link name="femur_r_f2"> 
 
        <inertial>
            <mass value="0.0001"/> 
            <origin xyz=" 0.00000000  0.00000000  0.00000000" rpy="0 0 0" /> 
            <inertia ixx="0.0003" iyy="0.0003" izz="0.0003" ixy="0.0" ixz="0.0" iyz="0.0"/> 
        </inertial> 
 
    </link> 
 
    <joint name="hip_adduction_r" type="revolute"> 
 
        <origin xyz=" 0.00000000  0.00000000  0.00000000" rpy=" 0.00000000  0.00000000  0.00000000" /> 
        <parent link="femur_r_f1"/> 
        <child link="femur_r_f2"/> 
        <axis xyz=" 0.00000000  1.00000000  0.00000000"/> 
        <limit effort="7.4466" velocity="1.0" lower="-2.0943951" upper="2.0943951" /> 
 
    </joint> 
 
    <joint name="hip_rotation_r" type="revolute"> 
 
        <origin xyz=" 0.00000000  0.00000000  0.00000000" rpy=" 0.00000000  0.00000000  0.00000000" /> 
        <parent link="femur_r_f2"/> 
        <child link="femur_r"/> 
        <axis xyz=" 0.00000000  0.00000000  1.00000000"/> 
        <limit effort="7.4466" velocity="1.0" lower="-2.0943951" upper="2.0943951" /> 
 
    </joint> 
 
    <joint name="knee_angle_r" type="revolute"> 
 
        <origin xyz=" 0.00000000 -0.00000000 -0.39000000" rpy=" 0.00000000 -0.00000000  0.00000000" /> 
        <parent link="femur_r"/> 
        <child link="tibia_r"/> 
        <axis xyz=" 1.00000000  0.00000000  0.00000000"/> 
        <limit effort="51.627500000000005" velocity="1.0" lower="-3.1416" upper="0.3491" /> 
 
    </joint> 
 
    <joint name="ankle_angle_r" type="revolute"> 
 
        <origin xyz=" 0.00000000 -0.00000000 -0.43000000" rpy=" 0.00000000 -0.00000000  0.00000000" /> 
        <parent link="tibia_r"/> 
        <child link="talus_r"/> 
        <axis xyz=" 0.97912632 -0.10501355 -0.17402245"/> 
        <limit effort="7.4466" velocity="1.0" lower="-1.57079633" upper="1.57079633" /> 
 
    </joint> 
 
    <joint name="subtalar_angle_r" type="revolute"> 
 
        <origin xyz=" 0.00792000 -0.04877000 -0.04195000" rpy=" 0.00000000 -0.00000000  0.00000000" /> 
        <parent link="talus_r"/> 
        <child link="calcn_r"/> 
        <axis xyz="-0.12094949  0.78717961  0.60474746"/> 
        <limit effort="7.4466" velocity="1.0" lower="-1.57079633" upper="1.57079633" /> 
 
    </joint> 
 
    <joint name="mtp_angle_r" type="revolute"> 
 
        <origin xyz=" 0.00108000  0.17880000 -0.00200000" rpy=" 0.00000000 -0.00000000  0.00000000" /> 
        <parent link="calcn_r"/> 
        <child link="toes_r"/> 
        <axis xyz=" 0.81393611 -0.58095440  0.00000000"/> 
        <limit effort="7.4466" velocity="1.0" lower="-1.57079633" upper="1.57079633" /> 
 
    </joint> 
 
    <link name="femur_l_f1"> 
 
        <inertial>
            <mass value="0.0001"/> 
            <origin xyz=" 0.00000000  0.00000000  0.00000000" rpy="0 0 0" /> 
            <inertia ixx="0.0003" iyy="0.0003" izz="0.0003" ixy="0.0" ixz="0.0" iyz="0.0"/> 
        </inertial> 
 
    </link> 
 
    <joint name="hip_flexion_l" type="revolute"> 
 
        <origin xyz="-0.08350000 -0.07070000 -0.06610000" rpy=" 0.00000000 -0.00000000  0.00000000" /> 
        <parent link="pelvis"/> 
        <child link="femur_l_f1"/> 
        <axis xyz=" 1.00000000  0.00000000  0.00000000"/> 
        <limit effort="49.02383333333333" velocity="1.0" lower="-2.618" upper="2.0943951" /> 
 
    </joint> 
 
    <link name="femur_l_f2"> 
 
        <inertial>
            <mass value="0.0001"/> 
            <origin xyz=" 0.00000000  0.00000000  0.00000000" rpy="0 0 0" /> 
            <inertia ixx="0.0003" iyy="0.0003" izz="0.0003" ixy="0.0" ixz="0.0" iyz="0.0"/> 
        </inertial> 
 
    </link> 
 
    <joint name="hip_adduction_l" type="revolute"> 
 
        <origin xyz=" 0.00000000  0.00000000  0.00000000" rpy=" 0.00000000  0.00000000  0.00000000" /> 
        <parent link="femur_l_f1"/> 
        <child link="femur_l_f2"/> 
        <axis xyz=" 0.00000000 -1.00000000  0.00000000"/> 
        <limit effort="7.4466" velocity="1.0" lower="-2.0943951" upper="2.0943951" /> 
 
    </joint> 
 
    <joint name="hip_rotation_l" type="revolute"> 
 
        <origin xyz=" 0.00000000  0.00000000  0.00000000" rpy=" 0.00000000  0.00000000  0.00000000" /> 
        <parent link="femur_l_f2"/> 
        <child link="femur_l"/> 
        <axis xyz=" 0.00000000  0.00000000 -1.00000000"/> 
        <limit effort="7.4466" velocity="1.0" lower="-2.0943951" upper="2.0943951" /> 
 
    </joint> 
 
    <joint name="knee_angle_l" type="revolute"> 
 
        <origin xyz=" 0.00000000 -0.00000000 -0.39000000" rpy=" 0.00000000 -0.00000000  0.00000000" /> 
        <parent link="femur_l"/> 
        <child link="tibia_l"/> 
        <axis xyz=" 1.00000000  0.00000000  0.00000000"/> 
        <limit effort="51.627500000000005" velocity="1.0" lower="-3.1416" upper="0.3491" /> 
 
    </joint> 
 
    <joint name="ankle_angle_l" type="revolute"> 
 
        <origin xyz=" 0.00000000 -0.00000000 -0.43000000" rpy=" 0.00000000 -0.00000000  0.00000000" /> 
        <parent link="tibia_l"/> 
        <child link="talus_l"/> 
        <axis xyz=" 0.97912632  0.10501355  0.17402245"/> 
        <limit effort="7.4466" velocity="1.0" lower="-1.57079633" upper="1.57079633" /> 
 
    </joint> 
 
    <joint name="subtalar_angle_l" type="revolute"> 
 
        <origin xyz="-0.00792000 -0.04877000 -0.04195000" rpy=" 0.00000000 -0.00000000  0.00000000" /> 
        <parent link="talus_l"/> 
        <child link="calcn_l"/> 
        <axis xyz="-0.12094949 -0.78717961 -0.60474746"/> 
        <limit effort="7.4466" velocity="1.0" lower="-1.57079633" upper="1.57079633" /> 
 
    </joint> 
 
    <joint name="mtp_angle_l" type="revolute"> 
 
        <origin xyz="-0.00108000  0.17880000 -0.00200000" rpy=" 0.00000000 -0.00000000  0.00000000" /> 
        <parent link="calcn_l"/> 
        <child link="toes_l"/> 
        <axis xyz=" 0.81393611  0.58095440  0.00000000"/> 
        <limit effort="7.4466" velocity="1.0" lower="-1.04719755" upper="1.04719755" /> 
 
    </joint> 
 
    <link name="torso_f1"> 
 
        <inertial>
            <mass value="0.0001"/> 
            <origin xyz=" 0.00000000  0.00000000  0.00000000" rpy="0 0 0" /> 
            <inertia ixx="0.0003" iyy="0.0003" izz="0.0003" ixy="0.0" ixz="0.0" iyz="0.0"/> 
        </inertial> 
 
    </link> 
 
    <joint name="lumbar_extension" type="revolute"> 
 
        <origin xyz="-0.00000000 -0.10070000  0.08150000" rpy=" 0.00000000 -0.00000000  0.00000000" /> 
        <parent link="pelvis"/> 
        <child link="torso_f1"/> 
        <axis xyz=" 1.00000000  0.00000000  0.00000000"/> 
        <limit effort="179.42970000000003" velocity="1.0" lower="-1.57079633" upper="1.57079633" /> 
 
    </joint> 
 
    <link name="torso_f2"> 
 
        <inertial>
            <mass value="0.0001"/> 
            <origin xyz=" 0.00000000  0.00000000  0.00000000" rpy="0 0 0" /> 
            <inertia ixx="0.0003" iyy="0.0003" izz="0.0003" ixy="0.0" ixz="0.0" iyz="0.0"/> 
        </inertial> 
 
    </link> 
 
    <joint name="lumbar_bending" type="revolute"> 
 
        <origin xyz=" 0.00000000  0.00000000  0.00000000" rpy=" 0.00000000  0.00000000  0.00000000" /> 
        <parent link="torso_f1"/> 
        <child link="torso_f2"/> 
        <axis xyz=" 0.00000000  1.00000000  0.00000000"/> 
        <limit effort="7.4466" velocity="1.0" lower="-1.57079633" upper="1.57079633" /> 
 
    </joint> 
 
    <joint name="lumbar_rotation" type="revolute"> 
 
        <origin xyz=" 0.00000000  0.00000000  0.00000000" rpy=" 0.00000000  0.00000000  0.00000000" /> 
        <parent link="torso_f2"/> 
        <child link="torso"/> 
        <axis xyz=" 0.00000000  0.00000000  1.00000000"/> 
        <limit effort="7.4466" velocity="1.0" lower="-1.57079633" upper="1.57079633" /> 
 
    </joint> 
 
    <link name="head_and_neck_f1"> 
 
        <inertial>
            <mass value="0.0001"/> 
            <origin xyz=" 0.00000000  0.00000000  0.00000000" rpy="0 0 0" /> 
            <inertia ixx="0.0003" iyy="0.0003" izz="0.0003" ixy="0.0" ixz="0.0" iyz="0.0"/> 
        </inertial> 
 
    </link> 
 
    <joint name="neck_flexion" type="revolute"> 
 
        <origin xyz="-0.00000000 -0.01000000  0.44500000" rpy=" 0.00000000 -0.00000000  0.00000000" /> 
        <parent link="torso"/> 
        <child link="head_and_neck_f1"/> 
        <axis xyz=" 1.00000000  0.00000000  0.00000000"/> 
        <limit effort="7.4466" velocity="1.0" lower="-1.74533" upper="1.04719755" /> 
 
    </joint> 
 
    <link name="head_and_neck_f2"> 
 
        <inertial>
            <mass value="0.0001"/> 
            <origin xyz=" 0.00000000  0.00000000  0.00000000" rpy="0 0 0" /> 
            <inertia ixx="0.0003" iyy="0.0003" izz="0.0003" ixy="0.0" ixz="0.0" iyz="0.0"/> 
        </inertial> 
 
    </link> 
 
    <joint name="neck_lateral_bending" type="revolute"> 
 
        <origin xyz=" 0.00000000  0.00000000  0.00000000" rpy=" 0.00000000  0.00000000  0.00000000" /> 
        <parent link="head_and_neck_f1"/> 
        <child link="head_and_neck_f2"/> 
        <axis xyz=" 0.00000000  1.00000000  0.00000000"/> 
        <limit effort="7.4466" velocity="1.0" lower="-0.6" upper="0.6" /> 
 
    </joint> 
 
    <joint name="neck_rotation" type="revolute"> 
 
        <origin xyz=" 0.00000000  0.00000000  0.00000000" rpy=" 0.00000000  0.00000000  0.00000000" /> 
        <parent link="head_and_neck_f2"/> 
        <child link="head_and_neck"/> 
        <axis xyz=" 0.00000000  0.00000000  1.00000000"/> 
        <limit effort="7.4466" velocity="1.0" lower="-1.2217" upper="1.2217" /> 
 
    </joint> 
 
    <link name="humerus_r_f1"> 
 
        <inertial>
            <mass value="0.0001"/> 
            <origin xyz=" 0.00000000  0.00000000  0.00000000" rpy="0 0 0" /> 
            <inertia ixx="0.0003" iyy="0.0003" izz="0.0003" ixy="0.0" ixz="0.0" iyz="0.0"/> 
        </inertial> 
 
    </link> 
 
    <joint name="arm_flex_r" type="revolute"> 
 
        <origin xyz=" 0.17000000  0.00315500  0.37150000" rpy=" 0.00000000 -0.00000000  0.00000000" /> 
        <parent link="torso"/> 
        <child link="humerus_r_f1"/> 
        <axis xyz=" 1.00000000  0.00000000  0.00000000"/> 
        <limit effort="85.65791871428571" velocity="1.0" lower="-1.57079633" upper="3.1416" /> 
 
    </joint> 
 
    <link name="humerus_r_f2"> 
 
        <inertial>
            <mass value="0.0001"/> 
            <origin xyz=" 0.00000000  0.00000000  0.00000000" rpy="0 0 0" /> 
            <inertia ixx="0.0003" iyy="0.0003" izz="0.0003" ixy="0.0" ixz="0.0" iyz="0.0"/> 
        </inertial> 
 
    </link> 
 
    <joint name="arm_add_r" type="revolute"> 
 
        <origin xyz=" 0.00000000  0.00000000  0.00000000" rpy=" 0.00000000  0.00000000  0.00000000" /> 
        <parent link="humerus_r_f1"/> 
        <child link="humerus_r_f2"/> 
        <axis xyz=" 0.00000000  1.00000000  0.00000000"/> 
        <limit effort="7.4466" velocity="1.0" lower="-3.8397" upper="1.57079633" /> 
 
    </joint> 
 
    <joint name="arm_rot_r" type="revolute"> 
 
        <origin xyz=" 0.00000000  0.00000000  0.00000000" rpy=" 0.00000000  0.00000000  0.00000000" /> 
        <parent link="humerus_r_f2"/> 
        <child link="humerus_r"/> 
        <axis xyz=" 0.00000000  0.00000000  1.00000000"/> 
        <limit effort="7.4466" velocity="1.0" lower="-1.57079633" upper="1.57079633" /> 
 
    </joint> 
 
    <joint name="elbow_flex_r" type="revolute"> 
 
        <origin xyz="-0.00959500  0.01314400 -0.28627300" rpy=" 0.00000000 -0.00000000  0.00000000" /> 
        <parent link="humerus_r"/> 
        <child link="ulna_r"/> 
        <axis xyz=" 0.97386183  0.22604696  0.02226900"/> 
        <limit effort="77.84552666666667" velocity="1.0" lower="0" upper="3.1416" /> 
 
    </joint> 
 
    <joint name="pro_sup_r" type="revolute"> 
 
        <origin xyz=" 0.02608300 -0.00672700 -0.01300700" rpy=" 0.00000000 -0.00000000  0.00000000" /> 
        <parent link="ulna_r"/> 
        <child link="radius_r"/> 
        <axis xyz=" 0.00195200  0.05639803  0.99840646"/> 
        <limit effort="55.489560000000004" velocity="1.0" lower="-3.1416" upper="3.1416" /> 
 
    </joint> 
 
    <joint name="wrist_flex_r" type="revolute"> 
 
        <origin xyz=" 0.01361000 -0.00879700 -0.23584100" rpy=" 0.00000000  0.10000000 -0.00000000" /> 
        <parent link="radius_r"/> 
        <child link="lunate_r"/> 
        <axis xyz=" 1.00000000  0.00000000  0.00000000"/> 
        <limit effort="7.4466" velocity="1.0" lower="-1.5708" upper="1.5708" /> 
 
    </joint> 
 
    <joint name="wrist_dev_r" type="revolute"> 
 
        <origin xyz=" 0.00000000  0.00000000  0.00000000" rpy=" 0.00000000 -0.00000000  0.00000000" /> 
        <parent link="lunate_r"/> 
        <child link="hand_r"/> 
        <axis xyz=" 0.00000000  1.00000000  0.00000000"/> 
        <limit effort="7.4466" velocity="1.0" lower="-0.43633231" upper="0.61086524" /> 
 
    </joint> 
 
    <joint name="hand_finger_flex_r" type="revolute"> 
 
        <origin xyz="-0.01000000  0.00000000 -0.07700000" rpy=" 0.00000000 -0.00000000  0.00000000" /> 
        <parent link="hand_r"/> 
        <child link="fingers_r"/> 
        <axis xyz=" 1.00000000  0.00000000  0.00000000"/> 
        <limit effort="7.4466" velocity="1.0" lower="-1.5708" upper="1.5708" /> 
 
    </joint> 
 
    <link name="humerus_l_f1"> 
 
        <inertial>
            <mass value="0.0001"/> 
            <origin xyz=" 0.00000000  0.00000000  0.00000000" rpy="0 0 0" /> 
            <inertia ixx="0.0003" iyy="0.0003" izz="0.0003" ixy="0.0" ixz="0.0" iyz="0.0"/> 
        </inertial> 
 
    </link> 
 
    <joint name="arm_flex_l" type="revolute"> 
 
        <origin xyz="-0.17000000  0.00315500  0.37150000" rpy=" 0.00000000 -0.00000000  0.00000000" /> 
        <parent link="torso"/> 
        <child link="humerus_l_f1"/> 
        <axis xyz=" 1.00000000  0.00000000  0.00000000"/> 
        <limit effort="85.65791871428571" velocity="1.0" lower="-1.57079633" upper="3.1416" /> 
 
    </joint> 
 
    <link name="humerus_l_f2"> 
 
        <inertial>
            <mass value="0.0001"/> 
            <origin xyz=" 0.00000000  0.00000000  0.00000000" rpy="0 0 0" /> 
            <inertia ixx="0.0003" iyy="0.0003" izz="0.0003" ixy="0.0" ixz="0.0" iyz="0.0"/> 
        </inertial> 
 
    </link> 
 
    <joint name="arm_add_l" type="revolute"> 
 
        <origin xyz=" 0.00000000  0.00000000  0.00000000" rpy=" 0.00000000  0.00000000  0.00000000" /> 
        <parent link="humerus_l_f1"/> 
        <child link="humerus_l_f2"/> 
        <axis xyz=" 0.00000000 -1.00000000  0.00000000"/> 
        <limit effort="7.4466" velocity="1.0" lower="-3.8397" upper="1.57079633" /> 
 
    </joint> 
 
    <joint name="arm_rot_l" type="revolute"> 
 
        <origin xyz=" 0.00000000  0.00000000  0.00000000" rpy=" 0.00000000  0.00000000  0.00000000" /> 
        <parent link="humerus_l_f2"/> 
        <child link="humerus_l"/> 
        <axis xyz=" 0.00000000  0.00000000 -1.00000000"/> 
        <limit effort="7.4466" velocity="1.0" lower="-1.57079633" upper="1.57079633" /> 
 
    </joint> 
 
    <joint name="elbow_flex_l" type="revolute"> 
 
        <origin xyz=" 0.00959500  0.01314400 -0.28627300" rpy=" 0.00000000 -0.00000000  0.00000000" /> 
        <parent link="humerus_l"/> 
        <child link="ulna_l"/> 
        <axis xyz=" 0.97386183 -0.22604696 -0.02226900"/> 
        <limit effort="77.84552666666667" velocity="1.0" lower="0" upper="3.1416" /> 
 
    </joint> 
 
    <joint name="pro_sup_l" type="revolute"> 
 
        <origin xyz="-0.02608300 -0.00672700 -0.01300700" rpy=" 0.00000000 -0.00000000  0.00000000" /> 
        <parent link="ulna_l"/> 
        <child link="radius_l"/> 
        <axis xyz=" 0.00195200 -0.05639803 -0.99840646"/> 
        <limit effort="55.489560000000004" velocity="1.0" lower="-3.1416" upper="3.1416" /> 
 
    </joint> 
 
    <joint name="wrist_flex_l" type="revolute"> 
 
        <origin xyz="-0.01361000 -0.00879700 -0.23584100" rpy=" 0.00000000 -0.00000000  0.00000000" /> 
        <parent link="radius_l"/> 
        <child link="lunate_l"/> 
        <axis xyz=" 1.00000000  0.00000000  0.00000000"/> 
        <limit effort="7.4466" velocity="1.0" lower="-1.5708" upper="1.5708" /> 
 
    </joint> 
 
    <joint name="wrist_dev_l" type="revolute"> 
 
        <origin xyz=" 0.00000000  0.00000000  0.00000000" rpy=" 0.00000000 -0.00000000  0.00000000" /> 
        <parent link="lunate_l"/> 
        <child link="hand_l"/> 
        <axis xyz="-0.00000000 -1.00000000  0.00000000"/> 
        <limit effort="7.4466" velocity="1.0" lower="-0.43633231" upper="0.61086524" /> 
 
    </joint> 
 
    <joint name="hand_finger_flex_l" type="revolute"> 
 
        <origin xyz=" 0.01000000 -0.00000000 -0.07700000" rpy=" 0.00000000 -0.00000000  0.00000000" /> 
        <parent link="hand_l"/> 
        <child link="fingers_l"/> 
        <axis xyz=" 1.00000000  0.00000000  0.00000000"/> 
        <limit effort="7.4466" velocity="1.0" lower="-1.5708" upper="1.5708" /> 
 
    </joint> 
 
</robot> 
