[
  [
    [35, 30], [70, 30], [140, 30], [175, 30]
  ],
  [
    [0, 30], [70, 30], [105, 30], [175, 30]
  ],
  [
    [0, 30], [70, 30], [105, 30], [175, 30]
  ],
  [
    [0, 30], [70, 30], [105, 30], [175, 30]
  ]
]
