{
    "transitions_times": {
        "database": {
            "configure0": 1.61,
            "configure1": 3.41,
            "bootstrap": 1.14,
            "deploy": 1.09,
            "interrupt": 17.5,
            "unconfigure": 9.33
        },
        "system": {
            "initiate0": 2.23,
            "initiate1": 2.75,
            "initiate2": 4.69,
            "deploy": 7.93,
            "stop": 6.1
        },
        "listener0": {
            "start": 2.73,
            "configure": 2.59,
            "run": 8.92,
            "interrupt": 5.34
        },
        "sensor0": {
            "provision0": 1.34,
            "provision1": 12.63,
            "provision2": 1.24,
            "install": 1.11,
            "configure": 3.4,
            "run": 1.07,
            "pause": 2.31
        },
        "listener1": {
            "start": 2.81,
            "configure": 3.58,
            "run": 2.02,
            "interrupt": 8.83
        },
        "sensor1": {
            "provision0": 3.73,
            "provision1": 2.3,
            "provision2": 2.9,
            "install": 1.62,
            "configure": 2.76,
            "run": 3.05,
            "pause": 2.9
        },
        "listener2": {
            "start": 8.89,
            "configure": 2.17,
            "run": 2.64,
            "interrupt": 1.99
        },
        "sensor2": {
            "provision0": 6.08,
            "provision1": 8.67,
            "provision2": 2.06,
            "install": 4.64,
            "configure": 5.2,
            "run": 1.99,
            "pause": 2.13
        },
        "listener3": {
            "start": 4.21,
            "configure": 5.15,
            "run": 1.96,
            "interrupt": 6.57
        },
        "sensor3": {
            "provision0": 4.46,
            "provision1": 4.3,
            "provision2": 6.06,
            "install": 1.16,
            "configure": 1.02,
            "run": 2.57,
            "pause": 2.13
        },
        "listener4": {
            "start": 4.95,
            "configure": 3.24,
            "run": 6.12,
            "interrupt": 14.99
        },
        "sensor4": {
            "provision0": 5.13,
            "provision1": 1.74,
            "provision2": 5.49,
            "install": 2.48,
            "configure": 21.9,
            "run": 1.77,
            "pause": 18.25
        },
        "listener5": {
            "start": 2.08,
            "configure": 4.83,
            "run": 2.29,
            "interrupt": 3.83
        },
        "sensor5": {
            "provision0": 2.38,
            "provision1": 1.08,
            "provision2": 1.94,
            "install": 1.18,
            "configure": 1.94,
            "run": 6.72,
            "pause": 5.92
        },
        "listener6": {
            "start": 1.05,
            "configure": 11.47,
            "run": 1.13,
            "interrupt": 3.33
        },
        "sensor6": {
            "provision0": 5.6,
            "provision1": 1.29,
            "provision2": 2.57,
            "install": 1.63,
            "configure": 4.2,
            "run": 2.97,
            "pause": 4.36
        },
        "listener7": {
            "start": 1.49,
            "configure": 1.73,
            "run": 2.27,
            "interrupt": 1.03
        },
        "sensor7": {
            "provision0": 1.27,
            "provision1": 1.98,
            "provision2": 12.16,
            "install": 5.98,
            "configure": 3.33,
            "run": 3.71,
            "pause": 8.48
        },
        "listener8": {
            "start": 1.24,
            "configure": 1.45,
            "run": 3.49,
            "interrupt": 8.61
        },
        "sensor8": {
            "provision0": 3.52,
            "provision1": 2.47,
            "provision2": 1.31,
            "install": 1.49,
            "configure": 1.98,
            "run": 4.26,
            "pause": 4.05
        },
        "listener9": {
            "start": 4.44,
            "configure": 1.44,
            "run": 3.22,
            "interrupt": 1.34
        },
        "sensor9": {
            "provision0": 6.36,
            "provision1": 7.71,
            "provision2": 1.53,
            "install": 1.27,
            "configure": 1.77,
            "run": 19.6,
            "pause": 9.82
        },
        "listener10": {
            "start": 1.78,
            "configure": 7.77,
            "run": 16.66,
            "interrupt": 4.58
        },
        "sensor10": {
            "provision0": 23.27,
            "provision1": 4.48,
            "provision2": 1.2,
            "install": 3.25,
            "configure": 1.09,
            "run": 1.08,
            "pause": 1.34
        },
        "listener11": {
            "start": 13.88,
            "configure": 7.62,
            "run": 8.14,
            "interrupt": 1.0
        },
        "sensor11": {
            "provision0": 1.3,
            "provision1": 1.46,
            "provision2": 5.07,
            "install": 2.7,
            "configure": 4.45,
            "run": 5.49,
            "pause": 8.38
        },
        "listener12": {
            "start": 2.66,
            "configure": 6.96,
            "run": 1.08,
            "interrupt": 2.83
        },
        "sensor12": {
            "provision0": 1.07,
            "provision1": 1.7,
            "provision2": 1.74,
            "install": 10.0,
            "configure": 3.94,
            "run": 1.17,
            "pause": 7.88
        },
        "listener13": {
            "start": 1.73,
            "configure": 9.71,
            "run": 3.91,
            "interrupt": 8.08
        },
        "sensor13": {
            "provision0": 1.52,
            "provision1": 1.23,
            "provision2": 3.37,
            "install": 4.01,
            "configure": 6.2,
            "run": 6.81,
            "pause": 2.23
        },
        "listener14": {
            "start": 1.37,
            "configure": 2.56,
            "run": 9.78,
            "interrupt": 1.07
        },
        "sensor14": {
            "provision0": 2.61,
            "provision1": 2.02,
            "provision2": 2.16,
            "install": 1.95,
            "configure": 5.67,
            "run": 6.32,
            "pause": 3.23
        }
    }
}