{
    "transitions_times": {
        "mariadbmaster": {
            "configure0": 3.3,
            "configure1": 4.77,
            "bootstrap": 25.92,
            "start": 12.68,
            "register": 2.72,
            "deploy": 12.25,
            "interrupt": 0.48,
            "unconfigure": 3.28
        },
        "mariadbworker0": {
            "configure0": 3.3,
            "configure1": 4.77,
            "bootstrap": 25.92,
            "start": 12.68,
            "register": 2.72,
            "deploy": 12.25,
            "interrupt": 0.48,
            "unconfigure": 3.28
        },
        "keystone0": {
            "pull": 3.3,
            "deploy": 77.59,
            "turnoff": 3.76
        },
        "glance0": {
            "pull0": 5.0,
            "pull1": 7.14,
            "pull2": 15.7,
            "deploy": 62.72,
            "turnoff": 3.76
        },
        "nova0": {
            "pull0": 11.73,
            "pull1": 15.05,
            "pull2": 9.47,
            "ready0": 33.97,
            "ready1": 79.37,
            "start": 13.42,
            "deploy": 124.82,
            "cell_setup": 37.68,
            "interrupt": 0.48,
            "unpull": 3.28
        },
        "neutron0": {
            "pull0": 8.37,
            "pull1": 20.58,
            "pull2": 19.37,
            "deploy": 141.1,
            "turnoff": 3.76
        },
        "mariadbworker1": {
            "configure0": 3.3,
            "configure1": 4.77,
            "bootstrap": 25.92,
            "start": 12.68,
            "register": 2.72,
            "deploy": 12.25,
            "interrupt": 0.48,
            "unconfigure": 3.28
        },
        "keystone1": {
            "pull": 3.3,
            "deploy": 77.59,
            "turnoff": 3.76
        },
        "glance1": {
            "pull0": 5.0,
            "pull1": 7.14,
            "pull2": 15.7,
            "deploy": 62.72,
            "turnoff": 3.76
        },
        "nova1": {
            "pull0": 11.73,
            "pull1": 15.05,
            "pull2": 9.47,
            "ready0": 33.97,
            "ready1": 79.37,
            "start": 13.42,
            "deploy": 124.82,
            "cell_setup": 37.68,
            "interrupt": 0.48,
            "unpull": 3.28
        },
        "neutron1": {
            "pull0": 8.37,
            "pull1": 20.58,
            "pull2": 19.37,
            "deploy": 141.1,
            "turnoff": 3.76
        },
        "mariadbworker2": {
            "configure0": 3.3,
            "configure1": 4.77,
            "bootstrap": 25.92,
            "start": 12.68,
            "register": 2.72,
            "deploy": 12.25,
            "interrupt": 0.48,
            "unconfigure": 3.28
        },
        "keystone2": {
            "pull": 3.3,
            "deploy": 77.59,
            "turnoff": 3.76
        },
        "glance2": {
            "pull0": 5.0,
            "pull1": 7.14,
            "pull2": 15.7,
            "deploy": 62.72,
            "turnoff": 3.76
        },
        "nova2": {
            "pull0": 11.73,
            "pull1": 15.05,
            "pull2": 9.47,
            "ready0": 33.97,
            "ready1": 79.37,
            "start": 13.42,
            "deploy": 124.82,
            "cell_setup": 37.68,
            "interrupt": 0.48,
            "unpull": 3.28
        },
        "neutron2": {
            "pull0": 8.37,
            "pull1": 20.58,
            "pull2": 19.37,
            "deploy": 141.1,
            "turnoff": 3.76
        },
        "mariadbworker3": {
            "configure0": 3.3,
            "configure1": 4.77,
            "bootstrap": 25.92,
            "start": 12.68,
            "register": 2.72,
            "deploy": 12.25,
            "interrupt": 0.48,
            "unconfigure": 3.28
        },
        "keystone3": {
            "pull": 3.3,
            "deploy": 77.59,
            "turnoff": 3.76
        },
        "glance3": {
            "pull0": 5.0,
            "pull1": 7.14,
            "pull2": 15.7,
            "deploy": 62.72,
            "turnoff": 3.76
        },
        "nova3": {
            "pull0": 11.73,
            "pull1": 15.05,
            "pull2": 9.47,
            "ready0": 33.97,
            "ready1": 79.37,
            "start": 13.42,
            "deploy": 124.82,
            "cell_setup": 37.68,
            "interrupt": 0.48,
            "unpull": 3.28
        },
        "neutron3": {
            "pull0": 8.37,
            "pull1": 20.58,
            "pull2": 19.37,
            "deploy": 141.1,
            "turnoff": 3.76
        },
        "mariadbworker4": {
            "configure0": 3.3,
            "configure1": 4.77,
            "bootstrap": 25.92,
            "start": 12.68,
            "register": 2.72,
            "deploy": 12.25,
            "interrupt": 0.48,
            "unconfigure": 3.28
        },
        "keystone4": {
            "pull": 3.3,
            "deploy": 77.59,
            "turnoff": 3.76
        },
        "glance4": {
            "pull0": 5.0,
            "pull1": 7.14,
            "pull2": 15.7,
            "deploy": 62.72,
            "turnoff": 3.76
        },
        "nova4": {
            "pull0": 11.73,
            "pull1": 15.05,
            "pull2": 9.47,
            "ready0": 33.97,
            "ready1": 79.37,
            "start": 13.42,
            "deploy": 124.82,
            "cell_setup": 37.68,
            "interrupt": 0.48,
            "unpull": 3.28
        },
        "neutron4": {
            "pull0": 8.37,
            "pull1": 20.58,
            "pull2": 19.37,
            "deploy": 141.1,
            "turnoff": 3.76
        },
        "mariadbworker5": {
            "configure0": 3.3,
            "configure1": 4.77,
            "bootstrap": 25.92,
            "start": 12.68,
            "register": 2.72,
            "deploy": 12.25,
            "interrupt": 0.48,
            "unconfigure": 3.28
        },
        "keystone5": {
            "pull": 3.3,
            "deploy": 77.59,
            "turnoff": 3.76
        },
        "glance5": {
            "pull0": 5.0,
            "pull1": 7.14,
            "pull2": 15.7,
            "deploy": 62.72,
            "turnoff": 3.76
        },
        "nova5": {
            "pull0": 11.73,
            "pull1": 15.05,
            "pull2": 9.47,
            "ready0": 33.97,
            "ready1": 79.37,
            "start": 13.42,
            "deploy": 124.82,
            "cell_setup": 37.68,
            "interrupt": 0.48,
            "unpull": 3.28
        },
        "neutron5": {
            "pull0": 8.37,
            "pull1": 20.58,
            "pull2": 19.37,
            "deploy": 141.1,
            "turnoff": 3.76
        },
        "mariadbworker6": {
            "configure0": 3.3,
            "configure1": 4.77,
            "bootstrap": 25.92,
            "start": 12.68,
            "register": 2.72,
            "deploy": 12.25,
            "interrupt": 0.48,
            "unconfigure": 3.28
        },
        "keystone6": {
            "pull": 3.3,
            "deploy": 77.59,
            "turnoff": 3.76
        },
        "glance6": {
            "pull0": 5.0,
            "pull1": 7.14,
            "pull2": 15.7,
            "deploy": 62.72,
            "turnoff": 3.76
        },
        "nova6": {
            "pull0": 11.73,
            "pull1": 15.05,
            "pull2": 9.47,
            "ready0": 33.97,
            "ready1": 79.37,
            "start": 13.42,
            "deploy": 124.82,
            "cell_setup": 37.68,
            "interrupt": 0.48,
            "unpull": 3.28
        },
        "neutron6": {
            "pull0": 8.37,
            "pull1": 20.58,
            "pull2": 19.37,
            "deploy": 141.1,
            "turnoff": 3.76
        },
        "mariadbworker7": {
            "configure0": 3.3,
            "configure1": 4.77,
            "bootstrap": 25.92,
            "start": 12.68,
            "register": 2.72,
            "deploy": 12.25,
            "interrupt": 0.48,
            "unconfigure": 3.28
        },
        "keystone7": {
            "pull": 3.3,
            "deploy": 77.59,
            "turnoff": 3.76
        },
        "glance7": {
            "pull0": 5.0,
            "pull1": 7.14,
            "pull2": 15.7,
            "deploy": 62.72,
            "turnoff": 3.76
        },
        "nova7": {
            "pull0": 11.73,
            "pull1": 15.05,
            "pull2": 9.47,
            "ready0": 33.97,
            "ready1": 79.37,
            "start": 13.42,
            "deploy": 124.82,
            "cell_setup": 37.68,
            "interrupt": 0.48,
            "unpull": 3.28
        },
        "neutron7": {
            "pull0": 8.37,
            "pull1": 20.58,
            "pull2": 19.37,
            "deploy": 141.1,
            "turnoff": 3.76
        },
        "mariadbworker8": {
            "configure0": 3.3,
            "configure1": 4.77,
            "bootstrap": 25.92,
            "start": 12.68,
            "register": 2.72,
            "deploy": 12.25,
            "interrupt": 0.48,
            "unconfigure": 3.28
        },
        "keystone8": {
            "pull": 3.3,
            "deploy": 77.59,
            "turnoff": 3.76
        },
        "glance8": {
            "pull0": 5.0,
            "pull1": 7.14,
            "pull2": 15.7,
            "deploy": 62.72,
            "turnoff": 3.76
        },
        "nova8": {
            "pull0": 11.73,
            "pull1": 15.05,
            "pull2": 9.47,
            "ready0": 33.97,
            "ready1": 79.37,
            "start": 13.42,
            "deploy": 124.82,
            "cell_setup": 37.68,
            "interrupt": 0.48,
            "unpull": 3.28
        },
        "neutron8": {
            "pull0": 8.37,
            "pull1": 20.58,
            "pull2": 19.37,
            "deploy": 141.1,
            "turnoff": 3.76
        },
        "mariadbworker9": {
            "configure0": 3.3,
            "configure1": 4.77,
            "bootstrap": 25.92,
            "start": 12.68,
            "register": 2.72,
            "deploy": 12.25,
            "interrupt": 0.48,
            "unconfigure": 3.28
        },
        "keystone9": {
            "pull": 3.3,
            "deploy": 77.59,
            "turnoff": 3.76
        },
        "glance9": {
            "pull0": 5.0,
            "pull1": 7.14,
            "pull2": 15.7,
            "deploy": 62.72,
            "turnoff": 3.76
        },
        "nova9": {
            "pull0": 11.73,
            "pull1": 15.05,
            "pull2": 9.47,
            "ready0": 33.97,
            "ready1": 79.37,
            "start": 13.42,
            "deploy": 124.82,
            "cell_setup": 37.68,
            "interrupt": 0.48,
            "unpull": 3.28
        },
        "neutron9": {
            "pull0": 8.37,
            "pull1": 20.58,
            "pull2": 19.37,
            "deploy": 141.1,
            "turnoff": 3.76
        },
        "mariadbworker10": {
            "configure0": 3.3,
            "configure1": 4.77,
            "bootstrap": 25.92,
            "start": 12.68,
            "register": 2.72,
            "deploy": 12.25,
            "interrupt": 0.48,
            "unconfigure": 3.28
        },
        "keystone10": {
            "pull": 3.3,
            "deploy": 77.59,
            "turnoff": 3.76
        },
        "glance10": {
            "pull0": 5.0,
            "pull1": 7.14,
            "pull2": 15.7,
            "deploy": 62.72,
            "turnoff": 3.76
        },
        "nova10": {
            "pull0": 11.73,
            "pull1": 15.05,
            "pull2": 9.47,
            "ready0": 33.97,
            "ready1": 79.37,
            "start": 13.42,
            "deploy": 124.82,
            "cell_setup": 37.68,
            "interrupt": 0.48,
            "unpull": 3.28
        },
        "neutron10": {
            "pull0": 8.37,
            "pull1": 20.58,
            "pull2": 19.37,
            "deploy": 141.1,
            "turnoff": 3.76
        },
        "mariadbworker11": {
            "configure0": 3.3,
            "configure1": 4.77,
            "bootstrap": 25.92,
            "start": 12.68,
            "register": 2.72,
            "deploy": 12.25,
            "interrupt": 0.48,
            "unconfigure": 3.28
        },
        "keystone11": {
            "pull": 3.3,
            "deploy": 77.59,
            "turnoff": 3.76
        },
        "glance11": {
            "pull0": 5.0,
            "pull1": 7.14,
            "pull2": 15.7,
            "deploy": 62.72,
            "turnoff": 3.76
        },
        "nova11": {
            "pull0": 11.73,
            "pull1": 15.05,
            "pull2": 9.47,
            "ready0": 33.97,
            "ready1": 79.37,
            "start": 13.42,
            "deploy": 124.82,
            "cell_setup": 37.68,
            "interrupt": 0.48,
            "unpull": 3.28
        },
        "neutron11": {
            "pull0": 8.37,
            "pull1": 20.58,
            "pull2": 19.37,
            "deploy": 141.1,
            "turnoff": 3.76
        },
        "mariadbworker12": {
            "configure0": 3.3,
            "configure1": 4.77,
            "bootstrap": 25.92,
            "start": 12.68,
            "register": 2.72,
            "deploy": 12.25,
            "interrupt": 0.48,
            "unconfigure": 3.28
        },
        "keystone12": {
            "pull": 3.3,
            "deploy": 77.59,
            "turnoff": 3.76
        },
        "glance12": {
            "pull0": 5.0,
            "pull1": 7.14,
            "pull2": 15.7,
            "deploy": 62.72,
            "turnoff": 3.76
        },
        "nova12": {
            "pull0": 11.73,
            "pull1": 15.05,
            "pull2": 9.47,
            "ready0": 33.97,
            "ready1": 79.37,
            "start": 13.42,
            "deploy": 124.82,
            "cell_setup": 37.68,
            "interrupt": 0.48,
            "unpull": 3.28
        },
        "neutron12": {
            "pull0": 8.37,
            "pull1": 20.58,
            "pull2": 19.37,
            "deploy": 141.1,
            "turnoff": 3.76
        },
        "mariadbworker13": {
            "configure0": 3.3,
            "configure1": 4.77,
            "bootstrap": 25.92,
            "start": 12.68,
            "register": 2.72,
            "deploy": 12.25,
            "interrupt": 0.48,
            "unconfigure": 3.28
        },
        "keystone13": {
            "pull": 3.3,
            "deploy": 77.59,
            "turnoff": 3.76
        },
        "glance13": {
            "pull0": 5.0,
            "pull1": 7.14,
            "pull2": 15.7,
            "deploy": 62.72,
            "turnoff": 3.76
        },
        "nova13": {
            "pull0": 11.73,
            "pull1": 15.05,
            "pull2": 9.47,
            "ready0": 33.97,
            "ready1": 79.37,
            "start": 13.42,
            "deploy": 124.82,
            "cell_setup": 37.68,
            "interrupt": 0.48,
            "unpull": 3.28
        },
        "neutron13": {
            "pull0": 8.37,
            "pull1": 20.58,
            "pull2": 19.37,
            "deploy": 141.1,
            "turnoff": 3.76
        },
        "mariadbworker14": {
            "configure0": 3.3,
            "configure1": 4.77,
            "bootstrap": 25.92,
            "start": 12.68,
            "register": 2.72,
            "deploy": 12.25,
            "interrupt": 0.48,
            "unconfigure": 3.28
        },
        "keystone14": {
            "pull": 3.3,
            "deploy": 77.59,
            "turnoff": 3.76
        },
        "glance14": {
            "pull0": 5.0,
            "pull1": 7.14,
            "pull2": 15.7,
            "deploy": 62.72,
            "turnoff": 3.76
        },
        "nova14": {
            "pull0": 11.73,
            "pull1": 15.05,
            "pull2": 9.47,
            "ready0": 33.97,
            "ready1": 79.37,
            "start": 13.42,
            "deploy": 124.82,
            "cell_setup": 37.68,
            "interrupt": 0.48,
            "unpull": 3.28
        },
        "neutron14": {
            "pull0": 8.37,
            "pull1": 20.58,
            "pull2": 19.37,
            "deploy": 141.1,
            "turnoff": 3.76
        }
    }
}