digraph alpchain {
	size="14,14";

	node [shape=box, color=lightblue, fontsize=11.0,
	fontname=Courier, height="0.2"];
	Lefff; input; output; frmg

	/* conf */
	node [shape=box, color=gold, height=0.2,
	fontname=Courier, fontsize=10.0]; 

	/* default */
	node [shape=ellipse, color=darkseagreen3,
	fontname=Courier, fontsize=11.0, height="0.2"];
	edge [dir=none, color=darkseagreen];

	{ rank = same; callparser; parserd }

	input -> callparser -> output [dir=forward];
	{Lefff; sxpipe; } -> lexer;
	{ lexer; "frmg_parser"; "forest utils"; }  -> parserd;
	frmg                -> "frmg_parser" [dir=forward];
	callparser            -> parserd [dir=both];


}

