log4j:WARN No appenders could be found for logger (node).
log4j:WARN Please initialize the log4j system properly.
log4j:WARN See http://logging.apache.org/log4j/1.2/faq.html#noconfig for more info.
java.lang.OutOfMemoryError: Java heap space
Dumping heap to java_pid10506.hprof ...
Heap dump file created [1091109442 bytes in 5.691 secs]
