digraph sxpipe {

	node [shape=box, color=orange, fontsize=11.0,
	fontname=Courier, height="0.2", style="setlinewidth(1)"];
	"raw text"; "Direct Acyclic Graph (DAG)";

	/* default */
	node [shape=box, color=lightblue, fontsize=11.0,
	fontname=Courier, height="0.2", style="setlinewidth(1)"];

	edge [color=lightblue, fontsize=11.0, fontname=Courier];

"raw text"
-> 
"First set of local grammars\n\
(e-mail addresses, URLs, dates,\n\
phone numbers, times, addresses,\n\
numbers in digits, smilies, quoted words,\n\
ponctuation and oral artifacts)"
->
"Sentence boundaries detection\n\
and unknown words identification"
->
"Preliminary tokenization\n\
and lexicon-aware local grammars\n\
(acronyms with expansion, proper nouns,\n\
(sequences in foreign languages)"
->
"Tokenization and spelling\n\
error correction\n\
(SXSPELL)"
->  
"Last set of local grammars\n\
(numbers in letters - including\n\
ordinals and others, and dates)"
->
"Lattice builder: non deterministic\n\
multi-word identification, re-accentuation,\n\
and de- or re-capitalization"
->
"Direct Acyclic Graph (DAG)";


}

/*
dot -Tpng -osxpipe.png sxpipe.dot
*/
