################
#SPORT
################
POSITION	0
PROGRAM		0
SCORE		0
RESULT		0
TABLES		0
TEAM		0
SQUAD		0
################
#SPECIAUX AFP
################
COMMUNIQUE	0
AGENDA		0
################
#AUTRE
################
PRESSDIGEST	0
CHRONO		0
OBITUARY	0
################
#QUOTE
################
QUOTE	0
TQ	0
QA	0
INTERVIEW	0
MAINPOINTS	0
