%!PS-Adobe-3.0 EPSF-3.0
%%Title: analysis_dissem_by_density_S.eps
%%Creator: Matplotlib v3.5.2, https://matplotlib.org/
%%CreationDate: Wed Sep 21 20:02:42 2022
%%Orientation: portrait
%%BoundingBox: 229 325 383 467
%%HiResBoundingBox: 229.059062 325.144687 382.940938 466.855312
%%EndComments
%%BeginProlog
/mpldict 11 dict def
mpldict begin
/_d { bind def } bind def
/m { moveto } _d
/l { lineto } _d
/r { rlineto } _d
/c { curveto } _d
/cl { closepath } _d
/ce { closepath eofill } _d
/box {
      m
      1 index 0 r
      0 exch r
      neg 0 r
      cl
    } _d
/clipbox {
      box
      clip
      newpath
    } _d
/sc { setcachedevice } _d
%!PS-Adobe-3.0 Resource-Font
%%Creator: Converted from TrueType to Type 3 by Matplotlib.
10 dict begin
/FontName /DejaVuSans def
/PaintType 0 def
/FontMatrix [0.00048828125 0 0 0.00048828125 0 0] def
/FontBBox [-2090 -948 3673 2524] def
/FontType 3 def
/Encoding [/space /percent /period /zero /one /two /three /four /five /six /seven /eight /nine /equal /C /D /F /R /c /d /e /f /i /n /o /s /t /u] def
/CharStrings 29 dict dup begin
/.notdef 0 def
/space{651 0 0 0 0 0 sc
ce} _d
/percent{1946 0 113 -29 1833 1520 sc
1489 657 m
1431 657 1385 632 1352 583 c
1319 534 1303 465 1303 377 c
1303 290 1319 222 1352 172 c
1385 123 1431 98 1489 98 c
1546 98 1590 123 1623 172 c
1656 222 1673 290 1673 377 c
1673 464 1656 533 1623 582 c
1590 632 1546 657 1489 657 c

1489 784 m
1594 784 1678 747 1740 674 c
1802 601 1833 502 1833 377 c
1833 252 1802 153 1739 80 c
1677 7 1594 -29 1489 -29 c
1382 -29 1298 7 1236 80 c
1174 153 1143 252 1143 377 c
1143 502 1174 601 1236 674 c
1299 747 1383 784 1489 784 c

457 1393 m
400 1393 354 1368 321 1318 c
288 1269 272 1201 272 1114 c
272 1026 288 957 321 908 c
354 859 399 834 457 834 c
515 834 560 859 593 908 c
626 957 643 1026 643 1114 c
643 1200 626 1268 593 1318 c
560 1368 514 1393 457 1393 c

1360 1520 m
1520 1520 l
586 -29 l
426 -29 l
1360 1520 l

457 1520 m
562 1520 646 1483 709 1410 c
772 1337 803 1239 803 1114 c
803 988 772 889 709 816 c
647 743 563 707 457 707 c
351 707 267 743 205 816 c
144 889 113 989 113 1114 c
113 1238 144 1337 206 1410 c
268 1483 352 1520 457 1520 c

ce} _d
/period{651 0 219 0 430 254 sc
219 254 m
430 254 l
430 0 l
219 0 l
219 254 l

ce} _d
/zero{1303 0 135 -29 1167 1520 sc
651 1360 m
547 1360 469 1309 416 1206 c
364 1104 338 950 338 745 c
338 540 364 387 416 284 c
469 182 547 131 651 131 c
756 131 834 182 886 284 c
939 387 965 540 965 745 c
965 950 939 1104 886 1206 c
834 1309 756 1360 651 1360 c

651 1520 m
818 1520 946 1454 1034 1321 c
1123 1189 1167 997 1167 745 c
1167 494 1123 302 1034 169 c
946 37 818 -29 651 -29 c
484 -29 356 37 267 169 c
179 302 135 494 135 745 c
135 997 179 1189 267 1321 c
356 1454 484 1520 651 1520 c

ce} _d
/one{1303 0 225 0 1114 1493 sc
254 170 m
584 170 l
584 1309 l
225 1237 l
225 1421 l
582 1493 l
784 1493 l
784 170 l
1114 170 l
1114 0 l
254 0 l
254 170 l

ce} _d
/two{1303 0 150 0 1098 1520 sc
393 170 m
1098 170 l
1098 0 l
150 0 l
150 170 l
227 249 331 356 463 489 c
596 623 679 709 713 748 c
778 821 823 882 848 932 c
874 983 887 1032 887 1081 c
887 1160 859 1225 803 1275 c
748 1325 675 1350 586 1350 c
523 1350 456 1339 385 1317 c
315 1295 240 1262 160 1217 c
160 1421 l
241 1454 317 1478 388 1495 c
459 1512 523 1520 582 1520 c
737 1520 860 1481 952 1404 c
1044 1327 1090 1223 1090 1094 c
1090 1033 1078 974 1055 919 c
1032 864 991 800 930 725 c
913 706 860 650 771 557 c
682 465 556 336 393 170 c

ce} _d
/three{1303 0 156 -29 1139 1520 sc
831 805 m
928 784 1003 741 1057 676 c
1112 611 1139 530 1139 434 c
1139 287 1088 173 987 92 c
886 11 742 -29 555 -29 c
492 -29 428 -23 361 -10 c
295 2 227 20 156 45 c
156 240 l
212 207 273 183 340 166 c
407 149 476 141 549 141 c
676 141 772 166 838 216 c
905 266 938 339 938 434 c
938 522 907 591 845 640 c
784 690 698 715 588 715 c
414 715 l
414 881 l
596 881 l
695 881 771 901 824 940 c
877 980 903 1037 903 1112 c
903 1189 876 1247 821 1288 c
767 1329 689 1350 588 1350 c
533 1350 473 1344 410 1332 c
347 1320 277 1301 201 1276 c
201 1456 l
278 1477 349 1493 416 1504 c
483 1515 547 1520 606 1520 c
759 1520 881 1485 970 1415 c
1059 1346 1104 1252 1104 1133 c
1104 1050 1080 980 1033 923 c
986 866 918 827 831 805 c

ce} _d
/four{1303 0 100 0 1188 1493 sc
774 1317 m
264 520 l
774 520 l
774 1317 l

721 1493 m
975 1493 l
975 520 l
1188 520 l
1188 352 l
975 352 l
975 0 l
774 0 l
774 352 l
100 352 l
100 547 l
721 1493 l

ce} _d
/five{1303 0 158 -29 1124 1493 sc
221 1493 m
1014 1493 l
1014 1323 l
406 1323 l
406 957 l
435 967 465 974 494 979 c
523 984 553 987 582 987 c
749 987 881 941 978 850 c
1075 759 1124 635 1124 479 c
1124 318 1074 193 974 104 c
874 15 733 -29 551 -29 c
488 -29 424 -24 359 -13 c
294 -2 227 14 158 35 c
158 238 l
218 205 280 181 344 165 c
408 149 476 141 547 141 c
662 141 754 171 821 232 c
888 293 922 375 922 479 c
922 583 888 665 821 726 c
754 787 662 817 547 817 c
493 817 439 811 385 799 c
332 787 277 768 221 743 c
221 1493 l

ce} _d
/six{1303 0 143 -29 1174 1520 sc
676 827 m
585 827 513 796 460 734 c
407 672 381 587 381 479 c
381 372 407 287 460 224 c
513 162 585 131 676 131 c
767 131 838 162 891 224 c
944 287 971 372 971 479 c
971 587 944 672 891 734 c
838 796 767 827 676 827 c

1077 1460 m
1077 1276 l
1026 1300 975 1318 923 1331 c
872 1344 821 1350 770 1350 c
637 1350 535 1305 464 1215 c
394 1125 354 989 344 807 c
383 865 433 909 492 940 c
551 971 617 987 688 987 c
838 987 956 941 1043 850 c
1130 759 1174 636 1174 479 c
1174 326 1129 203 1038 110 c
947 17 827 -29 676 -29 c
503 -29 371 37 280 169 c
189 302 143 494 143 745 c
143 981 199 1169 311 1309 c
423 1450 573 1520 762 1520 c
813 1520 864 1515 915 1505 c
967 1495 1021 1480 1077 1460 c

ce} _d
/seven{1303 0 168 0 1128 1493 sc
168 1493 m
1128 1493 l
1128 1407 l
586 0 l
375 0 l
885 1323 l
168 1323 l
168 1493 l

ce} _d
/eight{1303 0 139 -29 1163 1520 sc
651 709 m
555 709 479 683 424 632 c
369 581 342 510 342 420 c
342 330 369 259 424 208 c
479 157 555 131 651 131 c
747 131 823 157 878 208 c
933 260 961 331 961 420 c
961 510 933 581 878 632 c
823 683 748 709 651 709 c

449 795 m
362 816 295 857 246 916 c
198 975 174 1048 174 1133 c
174 1252 216 1347 301 1416 c
386 1485 503 1520 651 1520 c
800 1520 916 1485 1001 1416 c
1086 1347 1128 1252 1128 1133 c
1128 1048 1104 975 1055 916 c
1007 857 940 816 854 795 c
951 772 1027 728 1081 662 c
1136 596 1163 515 1163 420 c
1163 275 1119 164 1030 87 c
942 10 816 -29 651 -29 c
486 -29 360 10 271 87 c
183 164 139 275 139 420 c
139 515 166 596 221 662 c
276 728 352 772 449 795 c

375 1114 m
375 1037 399 976 447 933 c
496 890 564 868 651 868 c
738 868 805 890 854 933 c
903 976 928 1037 928 1114 c
928 1191 903 1252 854 1295 c
805 1338 738 1360 651 1360 c
564 1360 496 1338 447 1295 c
399 1252 375 1191 375 1114 c

ce} _d
/nine{1303 0 129 -29 1159 1520 sc
225 31 m
225 215 l
276 191 327 173 379 160 c
431 147 482 141 532 141 c
665 141 767 186 837 275 c
908 365 948 501 958 684 c
919 627 870 583 811 552 c
752 521 686 506 614 506 c
465 506 346 551 259 641 c
172 732 129 855 129 1012 c
129 1165 174 1288 265 1381 c
356 1474 476 1520 627 1520 c
800 1520 931 1454 1022 1321 c
1113 1189 1159 997 1159 745 c
1159 510 1103 322 991 181 c
880 41 730 -29 541 -29 c
490 -29 439 -24 387 -14 c
335 -4 281 11 225 31 c

627 664 m
718 664 789 695 842 757 c
895 819 922 904 922 1012 c
922 1119 895 1204 842 1266 c
789 1329 718 1360 627 1360 c
536 1360 464 1329 411 1266 c
358 1204 332 1119 332 1012 c
332 904 358 819 411 757 c
464 695 536 664 627 664 c

ce} _d
/equal{1716 0 217 352 1499 930 sc
217 930 m
1499 930 l
1499 762 l
217 762 l
217 930 l

217 522 m
1499 522 l
1499 352 l
217 352 l
217 522 l

ce} _d
/C{1430 0 115 -29 1319 1520 sc
1319 1378 m
1319 1165 l
1251 1228 1178 1276 1101 1307 c
1024 1338 943 1354 856 1354 c
685 1354 555 1302 464 1197 c
373 1093 328 942 328 745 c
328 548 373 398 464 293 c
555 189 685 137 856 137 c
943 137 1024 153 1101 184 c
1178 215 1251 263 1319 326 c
1319 115 l
1248 67 1173 31 1094 7 c
1015 -17 932 -29 844 -29 c
618 -29 440 40 310 178 c
180 317 115 506 115 745 c
115 985 180 1174 310 1312 c
440 1451 618 1520 844 1520 c
933 1520 1017 1508 1096 1484 c
1175 1461 1250 1425 1319 1378 c

ce} _d
/D{1577 0 201 0 1456 1493 sc
403 1327 m
403 166 l
647 166 l
853 166 1004 213 1099 306 c
1195 399 1243 547 1243 748 c
1243 948 1195 1094 1099 1187 c
1004 1280 853 1327 647 1327 c
403 1327 l

201 1493 m
616 1493 l
905 1493 1118 1433 1253 1312 c
1388 1192 1456 1004 1456 748 c
1456 491 1388 302 1252 181 c
1116 60 904 0 616 0 c
201 0 l
201 1493 l

ce} _d
/F{1178 0 201 0 1059 1493 sc
201 1493 m
1059 1493 l
1059 1323 l
403 1323 l
403 883 l
995 883 l
995 713 l
403 713 l
403 0 l
201 0 l
201 1493 l

ce} _d
/R{1423 0 201 0 1364 1493 sc
909 700 m
952 685 994 654 1035 606 c
1076 558 1118 492 1159 408 c
1364 0 l
1147 0 l
956 383 l
907 483 859 549 812 582 c
766 615 703 631 623 631 c
403 631 l
403 0 l
201 0 l
201 1493 l
657 1493 l
828 1493 955 1457 1039 1386 c
1123 1315 1165 1207 1165 1063 c
1165 969 1143 891 1099 829 c
1056 767 992 724 909 700 c

403 1327 m
403 797 l
657 797 l
754 797 828 819 877 864 c
927 909 952 976 952 1063 c
952 1150 927 1216 877 1260 c
828 1305 754 1327 657 1327 c
403 1327 l

ce} _d
/c{1126 0 113 -29 999 1147 sc
999 1077 m
999 905 l
947 934 895 955 842 969 c
790 984 737 991 684 991 c
565 991 472 953 406 877 c
340 802 307 696 307 559 c
307 422 340 316 406 240 c
472 165 565 127 684 127 c
737 127 790 134 842 148 c
895 163 947 184 999 213 c
999 43 l
948 19 894 1 839 -11 c
784 -23 726 -29 664 -29 c
495 -29 361 24 262 130 c
163 236 113 379 113 559 c
113 742 163 885 263 990 c
364 1095 501 1147 676 1147 c
733 1147 788 1141 842 1129 c
896 1118 948 1100 999 1077 c

ce} _d
/d{1300 0 113 -29 1114 1556 sc
930 950 m
930 1556 l
1114 1556 l
1114 0 l
930 0 l
930 168 l
891 101 842 52 783 19 c
724 -13 654 -29 571 -29 c
436 -29 325 25 240 133 c
155 241 113 383 113 559 c
113 735 155 877 240 985 c
325 1093 436 1147 571 1147 c
654 1147 724 1131 783 1098 c
842 1066 891 1017 930 950 c

303 559 m
303 424 331 317 386 240 c
442 163 519 125 616 125 c
713 125 790 163 846 240 c
902 317 930 424 930 559 c
930 694 902 800 846 877 c
790 954 713 993 616 993 c
519 993 442 954 386 877 c
331 800 303 694 303 559 c

ce} _d
/e{1260 0 113 -29 1151 1147 sc
1151 606 m
1151 516 l
305 516 l
313 389 351 293 419 226 c
488 160 583 127 705 127 c
776 127 844 136 910 153 c
977 170 1043 196 1108 231 c
1108 57 l
1042 29 974 8 905 -7 c
836 -22 765 -29 694 -29 c
515 -29 374 23 269 127 c
165 231 113 372 113 549 c
113 732 162 878 261 985 c
360 1093 494 1147 662 1147 c
813 1147 932 1098 1019 1001 c
1107 904 1151 773 1151 606 c

967 660 m
966 761 937 841 882 901 c
827 961 755 991 664 991 c
561 991 479 962 417 904 c
356 846 320 764 311 659 c
967 660 l

ce} _d
/f{721 0 47 0 760 1556 sc
760 1556 m
760 1403 l
584 1403 l
518 1403 472 1390 446 1363 c
421 1336 408 1288 408 1219 c
408 1120 l
711 1120 l
711 977 l
408 977 l
408 0 l
223 0 l
223 977 l
47 977 l
47 1120 l
223 1120 l
223 1198 l
223 1323 252 1413 310 1470 c
368 1527 460 1556 586 1556 c
760 1556 l

ce} _d
/i{569 0 193 0 377 1556 sc
193 1120 m
377 1120 l
377 0 l
193 0 l
193 1120 l

193 1556 m
377 1556 l
377 1323 l
193 1323 l
193 1556 l

ce} _d
/n{1298 0 186 0 1124 1147 sc
1124 676 m
1124 0 l
940 0 l
940 670 l
940 776 919 855 878 908 c
837 961 775 987 692 987 c
593 987 514 955 457 892 c
400 829 371 742 371 633 c
371 0 l
186 0 l
186 1120 l
371 1120 l
371 946 l
415 1013 467 1064 526 1097 c
586 1130 655 1147 733 1147 c
862 1147 959 1107 1025 1027 c
1091 948 1124 831 1124 676 c

ce} _d
/o{1253 0 113 -29 1141 1147 sc
627 991 m
528 991 450 952 393 875 c
336 798 307 693 307 559 c
307 425 335 319 392 242 c
449 165 528 127 627 127 c
725 127 803 166 860 243 c
917 320 946 426 946 559 c
946 692 917 797 860 874 c
803 952 725 991 627 991 c

627 1147 m
787 1147 913 1095 1004 991 c
1095 887 1141 743 1141 559 c
1141 376 1095 232 1004 127 c
913 23 787 -29 627 -29 c
466 -29 340 23 249 127 c
158 232 113 376 113 559 c
113 743 158 887 249 991 c
340 1095 466 1147 627 1147 c

ce} _d
/s{1067 0 111 -29 967 1147 sc
907 1087 m
907 913 l
855 940 801 960 745 973 c
689 986 631 993 571 993 c
480 993 411 979 365 951 c
320 923 297 881 297 825 c
297 782 313 749 346 724 c
379 700 444 677 543 655 c
606 641 l
737 613 829 573 884 522 c
939 471 967 400 967 309 c
967 205 926 123 843 62 c
761 1 648 -29 504 -29 c
444 -29 381 -23 316 -11 c
251 0 183 18 111 41 c
111 231 l
179 196 246 169 312 151 c
378 134 443 125 508 125 c
595 125 661 140 708 169 c
755 199 778 241 778 295 c
778 345 761 383 727 410 c
694 437 620 462 506 487 c
442 502 l
328 526 246 563 195 612 c
144 662 119 730 119 817 c
119 922 156 1004 231 1061 c
306 1118 412 1147 549 1147 c
617 1147 681 1142 741 1132 c
801 1122 856 1107 907 1087 c

ce} _d
/t{803 0 55 0 754 1438 sc
375 1438 m
375 1120 l
754 1120 l
754 977 l
375 977 l
375 369 l
375 278 387 219 412 193 c
437 167 488 154 565 154 c
754 154 l
754 0 l
565 0 l
423 0 325 26 271 79 c
217 132 190 229 190 369 c
190 977 l
55 977 l
55 1120 l
190 1120 l
190 1438 l
375 1438 l

ce} _d
/u{1298 0 174 -29 1112 1147 sc
174 442 m
174 1120 l
358 1120 l
358 449 l
358 343 379 263 420 210 c
461 157 523 131 606 131 c
705 131 784 163 841 226 c
899 289 928 376 928 485 c
928 1120 l
1112 1120 l
1112 0 l
928 0 l
928 172 l
883 104 831 53 772 20 c
713 -13 645 -29 567 -29 c
438 -29 341 11 274 91 c
207 171 174 288 174 442 c

637 1147 m
637 1147 l

ce} _d
end readonly def

/BuildGlyph {
 exch begin
 CharStrings exch
 2 copy known not {pop /.notdef} if
 true 3 1 roll get exec
 end
} _d

/BuildChar {
 1 index /Encoding get exch get
 1 index /BuildGlyph get exec
} _d

FontName currentdict end definefont pop
end
%%EndProlog
mpldict begin
229.059 325.145 translate
153.882 141.711 0 0 clipbox
gsave
0 0 m
153.881875 0 l
153.881875 141.710625 l
0 141.710625 l
cl
1.000 setgray
fill
grestore
gsave
47.141875 30.110625 m
153.161875 30.110625 l
153.161875 140.990625 l
47.141875 140.990625 l
cl
1.000 setgray
fill
grestore
0.800 setlinewidth
1 setlinejoin
0 setlinecap
[2.96 1.28] 0 setdash
0.690 setgray
gsave
106.02 110.88 47.142 30.111 clipbox
51.960966 30.110625 m
51.960966 140.990625 l
stroke
grestore
[] 0 setdash
0.000 setgray
gsave
/o {
gsave
newpath
translate
0.8 setlinewidth
1 setlinejoin

0 setlinecap

0 0 m
0 -3.5 l

gsave
0.000 setgray
fill
grestore
stroke
grestore
} bind def
51.961 30.1106 o
grestore
/DejaVuSans 9.000 selectfont
gsave

49.093778 16.266875 translate
0.000000 rotate
0.000000 0 m /zero glyphshow
grestore
[2.96 1.28] 0 setdash
0.690 setgray
gsave
106.02 110.88 47.142 30.111 clipbox
62.670057 30.110625 m
62.670057 140.990625 l
stroke
grestore
[] 0 setdash
0.000 setgray
gsave
/o {
gsave
newpath
translate
0.8 setlinewidth
1 setlinejoin

0 setlinecap

0 0 m
0 -3.5 l

gsave
0.000 setgray
fill
grestore
stroke
grestore
} bind def
62.6701 30.1106 o
grestore
gsave

59.802869 16.266875 translate
0.000000 rotate
0.000000 0 m /one glyphshow
grestore
[2.96 1.28] 0 setdash
0.690 setgray
gsave
106.02 110.88 47.142 30.111 clipbox
73.379148 30.110625 m
73.379148 140.990625 l
stroke
grestore
[] 0 setdash
0.000 setgray
gsave
/o {
gsave
newpath
translate
0.8 setlinewidth
1 setlinejoin

0 setlinecap

0 0 m
0 -3.5 l

gsave
0.000 setgray
fill
grestore
stroke
grestore
} bind def
73.3791 30.1106 o
grestore
gsave

70.511960 16.266875 translate
0.000000 rotate
0.000000 0 m /two glyphshow
grestore
[2.96 1.28] 0 setdash
0.690 setgray
gsave
106.02 110.88 47.142 30.111 clipbox
84.088239 30.110625 m
84.088239 140.990625 l
stroke
grestore
[] 0 setdash
0.000 setgray
gsave
/o {
gsave
newpath
translate
0.8 setlinewidth
1 setlinejoin

0 setlinecap

0 0 m
0 -3.5 l

gsave
0.000 setgray
fill
grestore
stroke
grestore
} bind def
84.0882 30.1106 o
grestore
gsave

81.221051 16.266875 translate
0.000000 rotate
0.000000 0 m /three glyphshow
grestore
[2.96 1.28] 0 setdash
0.690 setgray
gsave
106.02 110.88 47.142 30.111 clipbox
94.79733 30.110625 m
94.79733 140.990625 l
stroke
grestore
[] 0 setdash
0.000 setgray
gsave
/o {
gsave
newpath
translate
0.8 setlinewidth
1 setlinejoin

0 setlinecap

0 0 m
0 -3.5 l

gsave
0.000 setgray
fill
grestore
stroke
grestore
} bind def
94.7973 30.1106 o
grestore
gsave

91.930142 16.266875 translate
0.000000 rotate
0.000000 0 m /four glyphshow
grestore
[2.96 1.28] 0 setdash
0.690 setgray
gsave
106.02 110.88 47.142 30.111 clipbox
105.50642 30.110625 m
105.50642 140.990625 l
stroke
grestore
[] 0 setdash
0.000 setgray
gsave
/o {
gsave
newpath
translate
0.8 setlinewidth
1 setlinejoin

0 setlinecap

0 0 m
0 -3.5 l

gsave
0.000 setgray
fill
grestore
stroke
grestore
} bind def
105.506 30.1106 o
grestore
gsave

102.639233 16.266875 translate
0.000000 rotate
0.000000 0 m /five glyphshow
grestore
[2.96 1.28] 0 setdash
0.690 setgray
gsave
106.02 110.88 47.142 30.111 clipbox
116.215511 30.110625 m
116.215511 140.990625 l
stroke
grestore
[] 0 setdash
0.000 setgray
gsave
/o {
gsave
newpath
translate
0.8 setlinewidth
1 setlinejoin

0 setlinecap

0 0 m
0 -3.5 l

gsave
0.000 setgray
fill
grestore
stroke
grestore
} bind def
116.216 30.1106 o
grestore
gsave

113.348324 16.266875 translate
0.000000 rotate
0.000000 0 m /six glyphshow
grestore
[2.96 1.28] 0 setdash
0.690 setgray
gsave
106.02 110.88 47.142 30.111 clipbox
126.924602 30.110625 m
126.924602 140.990625 l
stroke
grestore
[] 0 setdash
0.000 setgray
gsave
/o {
gsave
newpath
translate
0.8 setlinewidth
1 setlinejoin

0 setlinecap

0 0 m
0 -3.5 l

gsave
0.000 setgray
fill
grestore
stroke
grestore
} bind def
126.925 30.1106 o
grestore
gsave

124.057415 16.266875 translate
0.000000 rotate
0.000000 0 m /seven glyphshow
grestore
[2.96 1.28] 0 setdash
0.690 setgray
gsave
106.02 110.88 47.142 30.111 clipbox
137.633693 30.110625 m
137.633693 140.990625 l
stroke
grestore
[] 0 setdash
0.000 setgray
gsave
/o {
gsave
newpath
translate
0.8 setlinewidth
1 setlinejoin

0 setlinecap

0 0 m
0 -3.5 l

gsave
0.000 setgray
fill
grestore
stroke
grestore
} bind def
137.634 30.1106 o
grestore
gsave

134.766506 16.266875 translate
0.000000 rotate
0.000000 0 m /eight glyphshow
grestore
[2.96 1.28] 0 setdash
0.690 setgray
gsave
106.02 110.88 47.142 30.111 clipbox
148.342784 30.110625 m
148.342784 140.990625 l
stroke
grestore
[] 0 setdash
0.000 setgray
gsave
/o {
gsave
newpath
translate
0.8 setlinewidth
1 setlinejoin

0 setlinecap

0 0 m
0 -3.5 l

gsave
0.000 setgray
fill
grestore
stroke
grestore
} bind def
148.343 30.1106 o
grestore
gsave

145.475597 16.266875 translate
0.000000 rotate
0.000000 0 m /nine glyphshow
grestore
/DejaVuSans 10.000 selectfont
gsave

81.737813 2.798125 translate
0.000000 rotate
0.000000 0 m /R glyphshow
6.448242 0 m /o glyphshow
12.566406 0 m /u glyphshow
18.904297 0 m /n glyphshow
25.242188 0 m /d glyphshow
31.589844 0 m /s glyphshow
grestore
[2.96 1.28] 0 setdash
0.690 setgray
gsave
106.02 110.88 47.142 30.111 clipbox
47.141875 35.150625 m
153.161875 35.150625 l
stroke
grestore
[] 0 setdash
0.000 setgray
gsave
/o {
gsave
newpath
translate
0.8 setlinewidth
1 setlinejoin

0 setlinecap

-0 0 m
-3.5 0 l

gsave
0.000 setgray
fill
grestore
stroke
grestore
} bind def
47.1419 35.1506 o
grestore
/DejaVuSans 9.000 selectfont
gsave

25.860625 31.728750 translate
0.000000 rotate
0.000000 0 m /zero glyphshow
5.726074 0 m /percent glyphshow
grestore
[2.96 1.28] 0 setdash
0.690 setgray
gsave
106.02 110.88 47.142 30.111 clipbox
47.141875 55.310971 m
153.161875 55.310971 l
stroke
grestore
[] 0 setdash
0.000 setgray
gsave
/o {
gsave
newpath
translate
0.8 setlinewidth
1 setlinejoin

0 setlinecap

-0 0 m
-3.5 0 l

gsave
0.000 setgray
fill
grestore
stroke
grestore
} bind def
47.1419 55.311 o
grestore
gsave

20.126250 51.889096 translate
0.000000 rotate
0.000000 0 m /two glyphshow
5.726074 0 m /zero glyphshow
11.452148 0 m /percent glyphshow
grestore
[2.96 1.28] 0 setdash
0.690 setgray
gsave
106.02 110.88 47.142 30.111 clipbox
47.141875 75.471318 m
153.161875 75.471318 l
stroke
grestore
[] 0 setdash
0.000 setgray
gsave
/o {
gsave
newpath
translate
0.8 setlinewidth
1 setlinejoin

0 setlinecap

-0 0 m
-3.5 0 l

gsave
0.000 setgray
fill
grestore
stroke
grestore
} bind def
47.1419 75.4713 o
grestore
gsave

20.126250 72.049443 translate
0.000000 rotate
0.000000 0 m /four glyphshow
5.726074 0 m /zero glyphshow
11.452148 0 m /percent glyphshow
grestore
[2.96 1.28] 0 setdash
0.690 setgray
gsave
106.02 110.88 47.142 30.111 clipbox
47.141875 95.631664 m
153.161875 95.631664 l
stroke
grestore
[] 0 setdash
0.000 setgray
gsave
/o {
gsave
newpath
translate
0.8 setlinewidth
1 setlinejoin

0 setlinecap

-0 0 m
-3.5 0 l

gsave
0.000 setgray
fill
grestore
stroke
grestore
} bind def
47.1419 95.6317 o
grestore
gsave

20.126250 92.209789 translate
0.000000 rotate
0.000000 0 m /six glyphshow
5.726074 0 m /zero glyphshow
11.452148 0 m /percent glyphshow
grestore
[2.96 1.28] 0 setdash
0.690 setgray
gsave
106.02 110.88 47.142 30.111 clipbox
47.141875 115.792011 m
153.161875 115.792011 l
stroke
grestore
[] 0 setdash
0.000 setgray
gsave
/o {
gsave
newpath
translate
0.8 setlinewidth
1 setlinejoin

0 setlinecap

-0 0 m
-3.5 0 l

gsave
0.000 setgray
fill
grestore
stroke
grestore
} bind def
47.1419 115.792 o
grestore
gsave

20.126250 112.370136 translate
0.000000 rotate
0.000000 0 m /eight glyphshow
5.726074 0 m /zero glyphshow
11.452148 0 m /percent glyphshow
grestore
[2.96 1.28] 0 setdash
0.690 setgray
gsave
106.02 110.88 47.142 30.111 clipbox
47.141875 135.952357 m
153.161875 135.952357 l
stroke
grestore
[] 0 setdash
0.000 setgray
gsave
/o {
gsave
newpath
translate
0.8 setlinewidth
1 setlinejoin

0 setlinecap

-0 0 m
-3.5 0 l

gsave
0.000 setgray
fill
grestore
stroke
grestore
} bind def
47.1419 135.952 o
grestore
gsave

14.391875 132.530482 translate
0.000000 rotate
0.000000 0 m /one glyphshow
5.726074 0 m /zero glyphshow
11.452148 0 m /zero glyphshow
17.178223 0 m /percent glyphshow
grestore
/DejaVuSans 10.000 selectfont
gsave

8.313750 36.691250 translate
90.000000 rotate
0.000000 0 m /C glyphshow
6.982422 0 m /D glyphshow
14.682617 0 m /F glyphshow
20.434570 0 m /space glyphshow
23.613281 0 m /i glyphshow
26.391602 0 m /n glyphshow
32.729492 0 m /f glyphshow
36.250000 0 m /e glyphshow
42.402344 0 m /c glyphshow
47.900391 0 m /t glyphshow
51.821289 0 m /e glyphshow
57.973633 0 m /d glyphshow
64.321289 0 m /space glyphshow
67.500000 0 m /n glyphshow
73.837891 0 m /o glyphshow
79.956055 0 m /d glyphshow
86.303711 0 m /e glyphshow
92.456055 0 m /s glyphshow
grestore
0.750 setlinewidth
2 setlinecap
0.008 0.400 0.784 setrgbcolor
gsave
106.02 110.88 47.142 30.111 clipbox
51.960966 35.150625 m
62.670057 35.150625 l
73.379148 35.150625 l
84.088239 35.150625 l
94.79733 35.155851 l
105.50642 35.490052 l
116.215511 39.448993 l
126.924602 70.799897 l
137.633693 133.046992 l
148.342784 135.946313 l
stroke
grestore
1.000 setlinewidth
0 setlinecap
gsave
106.02 110.88 47.142 30.111 clipbox
/o {
gsave
newpath
translate
1.0 setlinewidth
1 setlinejoin

0 setlinecap

-3 -3 m
3 3 l
-3 3 m
3 -3 l

gsave
grestore
stroke
grestore
} bind def
51.961 35.1506 o
62.6701 35.1506 o
73.3791 35.1506 o
84.0882 35.1506 o
94.7973 35.1559 o
105.506 35.4901 o
116.216 39.449 o
126.925 70.7999 o
137.634 133.047 o
148.343 135.946 o
grestore
0.750 setlinewidth
2 setlinecap
gsave
106.02 110.88 47.142 30.111 clipbox
51.960966 35.150625 m
62.670057 35.150625 l
73.379148 35.150625 l
84.088239 35.150625 l
94.79733 35.151182 l
105.50642 35.213442 l
116.215511 38.586224 l
126.924602 71.077615 l
137.633693 133.371676 l
148.342784 135.947013 l
stroke
grestore
1.000 setlinewidth
0 setlinecap
gsave
106.02 110.88 47.142 30.111 clipbox
/o {
gsave
newpath
translate
1.0 setlinewidth
1 setlinejoin

0 setlinecap

0 -3 m
0.795609 -3 1.55874 -2.683901 2.12132 -2.12132 c
2.683901 -1.55874 3 -0.795609 3 0 c
3 0.795609 2.683901 1.55874 2.12132 2.12132 c
1.55874 2.683901 0.795609 3 0 3 c
-0.795609 3 -1.55874 2.683901 -2.12132 2.12132 c
-2.683901 1.55874 -3 0.795609 -3 0 c
-3 -0.795609 -2.683901 -1.55874 -2.12132 -2.12132 c
-1.55874 -2.683901 -0.795609 -3 0 -3 c
cl

gsave
grestore
stroke
grestore
} bind def
51.961 35.1506 o
62.6701 35.1506 o
73.3791 35.1506 o
84.0882 35.1506 o
94.7973 35.1512 o
105.506 35.2134 o
116.216 38.5862 o
126.925 71.0776 o
137.634 133.372 o
148.343 135.947 o
grestore
0.750 setlinewidth
2 setlinecap
gsave
106.02 110.88 47.142 30.111 clipbox
51.960966 35.150625 m
62.670057 35.150625 l
73.379148 35.150625 l
84.088239 35.150625 l
94.79733 35.150687 l
105.50642 35.158022 l
116.215511 35.85637 l
126.924602 67.176406 l
137.633693 134.550786 l
148.342784 135.950625 l
stroke
grestore
1.000 setlinewidth
0 setlinejoin
0 setlinecap
gsave
106.02 110.88 47.142 30.111 clipbox
/o {
gsave
newpath
translate
1.0 setlinewidth
0 setlinejoin

0 setlinecap

0 3 m
-3 -3 l
3 -3 l
cl

gsave
grestore
stroke
grestore
} bind def
51.961 35.1506 o
62.6701 35.1506 o
73.3791 35.1506 o
84.0882 35.1506 o
94.7973 35.1507 o
105.506 35.158 o
116.216 35.8564 o
126.925 67.1764 o
137.634 134.551 o
148.343 135.951 o
grestore
0.800 setlinewidth
2 setlinecap
0.000 setgray
gsave
47.141875 30.110625 m
47.141875 140.990625 l
stroke
grestore
gsave
47.141875 30.110625 m
153.161875 30.110625 l
stroke
grestore
1.000 setlinewidth
0 setlinecap
gsave
54.141875 88.975 m
126.485625 88.975 l
127.818958 88.975 128.485625 89.641667 128.485625 90.975 c
128.485625 133.990625 l
128.485625 135.323958 127.818958 135.990625 126.485625 135.990625 c
54.141875 135.990625 l
52.808542 135.990625 52.141875 135.323958 52.141875 133.990625 c
52.141875 90.975 l
52.141875 89.641667 52.808542 88.975 54.141875 88.975 c
cl
gsave
1.000 setgray
fill
grestore
stroke
grestore
0.750 setlinewidth
1 setlinejoin
2 setlinecap
0.008 0.400 0.784 setrgbcolor
gsave
56.141875 127.896875 m
66.141875 127.896875 l
76.141875 127.896875 l
stroke
grestore
1.000 setlinewidth
0 setlinecap
gsave
/o {
gsave
newpath
translate
1.0 setlinewidth
1 setlinejoin

0 setlinecap

-3 -3 m
3 3 l
-3 3 m
3 -3 l

gsave
grestore
stroke
grestore
} bind def
66.1419 127.897 o
grestore
0.000 setgray
gsave

81.141875 124.396875 translate
0.000000 rotate
0.000000 0 m /d glyphshow
6.347656 0 m /equal glyphshow
14.726562 0 m /zero glyphshow
21.088867 0 m /period glyphshow
24.267578 0 m /zero glyphshow
30.629883 0 m /zero glyphshow
36.992188 0 m /one glyphshow
grestore
0.750 setlinewidth
2 setlinecap
0.008 0.400 0.784 setrgbcolor
gsave
56.141875 113.225 m
66.141875 113.225 l
76.141875 113.225 l
stroke
grestore
1.000 setlinewidth
0 setlinecap
gsave
/o {
gsave
newpath
translate
1.0 setlinewidth
1 setlinejoin

0 setlinecap

0 -3 m
0.795609 -3 1.55874 -2.683901 2.12132 -2.12132 c
2.683901 -1.55874 3 -0.795609 3 0 c
3 0.795609 2.683901 1.55874 2.12132 2.12132 c
1.55874 2.683901 0.795609 3 0 3 c
-0.795609 3 -1.55874 2.683901 -2.12132 2.12132 c
-2.683901 1.55874 -3 0.795609 -3 0 c
-3 -0.795609 -2.683901 -1.55874 -2.12132 -2.12132 c
-1.55874 -2.683901 -0.795609 -3 0 -3 c
cl

gsave
grestore
stroke
grestore
} bind def
66.1419 113.225 o
grestore
0.000 setgray
gsave

81.141875 109.725000 translate
0.000000 rotate
0.000000 0 m /d glyphshow
6.347656 0 m /equal glyphshow
14.726562 0 m /zero glyphshow
21.088867 0 m /period glyphshow
24.267578 0 m /zero glyphshow
30.629883 0 m /one glyphshow
grestore
0.750 setlinewidth
2 setlinecap
0.008 0.400 0.784 setrgbcolor
gsave
56.141875 98.553125 m
66.141875 98.553125 l
76.141875 98.553125 l
stroke
grestore
1.000 setlinewidth
0 setlinejoin
0 setlinecap
gsave
/o {
gsave
newpath
translate
1.0 setlinewidth
0 setlinejoin

0 setlinecap

0 3 m
-3 -3 l
3 -3 l
cl

gsave
grestore
stroke
grestore
} bind def
66.1419 98.5531 o
grestore
0.000 setgray
gsave

81.141875 95.053125 translate
0.000000 rotate
0.000000 0 m /d glyphshow
6.347656 0 m /equal glyphshow
14.726562 0 m /zero glyphshow
21.088867 0 m /period glyphshow
24.267578 0 m /one glyphshow
grestore

end
showpage
