%!PS-Adobe-3.0 EPSF-3.0
%%Title: expe_blockchain_consistency.eps
%%Creator: Matplotlib v3.5.2, https://matplotlib.org/
%%CreationDate: Wed Sep 21 20:02:17 2022
%%Orientation: portrait
%%BoundingBox: 152 325 460 467
%%HiResBoundingBox: 152.891880 325.144687 459.108120 466.855312
%%EndComments
%%BeginProlog
/mpldict 11 dict def
mpldict begin
/_d { bind def } bind def
/m { moveto } _d
/l { lineto } _d
/r { rlineto } _d
/c { curveto } _d
/cl { closepath } _d
/ce { closepath eofill } _d
/box {
      m
      1 index 0 r
      0 exch r
      neg 0 r
      cl
    } _d
/clipbox {
      box
      clip
      newpath
    } _d
/sc { setcachedevice } _d
%!PS-Adobe-3.0 Resource-Font
%%Creator: Converted from TrueType to Type 3 by Matplotlib.
10 dict begin
/FontName /DejaVuSans def
/PaintType 0 def
/FontMatrix [0.00048828125 0 0 0.00048828125 0 0] def
/FontBBox [-2090 -948 3673 2524] def
/FontType 3 def
/Encoding [/space /percent /period /zero /one /two /three /four /five /colon /G /P /R /S /T /U /bracketleft /bracketright /a /c /d /e /f /i /m /n /o /r /s /t] def
/CharStrings 31 dict dup begin
/.notdef 0 def
/space{651 0 0 0 0 0 sc
ce} _d
/percent{1946 0 113 -29 1833 1520 sc
1489 657 m
1431 657 1385 632 1352 583 c
1319 534 1303 465 1303 377 c
1303 290 1319 222 1352 172 c
1385 123 1431 98 1489 98 c
1546 98 1590 123 1623 172 c
1656 222 1673 290 1673 377 c
1673 464 1656 533 1623 582 c
1590 632 1546 657 1489 657 c

1489 784 m
1594 784 1678 747 1740 674 c
1802 601 1833 502 1833 377 c
1833 252 1802 153 1739 80 c
1677 7 1594 -29 1489 -29 c
1382 -29 1298 7 1236 80 c
1174 153 1143 252 1143 377 c
1143 502 1174 601 1236 674 c
1299 747 1383 784 1489 784 c

457 1393 m
400 1393 354 1368 321 1318 c
288 1269 272 1201 272 1114 c
272 1026 288 957 321 908 c
354 859 399 834 457 834 c
515 834 560 859 593 908 c
626 957 643 1026 643 1114 c
643 1200 626 1268 593 1318 c
560 1368 514 1393 457 1393 c

1360 1520 m
1520 1520 l
586 -29 l
426 -29 l
1360 1520 l

457 1520 m
562 1520 646 1483 709 1410 c
772 1337 803 1239 803 1114 c
803 988 772 889 709 816 c
647 743 563 707 457 707 c
351 707 267 743 205 816 c
144 889 113 989 113 1114 c
113 1238 144 1337 206 1410 c
268 1483 352 1520 457 1520 c

ce} _d
/period{651 0 219 0 430 254 sc
219 254 m
430 254 l
430 0 l
219 0 l
219 254 l

ce} _d
/zero{1303 0 135 -29 1167 1520 sc
651 1360 m
547 1360 469 1309 416 1206 c
364 1104 338 950 338 745 c
338 540 364 387 416 284 c
469 182 547 131 651 131 c
756 131 834 182 886 284 c
939 387 965 540 965 745 c
965 950 939 1104 886 1206 c
834 1309 756 1360 651 1360 c

651 1520 m
818 1520 946 1454 1034 1321 c
1123 1189 1167 997 1167 745 c
1167 494 1123 302 1034 169 c
946 37 818 -29 651 -29 c
484 -29 356 37 267 169 c
179 302 135 494 135 745 c
135 997 179 1189 267 1321 c
356 1454 484 1520 651 1520 c

ce} _d
/one{1303 0 225 0 1114 1493 sc
254 170 m
584 170 l
584 1309 l
225 1237 l
225 1421 l
582 1493 l
784 1493 l
784 170 l
1114 170 l
1114 0 l
254 0 l
254 170 l

ce} _d
/two{1303 0 150 0 1098 1520 sc
393 170 m
1098 170 l
1098 0 l
150 0 l
150 170 l
227 249 331 356 463 489 c
596 623 679 709 713 748 c
778 821 823 882 848 932 c
874 983 887 1032 887 1081 c
887 1160 859 1225 803 1275 c
748 1325 675 1350 586 1350 c
523 1350 456 1339 385 1317 c
315 1295 240 1262 160 1217 c
160 1421 l
241 1454 317 1478 388 1495 c
459 1512 523 1520 582 1520 c
737 1520 860 1481 952 1404 c
1044 1327 1090 1223 1090 1094 c
1090 1033 1078 974 1055 919 c
1032 864 991 800 930 725 c
913 706 860 650 771 557 c
682 465 556 336 393 170 c

ce} _d
/three{1303 0 156 -29 1139 1520 sc
831 805 m
928 784 1003 741 1057 676 c
1112 611 1139 530 1139 434 c
1139 287 1088 173 987 92 c
886 11 742 -29 555 -29 c
492 -29 428 -23 361 -10 c
295 2 227 20 156 45 c
156 240 l
212 207 273 183 340 166 c
407 149 476 141 549 141 c
676 141 772 166 838 216 c
905 266 938 339 938 434 c
938 522 907 591 845 640 c
784 690 698 715 588 715 c
414 715 l
414 881 l
596 881 l
695 881 771 901 824 940 c
877 980 903 1037 903 1112 c
903 1189 876 1247 821 1288 c
767 1329 689 1350 588 1350 c
533 1350 473 1344 410 1332 c
347 1320 277 1301 201 1276 c
201 1456 l
278 1477 349 1493 416 1504 c
483 1515 547 1520 606 1520 c
759 1520 881 1485 970 1415 c
1059 1346 1104 1252 1104 1133 c
1104 1050 1080 980 1033 923 c
986 866 918 827 831 805 c

ce} _d
/four{1303 0 100 0 1188 1493 sc
774 1317 m
264 520 l
774 520 l
774 1317 l

721 1493 m
975 1493 l
975 520 l
1188 520 l
1188 352 l
975 352 l
975 0 l
774 0 l
774 352 l
100 352 l
100 547 l
721 1493 l

ce} _d
/five{1303 0 158 -29 1124 1493 sc
221 1493 m
1014 1493 l
1014 1323 l
406 1323 l
406 957 l
435 967 465 974 494 979 c
523 984 553 987 582 987 c
749 987 881 941 978 850 c
1075 759 1124 635 1124 479 c
1124 318 1074 193 974 104 c
874 15 733 -29 551 -29 c
488 -29 424 -24 359 -13 c
294 -2 227 14 158 35 c
158 238 l
218 205 280 181 344 165 c
408 149 476 141 547 141 c
662 141 754 171 821 232 c
888 293 922 375 922 479 c
922 583 888 665 821 726 c
754 787 662 817 547 817 c
493 817 439 811 385 799 c
332 787 277 768 221 743 c
221 1493 l

ce} _d
/colon{690 0 240 0 451 1059 sc
240 254 m
451 254 l
451 0 l
240 0 l
240 254 l

240 1059 m
451 1059 l
451 805 l
240 805 l
240 1059 l

ce} _d
/G{1587 0 115 -29 1419 1520 sc
1219 213 m
1219 614 l
889 614 l
889 780 l
1419 780 l
1419 139 l
1341 84 1255 42 1161 13 c
1067 -15 967 -29 860 -29 c
627 -29 444 39 312 175 c
181 312 115 502 115 745 c
115 989 181 1179 312 1315 c
444 1452 627 1520 860 1520 c
957 1520 1050 1508 1137 1484 c
1225 1460 1306 1425 1380 1378 c
1380 1163 l
1305 1226 1226 1274 1142 1306 c
1058 1338 970 1354 877 1354 c
694 1354 557 1303 465 1201 c
374 1099 328 947 328 745 c
328 544 374 392 465 290 c
557 188 694 137 877 137 c
948 137 1012 143 1068 155 c
1124 168 1174 187 1219 213 c

ce} _d
/P{1235 0 201 0 1165 1493 sc
403 1327 m
403 766 l
657 766 l
751 766 824 790 875 839 c
926 888 952 957 952 1047 c
952 1136 926 1205 875 1254 c
824 1303 751 1327 657 1327 c
403 1327 l

201 1493 m
657 1493 l
824 1493 951 1455 1036 1379 c
1122 1304 1165 1193 1165 1047 c
1165 900 1122 788 1036 713 c
951 638 824 600 657 600 c
403 600 l
403 0 l
201 0 l
201 1493 l

ce} _d
/R{1423 0 201 0 1364 1493 sc
909 700 m
952 685 994 654 1035 606 c
1076 558 1118 492 1159 408 c
1364 0 l
1147 0 l
956 383 l
907 483 859 549 812 582 c
766 615 703 631 623 631 c
403 631 l
403 0 l
201 0 l
201 1493 l
657 1493 l
828 1493 955 1457 1039 1386 c
1123 1315 1165 1207 1165 1063 c
1165 969 1143 891 1099 829 c
1056 767 992 724 909 700 c

403 1327 m
403 797 l
657 797 l
754 797 828 819 877 864 c
927 909 952 976 952 1063 c
952 1150 927 1216 877 1260 c
828 1305 754 1327 657 1327 c
403 1327 l

ce} _d
/S{1300 0 135 -29 1186 1520 sc
1096 1444 m
1096 1247 l
1019 1284 947 1311 879 1329 c
811 1347 745 1356 682 1356 c
572 1356 487 1335 427 1292 c
368 1249 338 1189 338 1110 c
338 1044 358 994 397 960 c
437 927 512 900 623 879 c
745 854 l
896 825 1007 775 1078 702 c
1150 630 1186 533 1186 412 c
1186 267 1137 158 1040 83 c
943 8 801 -29 614 -29 c
543 -29 468 -21 388 -5 c
309 11 226 35 141 66 c
141 274 l
223 228 303 193 382 170 c
461 147 538 135 614 135 c
729 135 818 158 881 203 c
944 248 975 313 975 397 c
975 470 952 528 907 569 c
862 610 789 641 686 662 c
563 686 l
412 716 303 763 236 827 c
169 891 135 980 135 1094 c
135 1226 181 1330 274 1406 c
367 1482 496 1520 659 1520 c
729 1520 800 1514 873 1501 c
946 1488 1020 1469 1096 1444 c

ce} _d
/T{1251 0 -6 0 1257 1493 sc
-6 1493 m
1257 1493 l
1257 1323 l
727 1323 l
727 0 l
524 0 l
524 1323 l
-6 1323 l
-6 1493 l

ce} _d
/U{1499 0 178 -29 1321 1493 sc
178 1493 m
381 1493 l
381 586 l
381 426 410 311 468 240 c
526 170 620 135 750 135 c
879 135 973 170 1031 240 c
1089 311 1118 426 1118 586 c
1118 1493 l
1321 1493 l
1321 561 l
1321 366 1273 219 1176 120 c
1080 21 938 -29 750 -29 c
561 -29 419 21 322 120 c
226 219 178 366 178 561 c
178 1493 l

ce} _d
/bracketleft{799 0 176 -270 600 1556 sc
176 1556 m
600 1556 l
600 1413 l
360 1413 l
360 -127 l
600 -127 l
600 -270 l
176 -270 l
176 1556 l

ce} _d
/bracketright{799 0 199 -270 623 1556 sc
623 1556 m
623 -270 l
199 -270 l
199 -127 l
438 -127 l
438 1413 l
199 1413 l
199 1556 l
623 1556 l

ce} _d
/a{1255 0 123 -29 1069 1147 sc
702 563 m
553 563 450 546 393 512 c
336 478 307 420 307 338 c
307 273 328 221 371 182 c
414 144 473 125 547 125 c
649 125 731 161 792 233 c
854 306 885 402 885 522 c
885 563 l
702 563 l

1069 639 m
1069 0 l
885 0 l
885 170 l
843 102 791 52 728 19 c
665 -13 589 -29 498 -29 c
383 -29 292 3 224 67 c
157 132 123 218 123 326 c
123 452 165 547 249 611 c
334 675 460 707 627 707 c
885 707 l
885 725 l
885 810 857 875 801 921 c
746 968 668 991 567 991 c
503 991 441 983 380 968 c
319 953 261 930 205 899 c
205 1069 l
272 1095 338 1114 401 1127 c
464 1140 526 1147 586 1147 c
748 1147 869 1105 949 1021 c
1029 937 1069 810 1069 639 c

ce} _d
/c{1126 0 113 -29 999 1147 sc
999 1077 m
999 905 l
947 934 895 955 842 969 c
790 984 737 991 684 991 c
565 991 472 953 406 877 c
340 802 307 696 307 559 c
307 422 340 316 406 240 c
472 165 565 127 684 127 c
737 127 790 134 842 148 c
895 163 947 184 999 213 c
999 43 l
948 19 894 1 839 -11 c
784 -23 726 -29 664 -29 c
495 -29 361 24 262 130 c
163 236 113 379 113 559 c
113 742 163 885 263 990 c
364 1095 501 1147 676 1147 c
733 1147 788 1141 842 1129 c
896 1118 948 1100 999 1077 c

ce} _d
/d{1300 0 113 -29 1114 1556 sc
930 950 m
930 1556 l
1114 1556 l
1114 0 l
930 0 l
930 168 l
891 101 842 52 783 19 c
724 -13 654 -29 571 -29 c
436 -29 325 25 240 133 c
155 241 113 383 113 559 c
113 735 155 877 240 985 c
325 1093 436 1147 571 1147 c
654 1147 724 1131 783 1098 c
842 1066 891 1017 930 950 c

303 559 m
303 424 331 317 386 240 c
442 163 519 125 616 125 c
713 125 790 163 846 240 c
902 317 930 424 930 559 c
930 694 902 800 846 877 c
790 954 713 993 616 993 c
519 993 442 954 386 877 c
331 800 303 694 303 559 c

ce} _d
/e{1260 0 113 -29 1151 1147 sc
1151 606 m
1151 516 l
305 516 l
313 389 351 293 419 226 c
488 160 583 127 705 127 c
776 127 844 136 910 153 c
977 170 1043 196 1108 231 c
1108 57 l
1042 29 974 8 905 -7 c
836 -22 765 -29 694 -29 c
515 -29 374 23 269 127 c
165 231 113 372 113 549 c
113 732 162 878 261 985 c
360 1093 494 1147 662 1147 c
813 1147 932 1098 1019 1001 c
1107 904 1151 773 1151 606 c

967 660 m
966 761 937 841 882 901 c
827 961 755 991 664 991 c
561 991 479 962 417 904 c
356 846 320 764 311 659 c
967 660 l

ce} _d
/f{721 0 47 0 760 1556 sc
760 1556 m
760 1403 l
584 1403 l
518 1403 472 1390 446 1363 c
421 1336 408 1288 408 1219 c
408 1120 l
711 1120 l
711 977 l
408 977 l
408 0 l
223 0 l
223 977 l
47 977 l
47 1120 l
223 1120 l
223 1198 l
223 1323 252 1413 310 1470 c
368 1527 460 1556 586 1556 c
760 1556 l

ce} _d
/i{569 0 193 0 377 1556 sc
193 1120 m
377 1120 l
377 0 l
193 0 l
193 1120 l

193 1556 m
377 1556 l
377 1323 l
193 1323 l
193 1556 l

ce} _d
/m{1995 0 186 0 1821 1147 sc
1065 905 m
1111 988 1166 1049 1230 1088 c
1294 1127 1369 1147 1456 1147 c
1573 1147 1663 1106 1726 1024 c
1789 943 1821 827 1821 676 c
1821 0 l
1636 0 l
1636 670 l
1636 777 1617 857 1579 909 c
1541 961 1483 987 1405 987 c
1310 987 1234 955 1179 892 c
1124 829 1096 742 1096 633 c
1096 0 l
911 0 l
911 670 l
911 778 892 858 854 909 c
816 961 757 987 678 987 c
584 987 509 955 454 891 c
399 828 371 742 371 633 c
371 0 l
186 0 l
186 1120 l
371 1120 l
371 946 l
413 1015 463 1065 522 1098 c
581 1131 650 1147 731 1147 c
812 1147 881 1126 938 1085 c
995 1044 1038 984 1065 905 c

ce} _d
/n{1298 0 186 0 1124 1147 sc
1124 676 m
1124 0 l
940 0 l
940 670 l
940 776 919 855 878 908 c
837 961 775 987 692 987 c
593 987 514 955 457 892 c
400 829 371 742 371 633 c
371 0 l
186 0 l
186 1120 l
371 1120 l
371 946 l
415 1013 467 1064 526 1097 c
586 1130 655 1147 733 1147 c
862 1147 959 1107 1025 1027 c
1091 948 1124 831 1124 676 c

ce} _d
/o{1253 0 113 -29 1141 1147 sc
627 991 m
528 991 450 952 393 875 c
336 798 307 693 307 559 c
307 425 335 319 392 242 c
449 165 528 127 627 127 c
725 127 803 166 860 243 c
917 320 946 426 946 559 c
946 692 917 797 860 874 c
803 952 725 991 627 991 c

627 1147 m
787 1147 913 1095 1004 991 c
1095 887 1141 743 1141 559 c
1141 376 1095 232 1004 127 c
913 23 787 -29 627 -29 c
466 -29 340 23 249 127 c
158 232 113 376 113 559 c
113 743 158 887 249 991 c
340 1095 466 1147 627 1147 c

ce} _d
/r{842 0 186 0 842 1147 sc
842 948 m
821 960 799 969 774 974 c
750 980 723 983 694 983 c
590 983 510 949 454 881 c
399 814 371 717 371 590 c
371 0 l
186 0 l
186 1120 l
371 1120 l
371 946 l
410 1014 460 1064 522 1097 c
584 1130 659 1147 748 1147 c
761 1147 775 1146 790 1144 c
805 1143 822 1140 841 1137 c
842 948 l

ce} _d
/s{1067 0 111 -29 967 1147 sc
907 1087 m
907 913 l
855 940 801 960 745 973 c
689 986 631 993 571 993 c
480 993 411 979 365 951 c
320 923 297 881 297 825 c
297 782 313 749 346 724 c
379 700 444 677 543 655 c
606 641 l
737 613 829 573 884 522 c
939 471 967 400 967 309 c
967 205 926 123 843 62 c
761 1 648 -29 504 -29 c
444 -29 381 -23 316 -11 c
251 0 183 18 111 41 c
111 231 l
179 196 246 169 312 151 c
378 134 443 125 508 125 c
595 125 661 140 708 169 c
755 199 778 241 778 295 c
778 345 761 383 727 410 c
694 437 620 462 506 487 c
442 502 l
328 526 246 563 195 612 c
144 662 119 730 119 817 c
119 922 156 1004 231 1061 c
306 1118 412 1147 549 1147 c
617 1147 681 1142 741 1132 c
801 1122 856 1107 907 1087 c

ce} _d
/t{803 0 55 0 754 1438 sc
375 1438 m
375 1120 l
754 1120 l
754 977 l
375 977 l
375 369 l
375 278 387 219 412 193 c
437 167 488 154 565 154 c
754 154 l
754 0 l
565 0 l
423 0 325 26 271 79 c
217 132 190 229 190 369 c
190 977 l
55 977 l
55 1120 l
190 1120 l
190 1438 l
375 1438 l

ce} _d
end readonly def

/BuildGlyph {
 exch begin
 CharStrings exch
 2 copy known not {pop /.notdef} if
 true 3 1 roll get exec
 end
} _d

/BuildChar {
 1 index /Encoding get exch get
 1 index /BuildGlyph get exec
} _d

FontName currentdict end definefont pop
end
%%EndProlog
mpldict begin
152.892 325.145 translate
306.216 141.711 0 0 clipbox
gsave
0 0 m
306.216239 0 l
306.216239 141.710625 l
0 141.710625 l
cl
1.000 setgray
fill
grestore
gsave
35.673125 30.110625 m
114.449596 30.110625 l
114.449596 140.990625 l
35.673125 140.990625 l
cl
1.000 setgray
fill
grestore
0.800 setlinewidth
1 setlinejoin
0 setlinecap
[2.96 1.28] 0 setdash
0.690 setgray
gsave
78.776 110.88 35.673 30.111 clipbox
35.673125 30.110625 m
35.673125 140.990625 l
stroke
grestore
[] 0 setdash
0.000 setgray
gsave
/o {
gsave
newpath
translate
0.8 setlinewidth
1 setlinejoin

0 setlinecap

0 0 m
0 -3.5 l

gsave
0.000 setgray
fill
grestore
stroke
grestore
} bind def
35.6731 30.1106 o
grestore
/DejaVuSans 9.000 selectfont
gsave

28.509063 16.266875 translate
0.000000 rotate
0.000000 0 m /zero glyphshow
5.726074 0 m /period glyphshow
8.586914 0 m /zero glyphshow
grestore
[2.96 1.28] 0 setdash
0.690 setgray
gsave
78.776 110.88 35.673 30.111 clipbox
60.290772 30.110625 m
60.290772 140.990625 l
stroke
grestore
[] 0 setdash
0.000 setgray
gsave
/o {
gsave
newpath
translate
0.8 setlinewidth
1 setlinejoin

0 setlinecap

0 0 m
0 -3.5 l

gsave
0.000 setgray
fill
grestore
stroke
grestore
} bind def
60.2908 30.1106 o
grestore
gsave

53.126710 16.266875 translate
0.000000 rotate
0.000000 0 m /zero glyphshow
5.726074 0 m /period glyphshow
8.586914 0 m /five glyphshow
grestore
[2.96 1.28] 0 setdash
0.690 setgray
gsave
78.776 110.88 35.673 30.111 clipbox
84.908419 30.110625 m
84.908419 140.990625 l
stroke
grestore
[] 0 setdash
0.000 setgray
gsave
/o {
gsave
newpath
translate
0.8 setlinewidth
1 setlinejoin

0 setlinecap

0 0 m
0 -3.5 l

gsave
0.000 setgray
fill
grestore
stroke
grestore
} bind def
84.9084 30.1106 o
grestore
gsave

77.744357 16.266875 translate
0.000000 rotate
0.000000 0 m /one glyphshow
5.726074 0 m /period glyphshow
8.586914 0 m /zero glyphshow
grestore
[2.96 1.28] 0 setdash
0.690 setgray
gsave
78.776 110.88 35.673 30.111 clipbox
109.526066 30.110625 m
109.526066 140.990625 l
stroke
grestore
[] 0 setdash
0.000 setgray
gsave
/o {
gsave
newpath
translate
0.8 setlinewidth
1 setlinejoin

0 setlinecap

0 0 m
0 -3.5 l

gsave
0.000 setgray
fill
grestore
stroke
grestore
} bind def
109.526 30.1106 o
grestore
gsave

102.362004 16.266875 translate
0.000000 rotate
0.000000 0 m /one glyphshow
5.726074 0 m /period glyphshow
8.586914 0 m /five glyphshow
grestore
[2.96 1.28] 0 setdash
0.690 setgray
gsave
78.776 110.88 35.673 30.111 clipbox
35.673125 30.110625 m
114.449596 30.110625 l
stroke
grestore
[] 0 setdash
0.000 setgray
gsave
/o {
gsave
newpath
translate
0.8 setlinewidth
1 setlinejoin

0 setlinecap

-0 0 m
-3.5 0 l

gsave
0.000 setgray
fill
grestore
stroke
grestore
} bind def
35.6731 30.1106 o
grestore
gsave

14.391875 26.688750 translate
0.000000 rotate
0.000000 0 m /zero glyphshow
5.726074 0 m /percent glyphshow
grestore
[2.96 1.28] 0 setdash
0.690 setgray
gsave
78.776 110.88 35.673 30.111 clipbox
35.673125 51.433702 m
114.449596 51.433702 l
stroke
grestore
[] 0 setdash
0.000 setgray
gsave
/o {
gsave
newpath
translate
0.8 setlinewidth
1 setlinejoin

0 setlinecap

-0 0 m
-3.5 0 l

gsave
0.000 setgray
fill
grestore
stroke
grestore
} bind def
35.6731 51.4337 o
grestore
gsave

14.391875 48.011827 translate
0.000000 rotate
0.000000 0 m /one glyphshow
5.726074 0 m /percent glyphshow
grestore
[2.96 1.28] 0 setdash
0.690 setgray
gsave
78.776 110.88 35.673 30.111 clipbox
35.673125 72.756779 m
114.449596 72.756779 l
stroke
grestore
[] 0 setdash
0.000 setgray
gsave
/o {
gsave
newpath
translate
0.8 setlinewidth
1 setlinejoin

0 setlinecap

-0 0 m
-3.5 0 l

gsave
0.000 setgray
fill
grestore
stroke
grestore
} bind def
35.6731 72.7568 o
grestore
gsave

14.391875 69.334904 translate
0.000000 rotate
0.000000 0 m /two glyphshow
5.726074 0 m /percent glyphshow
grestore
[2.96 1.28] 0 setdash
0.690 setgray
gsave
78.776 110.88 35.673 30.111 clipbox
35.673125 94.079856 m
114.449596 94.079856 l
stroke
grestore
[] 0 setdash
0.000 setgray
gsave
/o {
gsave
newpath
translate
0.8 setlinewidth
1 setlinejoin

0 setlinecap

-0 0 m
-3.5 0 l

gsave
0.000 setgray
fill
grestore
stroke
grestore
} bind def
35.6731 94.0799 o
grestore
gsave

14.391875 90.657981 translate
0.000000 rotate
0.000000 0 m /three glyphshow
5.726074 0 m /percent glyphshow
grestore
[2.96 1.28] 0 setdash
0.690 setgray
gsave
78.776 110.88 35.673 30.111 clipbox
35.673125 115.402933 m
114.449596 115.402933 l
stroke
grestore
[] 0 setdash
0.000 setgray
gsave
/o {
gsave
newpath
translate
0.8 setlinewidth
1 setlinejoin

0 setlinecap

-0 0 m
-3.5 0 l

gsave
0.000 setgray
fill
grestore
stroke
grestore
} bind def
35.6731 115.403 o
grestore
gsave

14.391875 111.981058 translate
0.000000 rotate
0.000000 0 m /four glyphshow
5.726074 0 m /percent glyphshow
grestore
/DejaVuSans 10.000 selectfont
gsave

8.313750 5.287500 translate
90.000000 rotate
0.000000 0 m /R glyphshow
6.698242 0 m /a glyphshow
12.826172 0 m /t glyphshow
16.747070 0 m /i glyphshow
19.525391 0 m /o glyphshow
25.643555 0 m /space glyphshow
28.822266 0 m /o glyphshow
34.940430 0 m /f glyphshow
38.460938 0 m /space glyphshow
41.639648 0 m /i glyphshow
44.417969 0 m /n glyphshow
50.755859 0 m /c glyphshow
56.253906 0 m /o glyphshow
62.372070 0 m /n glyphshow
68.709961 0 m /s glyphshow
73.919922 0 m /i glyphshow
76.698242 0 m /s glyphshow
81.908203 0 m /t glyphshow
85.829102 0 m /e glyphshow
91.981445 0 m /n glyphshow
98.319336 0 m /t glyphshow
102.240234 0 m /space glyphshow
105.418945 0 m /n glyphshow
111.756836 0 m /o glyphshow
117.875000 0 m /d glyphshow
124.222656 0 m /e glyphshow
130.375000 0 m /s glyphshow
grestore
1.500 setlinewidth
gsave
78.776 110.88 35.673 30.111 clipbox
35.673125 30.110625 m
35.673125 30.110625 l
stroke
grestore
gsave
78.776 110.88 35.673 30.111 clipbox
47.981949 30.197616 m
47.981949 30.274139 l
stroke
grestore
gsave
78.776 110.88 35.673 30.111 clipbox
60.290772 81.652596 m
60.290772 93.729228 l
stroke
grestore
gsave
78.776 110.88 35.673 30.111 clipbox
72.599596 89.967595 m
72.599596 103.51036 l
stroke
grestore
gsave
78.776 110.88 35.673 30.111 clipbox
84.908419 77.380319 m
84.908419 88.166651 l
stroke
grestore
gsave
78.776 110.88 35.673 30.111 clipbox
97.217243 30.500181 m
97.217243 32.825539 l
stroke
grestore
gsave
78.776 110.88 35.673 30.111 clipbox
109.526066 30.110178 m
109.526066 30.133339 l
stroke
grestore
gsave
78.776 110.88 35.673 30.111 clipbox
121.83489 30.109935 m
121.83489 30.115026 l
stroke
grestore
1.000 0.000 0.000 setrgbcolor
gsave
78.776 110.88 35.673 30.111 clipbox
35.673125 30.110625 m
35.673125 30.110625 l
stroke
grestore
gsave
78.776 110.88 35.673 30.111 clipbox
47.981949 53.705529 m
47.981949 62.943858 l
stroke
grestore
gsave
78.776 110.88 35.673 30.111 clipbox
60.290772 78.987208 m
60.290772 92.400079 l
stroke
grestore
gsave
78.776 110.88 35.673 30.111 clipbox
72.599596 89.042331 m
72.599596 107.958652 l
stroke
grestore
gsave
78.776 110.88 35.673 30.111 clipbox
84.908419 34.874688 m
84.908419 39.648624 l
stroke
grestore
gsave
78.776 110.88 35.673 30.111 clipbox
97.217243 30.048866 m
97.217243 30.302403 l
stroke
grestore
gsave
78.776 110.88 35.673 30.111 clipbox
109.526066 30.110625 m
109.526066 30.110625 l
stroke
grestore
gsave
78.776 110.88 35.673 30.111 clipbox
121.83489 30.110625 m
121.83489 30.110625 l
stroke
grestore
0.122 0.467 0.706 setrgbcolor
gsave
78.776 110.88 35.673 30.111 clipbox
35.673125 30.110625 m
35.673125 30.110625 l
stroke
grestore
gsave
78.776 110.88 35.673 30.111 clipbox
47.981949 30.148598 m
47.981949 30.219484 l
stroke
grestore
gsave
78.776 110.88 35.673 30.111 clipbox
60.290772 76.997048 m
60.290772 89.572269 l
stroke
grestore
gsave
78.776 110.88 35.673 30.111 clipbox
72.599596 76.582558 m
72.599596 88.222859 l
stroke
grestore
gsave
78.776 110.88 35.673 30.111 clipbox
84.908419 77.804284 m
84.908419 90.120433 l
stroke
grestore
gsave
78.776 110.88 35.673 30.111 clipbox
97.217243 30.606354 m
97.217243 33.526729 l
stroke
grestore
gsave
78.776 110.88 35.673 30.111 clipbox
109.526066 30.113158 m
109.526066 30.130681 l
stroke
grestore
gsave
78.776 110.88 35.673 30.111 clipbox
121.83489 30.109932 m
121.83489 30.118847 l
stroke
grestore
[5.55 2.4] 0 setdash
0.000 setgray
gsave
78.776 110.88 35.673 30.111 clipbox
35.673125 30.110625 m
47.489596 30.183921 l
48.966654 30.425153 l
49.95136 30.878856 l
50.936066 32.065533 l
51.428419 33.005412 l
51.920772 34.321055 l
52.413125 35.972569 l
52.905478 38.053662 l
53.890184 43.675301 l
54.87489 51.433702 l
57.336654 72.332767 l
58.813713 81.694434 l
59.798419 86.170221 l
60.290772 87.690912 l
60.783125 89.931588 l
61.275478 90.633018 l
61.767831 92.108245 l
62.260184 92.296593 l
62.752537 92.836582 l
63.24489 92.93493 l
63.737243 93.24111 l
64.721949 93.481414 l
65.214301 92.807819 l
65.706654 92.56566 l
66.199007 92.936787 l
67.183713 93.235543 l
67.676066 93.67904 l
70.137831 97.417212 l
70.630184 97.79205 l
71.122537 98.501828 l
71.61489 98.395129 l
72.107243 97.9238 l
72.599596 96.738977 l
73.091949 96.150743 l
73.584301 94.948292 l
74.076654 94.412941 l
74.569007 93.292138 l
75.06136 91.879075 l
75.553713 91.274138 l
77.030772 90.435393 l
77.523125 90.748067 l
79.492537 93.919344 l
79.98489 94.281192 l
80.477243 94.27006 l
80.969596 94.700565 l
81.461949 94.471394 l
81.954301 94.047382 l
82.446654 92.93957 l
83.43136 89.659738 l
84.908419 82.773485 l
89.831949 50.896496 l
91.309007 43.59922 l
91.80136 41.303804 l
93.278419 36.499569 l
94.263125 34.240337 l
96.232537 32.21955 l
97.709596 31.443895 l
102.140772 30.359278 l
106.079596 30.165365 l
110.018419 30.127325 l
123.311949 30.112481 l
133.65136 30.112481 l
133.65136 30.112481 l
stroke
grestore
1.000 setlinewidth
[] 0 setdash
gsave
78.776 110.88 35.673 30.111 clipbox
/o {
gsave
newpath
translate
1.0 setlinewidth
1 setlinejoin

0 setlinecap

-3 0 m
3 0 l
0 -3 m
0 3 l

gsave
grestore
stroke
grestore
} bind def
35.6731 30.1106 o
47.9819 30.2359 o
60.2908 87.6909 o
72.5996 96.739 o
84.9084 82.7735 o
97.2172 31.6629 o
109.526 30.1218 o
121.835 30.1125 o
grestore
1.500 setlinewidth
[1.5 2.475] 0 setdash
1.000 0.000 0.000 setrgbcolor
gsave
78.776 110.88 35.673 30.111 clipbox
35.673125 30.110625 m
40.104301 30.175634 l
40.596654 30.565691 l
42.073713 30.565691 l
43.058419 31.410812 l
44.535478 34.596272 l
45.027831 36.611562 l
45.520184 39.667002 l
46.50489 47.923193 l
46.997243 49.808464 l
47.489596 55.724318 l
47.981949 58.324693 l
48.474301 63.135388 l
48.966654 65.995801 l
49.459007 67.621035 l
49.95136 73.276851 l
50.443713 81.012968 l
50.936066 82.508184 l
51.428419 86.0837 l
51.920772 82.508183 l
52.413125 89.724225 l
52.905478 88.814093 l
53.397831 91.869534 l
53.890184 92.194581 l
54.382537 91.674507 l
54.87489 98.045426 l
55.367243 98.69552 l
55.859596 98.240454 l
56.351949 95.445051 l
56.844301 102.401055 l
57.336654 94.014844 l
57.829007 98.240455 l
58.32136 96.485201 l
58.813713 90.504338 l
59.306066 89.724226 l
59.798419 90.244301 l
60.290772 85.693644 l
60.783125 88.814094 l
61.275478 88.033982 l
62.260184 83.938389 l
62.752537 88.033981 l
63.24489 84.198426 l
64.229596 86.018689 l
64.721949 86.083699 l
65.214301 88.033981 l
65.706654 87.383887 l
66.199007 86.993831 l
66.69136 87.318878 l
67.183713 87.058839 l
67.676066 88.359028 l
68.168419 88.879103 l
68.660772 91.34946 l
69.153125 91.154431 l
69.645478 94.859967 l
70.137831 96.355182 l
70.630184 94.924978 l
71.122537 94.339892 l
71.61489 97.005277 l
72.107243 95.705087 l
72.599596 98.500491 l
73.091949 95.57507 l
73.584301 91.479478 l
74.076654 96.030136 l
74.569007 92.909685 l
75.06136 91.869535 l
75.553713 91.609498 l
76.538419 85.628634 l
77.030772 83.93839 l
77.523125 84.783513 l
78.015478 78.607621 l
78.507831 77.502462 l
79.000184 73.081823 l
79.492537 71.976664 l
79.98489 66.450866 l
80.969596 59.039796 l
81.461949 57.934637 l
81.954301 52.083794 l
82.446654 49.028353 l
82.939007 45.192799 l
83.43136 44.932762 l
84.416066 39.667003 l
84.908419 37.261656 l
85.400772 37.196647 l
85.893125 34.596272 l
86.385478 35.506403 l
86.877831 34.856309 l
87.370184 33.621131 l
87.862537 33.686141 l
88.35489 32.385953 l
88.847243 32.776009 l
89.339596 32.580981 l
89.831949 30.955747 l
90.324301 31.215784 l
90.816654 31.345803 l
91.309007 30.825728 l
91.80136 31.020756 l
92.293713 30.435672 l
92.786066 30.565691 l
93.770772 30.240644 l
94.263125 30.305653 l
94.755478 30.110625 l
95.740184 30.305653 l
96.232537 30.110625 l
97.709596 30.240644 l
99.186654 30.110625 l
133.65136 30.110625 l
133.65136 30.110625 l
stroke
grestore
1.000 setlinewidth
0 setlinejoin
[] 0 setdash
gsave
78.776 110.88 35.673 30.111 clipbox
/o {
gsave
newpath
translate
1.0 setlinewidth
0 setlinejoin

0 setlinecap

0 3 m
-3 -3 l
3 -3 l
cl

gsave
grestore
stroke
grestore
} bind def
35.6731 30.1106 o
47.9819 58.3247 o
60.2908 85.6936 o
72.5996 98.5005 o
84.9084 37.2617 o
97.2172 30.1756 o
109.526 30.1106 o
121.835 30.1106 o
grestore
1.500 setlinewidth
1 setlinejoin
[1.5 2.475] 0 setdash
0.122 0.467 0.706 setrgbcolor
gsave
78.776 110.88 35.673 30.111 clipbox
35.673125 30.110625 m
48.474301 30.197219 l
49.95136 30.543598 l
50.443713 30.738438 l
50.936066 31.078229 l
51.428419 31.588388 l
51.920772 32.293383 l
52.905478 34.90347 l
53.397831 36.529949 l
53.890184 38.88778 l
54.87489 45.207333 l
56.351949 57.353223 l
57.336654 65.756703 l
58.813713 76.42389 l
60.290772 83.284659 l
60.783125 85.303642 l
61.767831 88.165041 l
62.260184 90.063542 l
62.752537 91.024559 l
63.24489 92.270774 l
63.737243 93.005889 l
64.229596 93.477455 l
64.721949 93.00589 l
65.214301 92.333837 l
66.199007 90.044718 l
67.183713 86.617626 l
68.660772 82.473302 l
69.153125 82.260579 l
69.645478 81.264737 l
70.137831 81.374862 l
71.122537 81.298622 l
72.107243 81.827606 l
72.599596 82.402708 l
73.091949 82.579663 l
73.584301 82.618255 l
74.569007 83.898355 l
75.553713 84.637236 l
76.046066 86.013344 l
76.538419 85.884393 l
77.030772 86.795523 l
77.523125 87.433691 l
78.015478 88.484124 l
79.492537 90.582171 l
79.98489 91.15445 l
80.477243 91.030206 l
80.969596 91.825562 l
81.461949 91.674962 l
81.954301 90.798659 l
82.446654 90.496518 l
83.43136 88.906748 l
83.923713 87.044012 l
84.416066 86.180887 l
86.385478 76.849333 l
86.877831 73.879689 l
87.862537 66.764781 l
88.847243 59.907775 l
89.831949 52.819222 l
91.309007 44.206784 l
92.293713 40.17447 l
93.278419 37.270714 l
93.770772 35.998144 l
94.755478 34.350014 l
95.740184 33.241222 l
96.72489 32.310325 l
98.201949 31.509321 l
98.694301 31.198708 l
101.156066 30.479593 l
108.54136 30.131332 l
133.65136 30.113449 l
133.65136 30.113449 l
stroke
grestore
1.000 setlinewidth
[] 0 setdash
gsave
78.776 110.88 35.673 30.111 clipbox
/o {
gsave
newpath
translate
1.0 setlinewidth
1 setlinejoin

0 setlinecap

0 -3 m
0.795609 -3 1.55874 -2.683901 2.12132 -2.12132 c
2.683901 -1.55874 3 -0.795609 3 0 c
3 0.795609 2.683901 1.55874 2.12132 2.12132 c
1.55874 2.683901 0.795609 3 0 3 c
-0.795609 3 -1.55874 2.683901 -2.12132 2.12132 c
-2.683901 1.55874 -3 0.795609 -3 0 c
-3 -0.795609 -2.683901 -1.55874 -2.12132 -2.12132 c
-1.55874 -2.683901 -0.795609 -3 0 -3 c
cl

gsave
grestore
stroke
grestore
} bind def
35.6731 30.1106 o
47.9819 30.184 o
60.2908 83.2847 o
72.5996 82.4027 o
84.9084 83.9624 o
97.2172 32.0665 o
109.526 30.1219 o
121.835 30.1144 o
grestore
0.800 setlinewidth
0 setlinejoin
2 setlinecap
0.000 setgray
gsave
35.673125 30.110625 m
35.673125 140.990625 l
stroke
grestore
gsave
35.673125 30.110625 m
114.449596 30.110625 l
stroke
grestore
gsave
130.20489 30.110625 m
208.98136 30.110625 l
208.98136 140.990625 l
130.20489 140.990625 l
cl
1.000 setgray
fill
grestore
1 setlinejoin
0 setlinecap
[2.96 1.28] 0 setdash
0.690 setgray
gsave
78.776 110.88 130.205 30.111 clipbox
130.20489 30.110625 m
130.20489 140.990625 l
stroke
grestore
[] 0 setdash
0.000 setgray
gsave
/o {
gsave
newpath
translate
0.8 setlinewidth
1 setlinejoin

0 setlinecap

0 0 m
0 -3.5 l

gsave
0.000 setgray
fill
grestore
stroke
grestore
} bind def
130.205 30.1106 o
grestore
/DejaVuSans 9.000 selectfont
gsave

127.337702 16.266875 translate
0.000000 rotate
0.000000 0 m /zero glyphshow
grestore
[2.96 1.28] 0 setdash
0.690 setgray
gsave
78.776 110.88 130.205 30.111 clipbox
167.717495 30.110625 m
167.717495 140.990625 l
stroke
grestore
[] 0 setdash
0.000 setgray
gsave
/o {
gsave
newpath
translate
0.8 setlinewidth
1 setlinejoin

0 setlinecap

0 0 m
0 -3.5 l

gsave
0.000 setgray
fill
grestore
stroke
grestore
} bind def
167.717 30.1106 o
grestore
gsave

164.850307 16.266875 translate
0.000000 rotate
0.000000 0 m /one glyphshow
grestore
[2.96 1.28] 0 setdash
0.690 setgray
gsave
78.776 110.88 130.205 30.111 clipbox
205.2301 30.110625 m
205.2301 140.990625 l
stroke
grestore
[] 0 setdash
0.000 setgray
gsave
/o {
gsave
newpath
translate
0.8 setlinewidth
1 setlinejoin

0 setlinecap

0 0 m
0 -3.5 l

gsave
0.000 setgray
fill
grestore
stroke
grestore
} bind def
205.23 30.1106 o
grestore
gsave

202.362912 16.266875 translate
0.000000 rotate
0.000000 0 m /two glyphshow
grestore
[2.96 1.28] 0 setdash
0.690 setgray
gsave
78.776 110.88 130.205 30.111 clipbox
148.961192 30.110625 m
148.961192 140.990625 l
stroke
grestore
0.600 setlinewidth
[] 0 setdash
0.000 setgray
gsave
/o {
gsave
newpath
translate
0.6 setlinewidth
1 setlinejoin

0 setlinecap

0 0 m
0 -2 l

gsave
0.000 setgray
fill
grestore
stroke
grestore
} bind def
148.961 30.1106 o
grestore
0.800 setlinewidth
[2.96 1.28] 0 setdash
0.690 setgray
gsave
78.776 110.88 130.205 30.111 clipbox
186.473797 30.110625 m
186.473797 140.990625 l
stroke
grestore
0.600 setlinewidth
[] 0 setdash
0.000 setgray
gsave
/o {
gsave
newpath
translate
0.6 setlinewidth
1 setlinejoin

0 setlinecap

0 0 m
0 -2 l

gsave
0.000 setgray
fill
grestore
stroke
grestore
} bind def
186.474 30.1106 o
grestore
/DejaVuSans 10.000 selectfont
gsave

149.210312 2.798125 translate
0.000000 rotate
0.000000 0 m /T glyphshow
5.858398 0 m /i glyphshow
8.636719 0 m /m glyphshow
18.377930 0 m /e glyphshow
24.530273 0 m /space glyphshow
27.708984 0 m /bracketleft glyphshow
31.610352 0 m /s glyphshow
36.820312 0 m /bracketright glyphshow
grestore
0.800 setlinewidth
[2.96 1.28] 0 setdash
0.690 setgray
gsave
78.776 110.88 130.205 30.111 clipbox
130.20489 30.110625 m
208.98136 30.110625 l
stroke
grestore
[] 0 setdash
0.000 setgray
gsave
/o {
gsave
newpath
translate
0.8 setlinewidth
1 setlinejoin

0 setlinecap

-0 0 m
-3.5 0 l

gsave
0.000 setgray
fill
grestore
stroke
grestore
} bind def
130.205 30.1106 o
grestore
[2.96 1.28] 0 setdash
0.690 setgray
gsave
78.776 110.88 130.205 30.111 clipbox
130.20489 51.433702 m
208.98136 51.433702 l
stroke
grestore
[] 0 setdash
0.000 setgray
gsave
/o {
gsave
newpath
translate
0.8 setlinewidth
1 setlinejoin

0 setlinecap

-0 0 m
-3.5 0 l

gsave
0.000 setgray
fill
grestore
stroke
grestore
} bind def
130.205 51.4337 o
grestore
[2.96 1.28] 0 setdash
0.690 setgray
gsave
78.776 110.88 130.205 30.111 clipbox
130.20489 72.756779 m
208.98136 72.756779 l
stroke
grestore
[] 0 setdash
0.000 setgray
gsave
/o {
gsave
newpath
translate
0.8 setlinewidth
1 setlinejoin

0 setlinecap

-0 0 m
-3.5 0 l

gsave
0.000 setgray
fill
grestore
stroke
grestore
} bind def
130.205 72.7568 o
grestore
[2.96 1.28] 0 setdash
0.690 setgray
gsave
78.776 110.88 130.205 30.111 clipbox
130.20489 94.079856 m
208.98136 94.079856 l
stroke
grestore
[] 0 setdash
0.000 setgray
gsave
/o {
gsave
newpath
translate
0.8 setlinewidth
1 setlinejoin

0 setlinecap

-0 0 m
-3.5 0 l

gsave
0.000 setgray
fill
grestore
stroke
grestore
} bind def
130.205 94.0799 o
grestore
[2.96 1.28] 0 setdash
0.690 setgray
gsave
78.776 110.88 130.205 30.111 clipbox
130.20489 115.402933 m
208.98136 115.402933 l
stroke
grestore
[] 0 setdash
0.000 setgray
gsave
/o {
gsave
newpath
translate
0.8 setlinewidth
1 setlinejoin

0 setlinecap

-0 0 m
-3.5 0 l

gsave
0.000 setgray
fill
grestore
stroke
grestore
} bind def
130.205 115.403 o
grestore
1.500 setlinewidth
gsave
78.776 110.88 130.205 30.111 clipbox
130.20489 30.110625 m
130.20489 30.110625 l
stroke
grestore
gsave
78.776 110.88 130.205 30.111 clipbox
139.583041 30.120246 m
139.583041 30.136259 l
stroke
grestore
gsave
78.776 110.88 130.205 30.111 clipbox
148.961192 36.8752 m
148.961192 41.089612 l
stroke
grestore
gsave
78.776 110.88 130.205 30.111 clipbox
158.339343 36.081234 m
158.339343 39.571459 l
stroke
grestore
gsave
78.776 110.88 130.205 30.111 clipbox
167.717495 35.989123 m
167.717495 38.982553 l
stroke
grestore
gsave
78.776 110.88 130.205 30.111 clipbox
177.095646 37.332088 m
177.095646 40.692103 l
stroke
grestore
gsave
78.776 110.88 130.205 30.111 clipbox
186.473797 37.193617 m
186.473797 42.144363 l
stroke
grestore
gsave
78.776 110.88 130.205 30.111 clipbox
195.851949 32.979291 m
195.851949 35.787146 l
stroke
grestore
gsave
78.776 110.88 130.205 30.111 clipbox
205.2301 30.151334 m
205.2301 30.214654 l
stroke
grestore
gsave
78.776 110.88 130.205 30.111 clipbox
214.608251 30.109935 m
214.608251 30.115026 l
stroke
grestore
gsave
78.776 110.88 130.205 30.111 clipbox
223.986402 30.109744 m
223.986402 30.113362 l
stroke
grestore
gsave
78.776 110.88 130.205 30.111 clipbox
233.364554 30.110625 m
233.364554 30.110625 l
stroke
grestore
gsave
78.776 110.88 130.205 30.111 clipbox
242.742705 30.109744 m
242.742705 30.113362 l
stroke
grestore
gsave
78.776 110.88 130.205 30.111 clipbox
252.120856 30.109744 m
252.120856 30.113362 l
stroke
grestore
gsave
78.776 110.88 130.205 30.111 clipbox
261.499007 30.109744 m
261.499007 30.113362 l
stroke
grestore
gsave
78.776 110.88 130.205 30.111 clipbox
270.877159 30.110625 m
270.877159 30.110625 l
stroke
grestore
gsave
78.776 110.88 130.205 30.111 clipbox
280.25531 30.110625 m
280.25531 30.110625 l
stroke
grestore
gsave
78.776 110.88 130.205 30.111 clipbox
289.633461 30.110625 m
289.633461 30.110625 l
stroke
grestore
gsave
78.776 110.88 130.205 30.111 clipbox
299.011612 30.109744 m
299.011612 30.113362 l
stroke
grestore
gsave
78.776 110.88 130.205 30.111 clipbox

stroke
grestore
gsave
78.776 110.88 130.205 30.111 clipbox

stroke
grestore
gsave
78.776 110.88 130.205 30.111 clipbox

stroke
grestore
gsave
78.776 110.88 130.205 30.111 clipbox

stroke
grestore
gsave
78.776 110.88 130.205 30.111 clipbox

stroke
grestore
gsave
78.776 110.88 130.205 30.111 clipbox

stroke
grestore
gsave
78.776 110.88 130.205 30.111 clipbox

stroke
grestore
gsave
78.776 110.88 130.205 30.111 clipbox

stroke
grestore
gsave
78.776 110.88 130.205 30.111 clipbox

stroke
grestore
gsave
78.776 110.88 130.205 30.111 clipbox

stroke
grestore
gsave
78.776 110.88 130.205 30.111 clipbox

stroke
grestore
gsave
78.776 110.88 130.205 30.111 clipbox

stroke
grestore
gsave
78.776 110.88 130.205 30.111 clipbox

stroke
grestore
gsave
78.776 110.88 130.205 30.111 clipbox

stroke
grestore
gsave
78.776 110.88 130.205 30.111 clipbox

stroke
grestore
gsave
78.776 110.88 130.205 30.111 clipbox

stroke
grestore
gsave
78.776 110.88 130.205 30.111 clipbox

stroke
grestore
gsave
78.776 110.88 130.205 30.111 clipbox

stroke
grestore
gsave
78.776 110.88 130.205 30.111 clipbox

stroke
grestore
gsave
78.776 110.88 130.205 30.111 clipbox

stroke
grestore
gsave
78.776 110.88 130.205 30.111 clipbox

stroke
grestore
1.000 0.000 0.000 setrgbcolor
gsave
78.776 110.88 130.205 30.111 clipbox
130.20489 30.110625 m
130.20489 30.110625 l
stroke
grestore
gsave
78.776 110.88 130.205 30.111 clipbox
139.583041 33.423309 m
139.583041 36.029271 l
stroke
grestore
gsave
78.776 110.88 130.205 30.111 clipbox
148.961192 34.636198 m
148.961192 39.107001 l
stroke
grestore
gsave
78.776 110.88 130.205 30.111 clipbox
158.339343 37.072701 m
158.339343 43.171435 l
stroke
grestore
gsave
78.776 110.88 130.205 30.111 clipbox
167.717495 37.503814 m
167.717495 45.08066 l
stroke
grestore
gsave
78.776 110.88 130.205 30.111 clipbox
177.095646 36.138286 m
177.095646 42.285588 l
stroke
grestore
gsave
78.776 110.88 130.205 30.111 clipbox
186.473797 34.113009 m
186.473797 41.190415 l
stroke
grestore
gsave
78.776 110.88 130.205 30.111 clipbox
195.851949 29.372302 m
195.851949 33.449324 l
stroke
grestore
gsave
78.776 110.88 130.205 30.111 clipbox
205.2301 30.110625 m
205.2301 30.110625 l
stroke
grestore
gsave
78.776 110.88 130.205 30.111 clipbox
214.608251 30.110625 m
214.608251 30.110625 l
stroke
grestore
gsave
78.776 110.88 130.205 30.111 clipbox
223.986402 30.110625 m
223.986402 30.110625 l
stroke
grestore
gsave
78.776 110.88 130.205 30.111 clipbox
233.364554 30.110625 m
233.364554 30.110625 l
stroke
grestore
gsave
78.776 110.88 130.205 30.111 clipbox
242.742705 30.110625 m
242.742705 30.110625 l
stroke
grestore
gsave
78.776 110.88 130.205 30.111 clipbox
252.120856 30.110625 m
252.120856 30.110625 l
stroke
grestore
gsave
78.776 110.88 130.205 30.111 clipbox
261.499007 30.110625 m
261.499007 30.110625 l
stroke
grestore
gsave
78.776 110.88 130.205 30.111 clipbox
270.877159 30.110625 m
270.877159 30.110625 l
stroke
grestore
gsave
78.776 110.88 130.205 30.111 clipbox
280.25531 30.110625 m
280.25531 30.110625 l
stroke
grestore
gsave
78.776 110.88 130.205 30.111 clipbox
289.633461 30.110625 m
289.633461 30.110625 l
stroke
grestore
gsave
78.776 110.88 130.205 30.111 clipbox
299.011612 30.110625 m
299.011612 30.110625 l
stroke
grestore
gsave
78.776 110.88 130.205 30.111 clipbox

stroke
grestore
gsave
78.776 110.88 130.205 30.111 clipbox

stroke
grestore
gsave
78.776 110.88 130.205 30.111 clipbox

stroke
grestore
gsave
78.776 110.88 130.205 30.111 clipbox

stroke
grestore
gsave
78.776 110.88 130.205 30.111 clipbox

stroke
grestore
gsave
78.776 110.88 130.205 30.111 clipbox

stroke
grestore
gsave
78.776 110.88 130.205 30.111 clipbox

stroke
grestore
gsave
78.776 110.88 130.205 30.111 clipbox

stroke
grestore
gsave
78.776 110.88 130.205 30.111 clipbox

stroke
grestore
gsave
78.776 110.88 130.205 30.111 clipbox

stroke
grestore
gsave
78.776 110.88 130.205 30.111 clipbox

stroke
grestore
gsave
78.776 110.88 130.205 30.111 clipbox

stroke
grestore
gsave
78.776 110.88 130.205 30.111 clipbox

stroke
grestore
gsave
78.776 110.88 130.205 30.111 clipbox

stroke
grestore
gsave
78.776 110.88 130.205 30.111 clipbox

stroke
grestore
gsave
78.776 110.88 130.205 30.111 clipbox

stroke
grestore
gsave
78.776 110.88 130.205 30.111 clipbox

stroke
grestore
gsave
78.776 110.88 130.205 30.111 clipbox

stroke
grestore
gsave
78.776 110.88 130.205 30.111 clipbox

stroke
grestore
gsave
78.776 110.88 130.205 30.111 clipbox

stroke
grestore
gsave
78.776 110.88 130.205 30.111 clipbox

stroke
grestore
0.122 0.467 0.706 setrgbcolor
gsave
78.776 110.88 130.205 30.111 clipbox
130.20489 30.110625 m
130.20489 30.110625 l
stroke
grestore
gsave
78.776 110.88 130.205 30.111 clipbox
139.583041 30.109925 m
139.583041 30.11509 l
stroke
grestore
gsave
78.776 110.88 130.205 30.111 clipbox
148.961192 35.677711 m
148.961192 40.017688 l
stroke
grestore
gsave
78.776 110.88 130.205 30.111 clipbox
158.339343 35.413489 m
158.339343 38.265752 l
stroke
grestore
gsave
78.776 110.88 130.205 30.111 clipbox
167.717495 35.535398 m
167.717495 39.177336 l
stroke
grestore
gsave
78.776 110.88 130.205 30.111 clipbox
177.095646 36.04233 m
177.095646 39.572119 l
stroke
grestore
gsave
78.776 110.88 130.205 30.111 clipbox
186.473797 35.316383 m
186.473797 40.409137 l
stroke
grestore
gsave
78.776 110.88 130.205 30.111 clipbox
195.851949 32.001546 m
195.851949 34.825396 l
stroke
grestore
gsave
78.776 110.88 130.205 30.111 clipbox
205.2301 29.906258 m
205.2301 30.892917 l
stroke
grestore
gsave
78.776 110.88 130.205 30.111 clipbox
214.608251 30.108603 m
214.608251 30.120177 l
stroke
grestore
gsave
78.776 110.88 130.205 30.111 clipbox
223.986402 30.109731 m
223.986402 30.113402 l
stroke
grestore
gsave
78.776 110.88 130.205 30.111 clipbox
233.364554 30.110625 m
233.364554 30.110625 l
stroke
grestore
gsave
78.776 110.88 130.205 30.111 clipbox
242.742705 30.109731 m
242.742705 30.113402 l
stroke
grestore
gsave
78.776 110.88 130.205 30.111 clipbox
252.120856 30.109925 m
252.120856 30.11509 l
stroke
grestore
gsave
78.776 110.88 130.205 30.111 clipbox
261.499007 30.108837 m
261.499007 30.116178 l
stroke
grestore
gsave
78.776 110.88 130.205 30.111 clipbox
270.877159 30.110625 m
270.877159 30.110625 l
stroke
grestore
gsave
78.776 110.88 130.205 30.111 clipbox
280.25531 30.110625 m
280.25531 30.110625 l
stroke
grestore
gsave
78.776 110.88 130.205 30.111 clipbox
289.633461 30.110625 m
289.633461 30.110625 l
stroke
grestore
gsave
78.776 110.88 130.205 30.111 clipbox
299.011612 30.110625 m
299.011612 30.110625 l
stroke
grestore
gsave
78.776 110.88 130.205 30.111 clipbox

stroke
grestore
gsave
78.776 110.88 130.205 30.111 clipbox

stroke
grestore
gsave
78.776 110.88 130.205 30.111 clipbox

stroke
grestore
gsave
78.776 110.88 130.205 30.111 clipbox

stroke
grestore
gsave
78.776 110.88 130.205 30.111 clipbox

stroke
grestore
gsave
78.776 110.88 130.205 30.111 clipbox

stroke
grestore
gsave
78.776 110.88 130.205 30.111 clipbox

stroke
grestore
gsave
78.776 110.88 130.205 30.111 clipbox

stroke
grestore
gsave
78.776 110.88 130.205 30.111 clipbox

stroke
grestore
gsave
78.776 110.88 130.205 30.111 clipbox

stroke
grestore
gsave
78.776 110.88 130.205 30.111 clipbox

stroke
grestore
gsave
78.776 110.88 130.205 30.111 clipbox

stroke
grestore
gsave
78.776 110.88 130.205 30.111 clipbox

stroke
grestore
gsave
78.776 110.88 130.205 30.111 clipbox

stroke
grestore
gsave
78.776 110.88 130.205 30.111 clipbox

stroke
grestore
gsave
78.776 110.88 130.205 30.111 clipbox

stroke
grestore
gsave
78.776 110.88 130.205 30.111 clipbox

stroke
grestore
gsave
78.776 110.88 130.205 30.111 clipbox

stroke
grestore
gsave
78.776 110.88 130.205 30.111 clipbox

stroke
grestore
gsave
78.776 110.88 130.205 30.111 clipbox

stroke
grestore
gsave
78.776 110.88 130.205 30.111 clipbox

stroke
grestore
[5.55 2.4] 0 setdash
0.000 setgray
gsave
78.776 110.88 130.205 30.111 clipbox
130.20489 30.110625 m
140.708419 30.186704 l
141.833797 30.408453 l
142.584049 30.71556 l
143.334301 31.292662 l
144.084554 32.293777 l
145.209932 34.326623 l
145.960184 36.208234 l
146.710436 37.577691 l
147.835814 38.997251 l
148.961192 38.982406 l
149.336318 38.685503 l
149.711444 38.761585 l
150.08657 38.403449 l
153.087579 38.10098 l
153.462705 37.71408 l
153.837831 37.671401 l
154.588083 37.337387 l
154.963209 37.163886 l
155.338335 37.194503 l
155.713461 37.096154 l
156.088587 37.261306 l
156.463713 37.228832 l
157.589091 37.892221 l
157.964217 37.918199 l
159.464722 37.608309 l
159.839848 37.626865 l
160.214974 37.442229 l
162.090604 37.591609 l
162.46573 37.879232 l
162.840856 37.822633 l
164.34136 38.013765 l
165.091612 37.869026 l
165.466738 37.806862 l
165.841864 37.445942 l
166.216991 37.630576 l
166.592117 37.612948 l
166.967243 37.408829 l
167.342369 37.357799 l
167.717495 37.485838 l
168.092621 37.366149 l
168.467747 37.513672 l
168.842873 37.378212 l
170.718503 38.381181 l
171.093629 38.506435 l
172.219007 39.659711 l
172.594133 39.76641 l
172.969259 40.050322 l
173.719512 40.170939 l
174.094638 40.414027 l
174.469764 40.105991 l
175.220016 40.219185 l
175.970268 39.609609 l
177.095646 39.012095 l
177.470772 39.155907 l
177.845898 39.090032 l
178.59615 39.387862 l
178.971276 39.219927 l
179.721528 39.451881 l
180.096654 39.494561 l
180.47178 39.334048 l
180.846907 39.019519 l
181.222033 39.05663 l
181.597159 38.720759 l
181.972285 38.162215 l
183.847915 38.202111 l
184.973293 38.875706 l
185.348419 38.913747 l
186.473797 39.66899 l
186.848923 39.357244 l
187.224049 39.847131 l
187.599175 39.842492 l
187.974301 40.028982 l
188.724554 40.013209 l
189.09968 39.755277 l
189.474806 39.76641 l
189.849932 39.539094 l
190.225058 39.495488 l
191.350436 38.395098 l
192.100688 37.74841 l
192.475814 37.241821 l
192.85094 37.032135 l
193.601192 36.278749 l
194.351444 35.82319 l
194.72657 35.247016 l
195.101696 35.070732 l
196.602201 33.454475 l
196.977327 33.225304 l
198.102705 32.094296 l
198.477831 31.972751 l
199.228083 31.303795 l
200.728587 30.755456 l
202.604217 30.345362 l
205.980352 30.155159 l
216.108755 30.112481 l
307.216239 30.110744 l
307.216239 30.110744 l
stroke
grestore
1.000 setlinewidth
[] 0 setdash
gsave
78.776 110.88 130.205 30.111 clipbox
/o {
gsave
newpath
translate
1.0 setlinewidth
1 setlinejoin

0 setlinecap

-3 0 m
3 0 l
0 -3 m
0 3 l

gsave
grestore
stroke
grestore
} bind def
130.205 30.1106 o
139.583 30.1283 o
148.961 38.9824 o
158.339 37.8263 o
167.717 37.4858 o
177.096 39.0121 o
186.474 39.669 o
195.852 34.3832 o
205.23 30.183 o
214.608 30.1125 o
223.986 30.1116 o
233.365 30.1106 o
242.743 30.1116 o
252.121 30.1116 o
261.499 30.1116 o
270.877 30.1106 o
280.255 30.1106 o
289.633 30.1106 o
299.012 30.1116 o
307.216 30.1116 o
grestore
1.500 setlinewidth
[1.5 2.475] 0 setdash
1.000 0.000 0.000 setrgbcolor
gsave
78.776 110.88 130.205 30.111 clipbox
130.20489 30.110625 m
135.456654 30.110625 l
136.206907 30.435672 l
136.582033 30.370662 l
137.332285 31.020756 l
137.707411 31.800869 l
138.082537 31.800869 l
138.832789 32.580981 l
139.207915 33.361094 l
139.583041 34.72629 l
139.958167 34.661281 l
141.083545 38.301806 l
141.458671 37.586703 l
141.833797 38.041769 l
142.208923 38.88689 l
142.584049 39.146927 l
142.959175 38.691862 l
143.334301 39.536984 l
143.709428 38.88689 l
144.084554 37.001618 l
144.45968 37.976759 l
144.834806 38.431824 l
145.209932 38.496834 l
145.585058 37.521693 l
145.960184 39.536984 l
146.33531 40.187078 l
146.710436 38.171787 l
147.085562 38.106778 l
148.21094 37.521693 l
148.586066 38.951899 l
148.961192 36.8716 l
149.336318 36.936609 l
149.711444 39.276946 l
150.836822 37.131637 l
151.211949 37.976759 l
151.587075 37.456684 l
152.337327 37.521693 l
152.712453 36.546553 l
153.087579 37.781731 l
153.462705 37.131637 l
153.837831 39.862031 l
154.212957 39.536984 l
154.588083 38.041768 l
154.963209 38.951899 l
155.338335 39.016909 l
155.713461 37.391674 l
156.838839 40.057059 l
157.213965 41.812312 l
157.589091 39.667003 l
157.964217 39.406965 l
158.339343 40.122068 l
158.71447 38.041768 l
159.089596 37.976759 l
159.464722 38.821881 l
160.5901 37.716721 l
160.965226 38.366815 l
161.340352 38.236796 l
161.715478 37.781731 l
162.090604 37.586703 l
162.46573 37.651712 l
162.840856 38.496834 l
163.215982 39.732012 l
163.591108 38.691862 l
163.966234 39.797022 l
164.34136 39.667002 l
165.091612 40.057059 l
165.466738 40.122068 l
165.841864 38.431825 l
166.216991 39.92704 l
166.592117 39.797022 l
167.342369 41.162218 l
167.717495 41.292237 l
168.092621 40.122068 l
168.467747 40.642143 l
168.842873 38.106778 l
169.217999 40.512124 l
169.593125 41.162218 l
169.968251 38.691862 l
170.718503 40.057059 l
171.093629 39.016909 l
171.843881 40.057059 l
172.219007 38.431825 l
172.594133 40.707153 l
172.969259 38.561843 l
173.344386 38.88689 l
173.719512 38.88689 l
174.094638 38.561843 l
174.469764 39.211937 l
174.84489 38.171787 l
175.220016 37.586703 l
175.595142 37.456684 l
175.970268 36.80659 l
176.345394 39.016909 l
176.72052 38.171787 l
177.095646 39.211937 l
177.470772 38.691862 l
177.845898 38.366815 l
178.221024 39.146928 l
178.59615 38.691862 l
178.971276 39.471975 l
179.346402 39.276947 l
179.721528 37.84674 l
180.096654 39.211937 l
180.47178 38.821881 l
180.846907 38.821881 l
181.222033 37.586703 l
181.597159 39.081919 l
181.972285 38.88689 l
182.347411 38.821881 l
182.722537 38.626853 l
183.097663 38.106778 l
183.472789 39.276947 l
183.847915 38.561844 l
184.223041 38.626853 l
184.598167 39.471975 l
184.973293 38.756872 l
185.348419 38.366815 l
185.723545 39.016909 l
186.098671 37.391675 l
186.473797 37.651712 l
187.224049 35.506403 l
187.599175 36.156497 l
188.349428 33.946178 l
188.724554 34.271225 l
189.09968 34.141206 l
189.474806 33.426103 l
189.849932 33.101056 l
190.225058 33.101056 l
190.600184 32.450962 l
191.350436 32.320944 l
191.725562 31.865878 l
192.100688 31.605841 l
192.475814 31.605841 l
192.85094 32.450962 l
193.226066 31.345803 l
193.601192 32.320944 l
193.976318 31.215784 l
194.351444 30.955747 l
194.72657 31.345803 l
195.476822 31.735859 l
195.851949 31.410813 l
196.227075 31.475822 l
196.602201 31.410813 l
196.977327 32.060906 l
197.352453 32.060906 l
198.477831 30.565691 l
198.852957 31.215785 l
199.228083 31.085766 l
199.603209 30.370662 l
199.978335 30.695709 l
200.353461 30.565691 l
200.728587 30.240644 l
201.478839 30.305653 l
201.853965 30.175634 l
307.216239 30.110625 l
307.216239 30.110625 l
stroke
grestore
1.000 setlinewidth
0 setlinejoin
[] 0 setdash
gsave
78.776 110.88 130.205 30.111 clipbox
/o {
gsave
newpath
translate
1.0 setlinewidth
0 setlinejoin

0 setlinecap

0 3 m
-3 -3 l
3 -3 l
cl

gsave
grestore
stroke
grestore
} bind def
130.205 30.1106 o
139.583 34.7263 o
148.961 36.8716 o
158.339 40.1221 o
167.717 41.2922 o
177.096 39.2119 o
186.474 37.6517 o
195.852 31.4108 o
205.23 30.1106 o
214.608 30.1106 o
223.986 30.1106 o
233.365 30.1106 o
242.743 30.1106 o
252.121 30.1106 o
261.499 30.1106 o
270.877 30.1106 o
280.255 30.1106 o
289.633 30.1106 o
299.012 30.1106 o
307.216 30.1106 o
grestore
1.500 setlinewidth
1 setlinejoin
[1.5 2.475] 0 setdash
0.122 0.467 0.706 setrgbcolor
gsave
78.776 110.88 130.205 30.111 clipbox
130.20489 30.110625 m
141.833797 30.194395 l
142.959175 30.398646 l
143.709428 30.780794 l
145.209932 32.414804 l
146.33531 34.336837 l
147.460688 36.472534 l
148.586066 37.619917 l
148.961192 37.847699 l
149.336318 37.725338 l
149.711444 37.729101 l
150.08657 37.540852 l
150.836822 37.571913 l
151.211949 37.763929 l
151.587075 37.723455 l
151.962201 38.121602 l
152.337327 38.086777 l
152.712453 38.248671 l
153.087579 38.13478 l
153.462705 38.413391 l
153.837831 38.06701 l
154.212957 37.995475 l
154.963209 37.296127 l
156.088587 36.608073 l
156.838839 36.459356 l
157.213965 36.606191 l
157.589091 36.557246 l
158.71447 36.89892 l
159.464722 36.716317 l
159.839848 36.876329 l
160.965226 36.832091 l
161.340352 36.970454 l
161.715478 37.268831 l
162.090604 37.366721 l
162.46573 37.745103 l
163.215982 38.02936 l
163.591108 38.483043 l
163.966234 38.046303 l
164.34136 38.372918 l
164.716486 38.203493 l
165.091612 38.199727 l
166.592117 37.496613 l
166.967243 37.423197 l
167.342369 37.142704 l
167.717495 37.356367 l
168.092621 37.172823 l
168.467747 37.235887 l
168.842873 37.453315 l
169.217999 37.419431 l
169.968251 37.692394 l
170.343377 37.794049 l
170.718503 38.024655 l
171.468755 38.739063 l
171.843881 38.925431 l
172.219007 38.919783 l
172.594133 39.27181 l
172.969259 39.220983 l
173.344386 39.336756 l
175.220016 38.659057 l
175.595142 38.226083 l
176.345394 38.146075 l
176.72052 37.894763 l
177.845898 37.626506 l
178.221024 37.7131 l
178.59615 37.583209 l
178.971276 37.263182 l
179.346402 37.244359 l
180.096654 36.848093 l
180.47178 36.824561 l
180.846907 36.637253 l
182.347411 36.985515 l
183.472789 37.447669 l
183.847915 37.524851 l
184.223041 37.826051 l
185.348419 37.821345 l
185.723545 38.060422 l
186.098671 37.845817 l
187.974301 37.940883 l
188.349428 37.789344 l
188.724554 37.858053 l
189.474806 37.857112 l
189.849932 37.859937 l
190.225058 37.974768 l
190.600184 38.216669 l
190.97531 38.213845 l
192.100688 37.649097 l
194.351444 34.830993 l
195.851949 33.413471 l
198.477831 32.157841 l
201.478839 31.909352 l
201.853965 31.681569 l
202.604217 31.481083 l
204.104722 30.728084 l
205.980352 30.29605 l
207.10573 30.191572 l
208.98136 30.14451 l
211.607243 30.117214 l
307.216239 30.111445 l
307.216239 30.111445 l
stroke
grestore
1.000 setlinewidth
[] 0 setdash
gsave
78.776 110.88 130.205 30.111 clipbox
/o {
gsave
newpath
translate
1.0 setlinewidth
1 setlinejoin

0 setlinecap

0 -3 m
0.795609 -3 1.55874 -2.683901 2.12132 -2.12132 c
2.683901 -1.55874 3 -0.795609 3 0 c
3 0.795609 2.683901 1.55874 2.12132 2.12132 c
1.55874 2.683901 0.795609 3 0 3 c
-0.795609 3 -1.55874 2.683901 -2.12132 2.12132 c
-2.683901 1.55874 -3 0.795609 -3 0 c
-3 -0.795609 -2.683901 -1.55874 -2.12132 -2.12132 c
-1.55874 -2.683901 -0.795609 -3 0 -3 c
cl

gsave
grestore
stroke
grestore
} bind def
130.205 30.1106 o
139.583 30.1125 o
148.961 37.8477 o
158.339 36.8396 o
167.717 37.3564 o
177.096 37.8072 o
186.474 37.8628 o
195.852 33.4135 o
205.23 30.3996 o
214.608 30.1144 o
223.986 30.1116 o
233.365 30.1106 o
242.743 30.1116 o
252.121 30.1125 o
261.499 30.1125 o
270.877 30.1106 o
280.255 30.1106 o
289.633 30.1106 o
299.012 30.1106 o
307.216 30.1106 o
grestore
0.800 setlinewidth
0 setlinejoin
2 setlinecap
0.000 setgray
gsave
130.20489 30.110625 m
208.98136 30.110625 l
stroke
grestore
gsave
224.736654 30.110625 m
303.513125 30.110625 l
303.513125 140.990625 l
224.736654 140.990625 l
cl
1.000 setgray
fill
grestore
1 setlinejoin
0 setlinecap
[2.96 1.28] 0 setdash
0.690 setgray
gsave
78.776 110.88 224.737 30.111 clipbox
224.736654 30.110625 m
224.736654 140.990625 l
stroke
grestore
[] 0 setdash
0.000 setgray
gsave
/o {
gsave
newpath
translate
0.8 setlinewidth
1 setlinejoin

0 setlinecap

0 0 m
0 -3.5 l

gsave
0.000 setgray
fill
grestore
stroke
grestore
} bind def
224.737 30.1106 o
grestore
/DejaVuSans 9.000 selectfont
gsave

221.869467 16.266875 translate
0.000000 rotate
0.000000 0 m /zero glyphshow
grestore
[2.96 1.28] 0 setdash
0.690 setgray
gsave
78.776 110.88 224.737 30.111 clipbox
243.492957 30.110625 m
243.492957 140.990625 l
stroke
grestore
[] 0 setdash
0.000 setgray
gsave
/o {
gsave
newpath
translate
0.8 setlinewidth
1 setlinejoin

0 setlinecap

0 0 m
0 -3.5 l

gsave
0.000 setgray
fill
grestore
stroke
grestore
} bind def
243.493 30.1106 o
grestore
gsave

240.625769 16.266875 translate
0.000000 rotate
0.000000 0 m /five glyphshow
grestore
[2.96 1.28] 0 setdash
0.690 setgray
gsave
78.776 110.88 224.737 30.111 clipbox
262.249259 30.110625 m
262.249259 140.990625 l
stroke
grestore
[] 0 setdash
0.000 setgray
gsave
/o {
gsave
newpath
translate
0.8 setlinewidth
1 setlinejoin

0 setlinecap

0 0 m
0 -3.5 l

gsave
0.000 setgray
fill
grestore
stroke
grestore
} bind def
262.249 30.1106 o
grestore
gsave

256.514884 16.266875 translate
0.000000 rotate
0.000000 0 m /one glyphshow
5.726074 0 m /zero glyphshow
grestore
[2.96 1.28] 0 setdash
0.690 setgray
gsave
78.776 110.88 224.737 30.111 clipbox
281.005562 30.110625 m
281.005562 140.990625 l
stroke
grestore
[] 0 setdash
0.000 setgray
gsave
/o {
gsave
newpath
translate
0.8 setlinewidth
1 setlinejoin

0 setlinecap

0 0 m
0 -3.5 l

gsave
0.000 setgray
fill
grestore
stroke
grestore
} bind def
281.006 30.1106 o
grestore
gsave

275.271187 16.266875 translate
0.000000 rotate
0.000000 0 m /one glyphshow
5.726074 0 m /five glyphshow
grestore
[2.96 1.28] 0 setdash
0.690 setgray
gsave
78.776 110.88 224.737 30.111 clipbox
299.761864 30.110625 m
299.761864 140.990625 l
stroke
grestore
[] 0 setdash
0.000 setgray
gsave
/o {
gsave
newpath
translate
0.8 setlinewidth
1 setlinejoin

0 setlinecap

0 0 m
0 -3.5 l

gsave
0.000 setgray
fill
grestore
stroke
grestore
} bind def
299.762 30.1106 o
grestore
gsave

294.027489 16.266875 translate
0.000000 rotate
0.000000 0 m /two glyphshow
5.726074 0 m /zero glyphshow
grestore
[2.96 1.28] 0 setdash
0.690 setgray
gsave
78.776 110.88 224.737 30.111 clipbox
224.736654 30.110625 m
303.513125 30.110625 l
stroke
grestore
[] 0 setdash
0.000 setgray
gsave
/o {
gsave
newpath
translate
0.8 setlinewidth
1 setlinejoin

0 setlinecap

-0 0 m
-3.5 0 l

gsave
0.000 setgray
fill
grestore
stroke
grestore
} bind def
224.737 30.1106 o
grestore
[2.96 1.28] 0 setdash
0.690 setgray
gsave
78.776 110.88 224.737 30.111 clipbox
224.736654 51.433702 m
303.513125 51.433702 l
stroke
grestore
[] 0 setdash
0.000 setgray
gsave
/o {
gsave
newpath
translate
0.8 setlinewidth
1 setlinejoin

0 setlinecap

-0 0 m
-3.5 0 l

gsave
0.000 setgray
fill
grestore
stroke
grestore
} bind def
224.737 51.4337 o
grestore
[2.96 1.28] 0 setdash
0.690 setgray
gsave
78.776 110.88 224.737 30.111 clipbox
224.736654 72.756779 m
303.513125 72.756779 l
stroke
grestore
[] 0 setdash
0.000 setgray
gsave
/o {
gsave
newpath
translate
0.8 setlinewidth
1 setlinejoin

0 setlinecap

-0 0 m
-3.5 0 l

gsave
0.000 setgray
fill
grestore
stroke
grestore
} bind def
224.737 72.7568 o
grestore
[2.96 1.28] 0 setdash
0.690 setgray
gsave
78.776 110.88 224.737 30.111 clipbox
224.736654 94.079856 m
303.513125 94.079856 l
stroke
grestore
[] 0 setdash
0.000 setgray
gsave
/o {
gsave
newpath
translate
0.8 setlinewidth
1 setlinejoin

0 setlinecap

-0 0 m
-3.5 0 l

gsave
0.000 setgray
fill
grestore
stroke
grestore
} bind def
224.737 94.0799 o
grestore
[2.96 1.28] 0 setdash
0.690 setgray
gsave
78.776 110.88 224.737 30.111 clipbox
224.736654 115.402933 m
303.513125 115.402933 l
stroke
grestore
[] 0 setdash
0.000 setgray
gsave
/o {
gsave
newpath
translate
0.8 setlinewidth
1 setlinejoin

0 setlinecap

-0 0 m
-3.5 0 l

gsave
0.000 setgray
fill
grestore
stroke
grestore
} bind def
224.737 115.403 o
grestore
1.500 setlinewidth
gsave
78.776 110.88 224.737 30.111 clipbox
224.736654 30.110625 m
224.736654 30.110625 l
stroke
grestore
gsave
78.776 110.88 224.737 30.111 clipbox
243.492957 30.109744 m
243.492957 30.113362 l
stroke
grestore
gsave
78.776 110.88 224.737 30.111 clipbox
262.249259 30.110625 m
262.249259 30.110625 l
stroke
grestore
gsave
78.776 110.88 224.737 30.111 clipbox
281.005562 30.110625 m
281.005562 30.110625 l
stroke
grestore
gsave
78.776 110.88 224.737 30.111 clipbox
299.761864 30.110625 m
299.761864 30.110625 l
stroke
grestore
gsave
78.776 110.88 224.737 30.111 clipbox

stroke
grestore
1.000 0.000 0.000 setrgbcolor
gsave
78.776 110.88 224.737 30.111 clipbox
224.736654 30.110625 m
224.736654 30.110625 l
stroke
grestore
gsave
78.776 110.88 224.737 30.111 clipbox
243.492957 30.110625 m
243.492957 30.110625 l
stroke
grestore
gsave
78.776 110.88 224.737 30.111 clipbox
262.249259 30.110625 m
262.249259 30.110625 l
stroke
grestore
gsave
78.776 110.88 224.737 30.111 clipbox
281.005562 30.110625 m
281.005562 30.110625 l
stroke
grestore
gsave
78.776 110.88 224.737 30.111 clipbox
299.761864 30.110625 m
299.761864 30.110625 l
stroke
grestore
gsave
78.776 110.88 224.737 30.111 clipbox

stroke
grestore
0.122 0.467 0.706 setrgbcolor
gsave
78.776 110.88 224.737 30.111 clipbox
224.736654 30.110625 m
224.736654 30.110625 l
stroke
grestore
gsave
78.776 110.88 224.737 30.111 clipbox
243.492957 30.110625 m
243.492957 30.110625 l
stroke
grestore
gsave
78.776 110.88 224.737 30.111 clipbox
262.249259 30.110625 m
262.249259 30.110625 l
stroke
grestore
gsave
78.776 110.88 224.737 30.111 clipbox
281.005562 30.110625 m
281.005562 30.110625 l
stroke
grestore
gsave
78.776 110.88 224.737 30.111 clipbox
299.761864 30.110625 m
299.761864 30.110625 l
stroke
grestore
gsave
78.776 110.88 224.737 30.111 clipbox

stroke
grestore
[5.55 2.4] 0 setdash
0.000 setgray
gsave
78.776 110.88 224.737 30.111 clipbox
224.736654 30.110625 m
307.216239 30.110625 l
307.216239 30.110625 l
stroke
grestore
1.000 setlinewidth
[] 0 setdash
gsave
78.776 110.88 224.737 30.111 clipbox
/o {
gsave
newpath
translate
1.0 setlinewidth
1 setlinejoin

0 setlinecap

-3 0 m
3 0 l
0 -3 m
0 3 l

gsave
grestore
stroke
grestore
} bind def
224.737 30.1106 o
243.493 30.1116 o
262.249 30.1106 o
281.006 30.1106 o
299.762 30.1106 o
307.216 30.1106 o
grestore
1.500 setlinewidth
[1.5 2.475] 0 setdash
1.000 0.000 0.000 setrgbcolor
gsave
78.776 110.88 224.737 30.111 clipbox
224.736654 30.110625 m
307.216239 30.110625 l
307.216239 30.110625 l
stroke
grestore
1.000 setlinewidth
0 setlinejoin
[] 0 setdash
gsave
78.776 110.88 224.737 30.111 clipbox
/o {
gsave
newpath
translate
1.0 setlinewidth
0 setlinejoin

0 setlinecap

0 3 m
-3 -3 l
3 -3 l
cl

gsave
grestore
stroke
grestore
} bind def
224.737 30.1106 o
243.493 30.1106 o
262.249 30.1106 o
281.006 30.1106 o
299.762 30.1106 o
307.216 30.1106 o
grestore
1.500 setlinewidth
1 setlinejoin
[1.5 2.475] 0 setdash
0.122 0.467 0.706 setrgbcolor
gsave
78.776 110.88 224.737 30.111 clipbox
224.736654 30.110625 m
307.216239 30.110625 l
307.216239 30.110625 l
stroke
grestore
1.000 setlinewidth
[] 0 setdash
gsave
78.776 110.88 224.737 30.111 clipbox
/o {
gsave
newpath
translate
1.0 setlinewidth
1 setlinejoin

0 setlinecap

0 -3 m
0.795609 -3 1.55874 -2.683901 2.12132 -2.12132 c
2.683901 -1.55874 3 -0.795609 3 0 c
3 0.795609 2.683901 1.55874 2.12132 2.12132 c
1.55874 2.683901 0.795609 3 0 3 c
-0.795609 3 -1.55874 2.683901 -2.12132 2.12132 c
-2.683901 1.55874 -3 0.795609 -3 0 c
-3 -0.795609 -2.683901 -1.55874 -2.12132 -2.12132 c
-1.55874 -2.683901 -0.795609 -3 0 -3 c
cl

gsave
grestore
stroke
grestore
} bind def
224.737 30.1106 o
243.493 30.1106 o
262.249 30.1106 o
281.006 30.1106 o
299.762 30.1106 o
307.216 30.1106 o
grestore
0.800 setlinewidth
0 setlinejoin
2 setlinecap
0.000 setgray
gsave
224.736654 30.110625 m
303.513125 30.110625 l
stroke
grestore
1.000 setlinewidth
0 setlinecap
gsave
57.304062 121.08035 m
281.882187 121.08035 l
283.215521 121.08035 283.882187 121.747017 283.882187 123.08035 c
283.882187 136.752225 l
283.882187 138.085558 283.215521 138.752225 281.882187 138.752225 c
57.304062 138.752225 l
55.970729 138.752225 55.304062 138.085558 55.304062 136.752225 c
55.304062 123.08035 l
55.304062 121.747017 55.970729 121.08035 57.304062 121.08035 c
cl
gsave
1.000 setgray
fill
grestore
stroke
grestore
1.500 setlinewidth
1 setlinejoin
gsave
69.304062 125.658475 m
69.304062 135.658475 l
stroke
grestore
[5.55 2.4] 0 setdash
gsave
59.304062 130.658475 m
79.304062 130.658475 l
stroke
grestore
1.000 setlinewidth
[] 0 setdash
gsave
/o {
gsave
newpath
translate
1.0 setlinewidth
1 setlinejoin

0 setlinecap

-3 0 m
3 0 l
0 -3 m
0 3 l

gsave
grestore
stroke
grestore
} bind def
69.3041 130.658 o
grestore
/DejaVuSans 10.000 selectfont
gsave

84.304062 127.158475 translate
0.000000 rotate
0.000000 0 m /U glyphshow
7.319336 0 m /n glyphshow
13.657227 0 m /i glyphshow
16.435547 0 m /f glyphshow
19.956055 0 m /o glyphshow
26.074219 0 m /r glyphshow
30.060547 0 m /m glyphshow
grestore
1.500 setlinewidth
1.000 0.000 0.000 setrgbcolor
gsave
154.132187 125.658475 m
154.132187 135.658475 l
stroke
grestore
[1.5 2.475] 0 setdash
gsave
144.132187 130.658475 m
164.132187 130.658475 l
stroke
grestore
1.000 setlinewidth
0 setlinejoin
[] 0 setdash
gsave
/o {
gsave
newpath
translate
1.0 setlinewidth
0 setlinejoin

0 setlinecap

0 3 m
-3 -3 l
3 -3 l
cl

gsave
grestore
stroke
grestore
} bind def
154.132 130.658 o
grestore
0.000 setgray
gsave

169.132187 127.158475 translate
0.000000 rotate
0.000000 0 m /G glyphshow
7.749023 0 m /P glyphshow
13.779297 0 m /S glyphshow
20.126953 0 m /colon glyphshow
23.496094 0 m /space glyphshow
26.674805 0 m /P glyphshow
grestore
1.500 setlinewidth
1 setlinejoin
0.122 0.467 0.706 setrgbcolor
gsave
231.850937 125.658475 m
231.850937 135.658475 l
stroke
grestore
[1.5 2.475] 0 setdash
gsave
221.850937 130.658475 m
241.850937 130.658475 l
stroke
grestore
1.000 setlinewidth
[] 0 setdash
gsave
/o {
gsave
newpath
translate
1.0 setlinewidth
1 setlinejoin

0 setlinecap

0 -3 m
0.795609 -3 1.55874 -2.683901 2.12132 -2.12132 c
2.683901 -1.55874 3 -0.795609 3 0 c
3 0.795609 2.683901 1.55874 2.12132 2.12132 c
1.55874 2.683901 0.795609 3 0 3 c
-0.795609 3 -1.55874 2.683901 -2.12132 2.12132 c
-2.683901 1.55874 -3 0.795609 -3 0 c
-3 -0.795609 -2.683901 -1.55874 -2.12132 -2.12132 c
-1.55874 -2.683901 -0.795609 -3 0 -3 c
cl

gsave
grestore
stroke
grestore
} bind def
231.851 130.658 o
grestore
0.000 setgray
gsave

246.850937 127.158475 translate
0.000000 rotate
0.000000 0 m /G glyphshow
7.749023 0 m /P glyphshow
13.779297 0 m /S glyphshow
20.126953 0 m /colon glyphshow
23.496094 0 m /space glyphshow
26.674805 0 m /S glyphshow
grestore

end
showpage
