%!PS-Adobe-3.0 EPSF-3.0
%%Title: expe_consistency.eps
%%Creator: Matplotlib v3.5.2, https://matplotlib.org/
%%CreationDate: Wed Sep 21 20:02:16 2022
%%Orientation: portrait
%%BoundingBox: 148 323 464 469
%%HiResBoundingBox: 148.149063 323.433750 463.850937 468.566250
%%EndComments
%%BeginProlog
/mpldict 11 dict def
mpldict begin
/_d { bind def } bind def
/m { moveto } _d
/l { lineto } _d
/r { rlineto } _d
/c { curveto } _d
/cl { closepath } _d
/ce { closepath eofill } _d
/box {
      m
      1 index 0 r
      0 exch r
      neg 0 r
      cl
    } _d
/clipbox {
      box
      clip
      newpath
    } _d
/sc { setcachedevice } _d
%!PS-Adobe-3.0 Resource-Font
%%Creator: Converted from TrueType to Type 3 by Matplotlib.
10 dict begin
/FontName /DejaVuSans def
/PaintType 0 def
/FontMatrix [0.00048828125 0 0 0.00048828125 0 0] def
/FontBBox [-2090 -948 3673 2524] def
/FontType 3 def
/Encoding [/space /percent /period /zero /one /two /four /six /eight /equal /P /R /S /U /a /c /d /e /f /i /m /n /o /r /s /t /u] def
/CharStrings 28 dict dup begin
/.notdef 0 def
/space{651 0 0 0 0 0 sc
ce} _d
/percent{1946 0 113 -29 1833 1520 sc
1489 657 m
1431 657 1385 632 1352 583 c
1319 534 1303 465 1303 377 c
1303 290 1319 222 1352 172 c
1385 123 1431 98 1489 98 c
1546 98 1590 123 1623 172 c
1656 222 1673 290 1673 377 c
1673 464 1656 533 1623 582 c
1590 632 1546 657 1489 657 c

1489 784 m
1594 784 1678 747 1740 674 c
1802 601 1833 502 1833 377 c
1833 252 1802 153 1739 80 c
1677 7 1594 -29 1489 -29 c
1382 -29 1298 7 1236 80 c
1174 153 1143 252 1143 377 c
1143 502 1174 601 1236 674 c
1299 747 1383 784 1489 784 c

457 1393 m
400 1393 354 1368 321 1318 c
288 1269 272 1201 272 1114 c
272 1026 288 957 321 908 c
354 859 399 834 457 834 c
515 834 560 859 593 908 c
626 957 643 1026 643 1114 c
643 1200 626 1268 593 1318 c
560 1368 514 1393 457 1393 c

1360 1520 m
1520 1520 l
586 -29 l
426 -29 l
1360 1520 l

457 1520 m
562 1520 646 1483 709 1410 c
772 1337 803 1239 803 1114 c
803 988 772 889 709 816 c
647 743 563 707 457 707 c
351 707 267 743 205 816 c
144 889 113 989 113 1114 c
113 1238 144 1337 206 1410 c
268 1483 352 1520 457 1520 c

ce} _d
/period{651 0 219 0 430 254 sc
219 254 m
430 254 l
430 0 l
219 0 l
219 254 l

ce} _d
/zero{1303 0 135 -29 1167 1520 sc
651 1360 m
547 1360 469 1309 416 1206 c
364 1104 338 950 338 745 c
338 540 364 387 416 284 c
469 182 547 131 651 131 c
756 131 834 182 886 284 c
939 387 965 540 965 745 c
965 950 939 1104 886 1206 c
834 1309 756 1360 651 1360 c

651 1520 m
818 1520 946 1454 1034 1321 c
1123 1189 1167 997 1167 745 c
1167 494 1123 302 1034 169 c
946 37 818 -29 651 -29 c
484 -29 356 37 267 169 c
179 302 135 494 135 745 c
135 997 179 1189 267 1321 c
356 1454 484 1520 651 1520 c

ce} _d
/one{1303 0 225 0 1114 1493 sc
254 170 m
584 170 l
584 1309 l
225 1237 l
225 1421 l
582 1493 l
784 1493 l
784 170 l
1114 170 l
1114 0 l
254 0 l
254 170 l

ce} _d
/two{1303 0 150 0 1098 1520 sc
393 170 m
1098 170 l
1098 0 l
150 0 l
150 170 l
227 249 331 356 463 489 c
596 623 679 709 713 748 c
778 821 823 882 848 932 c
874 983 887 1032 887 1081 c
887 1160 859 1225 803 1275 c
748 1325 675 1350 586 1350 c
523 1350 456 1339 385 1317 c
315 1295 240 1262 160 1217 c
160 1421 l
241 1454 317 1478 388 1495 c
459 1512 523 1520 582 1520 c
737 1520 860 1481 952 1404 c
1044 1327 1090 1223 1090 1094 c
1090 1033 1078 974 1055 919 c
1032 864 991 800 930 725 c
913 706 860 650 771 557 c
682 465 556 336 393 170 c

ce} _d
/four{1303 0 100 0 1188 1493 sc
774 1317 m
264 520 l
774 520 l
774 1317 l

721 1493 m
975 1493 l
975 520 l
1188 520 l
1188 352 l
975 352 l
975 0 l
774 0 l
774 352 l
100 352 l
100 547 l
721 1493 l

ce} _d
/six{1303 0 143 -29 1174 1520 sc
676 827 m
585 827 513 796 460 734 c
407 672 381 587 381 479 c
381 372 407 287 460 224 c
513 162 585 131 676 131 c
767 131 838 162 891 224 c
944 287 971 372 971 479 c
971 587 944 672 891 734 c
838 796 767 827 676 827 c

1077 1460 m
1077 1276 l
1026 1300 975 1318 923 1331 c
872 1344 821 1350 770 1350 c
637 1350 535 1305 464 1215 c
394 1125 354 989 344 807 c
383 865 433 909 492 940 c
551 971 617 987 688 987 c
838 987 956 941 1043 850 c
1130 759 1174 636 1174 479 c
1174 326 1129 203 1038 110 c
947 17 827 -29 676 -29 c
503 -29 371 37 280 169 c
189 302 143 494 143 745 c
143 981 199 1169 311 1309 c
423 1450 573 1520 762 1520 c
813 1520 864 1515 915 1505 c
967 1495 1021 1480 1077 1460 c

ce} _d
/eight{1303 0 139 -29 1163 1520 sc
651 709 m
555 709 479 683 424 632 c
369 581 342 510 342 420 c
342 330 369 259 424 208 c
479 157 555 131 651 131 c
747 131 823 157 878 208 c
933 260 961 331 961 420 c
961 510 933 581 878 632 c
823 683 748 709 651 709 c

449 795 m
362 816 295 857 246 916 c
198 975 174 1048 174 1133 c
174 1252 216 1347 301 1416 c
386 1485 503 1520 651 1520 c
800 1520 916 1485 1001 1416 c
1086 1347 1128 1252 1128 1133 c
1128 1048 1104 975 1055 916 c
1007 857 940 816 854 795 c
951 772 1027 728 1081 662 c
1136 596 1163 515 1163 420 c
1163 275 1119 164 1030 87 c
942 10 816 -29 651 -29 c
486 -29 360 10 271 87 c
183 164 139 275 139 420 c
139 515 166 596 221 662 c
276 728 352 772 449 795 c

375 1114 m
375 1037 399 976 447 933 c
496 890 564 868 651 868 c
738 868 805 890 854 933 c
903 976 928 1037 928 1114 c
928 1191 903 1252 854 1295 c
805 1338 738 1360 651 1360 c
564 1360 496 1338 447 1295 c
399 1252 375 1191 375 1114 c

ce} _d
/equal{1716 0 217 352 1499 930 sc
217 930 m
1499 930 l
1499 762 l
217 762 l
217 930 l

217 522 m
1499 522 l
1499 352 l
217 352 l
217 522 l

ce} _d
/P{1235 0 201 0 1165 1493 sc
403 1327 m
403 766 l
657 766 l
751 766 824 790 875 839 c
926 888 952 957 952 1047 c
952 1136 926 1205 875 1254 c
824 1303 751 1327 657 1327 c
403 1327 l

201 1493 m
657 1493 l
824 1493 951 1455 1036 1379 c
1122 1304 1165 1193 1165 1047 c
1165 900 1122 788 1036 713 c
951 638 824 600 657 600 c
403 600 l
403 0 l
201 0 l
201 1493 l

ce} _d
/R{1423 0 201 0 1364 1493 sc
909 700 m
952 685 994 654 1035 606 c
1076 558 1118 492 1159 408 c
1364 0 l
1147 0 l
956 383 l
907 483 859 549 812 582 c
766 615 703 631 623 631 c
403 631 l
403 0 l
201 0 l
201 1493 l
657 1493 l
828 1493 955 1457 1039 1386 c
1123 1315 1165 1207 1165 1063 c
1165 969 1143 891 1099 829 c
1056 767 992 724 909 700 c

403 1327 m
403 797 l
657 797 l
754 797 828 819 877 864 c
927 909 952 976 952 1063 c
952 1150 927 1216 877 1260 c
828 1305 754 1327 657 1327 c
403 1327 l

ce} _d
/S{1300 0 135 -29 1186 1520 sc
1096 1444 m
1096 1247 l
1019 1284 947 1311 879 1329 c
811 1347 745 1356 682 1356 c
572 1356 487 1335 427 1292 c
368 1249 338 1189 338 1110 c
338 1044 358 994 397 960 c
437 927 512 900 623 879 c
745 854 l
896 825 1007 775 1078 702 c
1150 630 1186 533 1186 412 c
1186 267 1137 158 1040 83 c
943 8 801 -29 614 -29 c
543 -29 468 -21 388 -5 c
309 11 226 35 141 66 c
141 274 l
223 228 303 193 382 170 c
461 147 538 135 614 135 c
729 135 818 158 881 203 c
944 248 975 313 975 397 c
975 470 952 528 907 569 c
862 610 789 641 686 662 c
563 686 l
412 716 303 763 236 827 c
169 891 135 980 135 1094 c
135 1226 181 1330 274 1406 c
367 1482 496 1520 659 1520 c
729 1520 800 1514 873 1501 c
946 1488 1020 1469 1096 1444 c

ce} _d
/U{1499 0 178 -29 1321 1493 sc
178 1493 m
381 1493 l
381 586 l
381 426 410 311 468 240 c
526 170 620 135 750 135 c
879 135 973 170 1031 240 c
1089 311 1118 426 1118 586 c
1118 1493 l
1321 1493 l
1321 561 l
1321 366 1273 219 1176 120 c
1080 21 938 -29 750 -29 c
561 -29 419 21 322 120 c
226 219 178 366 178 561 c
178 1493 l

ce} _d
/a{1255 0 123 -29 1069 1147 sc
702 563 m
553 563 450 546 393 512 c
336 478 307 420 307 338 c
307 273 328 221 371 182 c
414 144 473 125 547 125 c
649 125 731 161 792 233 c
854 306 885 402 885 522 c
885 563 l
702 563 l

1069 639 m
1069 0 l
885 0 l
885 170 l
843 102 791 52 728 19 c
665 -13 589 -29 498 -29 c
383 -29 292 3 224 67 c
157 132 123 218 123 326 c
123 452 165 547 249 611 c
334 675 460 707 627 707 c
885 707 l
885 725 l
885 810 857 875 801 921 c
746 968 668 991 567 991 c
503 991 441 983 380 968 c
319 953 261 930 205 899 c
205 1069 l
272 1095 338 1114 401 1127 c
464 1140 526 1147 586 1147 c
748 1147 869 1105 949 1021 c
1029 937 1069 810 1069 639 c

ce} _d
/c{1126 0 113 -29 999 1147 sc
999 1077 m
999 905 l
947 934 895 955 842 969 c
790 984 737 991 684 991 c
565 991 472 953 406 877 c
340 802 307 696 307 559 c
307 422 340 316 406 240 c
472 165 565 127 684 127 c
737 127 790 134 842 148 c
895 163 947 184 999 213 c
999 43 l
948 19 894 1 839 -11 c
784 -23 726 -29 664 -29 c
495 -29 361 24 262 130 c
163 236 113 379 113 559 c
113 742 163 885 263 990 c
364 1095 501 1147 676 1147 c
733 1147 788 1141 842 1129 c
896 1118 948 1100 999 1077 c

ce} _d
/d{1300 0 113 -29 1114 1556 sc
930 950 m
930 1556 l
1114 1556 l
1114 0 l
930 0 l
930 168 l
891 101 842 52 783 19 c
724 -13 654 -29 571 -29 c
436 -29 325 25 240 133 c
155 241 113 383 113 559 c
113 735 155 877 240 985 c
325 1093 436 1147 571 1147 c
654 1147 724 1131 783 1098 c
842 1066 891 1017 930 950 c

303 559 m
303 424 331 317 386 240 c
442 163 519 125 616 125 c
713 125 790 163 846 240 c
902 317 930 424 930 559 c
930 694 902 800 846 877 c
790 954 713 993 616 993 c
519 993 442 954 386 877 c
331 800 303 694 303 559 c

ce} _d
/e{1260 0 113 -29 1151 1147 sc
1151 606 m
1151 516 l
305 516 l
313 389 351 293 419 226 c
488 160 583 127 705 127 c
776 127 844 136 910 153 c
977 170 1043 196 1108 231 c
1108 57 l
1042 29 974 8 905 -7 c
836 -22 765 -29 694 -29 c
515 -29 374 23 269 127 c
165 231 113 372 113 549 c
113 732 162 878 261 985 c
360 1093 494 1147 662 1147 c
813 1147 932 1098 1019 1001 c
1107 904 1151 773 1151 606 c

967 660 m
966 761 937 841 882 901 c
827 961 755 991 664 991 c
561 991 479 962 417 904 c
356 846 320 764 311 659 c
967 660 l

ce} _d
/f{721 0 47 0 760 1556 sc
760 1556 m
760 1403 l
584 1403 l
518 1403 472 1390 446 1363 c
421 1336 408 1288 408 1219 c
408 1120 l
711 1120 l
711 977 l
408 977 l
408 0 l
223 0 l
223 977 l
47 977 l
47 1120 l
223 1120 l
223 1198 l
223 1323 252 1413 310 1470 c
368 1527 460 1556 586 1556 c
760 1556 l

ce} _d
/i{569 0 193 0 377 1556 sc
193 1120 m
377 1120 l
377 0 l
193 0 l
193 1120 l

193 1556 m
377 1556 l
377 1323 l
193 1323 l
193 1556 l

ce} _d
/m{1995 0 186 0 1821 1147 sc
1065 905 m
1111 988 1166 1049 1230 1088 c
1294 1127 1369 1147 1456 1147 c
1573 1147 1663 1106 1726 1024 c
1789 943 1821 827 1821 676 c
1821 0 l
1636 0 l
1636 670 l
1636 777 1617 857 1579 909 c
1541 961 1483 987 1405 987 c
1310 987 1234 955 1179 892 c
1124 829 1096 742 1096 633 c
1096 0 l
911 0 l
911 670 l
911 778 892 858 854 909 c
816 961 757 987 678 987 c
584 987 509 955 454 891 c
399 828 371 742 371 633 c
371 0 l
186 0 l
186 1120 l
371 1120 l
371 946 l
413 1015 463 1065 522 1098 c
581 1131 650 1147 731 1147 c
812 1147 881 1126 938 1085 c
995 1044 1038 984 1065 905 c

ce} _d
/n{1298 0 186 0 1124 1147 sc
1124 676 m
1124 0 l
940 0 l
940 670 l
940 776 919 855 878 908 c
837 961 775 987 692 987 c
593 987 514 955 457 892 c
400 829 371 742 371 633 c
371 0 l
186 0 l
186 1120 l
371 1120 l
371 946 l
415 1013 467 1064 526 1097 c
586 1130 655 1147 733 1147 c
862 1147 959 1107 1025 1027 c
1091 948 1124 831 1124 676 c

ce} _d
/o{1253 0 113 -29 1141 1147 sc
627 991 m
528 991 450 952 393 875 c
336 798 307 693 307 559 c
307 425 335 319 392 242 c
449 165 528 127 627 127 c
725 127 803 166 860 243 c
917 320 946 426 946 559 c
946 692 917 797 860 874 c
803 952 725 991 627 991 c

627 1147 m
787 1147 913 1095 1004 991 c
1095 887 1141 743 1141 559 c
1141 376 1095 232 1004 127 c
913 23 787 -29 627 -29 c
466 -29 340 23 249 127 c
158 232 113 376 113 559 c
113 743 158 887 249 991 c
340 1095 466 1147 627 1147 c

ce} _d
/r{842 0 186 0 842 1147 sc
842 948 m
821 960 799 969 774 974 c
750 980 723 983 694 983 c
590 983 510 949 454 881 c
399 814 371 717 371 590 c
371 0 l
186 0 l
186 1120 l
371 1120 l
371 946 l
410 1014 460 1064 522 1097 c
584 1130 659 1147 748 1147 c
761 1147 775 1146 790 1144 c
805 1143 822 1140 841 1137 c
842 948 l

ce} _d
/s{1067 0 111 -29 967 1147 sc
907 1087 m
907 913 l
855 940 801 960 745 973 c
689 986 631 993 571 993 c
480 993 411 979 365 951 c
320 923 297 881 297 825 c
297 782 313 749 346 724 c
379 700 444 677 543 655 c
606 641 l
737 613 829 573 884 522 c
939 471 967 400 967 309 c
967 205 926 123 843 62 c
761 1 648 -29 504 -29 c
444 -29 381 -23 316 -11 c
251 0 183 18 111 41 c
111 231 l
179 196 246 169 312 151 c
378 134 443 125 508 125 c
595 125 661 140 708 169 c
755 199 778 241 778 295 c
778 345 761 383 727 410 c
694 437 620 462 506 487 c
442 502 l
328 526 246 563 195 612 c
144 662 119 730 119 817 c
119 922 156 1004 231 1061 c
306 1118 412 1147 549 1147 c
617 1147 681 1142 741 1132 c
801 1122 856 1107 907 1087 c

ce} _d
/t{803 0 55 0 754 1438 sc
375 1438 m
375 1120 l
754 1120 l
754 977 l
375 977 l
375 369 l
375 278 387 219 412 193 c
437 167 488 154 565 154 c
754 154 l
754 0 l
565 0 l
423 0 325 26 271 79 c
217 132 190 229 190 369 c
190 977 l
55 977 l
55 1120 l
190 1120 l
190 1438 l
375 1438 l

ce} _d
/u{1298 0 174 -29 1112 1147 sc
174 442 m
174 1120 l
358 1120 l
358 449 l
358 343 379 263 420 210 c
461 157 523 131 606 131 c
705 131 784 163 841 226 c
899 289 928 376 928 485 c
928 1120 l
1112 1120 l
1112 0 l
928 0 l
928 172 l
883 104 831 53 772 20 c
713 -13 645 -29 567 -29 c
438 -29 341 11 274 91 c
207 171 174 288 174 442 c

637 1147 m
637 1147 l

ce} _d
end readonly def

/BuildGlyph {
 exch begin
 CharStrings exch
 2 copy known not {pop /.notdef} if
 true 3 1 roll get exec
 end
} _d

/BuildChar {
 1 index /Encoding get exch get
 1 index /BuildGlyph get exec
} _d

FontName currentdict end definefont pop
end
%%EndProlog
mpldict begin
148.149 323.434 translate
315.702 145.132 0 0 clipbox
gsave
0 0 m
315.701875 0 l
315.701875 145.1325 l
0 145.1325 l
cl
1.000 setgray
fill
grestore
gsave
41.4075 30.110625 m
163.152955 30.110625 l
163.152955 140.990625 l
41.4075 140.990625 l
cl
1.000 setgray
fill
grestore
0.800 setlinewidth
1 setlinejoin
0 setlinecap
[2.96 1.28] 0 setdash
0.690 setgray
gsave
121.745 110.88 41.408 30.111 clipbox
41.4075 30.110625 m
41.4075 140.990625 l
stroke
grestore
[] 0 setdash
0.000 setgray
gsave
/o {
gsave
newpath
translate
0.8 setlinewidth
1 setlinejoin

0 setlinecap

0 0 m
0 -3.5 l

gsave
0.000 setgray
fill
grestore
stroke
grestore
} bind def
41.4075 30.1106 o
grestore
/DejaVuSans 9.000 selectfont
gsave

38.540313 16.266875 translate
0.000000 rotate
0.000000 0 m /two glyphshow
grestore
[2.96 1.28] 0 setdash
0.690 setgray
gsave
121.745 110.88 41.408 30.111 clipbox
56.625682 30.110625 m
56.625682 140.990625 l
stroke
grestore
[] 0 setdash
0.000 setgray
gsave
/o {
gsave
newpath
translate
0.8 setlinewidth
1 setlinejoin

0 setlinecap

0 0 m
0 -3.5 l

gsave
0.000 setgray
fill
grestore
stroke
grestore
} bind def
56.6257 30.1106 o
grestore
gsave

53.758494 16.266875 translate
0.000000 rotate
0.000000 0 m /four glyphshow
grestore
[2.96 1.28] 0 setdash
0.690 setgray
gsave
121.745 110.88 41.408 30.111 clipbox
71.843864 30.110625 m
71.843864 140.990625 l
stroke
grestore
[] 0 setdash
0.000 setgray
gsave
/o {
gsave
newpath
translate
0.8 setlinewidth
1 setlinejoin

0 setlinecap

0 0 m
0 -3.5 l

gsave
0.000 setgray
fill
grestore
stroke
grestore
} bind def
71.8439 30.1106 o
grestore
gsave

68.976676 16.266875 translate
0.000000 rotate
0.000000 0 m /six glyphshow
grestore
[2.96 1.28] 0 setdash
0.690 setgray
gsave
121.745 110.88 41.408 30.111 clipbox
87.062045 30.110625 m
87.062045 140.990625 l
stroke
grestore
[] 0 setdash
0.000 setgray
gsave
/o {
gsave
newpath
translate
0.8 setlinewidth
1 setlinejoin

0 setlinecap

0 0 m
0 -3.5 l

gsave
0.000 setgray
fill
grestore
stroke
grestore
} bind def
87.062 30.1106 o
grestore
gsave

84.194858 16.266875 translate
0.000000 rotate
0.000000 0 m /eight glyphshow
grestore
[2.96 1.28] 0 setdash
0.690 setgray
gsave
121.745 110.88 41.408 30.111 clipbox
102.280227 30.110625 m
102.280227 140.990625 l
stroke
grestore
[] 0 setdash
0.000 setgray
gsave
/o {
gsave
newpath
translate
0.8 setlinewidth
1 setlinejoin

0 setlinecap

0 0 m
0 -3.5 l

gsave
0.000 setgray
fill
grestore
stroke
grestore
} bind def
102.28 30.1106 o
grestore
gsave

96.545852 16.266875 translate
0.000000 rotate
0.000000 0 m /one glyphshow
5.726074 0 m /zero glyphshow
grestore
[2.96 1.28] 0 setdash
0.690 setgray
gsave
121.745 110.88 41.408 30.111 clipbox
117.498409 30.110625 m
117.498409 140.990625 l
stroke
grestore
[] 0 setdash
0.000 setgray
gsave
/o {
gsave
newpath
translate
0.8 setlinewidth
1 setlinejoin

0 setlinecap

0 0 m
0 -3.5 l

gsave
0.000 setgray
fill
grestore
stroke
grestore
} bind def
117.498 30.1106 o
grestore
gsave

111.764034 16.266875 translate
0.000000 rotate
0.000000 0 m /one glyphshow
5.726074 0 m /two glyphshow
grestore
[2.96 1.28] 0 setdash
0.690 setgray
gsave
121.745 110.88 41.408 30.111 clipbox
132.716591 30.110625 m
132.716591 140.990625 l
stroke
grestore
[] 0 setdash
0.000 setgray
gsave
/o {
gsave
newpath
translate
0.8 setlinewidth
1 setlinejoin

0 setlinecap

0 0 m
0 -3.5 l

gsave
0.000 setgray
fill
grestore
stroke
grestore
} bind def
132.717 30.1106 o
grestore
gsave

126.982216 16.266875 translate
0.000000 rotate
0.000000 0 m /one glyphshow
5.726074 0 m /four glyphshow
grestore
[2.96 1.28] 0 setdash
0.690 setgray
gsave
121.745 110.88 41.408 30.111 clipbox
147.934773 30.110625 m
147.934773 140.990625 l
stroke
grestore
[] 0 setdash
0.000 setgray
gsave
/o {
gsave
newpath
translate
0.8 setlinewidth
1 setlinejoin

0 setlinecap

0 0 m
0 -3.5 l

gsave
0.000 setgray
fill
grestore
stroke
grestore
} bind def
147.935 30.1106 o
grestore
gsave

142.200398 16.266875 translate
0.000000 rotate
0.000000 0 m /one glyphshow
5.726074 0 m /six glyphshow
grestore
[2.96 1.28] 0 setdash
0.690 setgray
gsave
121.745 110.88 41.408 30.111 clipbox
163.152955 30.110625 m
163.152955 140.990625 l
stroke
grestore
[] 0 setdash
0.000 setgray
gsave
/o {
gsave
newpath
translate
0.8 setlinewidth
1 setlinejoin

0 setlinecap

0 0 m
0 -3.5 l

gsave
0.000 setgray
fill
grestore
stroke
grestore
} bind def
163.153 30.1106 o
grestore
gsave

157.418580 16.266875 translate
0.000000 rotate
0.000000 0 m /one glyphshow
5.726074 0 m /eight glyphshow
grestore
/DejaVuSans 10.000 selectfont
gsave

83.866165 2.798125 translate
0.000000 rotate
0.000000 0 m /R glyphshow
6.448242 0 m /o glyphshow
12.566406 0 m /u glyphshow
18.904297 0 m /n glyphshow
25.242188 0 m /d glyphshow
31.589844 0 m /s glyphshow
grestore
[2.96 1.28] 0 setdash
0.690 setgray
gsave
121.745 110.88 41.408 30.111 clipbox
41.4075 33.652774 m
163.152955 33.652774 l
stroke
grestore
[] 0 setdash
0.000 setgray
gsave
/o {
gsave
newpath
translate
0.8 setlinewidth
1 setlinejoin

0 setlinecap

-0 0 m
-3.5 0 l

gsave
0.000 setgray
fill
grestore
stroke
grestore
} bind def
41.4075 33.6528 o
grestore
/DejaVuSans 9.000 selectfont
gsave

20.126250 30.230899 translate
0.000000 rotate
0.000000 0 m /zero glyphshow
5.726074 0 m /percent glyphshow
grestore
[2.96 1.28] 0 setdash
0.690 setgray
gsave
121.745 110.88 41.408 30.111 clipbox
41.4075 55.120344 m
163.152955 55.120344 l
stroke
grestore
[] 0 setdash
0.000 setgray
gsave
/o {
gsave
newpath
translate
0.8 setlinewidth
1 setlinejoin

0 setlinecap

-0 0 m
-3.5 0 l

gsave
0.000 setgray
fill
grestore
stroke
grestore
} bind def
41.4075 55.1203 o
grestore
gsave

20.126250 51.698469 translate
0.000000 rotate
0.000000 0 m /two glyphshow
5.726074 0 m /percent glyphshow
grestore
[2.96 1.28] 0 setdash
0.690 setgray
gsave
121.745 110.88 41.408 30.111 clipbox
41.4075 76.587914 m
163.152955 76.587914 l
stroke
grestore
[] 0 setdash
0.000 setgray
gsave
/o {
gsave
newpath
translate
0.8 setlinewidth
1 setlinejoin

0 setlinecap

-0 0 m
-3.5 0 l

gsave
0.000 setgray
fill
grestore
stroke
grestore
} bind def
41.4075 76.5879 o
grestore
gsave

20.126250 73.166039 translate
0.000000 rotate
0.000000 0 m /four glyphshow
5.726074 0 m /percent glyphshow
grestore
[2.96 1.28] 0 setdash
0.690 setgray
gsave
121.745 110.88 41.408 30.111 clipbox
41.4075 98.055485 m
163.152955 98.055485 l
stroke
grestore
[] 0 setdash
0.000 setgray
gsave
/o {
gsave
newpath
translate
0.8 setlinewidth
1 setlinejoin

0 setlinecap

-0 0 m
-3.5 0 l

gsave
0.000 setgray
fill
grestore
stroke
grestore
} bind def
41.4075 98.0555 o
grestore
gsave

20.126250 94.633610 translate
0.000000 rotate
0.000000 0 m /six glyphshow
5.726074 0 m /percent glyphshow
grestore
[2.96 1.28] 0 setdash
0.690 setgray
gsave
121.745 110.88 41.408 30.111 clipbox
41.4075 119.523055 m
163.152955 119.523055 l
stroke
grestore
[] 0 setdash
0.000 setgray
gsave
/o {
gsave
newpath
translate
0.8 setlinewidth
1 setlinejoin

0 setlinecap

-0 0 m
-3.5 0 l

gsave
0.000 setgray
fill
grestore
stroke
grestore
} bind def
41.4075 119.523 o
grestore
gsave

20.126250 116.101180 translate
0.000000 rotate
0.000000 0 m /eight glyphshow
5.726074 0 m /percent glyphshow
grestore
[2.96 1.28] 0 setdash
0.690 setgray
gsave
121.745 110.88 41.408 30.111 clipbox
41.4075 140.990625 m
163.152955 140.990625 l
stroke
grestore
[] 0 setdash
0.000 setgray
gsave
/o {
gsave
newpath
translate
0.8 setlinewidth
1 setlinejoin

0 setlinecap

-0 0 m
-3.5 0 l

gsave
0.000 setgray
fill
grestore
stroke
grestore
} bind def
41.4075 140.991 o
grestore
gsave

14.391875 137.568750 translate
0.000000 rotate
0.000000 0 m /one glyphshow
5.726074 0 m /zero glyphshow
11.452148 0 m /percent glyphshow
grestore
/DejaVuSans 10.000 selectfont
gsave

8.313750 5.287500 translate
90.000000 rotate
0.000000 0 m /R glyphshow
6.698242 0 m /a glyphshow
12.826172 0 m /t glyphshow
16.747070 0 m /i glyphshow
19.525391 0 m /o glyphshow
25.643555 0 m /space glyphshow
28.822266 0 m /o glyphshow
34.940430 0 m /f glyphshow
38.460938 0 m /space glyphshow
41.639648 0 m /i glyphshow
44.417969 0 m /n glyphshow
50.755859 0 m /c glyphshow
56.253906 0 m /o glyphshow
62.372070 0 m /n glyphshow
68.709961 0 m /s glyphshow
73.919922 0 m /i glyphshow
76.698242 0 m /s glyphshow
81.908203 0 m /t glyphshow
85.829102 0 m /e glyphshow
91.981445 0 m /n glyphshow
98.319336 0 m /t glyphshow
102.240234 0 m /space glyphshow
105.418945 0 m /n glyphshow
111.756836 0 m /o glyphshow
117.875000 0 m /d glyphshow
124.222656 0 m /e glyphshow
130.375000 0 m /s glyphshow
grestore
1.500 setlinewidth
gsave
121.745 110.88 41.408 30.111 clipbox
26.189318 33.652774 m
26.189318 33.652774 l
stroke
grestore
gsave
121.745 110.88 41.408 30.111 clipbox
33.798409 33.652774 m
33.798409 33.652774 l
stroke
grestore
gsave
121.745 110.88 41.408 30.111 clipbox
41.4075 33.652774 m
41.4075 33.652774 l
stroke
grestore
gsave
121.745 110.88 41.408 30.111 clipbox
49.016591 33.652774 m
49.016591 33.652774 l
stroke
grestore
gsave
121.745 110.88 41.408 30.111 clipbox
56.625682 33.652774 m
56.625682 33.657068 l
stroke
grestore
gsave
121.745 110.88 41.408 30.111 clipbox
64.234773 33.770846 m
64.234773 33.813781 l
stroke
grestore
gsave
121.745 110.88 41.408 30.111 clipbox
71.843864 41.109535 m
71.843864 41.313477 l
stroke
grestore
gsave
121.745 110.88 41.408 30.111 clipbox
79.452955 81.424558 m
79.452955 82.362691 l
stroke
grestore
gsave
121.745 110.88 41.408 30.111 clipbox
87.062045 82.673971 m
87.062045 83.425336 l
stroke
grestore
gsave
121.745 110.88 41.408 30.111 clipbox
94.671136 82.393819 m
94.671136 83.348052 l
stroke
grestore
gsave
121.745 110.88 41.408 30.111 clipbox
102.280227 82.457148 m
102.280227 83.640011 l
stroke
grestore
gsave
121.745 110.88 41.408 30.111 clipbox
109.889318 82.418507 m
109.889318 83.432849 l
stroke
grestore
gsave
121.745 110.88 41.408 30.111 clipbox
117.498409 82.334783 m
117.498409 83.643231 l
stroke
grestore
gsave
121.745 110.88 41.408 30.111 clipbox
125.1075 82.357324 m
125.1075 83.355566 l
stroke
grestore
gsave
121.745 110.88 41.408 30.111 clipbox
132.716591 81.314 m
132.716591 82.303655 l
stroke
grestore
gsave
121.745 110.88 41.408 30.111 clipbox
140.325682 73.630757 m
140.325682 74.290884 l
stroke
grestore
gsave
121.745 110.88 41.408 30.111 clipbox
147.934773 34.602714 m
147.934773 34.703612 l
stroke
grestore
gsave
121.745 110.88 41.408 30.111 clipbox
155.543864 33.652774 m
155.543864 33.654921 l
stroke
grestore
gsave
121.745 110.88 41.408 30.111 clipbox
163.152955 33.652774 m
163.152955 33.654921 l
stroke
grestore
gsave
121.745 110.88 41.408 30.111 clipbox
170.762045 33.652774 m
170.762045 33.654921 l
stroke
grestore
gsave
121.745 110.88 41.408 30.111 clipbox
178.371136 33.652774 m
178.371136 33.654921 l
stroke
grestore
gsave
121.745 110.88 41.408 30.111 clipbox
185.980227 33.652774 m
185.980227 33.654921 l
stroke
grestore
gsave
121.745 110.88 41.408 30.111 clipbox
193.589318 33.652774 m
193.589318 33.654921 l
stroke
grestore
gsave
121.745 110.88 41.408 30.111 clipbox
201.198409 33.652774 m
201.198409 33.654921 l
stroke
grestore
gsave
121.745 110.88 41.408 30.111 clipbox
208.8075 33.652774 m
208.8075 33.654921 l
stroke
grestore
gsave
121.745 110.88 41.408 30.111 clipbox
216.416591 33.652774 m
216.416591 33.654921 l
stroke
grestore
0.173 0.627 0.173 setrgbcolor
gsave
121.745 110.88 41.408 30.111 clipbox
26.189318 33.652774 m
26.189318 33.652774 l
stroke
grestore
gsave
121.745 110.88 41.408 30.111 clipbox
33.798409 33.652774 m
33.798409 33.652774 l
stroke
grestore
gsave
121.745 110.88 41.408 30.111 clipbox
41.4075 33.652774 m
41.4075 33.652774 l
stroke
grestore
gsave
121.745 110.88 41.408 30.111 clipbox
49.016591 34.726153 m
49.016591 44.386559 l
stroke
grestore
gsave
121.745 110.88 41.408 30.111 clipbox
56.625682 66.927508 m
56.625682 86.248321 l
stroke
grestore
gsave
121.745 110.88 41.408 30.111 clipbox
64.234773 68.000886 m
64.234773 104.495756 l
stroke
grestore
gsave
121.745 110.88 41.408 30.111 clipbox
71.843864 73.367779 m
71.843864 98.055485 l
stroke
grestore
gsave
121.745 110.88 41.408 30.111 clipbox
79.452955 69.074265 m
79.452955 91.615214 l
stroke
grestore
gsave
121.745 110.88 41.408 30.111 clipbox
87.062045 69.074265 m
87.062045 89.468457 l
stroke
grestore
gsave
121.745 110.88 41.408 30.111 clipbox
94.671136 69.074265 m
94.671136 94.835349 l
stroke
grestore
gsave
121.745 110.88 41.408 30.111 clipbox
102.280227 70.147643 m
102.280227 93.761971 l
stroke
grestore
gsave
121.745 110.88 41.408 30.111 clipbox
109.889318 74.441157 m
109.889318 88.395078 l
stroke
grestore
gsave
121.745 110.88 41.408 30.111 clipbox
117.498409 60.487237 m
117.498409 84.101564 l
stroke
grestore
gsave
121.745 110.88 41.408 30.111 clipbox
125.1075 33.652774 m
125.1075 36.87291 l
stroke
grestore
gsave
121.745 110.88 41.408 30.111 clipbox
132.716591 33.652774 m
132.716591 34.726153 l
stroke
grestore
gsave
121.745 110.88 41.408 30.111 clipbox
140.325682 33.652774 m
140.325682 33.652774 l
stroke
grestore
gsave
121.745 110.88 41.408 30.111 clipbox
147.934773 33.652774 m
147.934773 33.652774 l
stroke
grestore
gsave
121.745 110.88 41.408 30.111 clipbox
155.543864 33.652774 m
155.543864 33.652774 l
stroke
grestore
gsave
121.745 110.88 41.408 30.111 clipbox
163.152955 33.652774 m
163.152955 33.652774 l
stroke
grestore
gsave
121.745 110.88 41.408 30.111 clipbox
170.762045 33.652774 m
170.762045 33.652774 l
stroke
grestore
gsave
121.745 110.88 41.408 30.111 clipbox
178.371136 33.652774 m
178.371136 33.652774 l
stroke
grestore
gsave
121.745 110.88 41.408 30.111 clipbox
185.980227 33.652774 m
185.980227 33.652774 l
stroke
grestore
gsave
121.745 110.88 41.408 30.111 clipbox
193.589318 33.652774 m
193.589318 33.652774 l
stroke
grestore
gsave
121.745 110.88 41.408 30.111 clipbox
201.198409 33.652774 m
201.198409 33.652774 l
stroke
grestore
gsave
121.745 110.88 41.408 30.111 clipbox
208.8075 33.652774 m
208.8075 33.652774 l
stroke
grestore
gsave
121.745 110.88 41.408 30.111 clipbox
216.416591 33.652774 m
216.416591 33.652774 l
stroke
grestore
0.122 0.467 0.706 setrgbcolor
gsave
121.745 110.88 41.408 30.111 clipbox
26.189318 33.652774 m
26.189318 33.652774 l
stroke
grestore
gsave
121.745 110.88 41.408 30.111 clipbox
33.798409 33.652774 m
33.798409 33.652774 l
stroke
grestore
gsave
121.745 110.88 41.408 30.111 clipbox
41.4075 33.652774 m
41.4075 33.652774 l
stroke
grestore
gsave
121.745 110.88 41.408 30.111 clipbox
49.016591 33.652774 m
49.016591 33.974788 l
stroke
grestore
gsave
121.745 110.88 41.408 30.111 clipbox
56.625682 39.34168 m
56.625682 41.595775 l
stroke
grestore
gsave
121.745 110.88 41.408 30.111 clipbox
64.234773 78.627334 m
64.234773 84.101564 l
stroke
grestore
gsave
121.745 110.88 41.408 30.111 clipbox
71.843864 79.164023 m
71.843864 86.677672 l
stroke
grestore
gsave
121.745 110.88 41.408 30.111 clipbox
79.452955 78.519996 m
79.452955 88.395078 l
stroke
grestore
gsave
121.745 110.88 41.408 30.111 clipbox
87.062045 79.915388 m
87.062045 85.81897 l
stroke
grestore
gsave
121.745 110.88 41.408 30.111 clipbox
94.671136 80.344739 m
94.671136 85.81897 l
stroke
grestore
gsave
121.745 110.88 41.408 30.111 clipbox
102.280227 79.700712 m
102.280227 86.677672 l
stroke
grestore
gsave
121.745 110.88 41.408 30.111 clipbox
109.889318 78.519996 m
109.889318 84.852929 l
stroke
grestore
gsave
121.745 110.88 41.408 30.111 clipbox
117.498409 78.090644 m
117.498409 85.81897 l
stroke
grestore
gsave
121.745 110.88 41.408 30.111 clipbox
125.1075 71.006346 m
125.1075 75.943887 l
stroke
grestore
gsave
121.745 110.88 41.408 30.111 clipbox
132.716591 34.082125 m
132.716591 35.692193 l
stroke
grestore
gsave
121.745 110.88 41.408 30.111 clipbox
140.325682 33.652774 m
140.325682 33.652774 l
stroke
grestore
gsave
121.745 110.88 41.408 30.111 clipbox
147.934773 33.652774 m
147.934773 33.652774 l
stroke
grestore
gsave
121.745 110.88 41.408 30.111 clipbox
155.543864 33.652774 m
155.543864 33.652774 l
stroke
grestore
gsave
121.745 110.88 41.408 30.111 clipbox
163.152955 33.652774 m
163.152955 33.652774 l
stroke
grestore
gsave
121.745 110.88 41.408 30.111 clipbox
170.762045 33.652774 m
170.762045 33.652774 l
stroke
grestore
gsave
121.745 110.88 41.408 30.111 clipbox
178.371136 33.652774 m
178.371136 33.652774 l
stroke
grestore
gsave
121.745 110.88 41.408 30.111 clipbox
185.980227 33.652774 m
185.980227 33.652774 l
stroke
grestore
gsave
121.745 110.88 41.408 30.111 clipbox
193.589318 33.652774 m
193.589318 33.652774 l
stroke
grestore
gsave
121.745 110.88 41.408 30.111 clipbox
201.198409 33.652774 m
201.198409 33.652774 l
stroke
grestore
gsave
121.745 110.88 41.408 30.111 clipbox
208.8075 33.652774 m
208.8075 33.652774 l
stroke
grestore
gsave
121.745 110.88 41.408 30.111 clipbox
216.416591 33.652774 m
216.416591 33.652774 l
stroke
grestore
1.000 0.000 0.000 setrgbcolor
gsave
121.745 110.88 41.408 30.111 clipbox
26.189318 33.652774 m
26.189318 33.652774 l
stroke
grestore
gsave
121.745 110.88 41.408 30.111 clipbox
33.798409 33.652774 m
33.798409 33.652774 l
stroke
grestore
gsave
121.745 110.88 41.408 30.111 clipbox
41.4075 33.652774 m
41.4075 33.652774 l
stroke
grestore
gsave
121.745 110.88 41.408 30.111 clipbox
49.016591 33.652774 m
49.016591 33.663508 l
stroke
grestore
gsave
121.745 110.88 41.408 30.111 clipbox
56.625682 33.706443 m
56.625682 33.845982 l
stroke
grestore
gsave
121.745 110.88 41.408 30.111 clipbox
64.234773 40.812209 m
64.234773 41.477703 l
stroke
grestore
gsave
121.745 110.88 41.408 30.111 clipbox
71.843864 81.385916 m
71.843864 83.221394 l
stroke
grestore
gsave
121.745 110.88 41.408 30.111 clipbox
79.452955 81.804534 m
79.452955 84.380642 l
stroke
grestore
gsave
121.745 110.88 41.408 30.111 clipbox
87.062045 81.944073 m
87.062045 84.026428 l
stroke
grestore
gsave
121.745 110.88 41.408 30.111 clipbox
94.671136 81.557657 m
94.671136 84.691922 l
stroke
grestore
gsave
121.745 110.88 41.408 30.111 clipbox
102.280227 81.70793 m
102.280227 83.854687 l
stroke
grestore
gsave
121.745 110.88 41.408 30.111 clipbox
109.889318 81.546923 m
109.889318 83.768817 l
stroke
grestore
gsave
121.745 110.88 41.408 30.111 clipbox
117.498409 81.332247 m
117.498409 83.994226 l
stroke
grestore
gsave
121.745 110.88 41.408 30.111 clipbox
125.1075 81.106838 m
125.1075 82.942315 l
stroke
grestore
gsave
121.745 110.88 41.408 30.111 clipbox
132.716591 72.573479 m
132.716591 74.945645 l
stroke
grestore
gsave
121.745 110.88 41.408 30.111 clipbox
140.325682 34.522211 m
140.325682 34.844224 l
stroke
grestore
gsave
121.745 110.88 41.408 30.111 clipbox
147.934773 33.652774 m
147.934773 33.663508 l
stroke
grestore
gsave
121.745 110.88 41.408 30.111 clipbox
155.543864 33.652774 m
155.543864 33.652774 l
stroke
grestore
gsave
121.745 110.88 41.408 30.111 clipbox
163.152955 33.652774 m
163.152955 33.652774 l
stroke
grestore
gsave
121.745 110.88 41.408 30.111 clipbox
170.762045 33.652774 m
170.762045 33.652774 l
stroke
grestore
gsave
121.745 110.88 41.408 30.111 clipbox
178.371136 33.652774 m
178.371136 33.652774 l
stroke
grestore
gsave
121.745 110.88 41.408 30.111 clipbox
185.980227 33.652774 m
185.980227 33.652774 l
stroke
grestore
gsave
121.745 110.88 41.408 30.111 clipbox
193.589318 33.652774 m
193.589318 33.652774 l
stroke
grestore
gsave
121.745 110.88 41.408 30.111 clipbox
201.198409 33.652774 m
201.198409 33.652774 l
stroke
grestore
gsave
121.745 110.88 41.408 30.111 clipbox
208.8075 33.652774 m
208.8075 33.652774 l
stroke
grestore
gsave
121.745 110.88 41.408 30.111 clipbox
216.416591 33.652774 m
216.416591 33.652774 l
stroke
grestore
[5.55 2.4] 0 setdash
0.000 setgray
gsave
121.745 110.88 41.408 30.111 clipbox
26.189318 33.652774 m
33.798409 33.652774 l
41.4075 33.652774 l
49.016591 33.652774 l
56.625682 33.654191 l
64.234773 33.786045 l
71.843864 41.206654 l
79.452955 81.983058 l
87.062045 82.973958 l
94.671136 82.998045 l
102.280227 82.93888 l
109.889318 83.07915 l
117.498409 83.064251 l
125.1075 82.907023 l
132.716591 81.977004 l
140.325682 73.922372 l
147.934773 34.641442 l
155.543864 33.653461 l
163.152955 33.653118 l
170.762045 33.653118 l
178.371136 33.653118 l
185.980227 33.653118 l
193.589318 33.653118 l
201.198409 33.653118 l
208.8075 33.653118 l
216.416591 33.653118 l
stroke
grestore
1.000 setlinewidth
[] 0 setdash
gsave
121.745 110.88 41.408 30.111 clipbox
/o {
gsave
newpath
translate
1.0 setlinewidth
1 setlinejoin

0 setlinecap

-3 0 m
3 0 l
0 -3 m
0 3 l

gsave
grestore
stroke
grestore
} bind def
26.1893 33.6528 o
33.7984 33.6528 o
41.4075 33.6528 o
49.0166 33.6528 o
56.6257 33.6542 o
64.2348 33.786 o
71.8439 41.2067 o
79.453 81.9831 o
87.062 82.974 o
94.6711 82.998 o
102.28 82.9389 o
109.889 83.0791 o
117.498 83.0643 o
125.107 82.907 o
132.717 81.977 o
140.326 73.9224 o
147.935 34.6414 o
155.544 33.6535 o
163.153 33.6531 o
170.762 33.6531 o
178.371 33.6531 o
185.98 33.6531 o
193.589 33.6531 o
201.198 33.6531 o
208.807 33.6531 o
216.417 33.6531 o
grestore
1.500 setlinewidth
[1.5 2.475] 0 setdash
0.173 0.627 0.173 setrgbcolor
gsave
121.745 110.88 41.408 30.111 clipbox
26.189318 33.652774 m
33.798409 33.652774 l
41.4075 33.652774 l
49.016591 39.749564 l
56.625682 78.691736 l
64.234773 78.348255 l
71.843864 81.525456 l
79.452955 80.967299 l
87.062045 80.022726 l
94.671136 81.353715 l
102.280227 79.765115 l
109.889318 82.555899 l
117.498409 74.011806 l
125.1075 34.554412 l
132.716591 33.695709 l
140.325682 33.652774 l
147.934773 33.652774 l
155.543864 33.652774 l
163.152955 33.652774 l
170.762045 33.652774 l
178.371136 33.652774 l
185.980227 33.652774 l
193.589318 33.652774 l
201.198409 33.652774 l
208.8075 33.652774 l
216.416591 33.652774 l
stroke
grestore
1.000 setlinewidth
0 setlinejoin
[] 0 setdash
gsave
121.745 110.88 41.408 30.111 clipbox
/o {
gsave
newpath
translate
1.0 setlinewidth
0 setlinejoin

0 setlinecap

-3 -3 m
3 -3 l
3 3 l
-3 3 l
cl

gsave
grestore
stroke
grestore
} bind def
26.1893 33.6528 o
33.7984 33.6528 o
41.4075 33.6528 o
49.0166 39.7496 o
56.6257 78.6917 o
64.2348 78.3483 o
71.8439 81.5255 o
79.453 80.9673 o
87.062 80.0227 o
94.6711 81.3537 o
102.28 79.7651 o
109.889 82.5559 o
117.498 74.0118 o
125.107 34.5544 o
132.717 33.6957 o
140.326 33.6528 o
147.935 33.6528 o
155.544 33.6528 o
163.153 33.6528 o
170.762 33.6528 o
178.371 33.6528 o
185.98 33.6528 o
193.589 33.6528 o
201.198 33.6528 o
208.807 33.6528 o
216.417 33.6528 o
grestore
1.500 setlinewidth
1 setlinejoin
[1.5 2.475] 0 setdash
0.122 0.467 0.706 setrgbcolor
gsave
121.745 110.88 41.408 30.111 clipbox
26.189318 33.652774 m
33.798409 33.652774 l
41.4075 33.652774 l
49.016591 33.755818 l
56.625682 40.784301 l
64.234773 82.238179 l
71.843864 82.375571 l
79.452955 82.792042 l
87.062045 82.646063 l
94.671136 83.023892 l
102.280227 82.843564 l
109.889318 82.680411 l
117.498409 81.662848 l
125.1075 73.432182 l
132.716591 34.708979 l
140.325682 33.652774 l
147.934773 33.652774 l
155.543864 33.652774 l
163.152955 33.652774 l
170.762045 33.652774 l
178.371136 33.652774 l
185.980227 33.652774 l
193.589318 33.652774 l
201.198409 33.652774 l
208.8075 33.652774 l
216.416591 33.652774 l
stroke
grestore
1.000 setlinewidth
[] 0 setdash
gsave
121.745 110.88 41.408 30.111 clipbox
/o {
gsave
newpath
translate
1.0 setlinewidth
1 setlinejoin

0 setlinecap

0 -3 m
0.795609 -3 1.55874 -2.683901 2.12132 -2.12132 c
2.683901 -1.55874 3 -0.795609 3 0 c
3 0.795609 2.683901 1.55874 2.12132 2.12132 c
1.55874 2.683901 0.795609 3 0 3 c
-0.795609 3 -1.55874 2.683901 -2.12132 2.12132 c
-2.683901 1.55874 -3 0.795609 -3 0 c
-3 -0.795609 -2.683901 -1.55874 -2.12132 -2.12132 c
-1.55874 -2.683901 -0.795609 -3 0 -3 c
cl

gsave
grestore
stroke
grestore
} bind def
26.1893 33.6528 o
33.7984 33.6528 o
41.4075 33.6528 o
49.0166 33.7558 o
56.6257 40.7843 o
64.2348 82.2382 o
71.8439 82.3756 o
79.453 82.792 o
87.062 82.6461 o
94.6711 83.0239 o
102.28 82.8436 o
109.889 82.6804 o
117.498 81.6628 o
125.107 73.4322 o
132.717 34.709 o
140.326 33.6528 o
147.935 33.6528 o
155.544 33.6528 o
163.153 33.6528 o
170.762 33.6528 o
178.371 33.6528 o
185.98 33.6528 o
193.589 33.6528 o
201.198 33.6528 o
208.807 33.6528 o
216.417 33.6528 o
grestore
1.500 setlinewidth
[1.5 2.475] 0 setdash
1.000 0.000 0.000 setrgbcolor
gsave
121.745 110.88 41.408 30.111 clipbox
26.189318 33.652774 m
33.798409 33.652774 l
41.4075 33.652774 l
49.016591 33.653203 l
56.625682 33.778145 l
64.234773 41.097298 l
71.843864 82.155314 l
79.452955 82.979669 l
87.062045 83.079278 l
94.671136 82.947467 l
102.280227 82.645633 l
109.889318 82.781738 l
117.498409 82.909255 l
125.1075 81.97284 l
132.716591 73.84393 l
140.325682 34.634701 l
147.934773 33.653633 l
155.543864 33.652774 l
163.152955 33.652774 l
170.762045 33.652774 l
178.371136 33.652774 l
185.980227 33.652774 l
193.589318 33.652774 l
201.198409 33.652774 l
208.8075 33.652774 l
216.416591 33.652774 l
stroke
grestore
1.000 setlinewidth
0 setlinejoin
[] 0 setdash
gsave
121.745 110.88 41.408 30.111 clipbox
/o {
gsave
newpath
translate
1.0 setlinewidth
0 setlinejoin

0 setlinecap

0 3 m
-3 -3 l
3 -3 l
cl

gsave
grestore
stroke
grestore
} bind def
26.1893 33.6528 o
33.7984 33.6528 o
41.4075 33.6528 o
49.0166 33.6532 o
56.6257 33.7781 o
64.2348 41.0973 o
71.8439 82.1553 o
79.453 82.9797 o
87.062 83.0793 o
94.6711 82.9475 o
102.28 82.6456 o
109.889 82.7817 o
117.498 82.9093 o
125.107 81.9728 o
132.717 73.8439 o
140.326 34.6347 o
147.935 33.6536 o
155.544 33.6528 o
163.153 33.6528 o
170.762 33.6528 o
178.371 33.6528 o
185.98 33.6528 o
193.589 33.6528 o
201.198 33.6528 o
208.807 33.6528 o
216.417 33.6528 o
grestore
0.800 setlinewidth
2 setlinecap
0.000 setgray
gsave
41.4075 30.110625 m
41.4075 140.990625 l
stroke
grestore
gsave
41.4075 30.110625 m
163.152955 30.110625 l
stroke
grestore
gsave
187.502045 30.110625 m
309.2475 30.110625 l
309.2475 140.990625 l
187.502045 140.990625 l
cl
1.000 setgray
fill
grestore
1 setlinejoin
0 setlinecap
[2.96 1.28] 0 setdash
0.690 setgray
gsave
121.745 110.88 187.502 30.111 clipbox
187.502045 30.110625 m
187.502045 140.990625 l
stroke
grestore
[] 0 setdash
0.000 setgray
gsave
/o {
gsave
newpath
translate
0.8 setlinewidth
1 setlinejoin

0 setlinecap

0 0 m
0 -3.5 l

gsave
0.000 setgray
fill
grestore
stroke
grestore
} bind def
187.502 30.1106 o
grestore
/DejaVuSans 9.000 selectfont
gsave

184.634858 16.266875 translate
0.000000 rotate
0.000000 0 m /two glyphshow
grestore
[2.96 1.28] 0 setdash
0.690 setgray
gsave
121.745 110.88 187.502 30.111 clipbox
202.720227 30.110625 m
202.720227 140.990625 l
stroke
grestore
[] 0 setdash
0.000 setgray
gsave
/o {
gsave
newpath
translate
0.8 setlinewidth
1 setlinejoin

0 setlinecap

0 0 m
0 -3.5 l

gsave
0.000 setgray
fill
grestore
stroke
grestore
} bind def
202.72 30.1106 o
grestore
gsave

199.853040 16.266875 translate
0.000000 rotate
0.000000 0 m /four glyphshow
grestore
[2.96 1.28] 0 setdash
0.690 setgray
gsave
121.745 110.88 187.502 30.111 clipbox
217.938409 30.110625 m
217.938409 140.990625 l
stroke
grestore
[] 0 setdash
0.000 setgray
gsave
/o {
gsave
newpath
translate
0.8 setlinewidth
1 setlinejoin

0 setlinecap

0 0 m
0 -3.5 l

gsave
0.000 setgray
fill
grestore
stroke
grestore
} bind def
217.938 30.1106 o
grestore
gsave

215.071222 16.266875 translate
0.000000 rotate
0.000000 0 m /six glyphshow
grestore
[2.96 1.28] 0 setdash
0.690 setgray
gsave
121.745 110.88 187.502 30.111 clipbox
233.156591 30.110625 m
233.156591 140.990625 l
stroke
grestore
[] 0 setdash
0.000 setgray
gsave
/o {
gsave
newpath
translate
0.8 setlinewidth
1 setlinejoin

0 setlinecap

0 0 m
0 -3.5 l

gsave
0.000 setgray
fill
grestore
stroke
grestore
} bind def
233.157 30.1106 o
grestore
gsave

230.289403 16.266875 translate
0.000000 rotate
0.000000 0 m /eight glyphshow
grestore
[2.96 1.28] 0 setdash
0.690 setgray
gsave
121.745 110.88 187.502 30.111 clipbox
248.374773 30.110625 m
248.374773 140.990625 l
stroke
grestore
[] 0 setdash
0.000 setgray
gsave
/o {
gsave
newpath
translate
0.8 setlinewidth
1 setlinejoin

0 setlinecap

0 0 m
0 -3.5 l

gsave
0.000 setgray
fill
grestore
stroke
grestore
} bind def
248.375 30.1106 o
grestore
gsave

242.640398 16.266875 translate
0.000000 rotate
0.000000 0 m /one glyphshow
5.726074 0 m /zero glyphshow
grestore
[2.96 1.28] 0 setdash
0.690 setgray
gsave
121.745 110.88 187.502 30.111 clipbox
263.592955 30.110625 m
263.592955 140.990625 l
stroke
grestore
[] 0 setdash
0.000 setgray
gsave
/o {
gsave
newpath
translate
0.8 setlinewidth
1 setlinejoin

0 setlinecap

0 0 m
0 -3.5 l

gsave
0.000 setgray
fill
grestore
stroke
grestore
} bind def
263.593 30.1106 o
grestore
gsave

257.858580 16.266875 translate
0.000000 rotate
0.000000 0 m /one glyphshow
5.726074 0 m /two glyphshow
grestore
[2.96 1.28] 0 setdash
0.690 setgray
gsave
121.745 110.88 187.502 30.111 clipbox
278.811136 30.110625 m
278.811136 140.990625 l
stroke
grestore
[] 0 setdash
0.000 setgray
gsave
/o {
gsave
newpath
translate
0.8 setlinewidth
1 setlinejoin

0 setlinecap

0 0 m
0 -3.5 l

gsave
0.000 setgray
fill
grestore
stroke
grestore
} bind def
278.811 30.1106 o
grestore
gsave

273.076761 16.266875 translate
0.000000 rotate
0.000000 0 m /one glyphshow
5.726074 0 m /four glyphshow
grestore
[2.96 1.28] 0 setdash
0.690 setgray
gsave
121.745 110.88 187.502 30.111 clipbox
294.029318 30.110625 m
294.029318 140.990625 l
stroke
grestore
[] 0 setdash
0.000 setgray
gsave
/o {
gsave
newpath
translate
0.8 setlinewidth
1 setlinejoin

0 setlinecap

0 0 m
0 -3.5 l

gsave
0.000 setgray
fill
grestore
stroke
grestore
} bind def
294.029 30.1106 o
grestore
gsave

288.294943 16.266875 translate
0.000000 rotate
0.000000 0 m /one glyphshow
5.726074 0 m /six glyphshow
grestore
[2.96 1.28] 0 setdash
0.690 setgray
gsave
121.745 110.88 187.502 30.111 clipbox
309.2475 30.110625 m
309.2475 140.990625 l
stroke
grestore
[] 0 setdash
0.000 setgray
gsave
/o {
gsave
newpath
translate
0.8 setlinewidth
1 setlinejoin

0 setlinecap

0 0 m
0 -3.5 l

gsave
0.000 setgray
fill
grestore
stroke
grestore
} bind def
309.248 30.1106 o
grestore
gsave

303.513125 16.266875 translate
0.000000 rotate
0.000000 0 m /one glyphshow
5.726074 0 m /eight glyphshow
grestore
/DejaVuSans 10.000 selectfont
gsave

229.960710 2.798125 translate
0.000000 rotate
0.000000 0 m /R glyphshow
6.448242 0 m /o glyphshow
12.566406 0 m /u glyphshow
18.904297 0 m /n glyphshow
25.242188 0 m /d glyphshow
31.589844 0 m /s glyphshow
grestore
[2.96 1.28] 0 setdash
0.690 setgray
gsave
121.745 110.88 187.502 30.111 clipbox
187.502045 32.633874 m
309.2475 32.633874 l
stroke
grestore
[] 0 setdash
0.000 setgray
gsave
/o {
gsave
newpath
translate
0.8 setlinewidth
1 setlinejoin

0 setlinecap

-0 0 m
-3.5 0 l

gsave
0.000 setgray
fill
grestore
stroke
grestore
} bind def
187.502 32.6339 o
grestore
[2.96 1.28] 0 setdash
0.690 setgray
gsave
121.745 110.88 187.502 30.111 clipbox
187.502045 54.305225 m
309.2475 54.305225 l
stroke
grestore
[] 0 setdash
0.000 setgray
gsave
/o {
gsave
newpath
translate
0.8 setlinewidth
1 setlinejoin

0 setlinecap

-0 0 m
-3.5 0 l

gsave
0.000 setgray
fill
grestore
stroke
grestore
} bind def
187.502 54.3052 o
grestore
[2.96 1.28] 0 setdash
0.690 setgray
gsave
121.745 110.88 187.502 30.111 clipbox
187.502045 75.976575 m
309.2475 75.976575 l
stroke
grestore
[] 0 setdash
0.000 setgray
gsave
/o {
gsave
newpath
translate
0.8 setlinewidth
1 setlinejoin

0 setlinecap

-0 0 m
-3.5 0 l

gsave
0.000 setgray
fill
grestore
stroke
grestore
} bind def
187.502 75.9766 o
grestore
[2.96 1.28] 0 setdash
0.690 setgray
gsave
121.745 110.88 187.502 30.111 clipbox
187.502045 97.647925 m
309.2475 97.647925 l
stroke
grestore
[] 0 setdash
0.000 setgray
gsave
/o {
gsave
newpath
translate
0.8 setlinewidth
1 setlinejoin

0 setlinecap

-0 0 m
-3.5 0 l

gsave
0.000 setgray
fill
grestore
stroke
grestore
} bind def
187.502 97.6479 o
grestore
[2.96 1.28] 0 setdash
0.690 setgray
gsave
121.745 110.88 187.502 30.111 clipbox
187.502045 119.319275 m
309.2475 119.319275 l
stroke
grestore
[] 0 setdash
0.000 setgray
gsave
/o {
gsave
newpath
translate
0.8 setlinewidth
1 setlinejoin

0 setlinecap

-0 0 m
-3.5 0 l

gsave
0.000 setgray
fill
grestore
stroke
grestore
} bind def
187.502 119.319 o
grestore
[2.96 1.28] 0 setdash
0.690 setgray
gsave
121.745 110.88 187.502 30.111 clipbox
187.502045 140.990625 m
309.2475 140.990625 l
stroke
grestore
[] 0 setdash
0.000 setgray
gsave
/o {
gsave
newpath
translate
0.8 setlinewidth
1 setlinejoin

0 setlinecap

-0 0 m
-3.5 0 l

gsave
0.000 setgray
fill
grestore
stroke
grestore
} bind def
187.502 140.991 o
grestore
1.500 setlinewidth
gsave
121.745 110.88 187.502 30.111 clipbox
172.283864 32.633874 m
172.283864 32.633874 l
stroke
grestore
gsave
121.745 110.88 187.502 30.111 clipbox
179.892955 32.633874 m
179.892955 32.633874 l
stroke
grestore
gsave
121.745 110.88 187.502 30.111 clipbox
187.502045 32.633874 m
187.502045 32.633874 l
stroke
grestore
gsave
121.745 110.88 187.502 30.111 clipbox
195.111136 32.633874 m
195.111136 32.633874 l
stroke
grestore
gsave
121.745 110.88 187.502 30.111 clipbox
202.720227 32.633874 m
202.720227 32.638209 l
stroke
grestore
gsave
121.745 110.88 187.502 30.111 clipbox
210.329318 32.753067 m
210.329318 32.79641 l
stroke
grestore
gsave
121.745 110.88 187.502 30.111 clipbox
217.938409 40.161418 m
217.938409 40.367296 l
stroke
grestore
gsave
121.745 110.88 187.502 30.111 clipbox
225.5475 80.85913 m
225.5475 81.806168 l
stroke
grestore
gsave
121.745 110.88 187.502 30.111 clipbox
233.156591 82.120402 m
233.156591 82.8789 l
stroke
grestore
gsave
121.745 110.88 187.502 30.111 clipbox
240.765682 81.837591 m
240.765682 82.800883 l
stroke
grestore
gsave
121.745 110.88 187.502 30.111 clipbox
248.374773 81.901522 m
248.374773 83.095613 l
stroke
grestore
gsave
121.745 110.88 187.502 30.111 clipbox
255.983864 81.862513 m
255.983864 82.886485 l
stroke
grestore
gsave
121.745 110.88 187.502 30.111 clipbox
263.592955 81.777995 m
263.592955 83.098864 l
stroke
grestore
gsave
121.745 110.88 187.502 30.111 clipbox
271.202045 81.80075 m
271.202045 82.808468 l
stroke
grestore
gsave
121.745 110.88 187.502 30.111 clipbox
278.811136 80.747522 m
278.811136 81.746572 l
stroke
grestore
gsave
121.745 110.88 187.502 30.111 clipbox
286.420227 72.991346 m
286.420227 73.65774 l
stroke
grestore
gsave
121.745 110.88 187.502 30.111 clipbox
294.029318 33.592832 m
294.029318 33.694687 l
stroke
grestore
gsave
121.745 110.88 187.502 30.111 clipbox
301.638409 32.633874 m
301.638409 32.636042 l
stroke
grestore
gsave
121.745 110.88 187.502 30.111 clipbox
309.2475 32.633874 m
309.2475 32.636042 l
stroke
grestore
gsave
121.745 110.88 187.502 30.111 clipbox

stroke
grestore
gsave
121.745 110.88 187.502 30.111 clipbox

stroke
grestore
gsave
121.745 110.88 187.502 30.111 clipbox

stroke
grestore
gsave
121.745 110.88 187.502 30.111 clipbox

stroke
grestore
gsave
121.745 110.88 187.502 30.111 clipbox

stroke
grestore
gsave
121.745 110.88 187.502 30.111 clipbox

stroke
grestore
gsave
121.745 110.88 187.502 30.111 clipbox

stroke
grestore
0.173 0.627 0.173 setrgbcolor
gsave
121.745 110.88 187.502 30.111 clipbox
172.283864 32.633874 m
172.283864 32.633874 l
stroke
grestore
gsave
121.745 110.88 187.502 30.111 clipbox
179.892955 32.633874 m
179.892955 32.633874 l
stroke
grestore
gsave
121.745 110.88 187.502 30.111 clipbox
187.502045 32.633874 m
187.502045 32.633874 l
stroke
grestore
gsave
121.745 110.88 187.502 30.111 clipbox
195.111136 32.633874 m
195.111136 32.633874 l
stroke
grestore
gsave
121.745 110.88 187.502 30.111 clipbox
202.720227 32.633874 m
202.720227 32.633874 l
stroke
grestore
gsave
121.745 110.88 187.502 30.111 clipbox
210.329318 32.637125 m
210.329318 32.646888 l
stroke
grestore
gsave
121.745 110.88 187.502 30.111 clipbox
217.938409 33.685986 m
217.938409 33.974508 l
stroke
grestore
gsave
121.745 110.88 187.502 30.111 clipbox
225.5475 61.973718 m
225.5475 66.081295 l
stroke
grestore
gsave
121.745 110.88 187.502 30.111 clipbox
233.156591 71.201932 m
233.156591 78.097073 l
stroke
grestore
gsave
121.745 110.88 187.502 30.111 clipbox
240.765682 70.217067 m
240.765682 76.665334 l
stroke
grestore
gsave
121.745 110.88 187.502 30.111 clipbox
248.374773 70.879798 m
248.374773 76.653393 l
stroke
grestore
gsave
121.745 110.88 187.502 30.111 clipbox
255.983864 70.848342 m
255.983864 76.7239 l
stroke
grestore
gsave
121.745 110.88 187.502 30.111 clipbox
263.592955 72.351662 m
263.592955 76.991812 l
stroke
grestore
gsave
121.745 110.88 187.502 30.111 clipbox
271.202045 72.48182 m
271.202045 77.382287 l
stroke
grestore
gsave
121.745 110.88 187.502 30.111 clipbox
278.811136 69.8971 m
278.811136 78.599263 l
stroke
grestore
gsave
121.745 110.88 187.502 30.111 clipbox
286.420227 68.241918 m
286.420227 73.751956 l
stroke
grestore
gsave
121.745 110.88 187.502 30.111 clipbox
294.029318 40.368531 m
294.029318 44.896955 l
stroke
grestore
gsave
121.745 110.88 187.502 30.111 clipbox
301.638409 32.64147 m
301.638409 32.659902 l
stroke
grestore
gsave
121.745 110.88 187.502 30.111 clipbox
309.2475 32.633874 m
309.2475 32.633874 l
stroke
grestore
gsave
121.745 110.88 187.502 30.111 clipbox

stroke
grestore
gsave
121.745 110.88 187.502 30.111 clipbox

stroke
grestore
gsave
121.745 110.88 187.502 30.111 clipbox

stroke
grestore
gsave
121.745 110.88 187.502 30.111 clipbox

stroke
grestore
gsave
121.745 110.88 187.502 30.111 clipbox

stroke
grestore
gsave
121.745 110.88 187.502 30.111 clipbox

stroke
grestore
gsave
121.745 110.88 187.502 30.111 clipbox

stroke
grestore
0.122 0.467 0.706 setrgbcolor
gsave
121.745 110.88 187.502 30.111 clipbox
172.283864 32.633874 m
172.283864 32.633874 l
stroke
grestore
gsave
121.745 110.88 187.502 30.111 clipbox
179.892955 32.633874 m
179.892955 32.633874 l
stroke
grestore
gsave
121.745 110.88 187.502 30.111 clipbox
187.502045 32.633874 m
187.502045 32.633874 l
stroke
grestore
gsave
121.745 110.88 187.502 30.111 clipbox
195.111136 32.633874 m
195.111136 32.633874 l
stroke
grestore
gsave
121.745 110.88 187.502 30.111 clipbox
202.720227 32.633874 m
202.720227 32.633874 l
stroke
grestore
gsave
121.745 110.88 187.502 30.111 clipbox
210.329318 32.633874 m
210.329318 32.637158 l
stroke
grestore
gsave
121.745 110.88 187.502 30.111 clipbox
217.938409 32.879042 m
217.938409 33.007098 l
stroke
grestore
gsave
121.745 110.88 187.502 30.111 clipbox
225.5475 54.136665 m
225.5475 55.997345 l
stroke
grestore
gsave
121.745 110.88 187.502 30.111 clipbox
233.156591 63.229877 m
233.156591 65.620292 l
stroke
grestore
gsave
121.745 110.88 187.502 30.111 clipbox
240.765682 63.250681 m
240.765682 66.106261 l
stroke
grestore
gsave
121.745 110.88 187.502 30.111 clipbox
248.374773 63.091971 m
248.374773 65.603876 l
stroke
grestore
gsave
121.745 110.88 187.502 30.111 clipbox
255.983864 63.614055 m
255.983864 65.469253 l
stroke
grestore
gsave
121.745 110.88 187.502 30.111 clipbox
263.592955 63.593262 m
263.592955 66.968737 l
stroke
grestore
gsave
121.745 110.88 187.502 30.111 clipbox
271.202045 63.311968 m
271.202045 65.888453 l
stroke
grestore
gsave
121.745 110.88 187.502 30.111 clipbox
278.811136 62.707803 m
278.811136 65.032543 l
stroke
grestore
gsave
121.745 110.88 187.502 30.111 clipbox
286.420227 62.708897 m
286.420227 64.986578 l
stroke
grestore
gsave
121.745 110.88 187.502 30.111 clipbox
294.029318 41.49724 m
294.029318 42.714335 l
stroke
grestore
gsave
121.745 110.88 187.502 30.111 clipbox
301.638409 32.641535 m
301.638409 32.655763 l
stroke
grestore
gsave
121.745 110.88 187.502 30.111 clipbox
309.2475 32.633874 m
309.2475 32.633874 l
stroke
grestore
gsave
121.745 110.88 187.502 30.111 clipbox

stroke
grestore
gsave
121.745 110.88 187.502 30.111 clipbox

stroke
grestore
gsave
121.745 110.88 187.502 30.111 clipbox

stroke
grestore
gsave
121.745 110.88 187.502 30.111 clipbox

stroke
grestore
gsave
121.745 110.88 187.502 30.111 clipbox

stroke
grestore
gsave
121.745 110.88 187.502 30.111 clipbox

stroke
grestore
gsave
121.745 110.88 187.502 30.111 clipbox

stroke
grestore
1.000 0.000 0.000 setrgbcolor
gsave
121.745 110.88 187.502 30.111 clipbox
172.283864 32.633874 m
172.283864 32.633874 l
stroke
grestore
gsave
121.745 110.88 187.502 30.111 clipbox
179.892955 32.633874 m
179.892955 32.633874 l
stroke
grestore
gsave
121.745 110.88 187.502 30.111 clipbox
187.502045 32.633874 m
187.502045 32.633874 l
stroke
grestore
gsave
121.745 110.88 187.502 30.111 clipbox
195.111136 32.633874 m
195.111136 32.633874 l
stroke
grestore
gsave
121.745 110.88 187.502 30.111 clipbox
202.720227 32.633874 m
202.720227 32.633874 l
stroke
grestore
gsave
121.745 110.88 187.502 30.111 clipbox
210.329318 32.633874 m
210.329318 32.633874 l
stroke
grestore
gsave
121.745 110.88 187.502 30.111 clipbox
217.938409 32.645913 m
217.938409 32.708521 l
stroke
grestore
gsave
121.745 110.88 187.502 30.111 clipbox
225.5475 38.14803 m
225.5475 38.835489 l
stroke
grestore
gsave
121.745 110.88 187.502 30.111 clipbox
233.156591 42.435349 m
233.156591 43.535766 l
stroke
grestore
gsave
121.745 110.88 187.502 30.111 clipbox
240.765682 42.289664 m
240.765682 43.623654 l
stroke
grestore
gsave
121.745 110.88 187.502 30.111 clipbox
248.374773 41.965796 m
248.374773 44.217211 l
stroke
grestore
gsave
121.745 110.88 187.502 30.111 clipbox
255.983864 42.005531 m
255.983864 44.443558 l
stroke
grestore
gsave
121.745 110.88 187.502 30.111 clipbox
263.592955 41.667219 m
263.592955 43.64292 l
stroke
grestore
gsave
121.745 110.88 187.502 30.111 clipbox
271.202045 41.841793 m
271.202045 43.357584 l
stroke
grestore
gsave
121.745 110.88 187.502 30.111 clipbox
278.811136 41.793628 m
278.811136 44.388176 l
stroke
grestore
gsave
121.745 110.88 187.502 30.111 clipbox
286.420227 41.703334 m
286.420227 43.70191 l
stroke
grestore
gsave
121.745 110.88 187.502 30.111 clipbox
294.029318 36.60334 m
294.029318 37.224592 l
stroke
grestore
gsave
121.745 110.88 187.502 30.111 clipbox
301.638409 32.633874 m
301.638409 32.638686 l
stroke
grestore
gsave
121.745 110.88 187.502 30.111 clipbox
309.2475 32.633874 m
309.2475 32.635077 l
stroke
grestore
gsave
121.745 110.88 187.502 30.111 clipbox

stroke
grestore
gsave
121.745 110.88 187.502 30.111 clipbox

stroke
grestore
gsave
121.745 110.88 187.502 30.111 clipbox

stroke
grestore
gsave
121.745 110.88 187.502 30.111 clipbox

stroke
grestore
gsave
121.745 110.88 187.502 30.111 clipbox

stroke
grestore
gsave
121.745 110.88 187.502 30.111 clipbox

stroke
grestore
gsave
121.745 110.88 187.502 30.111 clipbox

stroke
grestore
[5.55 2.4] 0 setdash
0.000 setgray
gsave
121.745 110.88 187.502 30.111 clipbox
172.283864 32.633874 m
179.892955 32.633874 l
187.502045 32.633874 l
195.111136 32.633874 l
202.720227 32.635305 l
210.329318 32.76841 l
217.938409 40.259459 l
225.5475 81.422932 l
233.156591 82.423238 l
240.765682 82.447553 l
248.374773 82.387827 l
255.983864 82.529427 l
263.592955 82.514388 l
271.202045 82.355667 l
278.811136 81.41682 l
286.420227 73.28573 l
294.029318 33.631927 l
301.638409 32.634568 l
309.2475 32.634221 l
316.701875 32.634221 l
stroke
grestore
1.000 setlinewidth
[] 0 setdash
gsave
121.745 110.88 187.502 30.111 clipbox
/o {
gsave
newpath
translate
1.0 setlinewidth
1 setlinejoin

0 setlinecap

-3 0 m
3 0 l
0 -3 m
0 3 l

gsave
grestore
stroke
grestore
} bind def
172.284 32.6339 o
179.893 32.6339 o
187.502 32.6339 o
195.111 32.6339 o
202.72 32.6353 o
210.329 32.7684 o
217.938 40.2595 o
225.547 81.4229 o
233.157 82.4232 o
240.766 82.4476 o
248.375 82.3878 o
255.984 82.5294 o
263.593 82.5144 o
271.202 82.3557 o
278.811 81.4168 o
286.42 73.2857 o
294.029 33.6319 o
301.638 32.6346 o
309.248 32.6342 o
316.702 32.6342 o
grestore
1.500 setlinewidth
[1.5 2.475] 0 setdash
0.173 0.627 0.173 setrgbcolor
gsave
121.745 110.88 187.502 30.111 clipbox
172.283864 32.633874 m
179.892955 32.633874 l
187.502045 32.633874 l
195.111136 32.633874 l
202.720227 32.633874 l
210.329318 32.640643 l
217.938409 33.794235 l
225.5475 63.629111 l
233.156591 74.469603 l
240.765682 74.084681 l
248.374773 73.725661 l
255.983864 73.689435 l
263.592955 74.977784 l
271.202045 74.455069 l
278.811136 73.961724 l
286.420227 71.626729 l
294.029318 43.24277 l
301.638409 32.650057 l
309.2475 32.633874 l
316.701875 32.633874 l
stroke
grestore
1.000 setlinewidth
0 setlinejoin
[] 0 setdash
gsave
121.745 110.88 187.502 30.111 clipbox
/o {
gsave
newpath
translate
1.0 setlinewidth
0 setlinejoin

0 setlinecap

-3 -3 m
3 -3 l
3 3 l
-3 3 l
cl

gsave
grestore
stroke
grestore
} bind def
172.284 32.6339 o
179.893 32.6339 o
187.502 32.6339 o
195.111 32.6339 o
202.72 32.6339 o
210.329 32.6406 o
217.938 33.7942 o
225.547 63.6291 o
233.157 74.4696 o
240.766 74.0847 o
248.375 73.7257 o
255.984 73.6894 o
263.593 74.9778 o
271.202 74.4551 o
278.811 73.9617 o
286.42 71.6267 o
294.029 43.2428 o
301.638 32.6501 o
309.248 32.6339 o
316.702 32.6339 o
grestore
1.500 setlinewidth
1 setlinejoin
[1.5 2.475] 0 setdash
0.122 0.467 0.706 setrgbcolor
gsave
121.745 110.88 187.502 30.111 clipbox
172.283864 32.633874 m
179.892955 32.633874 l
187.502045 32.633874 l
195.111136 32.633874 l
202.720227 32.633874 l
210.329318 32.634662 l
217.938409 32.938499 l
225.5475 54.920384 l
233.156591 64.23403 l
240.765682 64.3613 l
248.374773 64.416771 l
255.983864 64.536292 l
263.592955 65.177544 l
271.202045 64.561552 l
278.811136 64.261132 l
286.420227 63.69715 l
294.029318 42.16962 l
301.638409 32.647051 l
309.2475 32.633874 l
316.701875 32.633874 l
stroke
grestore
1.000 setlinewidth
[] 0 setdash
gsave
121.745 110.88 187.502 30.111 clipbox
/o {
gsave
newpath
translate
1.0 setlinewidth
1 setlinejoin

0 setlinecap

0 -3 m
0.795609 -3 1.55874 -2.683901 2.12132 -2.12132 c
2.683901 -1.55874 3 -0.795609 3 0 c
3 0.795609 2.683901 1.55874 2.12132 2.12132 c
1.55874 2.683901 0.795609 3 0 3 c
-0.795609 3 -1.55874 2.683901 -2.12132 2.12132 c
-2.683901 1.55874 -3 0.795609 -3 0 c
-3 -0.795609 -2.683901 -1.55874 -2.12132 -2.12132 c
-1.55874 -2.683901 -0.795609 -3 0 -3 c
cl

gsave
grestore
stroke
grestore
} bind def
172.284 32.6339 o
179.893 32.6339 o
187.502 32.6339 o
195.111 32.6339 o
202.72 32.6339 o
210.329 32.6347 o
217.938 32.9385 o
225.547 54.9204 o
233.157 64.234 o
240.766 64.3613 o
248.375 64.4168 o
255.984 64.5363 o
263.593 65.1775 o
271.202 64.5616 o
278.811 64.2611 o
286.42 63.6972 o
294.029 42.1696 o
301.638 32.6471 o
309.248 32.6339 o
316.702 32.6339 o
grestore
1.500 setlinewidth
[1.5 2.475] 0 setdash
1.000 0.000 0.000 setrgbcolor
gsave
121.745 110.88 187.502 30.111 clipbox
172.283864 32.633874 m
179.892955 32.633874 l
187.502045 32.633874 l
195.111136 32.633874 l
202.720227 32.633874 l
210.329318 32.633874 l
217.938409 32.671438 l
225.5475 38.499249 l
233.156591 43.109034 l
240.765682 43.005445 l
248.374773 42.973998 l
255.983864 43.129936 l
263.592955 42.981463 l
271.202045 42.843295 l
278.811136 42.955408 l
286.420227 42.760078 l
294.029318 37.075971 l
301.638409 32.63628 l
309.2475 32.633923 l
316.701875 32.633923 l
stroke
grestore
1.000 setlinewidth
0 setlinejoin
[] 0 setdash
gsave
121.745 110.88 187.502 30.111 clipbox
/o {
gsave
newpath
translate
1.0 setlinewidth
0 setlinejoin

0 setlinecap

0 3 m
-3 -3 l
3 -3 l
cl

gsave
grestore
stroke
grestore
} bind def
172.284 32.6339 o
179.893 32.6339 o
187.502 32.6339 o
195.111 32.6339 o
202.72 32.6339 o
210.329 32.6339 o
217.938 32.6714 o
225.547 38.4992 o
233.157 43.109 o
240.766 43.0054 o
248.375 42.974 o
255.984 43.1299 o
263.593 42.9815 o
271.202 42.8433 o
278.811 42.9554 o
286.42 42.7601 o
294.029 37.076 o
301.638 32.6363 o
309.248 32.6339 o
316.702 32.6339 o
grestore
0.800 setlinewidth
2 setlinecap
0.000 setgray
gsave
187.502045 30.110625 m
309.2475 30.110625 l
stroke
grestore
1.000 setlinewidth
0 setlinecap
gsave
75.272812 103.646875 m
275.382187 103.646875 l
276.715521 103.646875 277.382187 104.313542 277.382187 105.646875 c
277.382187 133.990625 l
277.382187 135.323958 276.715521 135.990625 275.382187 135.990625 c
75.272812 135.990625 l
73.939479 135.990625 73.272812 135.323958 73.272812 133.990625 c
73.272812 105.646875 l
73.272812 104.313542 73.939479 103.646875 75.272812 103.646875 c
cl
gsave
1.000 setgray
fill
grestore
stroke
grestore
1.500 setlinewidth
1 setlinejoin
gsave
87.272812 122.896875 m
87.272812 132.896875 l
stroke
grestore
[5.55 2.4] 0 setdash
gsave
77.272812 127.896875 m
97.272812 127.896875 l
stroke
grestore
1.000 setlinewidth
[] 0 setdash
gsave
/o {
gsave
newpath
translate
1.0 setlinewidth
1 setlinejoin

0 setlinecap

-3 0 m
3 0 l
0 -3 m
0 3 l

gsave
grestore
stroke
grestore
} bind def
87.2728 127.897 o
grestore
gsave

102.272812 124.396875 translate
0.000000 rotate
0.000000 0 m /U glyphshow
7.319336 0 m /n glyphshow
13.657227 0 m /i glyphshow
16.435547 0 m /f glyphshow
19.956055 0 m /o glyphshow
26.074219 0 m /r glyphshow
30.060547 0 m /m glyphshow
grestore
1.500 setlinewidth
0.173 0.627 0.173 setrgbcolor
gsave
87.272812 108.225 m
87.272812 118.225 l
stroke
grestore
[1.5 2.475] 0 setdash
gsave
77.272812 113.225 m
97.272812 113.225 l
stroke
grestore
1.000 setlinewidth
0 setlinejoin
[] 0 setdash
gsave
/o {
gsave
newpath
translate
1.0 setlinewidth
0 setlinejoin

0 setlinecap

-3 -3 m
3 -3 l
3 3 l
-3 3 l
cl

gsave
grestore
stroke
grestore
} bind def
87.2728 113.225 o
grestore
0.000 setgray
gsave

102.272812 109.725000 translate
0.000000 rotate
0.000000 0 m /U glyphshow
7.319336 0 m /P glyphshow
13.349609 0 m /S glyphshow
19.697266 0 m /space glyphshow
22.875977 0 m /d glyphshow
29.223633 0 m /equal glyphshow
37.602539 0 m /zero glyphshow
43.964844 0 m /period glyphshow
47.143555 0 m /zero glyphshow
53.505859 0 m /zero glyphshow
59.868164 0 m /one glyphshow
grestore
1.500 setlinewidth
1 setlinejoin
0.122 0.467 0.706 setrgbcolor
gsave
198.507187 122.896875 m
198.507187 132.896875 l
stroke
grestore
[1.5 2.475] 0 setdash
gsave
188.507187 127.896875 m
208.507187 127.896875 l
stroke
grestore
1.000 setlinewidth
[] 0 setdash
gsave
/o {
gsave
newpath
translate
1.0 setlinewidth
1 setlinejoin

0 setlinecap

0 -3 m
0.795609 -3 1.55874 -2.683901 2.12132 -2.12132 c
2.683901 -1.55874 3 -0.795609 3 0 c
3 0.795609 2.683901 1.55874 2.12132 2.12132 c
1.55874 2.683901 0.795609 3 0 3 c
-0.795609 3 -1.55874 2.683901 -2.12132 2.12132 c
-2.683901 1.55874 -3 0.795609 -3 0 c
-3 -0.795609 -2.683901 -1.55874 -2.12132 -2.12132 c
-1.55874 -2.683901 -0.795609 -3 0 -3 c
cl

gsave
grestore
stroke
grestore
} bind def
198.507 127.897 o
grestore
0.000 setgray
gsave

213.507187 124.396875 translate
0.000000 rotate
0.000000 0 m /U glyphshow
7.319336 0 m /P glyphshow
13.349609 0 m /S glyphshow
19.697266 0 m /space glyphshow
22.875977 0 m /d glyphshow
29.223633 0 m /equal glyphshow
37.602539 0 m /zero glyphshow
43.964844 0 m /period glyphshow
47.143555 0 m /zero glyphshow
53.505859 0 m /one glyphshow
grestore
1.500 setlinewidth
1.000 0.000 0.000 setrgbcolor
gsave
198.507187 108.225 m
198.507187 118.225 l
stroke
grestore
[1.5 2.475] 0 setdash
gsave
188.507187 113.225 m
208.507187 113.225 l
stroke
grestore
1.000 setlinewidth
0 setlinejoin
[] 0 setdash
gsave
/o {
gsave
newpath
translate
1.0 setlinewidth
0 setlinejoin

0 setlinecap

0 3 m
-3 -3 l
3 -3 l
cl

gsave
grestore
stroke
grestore
} bind def
198.507 113.225 o
grestore
0.000 setgray
gsave

213.507187 109.725000 translate
0.000000 rotate
0.000000 0 m /U glyphshow
7.319336 0 m /P glyphshow
13.349609 0 m /S glyphshow
19.697266 0 m /space glyphshow
22.875977 0 m /d glyphshow
29.223633 0 m /equal glyphshow
37.602539 0 m /zero glyphshow
43.964844 0 m /period glyphshow
47.143555 0 m /one glyphshow
grestore

end
showpage
