%!PS-Adobe-3.0 EPSF-3.0
%%Title: inconsistency_vs_round_10minus1.eps
%%Creator: Matplotlib v3.5.2, https://matplotlib.org/
%%CreationDate: Wed Sep 21 20:02:43 2022
%%Orientation: portrait
%%BoundingBox: 229 323 383 469
%%HiResBoundingBox: 229.059062 323.433750 382.940938 468.566250
%%EndComments
%%BeginProlog
/mpldict 11 dict def
mpldict begin
/_d { bind def } bind def
/m { moveto } _d
/l { lineto } _d
/r { rlineto } _d
/c { curveto } _d
/cl { closepath } _d
/ce { closepath eofill } _d
/box {
      m
      1 index 0 r
      0 exch r
      neg 0 r
      cl
    } _d
/clipbox {
      box
      clip
      newpath
    } _d
/sc { setcachedevice } _d
%!PS-Adobe-3.0 Resource-Font
%%Creator: Converted from TrueType to Type 3 by Matplotlib.
10 dict begin
/FontName /DejaVuSans def
/PaintType 0 def
/FontMatrix [0.00048828125 0 0 0.00048828125 0 0] def
/FontBBox [-2090 -948 3673 2524] def
/FontType 3 def
/Encoding [/space /percent /ampersand /zero /one /two /four /six /eight /colon /P /R /S /a /c /d /e /f /h /i /n /o /p /r /s /t /u /x /y] def
/CharStrings 30 dict dup begin
/.notdef 0 def
/space{651 0 0 0 0 0 sc
ce} _d
/percent{1946 0 113 -29 1833 1520 sc
1489 657 m
1431 657 1385 632 1352 583 c
1319 534 1303 465 1303 377 c
1303 290 1319 222 1352 172 c
1385 123 1431 98 1489 98 c
1546 98 1590 123 1623 172 c
1656 222 1673 290 1673 377 c
1673 464 1656 533 1623 582 c
1590 632 1546 657 1489 657 c

1489 784 m
1594 784 1678 747 1740 674 c
1802 601 1833 502 1833 377 c
1833 252 1802 153 1739 80 c
1677 7 1594 -29 1489 -29 c
1382 -29 1298 7 1236 80 c
1174 153 1143 252 1143 377 c
1143 502 1174 601 1236 674 c
1299 747 1383 784 1489 784 c

457 1393 m
400 1393 354 1368 321 1318 c
288 1269 272 1201 272 1114 c
272 1026 288 957 321 908 c
354 859 399 834 457 834 c
515 834 560 859 593 908 c
626 957 643 1026 643 1114 c
643 1200 626 1268 593 1318 c
560 1368 514 1393 457 1393 c

1360 1520 m
1520 1520 l
586 -29 l
426 -29 l
1360 1520 l

457 1520 m
562 1520 646 1483 709 1410 c
772 1337 803 1239 803 1114 c
803 988 772 889 709 816 c
647 743 563 707 457 707 c
351 707 267 743 205 816 c
144 889 113 989 113 1114 c
113 1238 144 1337 206 1410 c
268 1483 352 1520 457 1520 c

ce} _d
/ampersand{1597 0 129 -29 1534 1520 sc
498 803 m
437 749 393 695 364 641 c
336 588 322 532 322 473 c
322 376 357 295 428 230 c
499 165 587 133 694 133 c
757 133 817 143 872 164 c
927 185 979 217 1028 260 c
498 803 l

639 915 m
1147 395 l
1186 454 1217 518 1239 585 c
1261 653 1274 725 1278 801 c
1464 801 l
1456 713 1435 626 1400 540 c
1365 454 1317 369 1255 285 c
1534 0 l
1282 0 l
1139 147 l
1070 88 997 43 921 14 c
845 -15 763 -29 676 -29 c
515 -29 384 17 282 108 c
180 200 129 318 129 461 c
129 546 151 626 196 701 c
241 776 308 847 397 913 c
365 955 341 997 324 1038 c
307 1080 299 1121 299 1161 c
299 1269 336 1356 410 1421 c
484 1487 582 1520 705 1520 c
760 1520 815 1514 870 1502 c
925 1490 981 1472 1038 1448 c
1038 1266 l
980 1297 925 1321 872 1337 c
819 1354 770 1362 725 1362 c
655 1362 598 1343 554 1306 c
511 1269 489 1222 489 1163 c
489 1129 499 1095 518 1060 c
538 1026 578 978 639 915 c

ce} _d
/zero{1303 0 135 -29 1167 1520 sc
651 1360 m
547 1360 469 1309 416 1206 c
364 1104 338 950 338 745 c
338 540 364 387 416 284 c
469 182 547 131 651 131 c
756 131 834 182 886 284 c
939 387 965 540 965 745 c
965 950 939 1104 886 1206 c
834 1309 756 1360 651 1360 c

651 1520 m
818 1520 946 1454 1034 1321 c
1123 1189 1167 997 1167 745 c
1167 494 1123 302 1034 169 c
946 37 818 -29 651 -29 c
484 -29 356 37 267 169 c
179 302 135 494 135 745 c
135 997 179 1189 267 1321 c
356 1454 484 1520 651 1520 c

ce} _d
/one{1303 0 225 0 1114 1493 sc
254 170 m
584 170 l
584 1309 l
225 1237 l
225 1421 l
582 1493 l
784 1493 l
784 170 l
1114 170 l
1114 0 l
254 0 l
254 170 l

ce} _d
/two{1303 0 150 0 1098 1520 sc
393 170 m
1098 170 l
1098 0 l
150 0 l
150 170 l
227 249 331 356 463 489 c
596 623 679 709 713 748 c
778 821 823 882 848 932 c
874 983 887 1032 887 1081 c
887 1160 859 1225 803 1275 c
748 1325 675 1350 586 1350 c
523 1350 456 1339 385 1317 c
315 1295 240 1262 160 1217 c
160 1421 l
241 1454 317 1478 388 1495 c
459 1512 523 1520 582 1520 c
737 1520 860 1481 952 1404 c
1044 1327 1090 1223 1090 1094 c
1090 1033 1078 974 1055 919 c
1032 864 991 800 930 725 c
913 706 860 650 771 557 c
682 465 556 336 393 170 c

ce} _d
/four{1303 0 100 0 1188 1493 sc
774 1317 m
264 520 l
774 520 l
774 1317 l

721 1493 m
975 1493 l
975 520 l
1188 520 l
1188 352 l
975 352 l
975 0 l
774 0 l
774 352 l
100 352 l
100 547 l
721 1493 l

ce} _d
/six{1303 0 143 -29 1174 1520 sc
676 827 m
585 827 513 796 460 734 c
407 672 381 587 381 479 c
381 372 407 287 460 224 c
513 162 585 131 676 131 c
767 131 838 162 891 224 c
944 287 971 372 971 479 c
971 587 944 672 891 734 c
838 796 767 827 676 827 c

1077 1460 m
1077 1276 l
1026 1300 975 1318 923 1331 c
872 1344 821 1350 770 1350 c
637 1350 535 1305 464 1215 c
394 1125 354 989 344 807 c
383 865 433 909 492 940 c
551 971 617 987 688 987 c
838 987 956 941 1043 850 c
1130 759 1174 636 1174 479 c
1174 326 1129 203 1038 110 c
947 17 827 -29 676 -29 c
503 -29 371 37 280 169 c
189 302 143 494 143 745 c
143 981 199 1169 311 1309 c
423 1450 573 1520 762 1520 c
813 1520 864 1515 915 1505 c
967 1495 1021 1480 1077 1460 c

ce} _d
/eight{1303 0 139 -29 1163 1520 sc
651 709 m
555 709 479 683 424 632 c
369 581 342 510 342 420 c
342 330 369 259 424 208 c
479 157 555 131 651 131 c
747 131 823 157 878 208 c
933 260 961 331 961 420 c
961 510 933 581 878 632 c
823 683 748 709 651 709 c

449 795 m
362 816 295 857 246 916 c
198 975 174 1048 174 1133 c
174 1252 216 1347 301 1416 c
386 1485 503 1520 651 1520 c
800 1520 916 1485 1001 1416 c
1086 1347 1128 1252 1128 1133 c
1128 1048 1104 975 1055 916 c
1007 857 940 816 854 795 c
951 772 1027 728 1081 662 c
1136 596 1163 515 1163 420 c
1163 275 1119 164 1030 87 c
942 10 816 -29 651 -29 c
486 -29 360 10 271 87 c
183 164 139 275 139 420 c
139 515 166 596 221 662 c
276 728 352 772 449 795 c

375 1114 m
375 1037 399 976 447 933 c
496 890 564 868 651 868 c
738 868 805 890 854 933 c
903 976 928 1037 928 1114 c
928 1191 903 1252 854 1295 c
805 1338 738 1360 651 1360 c
564 1360 496 1338 447 1295 c
399 1252 375 1191 375 1114 c

ce} _d
/colon{690 0 240 0 451 1059 sc
240 254 m
451 254 l
451 0 l
240 0 l
240 254 l

240 1059 m
451 1059 l
451 805 l
240 805 l
240 1059 l

ce} _d
/P{1235 0 201 0 1165 1493 sc
403 1327 m
403 766 l
657 766 l
751 766 824 790 875 839 c
926 888 952 957 952 1047 c
952 1136 926 1205 875 1254 c
824 1303 751 1327 657 1327 c
403 1327 l

201 1493 m
657 1493 l
824 1493 951 1455 1036 1379 c
1122 1304 1165 1193 1165 1047 c
1165 900 1122 788 1036 713 c
951 638 824 600 657 600 c
403 600 l
403 0 l
201 0 l
201 1493 l

ce} _d
/R{1423 0 201 0 1364 1493 sc
909 700 m
952 685 994 654 1035 606 c
1076 558 1118 492 1159 408 c
1364 0 l
1147 0 l
956 383 l
907 483 859 549 812 582 c
766 615 703 631 623 631 c
403 631 l
403 0 l
201 0 l
201 1493 l
657 1493 l
828 1493 955 1457 1039 1386 c
1123 1315 1165 1207 1165 1063 c
1165 969 1143 891 1099 829 c
1056 767 992 724 909 700 c

403 1327 m
403 797 l
657 797 l
754 797 828 819 877 864 c
927 909 952 976 952 1063 c
952 1150 927 1216 877 1260 c
828 1305 754 1327 657 1327 c
403 1327 l

ce} _d
/S{1300 0 135 -29 1186 1520 sc
1096 1444 m
1096 1247 l
1019 1284 947 1311 879 1329 c
811 1347 745 1356 682 1356 c
572 1356 487 1335 427 1292 c
368 1249 338 1189 338 1110 c
338 1044 358 994 397 960 c
437 927 512 900 623 879 c
745 854 l
896 825 1007 775 1078 702 c
1150 630 1186 533 1186 412 c
1186 267 1137 158 1040 83 c
943 8 801 -29 614 -29 c
543 -29 468 -21 388 -5 c
309 11 226 35 141 66 c
141 274 l
223 228 303 193 382 170 c
461 147 538 135 614 135 c
729 135 818 158 881 203 c
944 248 975 313 975 397 c
975 470 952 528 907 569 c
862 610 789 641 686 662 c
563 686 l
412 716 303 763 236 827 c
169 891 135 980 135 1094 c
135 1226 181 1330 274 1406 c
367 1482 496 1520 659 1520 c
729 1520 800 1514 873 1501 c
946 1488 1020 1469 1096 1444 c

ce} _d
/a{1255 0 123 -29 1069 1147 sc
702 563 m
553 563 450 546 393 512 c
336 478 307 420 307 338 c
307 273 328 221 371 182 c
414 144 473 125 547 125 c
649 125 731 161 792 233 c
854 306 885 402 885 522 c
885 563 l
702 563 l

1069 639 m
1069 0 l
885 0 l
885 170 l
843 102 791 52 728 19 c
665 -13 589 -29 498 -29 c
383 -29 292 3 224 67 c
157 132 123 218 123 326 c
123 452 165 547 249 611 c
334 675 460 707 627 707 c
885 707 l
885 725 l
885 810 857 875 801 921 c
746 968 668 991 567 991 c
503 991 441 983 380 968 c
319 953 261 930 205 899 c
205 1069 l
272 1095 338 1114 401 1127 c
464 1140 526 1147 586 1147 c
748 1147 869 1105 949 1021 c
1029 937 1069 810 1069 639 c

ce} _d
/c{1126 0 113 -29 999 1147 sc
999 1077 m
999 905 l
947 934 895 955 842 969 c
790 984 737 991 684 991 c
565 991 472 953 406 877 c
340 802 307 696 307 559 c
307 422 340 316 406 240 c
472 165 565 127 684 127 c
737 127 790 134 842 148 c
895 163 947 184 999 213 c
999 43 l
948 19 894 1 839 -11 c
784 -23 726 -29 664 -29 c
495 -29 361 24 262 130 c
163 236 113 379 113 559 c
113 742 163 885 263 990 c
364 1095 501 1147 676 1147 c
733 1147 788 1141 842 1129 c
896 1118 948 1100 999 1077 c

ce} _d
/d{1300 0 113 -29 1114 1556 sc
930 950 m
930 1556 l
1114 1556 l
1114 0 l
930 0 l
930 168 l
891 101 842 52 783 19 c
724 -13 654 -29 571 -29 c
436 -29 325 25 240 133 c
155 241 113 383 113 559 c
113 735 155 877 240 985 c
325 1093 436 1147 571 1147 c
654 1147 724 1131 783 1098 c
842 1066 891 1017 930 950 c

303 559 m
303 424 331 317 386 240 c
442 163 519 125 616 125 c
713 125 790 163 846 240 c
902 317 930 424 930 559 c
930 694 902 800 846 877 c
790 954 713 993 616 993 c
519 993 442 954 386 877 c
331 800 303 694 303 559 c

ce} _d
/e{1260 0 113 -29 1151 1147 sc
1151 606 m
1151 516 l
305 516 l
313 389 351 293 419 226 c
488 160 583 127 705 127 c
776 127 844 136 910 153 c
977 170 1043 196 1108 231 c
1108 57 l
1042 29 974 8 905 -7 c
836 -22 765 -29 694 -29 c
515 -29 374 23 269 127 c
165 231 113 372 113 549 c
113 732 162 878 261 985 c
360 1093 494 1147 662 1147 c
813 1147 932 1098 1019 1001 c
1107 904 1151 773 1151 606 c

967 660 m
966 761 937 841 882 901 c
827 961 755 991 664 991 c
561 991 479 962 417 904 c
356 846 320 764 311 659 c
967 660 l

ce} _d
/f{721 0 47 0 760 1556 sc
760 1556 m
760 1403 l
584 1403 l
518 1403 472 1390 446 1363 c
421 1336 408 1288 408 1219 c
408 1120 l
711 1120 l
711 977 l
408 977 l
408 0 l
223 0 l
223 977 l
47 977 l
47 1120 l
223 1120 l
223 1198 l
223 1323 252 1413 310 1470 c
368 1527 460 1556 586 1556 c
760 1556 l

ce} _d
/h{1298 0 186 0 1124 1556 sc
1124 676 m
1124 0 l
940 0 l
940 670 l
940 776 919 855 878 908 c
837 961 775 987 692 987 c
593 987 514 955 457 892 c
400 829 371 742 371 633 c
371 0 l
186 0 l
186 1556 l
371 1556 l
371 946 l
415 1013 467 1064 526 1097 c
586 1130 655 1147 733 1147 c
862 1147 959 1107 1025 1027 c
1091 948 1124 831 1124 676 c

ce} _d
/i{569 0 193 0 377 1556 sc
193 1120 m
377 1120 l
377 0 l
193 0 l
193 1120 l

193 1556 m
377 1556 l
377 1323 l
193 1323 l
193 1556 l

ce} _d
/n{1298 0 186 0 1124 1147 sc
1124 676 m
1124 0 l
940 0 l
940 670 l
940 776 919 855 878 908 c
837 961 775 987 692 987 c
593 987 514 955 457 892 c
400 829 371 742 371 633 c
371 0 l
186 0 l
186 1120 l
371 1120 l
371 946 l
415 1013 467 1064 526 1097 c
586 1130 655 1147 733 1147 c
862 1147 959 1107 1025 1027 c
1091 948 1124 831 1124 676 c

ce} _d
/o{1253 0 113 -29 1141 1147 sc
627 991 m
528 991 450 952 393 875 c
336 798 307 693 307 559 c
307 425 335 319 392 242 c
449 165 528 127 627 127 c
725 127 803 166 860 243 c
917 320 946 426 946 559 c
946 692 917 797 860 874 c
803 952 725 991 627 991 c

627 1147 m
787 1147 913 1095 1004 991 c
1095 887 1141 743 1141 559 c
1141 376 1095 232 1004 127 c
913 23 787 -29 627 -29 c
466 -29 340 23 249 127 c
158 232 113 376 113 559 c
113 743 158 887 249 991 c
340 1095 466 1147 627 1147 c

ce} _d
/p{1300 0 186 -426 1188 1147 sc
371 168 m
371 -426 l
186 -426 l
186 1120 l
371 1120 l
371 950 l
410 1017 458 1066 517 1098 c
576 1131 647 1147 729 1147 c
865 1147 975 1093 1060 985 c
1145 877 1188 735 1188 559 c
1188 383 1145 241 1060 133 c
975 25 865 -29 729 -29 c
647 -29 576 -13 517 19 c
458 52 410 101 371 168 c

997 559 m
997 694 969 800 913 877 c
858 954 781 993 684 993 c
587 993 510 954 454 877 c
399 800 371 694 371 559 c
371 424 399 317 454 240 c
510 163 587 125 684 125 c
781 125 858 163 913 240 c
969 317 997 424 997 559 c

ce} _d
/r{842 0 186 0 842 1147 sc
842 948 m
821 960 799 969 774 974 c
750 980 723 983 694 983 c
590 983 510 949 454 881 c
399 814 371 717 371 590 c
371 0 l
186 0 l
186 1120 l
371 1120 l
371 946 l
410 1014 460 1064 522 1097 c
584 1130 659 1147 748 1147 c
761 1147 775 1146 790 1144 c
805 1143 822 1140 841 1137 c
842 948 l

ce} _d
/s{1067 0 111 -29 967 1147 sc
907 1087 m
907 913 l
855 940 801 960 745 973 c
689 986 631 993 571 993 c
480 993 411 979 365 951 c
320 923 297 881 297 825 c
297 782 313 749 346 724 c
379 700 444 677 543 655 c
606 641 l
737 613 829 573 884 522 c
939 471 967 400 967 309 c
967 205 926 123 843 62 c
761 1 648 -29 504 -29 c
444 -29 381 -23 316 -11 c
251 0 183 18 111 41 c
111 231 l
179 196 246 169 312 151 c
378 134 443 125 508 125 c
595 125 661 140 708 169 c
755 199 778 241 778 295 c
778 345 761 383 727 410 c
694 437 620 462 506 487 c
442 502 l
328 526 246 563 195 612 c
144 662 119 730 119 817 c
119 922 156 1004 231 1061 c
306 1118 412 1147 549 1147 c
617 1147 681 1142 741 1132 c
801 1122 856 1107 907 1087 c

ce} _d
/t{803 0 55 0 754 1438 sc
375 1438 m
375 1120 l
754 1120 l
754 977 l
375 977 l
375 369 l
375 278 387 219 412 193 c
437 167 488 154 565 154 c
754 154 l
754 0 l
565 0 l
423 0 325 26 271 79 c
217 132 190 229 190 369 c
190 977 l
55 977 l
55 1120 l
190 1120 l
190 1438 l
375 1438 l

ce} _d
/u{1298 0 174 -29 1112 1147 sc
174 442 m
174 1120 l
358 1120 l
358 449 l
358 343 379 263 420 210 c
461 157 523 131 606 131 c
705 131 784 163 841 226 c
899 289 928 376 928 485 c
928 1120 l
1112 1120 l
1112 0 l
928 0 l
928 172 l
883 104 831 53 772 20 c
713 -13 645 -29 567 -29 c
438 -29 341 11 274 91 c
207 171 174 288 174 442 c

637 1147 m
637 1147 l

ce} _d
/x{1212 0 59 0 1145 1120 sc
1124 1120 m
719 575 l
1145 0 l
928 0 l
602 440 l
276 0 l
59 0 l
494 586 l
96 1120 l
313 1120 l
610 721 l
907 1120 l
1124 1120 l

ce} _d
/y{1212 0 61 -426 1151 1120 sc
659 -104 m
607 -237 556 -324 507 -365 c
458 -406 392 -426 309 -426 c
162 -426 l
162 -272 l
270 -272 l
321 -272 360 -260 388 -236 c
416 -212 447 -155 481 -66 c
514 18 l
61 1120 l
256 1120 l
606 244 l
956 1120 l
1151 1120 l
659 -104 l

ce} _d
end readonly def

/BuildGlyph {
 exch begin
 CharStrings exch
 2 copy known not {pop /.notdef} if
 true 3 1 roll get exec
 end
} _d

/BuildChar {
 1 index /Encoding get exch get
 1 index /BuildGlyph get exec
} _d

FontName currentdict end definefont pop
end
%%EndProlog
mpldict begin
229.059 323.434 translate
153.882 145.132 0 0 clipbox
gsave
0 0 m
153.881875 0 l
153.881875 145.1325 l
0 145.1325 l
cl
1.000 setgray
fill
grestore
gsave
41.4075 30.110625 m
147.4275 30.110625 l
147.4275 140.990625 l
41.4075 140.990625 l
cl
1.000 setgray
fill
grestore
0.800 setlinewidth
1 setlinejoin
0 setlinecap
[2.96 1.28] 0 setdash
0.690 setgray
gsave
106.02 110.88 41.408 30.111 clipbox
41.4075 30.110625 m
41.4075 140.990625 l
stroke
grestore
[] 0 setdash
0.000 setgray
gsave
/o {
gsave
newpath
translate
0.8 setlinewidth
1 setlinejoin

0 setlinecap

0 0 m
0 -3.5 l

gsave
0.000 setgray
fill
grestore
stroke
grestore
} bind def
41.4075 30.1106 o
grestore
/DejaVuSans 9.000 selectfont
gsave

38.540313 16.266875 translate
0.000000 rotate
0.000000 0 m /two glyphshow
grestore
[2.96 1.28] 0 setdash
0.690 setgray
gsave
106.02 110.88 41.408 30.111 clipbox
54.66 30.110625 m
54.66 140.990625 l
stroke
grestore
[] 0 setdash
0.000 setgray
gsave
/o {
gsave
newpath
translate
0.8 setlinewidth
1 setlinejoin

0 setlinecap

0 0 m
0 -3.5 l

gsave
0.000 setgray
fill
grestore
stroke
grestore
} bind def
54.66 30.1106 o
grestore
gsave

51.792813 16.266875 translate
0.000000 rotate
0.000000 0 m /four glyphshow
grestore
[2.96 1.28] 0 setdash
0.690 setgray
gsave
106.02 110.88 41.408 30.111 clipbox
67.9125 30.110625 m
67.9125 140.990625 l
stroke
grestore
[] 0 setdash
0.000 setgray
gsave
/o {
gsave
newpath
translate
0.8 setlinewidth
1 setlinejoin

0 setlinecap

0 0 m
0 -3.5 l

gsave
0.000 setgray
fill
grestore
stroke
grestore
} bind def
67.9125 30.1106 o
grestore
gsave

65.045313 16.266875 translate
0.000000 rotate
0.000000 0 m /six glyphshow
grestore
[2.96 1.28] 0 setdash
0.690 setgray
gsave
106.02 110.88 41.408 30.111 clipbox
81.165 30.110625 m
81.165 140.990625 l
stroke
grestore
[] 0 setdash
0.000 setgray
gsave
/o {
gsave
newpath
translate
0.8 setlinewidth
1 setlinejoin

0 setlinecap

0 0 m
0 -3.5 l

gsave
0.000 setgray
fill
grestore
stroke
grestore
} bind def
81.165 30.1106 o
grestore
gsave

78.297813 16.266875 translate
0.000000 rotate
0.000000 0 m /eight glyphshow
grestore
[2.96 1.28] 0 setdash
0.690 setgray
gsave
106.02 110.88 41.408 30.111 clipbox
94.4175 30.110625 m
94.4175 140.990625 l
stroke
grestore
[] 0 setdash
0.000 setgray
gsave
/o {
gsave
newpath
translate
0.8 setlinewidth
1 setlinejoin

0 setlinecap

0 0 m
0 -3.5 l

gsave
0.000 setgray
fill
grestore
stroke
grestore
} bind def
94.4175 30.1106 o
grestore
gsave

88.683125 16.266875 translate
0.000000 rotate
0.000000 0 m /one glyphshow
5.726074 0 m /zero glyphshow
grestore
[2.96 1.28] 0 setdash
0.690 setgray
gsave
106.02 110.88 41.408 30.111 clipbox
107.67 30.110625 m
107.67 140.990625 l
stroke
grestore
[] 0 setdash
0.000 setgray
gsave
/o {
gsave
newpath
translate
0.8 setlinewidth
1 setlinejoin

0 setlinecap

0 0 m
0 -3.5 l

gsave
0.000 setgray
fill
grestore
stroke
grestore
} bind def
107.67 30.1106 o
grestore
gsave

101.935625 16.266875 translate
0.000000 rotate
0.000000 0 m /one glyphshow
5.726074 0 m /two glyphshow
grestore
[2.96 1.28] 0 setdash
0.690 setgray
gsave
106.02 110.88 41.408 30.111 clipbox
120.9225 30.110625 m
120.9225 140.990625 l
stroke
grestore
[] 0 setdash
0.000 setgray
gsave
/o {
gsave
newpath
translate
0.8 setlinewidth
1 setlinejoin

0 setlinecap

0 0 m
0 -3.5 l

gsave
0.000 setgray
fill
grestore
stroke
grestore
} bind def
120.923 30.1106 o
grestore
gsave

115.188125 16.266875 translate
0.000000 rotate
0.000000 0 m /one glyphshow
5.726074 0 m /four glyphshow
grestore
[2.96 1.28] 0 setdash
0.690 setgray
gsave
106.02 110.88 41.408 30.111 clipbox
134.175 30.110625 m
134.175 140.990625 l
stroke
grestore
[] 0 setdash
0.000 setgray
gsave
/o {
gsave
newpath
translate
0.8 setlinewidth
1 setlinejoin

0 setlinecap

0 0 m
0 -3.5 l

gsave
0.000 setgray
fill
grestore
stroke
grestore
} bind def
134.175 30.1106 o
grestore
gsave

128.440625 16.266875 translate
0.000000 rotate
0.000000 0 m /one glyphshow
5.726074 0 m /six glyphshow
grestore
[2.96 1.28] 0 setdash
0.690 setgray
gsave
106.02 110.88 41.408 30.111 clipbox
147.4275 30.110625 m
147.4275 140.990625 l
stroke
grestore
[] 0 setdash
0.000 setgray
gsave
/o {
gsave
newpath
translate
0.8 setlinewidth
1 setlinejoin

0 setlinecap

0 0 m
0 -3.5 l

gsave
0.000 setgray
fill
grestore
stroke
grestore
} bind def
147.428 30.1106 o
grestore
gsave

141.693125 16.266875 translate
0.000000 rotate
0.000000 0 m /one glyphshow
5.726074 0 m /eight glyphshow
grestore
/DejaVuSans 10.000 selectfont
gsave

76.003438 2.798125 translate
0.000000 rotate
0.000000 0 m /R glyphshow
6.448242 0 m /o glyphshow
12.566406 0 m /u glyphshow
18.904297 0 m /n glyphshow
25.242188 0 m /d glyphshow
31.589844 0 m /s glyphshow
grestore
[2.96 1.28] 0 setdash
0.690 setgray
gsave
106.02 110.88 41.408 30.111 clipbox
41.4075 32.757933 m
147.4275 32.757933 l
stroke
grestore
[] 0 setdash
0.000 setgray
gsave
/o {
gsave
newpath
translate
0.8 setlinewidth
1 setlinejoin

0 setlinecap

-0 0 m
-3.5 0 l

gsave
0.000 setgray
fill
grestore
stroke
grestore
} bind def
41.4075 32.7579 o
grestore
/DejaVuSans 9.000 selectfont
gsave

20.126250 29.336058 translate
0.000000 rotate
0.000000 0 m /zero glyphshow
5.726074 0 m /percent glyphshow
grestore
[2.96 1.28] 0 setdash
0.690 setgray
gsave
106.02 110.88 41.408 30.111 clipbox
41.4075 54.404471 m
147.4275 54.404471 l
stroke
grestore
[] 0 setdash
0.000 setgray
gsave
/o {
gsave
newpath
translate
0.8 setlinewidth
1 setlinejoin

0 setlinecap

-0 0 m
-3.5 0 l

gsave
0.000 setgray
fill
grestore
stroke
grestore
} bind def
41.4075 54.4045 o
grestore
gsave

20.126250 50.982596 translate
0.000000 rotate
0.000000 0 m /two glyphshow
5.726074 0 m /percent glyphshow
grestore
[2.96 1.28] 0 setdash
0.690 setgray
gsave
106.02 110.88 41.408 30.111 clipbox
41.4075 76.05101 m
147.4275 76.05101 l
stroke
grestore
[] 0 setdash
0.000 setgray
gsave
/o {
gsave
newpath
translate
0.8 setlinewidth
1 setlinejoin

0 setlinecap

-0 0 m
-3.5 0 l

gsave
0.000 setgray
fill
grestore
stroke
grestore
} bind def
41.4075 76.051 o
grestore
gsave

20.126250 72.629135 translate
0.000000 rotate
0.000000 0 m /four glyphshow
5.726074 0 m /percent glyphshow
grestore
[2.96 1.28] 0 setdash
0.690 setgray
gsave
106.02 110.88 41.408 30.111 clipbox
41.4075 97.697548 m
147.4275 97.697548 l
stroke
grestore
[] 0 setdash
0.000 setgray
gsave
/o {
gsave
newpath
translate
0.8 setlinewidth
1 setlinejoin

0 setlinecap

-0 0 m
-3.5 0 l

gsave
0.000 setgray
fill
grestore
stroke
grestore
} bind def
41.4075 97.6975 o
grestore
gsave

20.126250 94.275673 translate
0.000000 rotate
0.000000 0 m /six glyphshow
5.726074 0 m /percent glyphshow
grestore
[2.96 1.28] 0 setdash
0.690 setgray
gsave
106.02 110.88 41.408 30.111 clipbox
41.4075 119.344087 m
147.4275 119.344087 l
stroke
grestore
[] 0 setdash
0.000 setgray
gsave
/o {
gsave
newpath
translate
0.8 setlinewidth
1 setlinejoin

0 setlinecap

-0 0 m
-3.5 0 l

gsave
0.000 setgray
fill
grestore
stroke
grestore
} bind def
41.4075 119.344 o
grestore
gsave

20.126250 115.922212 translate
0.000000 rotate
0.000000 0 m /eight glyphshow
5.726074 0 m /percent glyphshow
grestore
[2.96 1.28] 0 setdash
0.690 setgray
gsave
106.02 110.88 41.408 30.111 clipbox
41.4075 140.990625 m
147.4275 140.990625 l
stroke
grestore
[] 0 setdash
0.000 setgray
gsave
/o {
gsave
newpath
translate
0.8 setlinewidth
1 setlinejoin

0 setlinecap

-0 0 m
-3.5 0 l

gsave
0.000 setgray
fill
grestore
stroke
grestore
} bind def
41.4075 140.991 o
grestore
gsave

14.391875 137.568750 translate
0.000000 rotate
0.000000 0 m /one glyphshow
5.726074 0 m /zero glyphshow
11.452148 0 m /percent glyphshow
grestore
/DejaVuSans 10.000 selectfont
gsave

8.313750 5.287500 translate
90.000000 rotate
0.000000 0 m /R glyphshow
6.698242 0 m /a glyphshow
12.826172 0 m /t glyphshow
16.747070 0 m /i glyphshow
19.525391 0 m /o glyphshow
25.643555 0 m /space glyphshow
28.822266 0 m /o glyphshow
34.940430 0 m /f glyphshow
38.460938 0 m /space glyphshow
41.639648 0 m /i glyphshow
44.417969 0 m /n glyphshow
50.755859 0 m /c glyphshow
56.253906 0 m /o glyphshow
62.372070 0 m /n glyphshow
68.709961 0 m /s glyphshow
73.919922 0 m /i glyphshow
76.698242 0 m /s glyphshow
81.908203 0 m /t glyphshow
85.829102 0 m /e glyphshow
91.981445 0 m /n glyphshow
98.319336 0 m /t glyphshow
102.240234 0 m /space glyphshow
105.418945 0 m /n glyphshow
111.756836 0 m /o glyphshow
117.875000 0 m /d glyphshow
124.222656 0 m /e glyphshow
130.375000 0 m /s glyphshow
grestore
0.750 setlinewidth
2 setlinecap
0.976 0.004 0.004 setrgbcolor
gsave
106.02 110.88 41.408 30.111 clipbox
28.155 32.757933 m
34.78125 32.757933 l
41.4075 32.757933 l
48.03375 32.866047 l
54.66 34.042882 l
61.28625 44.735223 l
67.9125 84.45833 l
74.53875 85.516493 l
81.165 85.563901 l
87.79125 85.610635 l
94.4175 85.657366 l
101.04375 85.704095 l
107.67 85.647878 l
114.29625 84.562489 l
120.9225 73.92983 l
127.54875 34.221234 l
134.175 33.200682 l
140.80125 33.200024 l
147.4275 33.200024 l
154.05375 33.200024 l
stroke
grestore
1.000 setlinewidth
0 setlinejoin
0 setlinecap
gsave
106.02 110.88 41.408 30.111 clipbox
/o {
gsave
newpath
translate
1.0 setlinewidth
0 setlinejoin

0 setlinecap

0 3 m
-3 -3 l
3 -3 l
cl

gsave
grestore
stroke
grestore
} bind def
28.155 32.7579 o
34.7813 32.7579 o
41.4075 32.7579 o
48.0338 32.866 o
54.66 34.0429 o
61.2863 44.7352 o
67.9125 84.4583 o
74.5388 85.5165 o
81.165 85.5639 o
87.7913 85.6106 o
94.4175 85.6574 o
101.044 85.7041 o
107.67 85.6479 o
114.296 84.5625 o
120.923 73.9298 o
127.549 34.2212 o
134.175 33.2007 o
140.801 33.2 o
147.428 33.2 o
154.054 33.2 o
grestore
0.750 setlinewidth
1 setlinejoin
2 setlinecap
0.008 0.400 0.784 setrgbcolor
gsave
106.02 110.88 41.408 30.111 clipbox
28.155 32.757933 m
34.78125 32.757933 l
41.4075 32.757933 l
48.03375 32.757933 l
54.66 32.757933 l
61.28625 32.758594 l
67.9125 32.83746 l
74.53875 38.007649 l
81.165 42.788503 l
87.79125 42.806753 l
94.4175 42.82279 l
101.04375 42.838825 l
107.67 42.854861 l
114.29625 42.870896 l
120.9225 42.886276 l
127.54875 42.823801 l
134.175 37.670274 l
140.80125 32.905753 l
147.4275 32.9036 l
154.05375 32.903599 l
stroke
grestore
1.000 setlinewidth
0 setlinejoin
0 setlinecap
gsave
106.02 110.88 41.408 30.111 clipbox
/o {
gsave
newpath
translate
1.0 setlinewidth
0 setlinejoin

0 setlinecap

-3 -3 m
3 -3 l
3 3 l
-3 3 l
cl

gsave
grestore
stroke
grestore
} bind def
28.155 32.7579 o
34.7813 32.7579 o
41.4075 32.7579 o
48.0338 32.7579 o
54.66 32.7579 o
61.2863 32.7586 o
67.9125 32.8375 o
74.5388 38.0076 o
81.165 42.7885 o
87.7913 42.8068 o
94.4175 42.8228 o
101.044 42.8388 o
107.67 42.8549 o
114.296 42.8709 o
120.923 42.8863 o
127.549 42.8238 o
134.175 37.6703 o
140.801 32.9058 o
147.428 32.9036 o
154.054 32.9036 o
grestore
0.750 setlinewidth
1 setlinejoin
[2.25 2.25] 0 setdash
0.498 setgray
gsave
106.02 110.88 41.408 30.111 clipbox
28.155 32.757933 m
34.78125 32.757933 l
41.4075 32.757933 l
48.03375 32.758366 l
54.66 32.884349 l
61.28625 40.26452 l
67.9125 81.664823 l
74.53875 82.49605 l
81.165 82.59649 l
87.79125 82.46358 l
94.4175 82.15923 l
101.04375 82.296469 l
107.67 82.42505 l
114.29625 81.480828 l
120.9225 73.284149 l
127.54875 33.748046 l
134.175 32.758799 l
140.80125 32.757933 l
147.4275 32.757933 l
154.05375 32.757933 l
stroke
grestore
1.000 setlinewidth
[] 0 setdash
gsave
106.02 110.88 41.408 30.111 clipbox
/o {
gsave
newpath
translate
1.0 setlinewidth
1 setlinejoin

0 setlinecap

0 -3 m
0.795609 -3 1.55874 -2.683901 2.12132 -2.12132 c
2.683901 -1.55874 3 -0.795609 3 0 c
3 0.795609 2.683901 1.55874 2.12132 2.12132 c
1.55874 2.683901 0.795609 3 0 3 c
-0.795609 3 -1.55874 2.683901 -2.12132 2.12132 c
-2.683901 1.55874 -3 0.795609 -3 0 c
-3 -0.795609 -2.683901 -1.55874 -2.12132 -2.12132 c
-1.55874 -2.683901 -0.795609 -3 0 -3 c
cl

gsave
grestore
stroke
grestore
} bind def
28.155 32.7579 o
34.7813 32.7579 o
41.4075 32.7579 o
48.0338 32.7584 o
54.66 32.8843 o
61.2863 40.2645 o
67.9125 81.6648 o
74.5388 82.4961 o
81.165 82.5965 o
87.7913 82.4636 o
94.4175 82.1592 o
101.044 82.2965 o
107.67 82.425 o
114.296 81.4808 o
120.923 73.2841 o
127.549 33.748 o
134.175 32.7588 o
140.801 32.7579 o
147.428 32.7579 o
154.054 32.7579 o
grestore
0.750 setlinewidth
[2.25 2.25] 0 setdash
gsave
106.02 110.88 41.408 30.111 clipbox
28.155 32.757933 m
34.78125 32.757933 l
41.4075 32.757933 l
48.03375 32.757933 l
54.66 32.757933 l
61.28625 32.757933 l
67.9125 32.795453 l
74.53875 38.616593 l
81.165 43.2211 l
87.79125 43.11763 l
94.4175 43.086218 l
101.04375 43.241978 l
107.67 43.093675 l
114.29625 42.955665 l
120.9225 43.06765 l
127.54875 42.872543 l
134.175 37.194944 l
140.80125 32.760336 l
147.4275 32.757981 l
154.05375 32.757981 l
stroke
grestore
1.000 setlinewidth
[] 0 setdash
gsave
106.02 110.88 41.408 30.111 clipbox
/o {
gsave
newpath
translate
1.0 setlinewidth
1 setlinejoin

0 setlinecap

-3 -3 m
3 3 l
-3 3 m
3 -3 l

gsave
grestore
stroke
grestore
} bind def
28.155 32.7579 o
34.7813 32.7579 o
41.4075 32.7579 o
48.0338 32.7579 o
54.66 32.7579 o
61.2863 32.7579 o
67.9125 32.7955 o
74.5388 38.6166 o
81.165 43.2211 o
87.7913 43.1176 o
94.4175 43.0862 o
101.044 43.242 o
107.67 43.0937 o
114.296 42.9557 o
120.923 43.0676 o
127.549 42.8725 o
134.175 37.1949 o
140.801 32.7603 o
147.428 32.758 o
154.054 32.758 o
grestore
0.800 setlinewidth
0 setlinejoin
2 setlinecap
0.000 setgray
gsave
41.4075 30.110625 m
41.4075 140.990625 l
stroke
grestore
gsave
41.4075 30.110625 m
147.4275 30.110625 l
stroke
grestore
1.000 setlinewidth
0 setlinecap
gsave
43.555 107.353125 m
145.28 107.353125 l
146.48 107.353125 147.08 107.953125 147.08 109.153125 c
147.08 134.690625 l
147.08 135.890625 146.48 136.490625 145.28 136.490625 c
43.555 136.490625 l
42.355 136.490625 41.755 135.890625 41.755 134.690625 c
41.755 109.153125 l
41.755 107.953125 42.355 107.353125 43.555 107.353125 c
cl
gsave
1.000 setgray
fill
grestore
stroke
grestore
0.750 setlinewidth
1 setlinejoin
2 setlinecap
0.976 0.004 0.004 setrgbcolor
gsave
45.355 129.196875 m
48.955 129.196875 l
52.555 129.196875 l
stroke
grestore
1.000 setlinewidth
0 setlinejoin
0 setlinecap
gsave
/o {
gsave
newpath
translate
1.0 setlinewidth
0 setlinejoin

0 setlinecap

0 3 m
-3 -3 l
3 -3 l
cl

gsave
grestore
stroke
grestore
} bind def
48.955 129.197 o
grestore
0.750 setlinewidth
1 setlinejoin
[2.25 2.25] 0 setdash
0.498 setgray
gsave
56.155 129.196875 m
59.755 129.196875 l
63.355 129.196875 l
stroke
grestore
1.000 setlinewidth
[] 0 setdash
gsave
/o {
gsave
newpath
translate
1.0 setlinewidth
1 setlinejoin

0 setlinecap

0 -3 m
0.795609 -3 1.55874 -2.683901 2.12132 -2.12132 c
2.683901 -1.55874 3 -0.795609 3 0 c
3 0.795609 2.683901 1.55874 2.12132 2.12132 c
1.55874 2.683901 0.795609 3 0 3 c
-0.795609 3 -1.55874 2.683901 -2.12132 2.12132 c
-2.683901 1.55874 -3 0.795609 -3 0 c
-3 -0.795609 -2.683901 -1.55874 -2.12132 -2.12132 c
-1.55874 -2.683901 -0.795609 -3 0 -3 c
cl

gsave
grestore
stroke
grestore
} bind def
59.755 129.197 o
grestore
0.000 setgray
/DejaVuSans 9.000 selectfont
gsave

67.855000 126.046875 translate
0.000000 rotate
0.000000 0 m /P glyphshow
5.427246 0 m /colon glyphshow
8.459473 0 m /space glyphshow
11.320312 0 m /t glyphshow
14.849121 0 m /h glyphshow
20.553223 0 m /e glyphshow
26.090332 0 m /o glyphshow
31.596680 0 m /r glyphshow
35.296875 0 m /y glyphshow
40.623047 0 m /space glyphshow
43.483887 0 m /ampersand glyphshow
50.501953 0 m /space glyphshow
53.362793 0 m /e glyphshow
58.774902 0 m /x glyphshow
64.101074 0 m /p glyphshow
69.813965 0 m /e glyphshow
grestore
0.750 setlinewidth
2 setlinecap
0.008 0.400 0.784 setrgbcolor
gsave
45.355 115.978125 m
48.955 115.978125 l
52.555 115.978125 l
stroke
grestore
1.000 setlinewidth
0 setlinejoin
0 setlinecap
gsave
/o {
gsave
newpath
translate
1.0 setlinewidth
0 setlinejoin

0 setlinecap

-3 -3 m
3 -3 l
3 3 l
-3 3 l
cl

gsave
grestore
stroke
grestore
} bind def
48.955 115.978 o
grestore
0.750 setlinewidth
1 setlinejoin
[2.25 2.25] 0 setdash
0.498 setgray
gsave
56.155 115.978125 m
59.755 115.978125 l
63.355 115.978125 l
stroke
grestore
1.000 setlinewidth
[] 0 setdash
gsave
/o {
gsave
newpath
translate
1.0 setlinewidth
1 setlinejoin

0 setlinecap

-3 -3 m
3 3 l
-3 3 m
3 -3 l

gsave
grestore
stroke
grestore
} bind def
59.755 115.978 o
grestore
0.000 setgray
gsave

67.855000 112.828125 translate
0.000000 rotate
0.000000 0 m /S glyphshow
5.712891 0 m /colon glyphshow
8.745117 0 m /space glyphshow
11.605957 0 m /t glyphshow
15.134766 0 m /h glyphshow
20.838867 0 m /e glyphshow
26.375977 0 m /o glyphshow
31.882324 0 m /r glyphshow
35.582520 0 m /y glyphshow
40.908691 0 m /space glyphshow
43.769531 0 m /ampersand glyphshow
50.787598 0 m /space glyphshow
53.648438 0 m /e glyphshow
59.060547 0 m /x glyphshow
64.386719 0 m /p glyphshow
70.099609 0 m /e glyphshow
grestore

end
showpage
