%!PS-Adobe-3.0 EPSF-3.0
%%Title: latency_vs_density_P_and_S.eps
%%Creator: Matplotlib v3.5.2, https://matplotlib.org/
%%CreationDate: Wed Sep 21 20:02:42 2022
%%Orientation: portrait
%%BoundingBox: 235 324 377 468
%%HiResBoundingBox: 235.976420 324.504063 376.023580 467.495938
%%EndComments
%%BeginProlog
/mpldict 11 dict def
mpldict begin
/_d { bind def } bind def
/m { moveto } _d
/l { lineto } _d
/r { rlineto } _d
/c { curveto } _d
/cl { closepath } _d
/ce { closepath eofill } _d
/box {
      m
      1 index 0 r
      0 exch r
      neg 0 r
      cl
    } _d
/clipbox {
      box
      clip
      newpath
    } _d
/sc { setcachedevice } _d
%!PS-Adobe-3.0 Resource-Font
%%Creator: Converted from TrueType to Type 3 by Matplotlib.
10 dict begin
/FontName /DejaVuSans def
/PaintType 0 def
/FontMatrix [0.00048828125 0 0 0.00048828125 0 0] def
/FontBBox [-2090 -948 3673 2524] def
/FontType 3 def
/Encoding [/minus /zero /one /two /three /four /six /D /L /P /S /a /c /e /i /n /s /t /y] def
/CharStrings 20 dict dup begin
/.notdef 0 def
/minus{1716 0 217 557 1499 727 sc
217 727 m
1499 727 l
1499 557 l
217 557 l
217 727 l

ce} _d
/zero{1303 0 135 -29 1167 1520 sc
651 1360 m
547 1360 469 1309 416 1206 c
364 1104 338 950 338 745 c
338 540 364 387 416 284 c
469 182 547 131 651 131 c
756 131 834 182 886 284 c
939 387 965 540 965 745 c
965 950 939 1104 886 1206 c
834 1309 756 1360 651 1360 c

651 1520 m
818 1520 946 1454 1034 1321 c
1123 1189 1167 997 1167 745 c
1167 494 1123 302 1034 169 c
946 37 818 -29 651 -29 c
484 -29 356 37 267 169 c
179 302 135 494 135 745 c
135 997 179 1189 267 1321 c
356 1454 484 1520 651 1520 c

ce} _d
/one{1303 0 225 0 1114 1493 sc
254 170 m
584 170 l
584 1309 l
225 1237 l
225 1421 l
582 1493 l
784 1493 l
784 170 l
1114 170 l
1114 0 l
254 0 l
254 170 l

ce} _d
/two{1303 0 150 0 1098 1520 sc
393 170 m
1098 170 l
1098 0 l
150 0 l
150 170 l
227 249 331 356 463 489 c
596 623 679 709 713 748 c
778 821 823 882 848 932 c
874 983 887 1032 887 1081 c
887 1160 859 1225 803 1275 c
748 1325 675 1350 586 1350 c
523 1350 456 1339 385 1317 c
315 1295 240 1262 160 1217 c
160 1421 l
241 1454 317 1478 388 1495 c
459 1512 523 1520 582 1520 c
737 1520 860 1481 952 1404 c
1044 1327 1090 1223 1090 1094 c
1090 1033 1078 974 1055 919 c
1032 864 991 800 930 725 c
913 706 860 650 771 557 c
682 465 556 336 393 170 c

ce} _d
/three{1303 0 156 -29 1139 1520 sc
831 805 m
928 784 1003 741 1057 676 c
1112 611 1139 530 1139 434 c
1139 287 1088 173 987 92 c
886 11 742 -29 555 -29 c
492 -29 428 -23 361 -10 c
295 2 227 20 156 45 c
156 240 l
212 207 273 183 340 166 c
407 149 476 141 549 141 c
676 141 772 166 838 216 c
905 266 938 339 938 434 c
938 522 907 591 845 640 c
784 690 698 715 588 715 c
414 715 l
414 881 l
596 881 l
695 881 771 901 824 940 c
877 980 903 1037 903 1112 c
903 1189 876 1247 821 1288 c
767 1329 689 1350 588 1350 c
533 1350 473 1344 410 1332 c
347 1320 277 1301 201 1276 c
201 1456 l
278 1477 349 1493 416 1504 c
483 1515 547 1520 606 1520 c
759 1520 881 1485 970 1415 c
1059 1346 1104 1252 1104 1133 c
1104 1050 1080 980 1033 923 c
986 866 918 827 831 805 c

ce} _d
/four{1303 0 100 0 1188 1493 sc
774 1317 m
264 520 l
774 520 l
774 1317 l

721 1493 m
975 1493 l
975 520 l
1188 520 l
1188 352 l
975 352 l
975 0 l
774 0 l
774 352 l
100 352 l
100 547 l
721 1493 l

ce} _d
/six{1303 0 143 -29 1174 1520 sc
676 827 m
585 827 513 796 460 734 c
407 672 381 587 381 479 c
381 372 407 287 460 224 c
513 162 585 131 676 131 c
767 131 838 162 891 224 c
944 287 971 372 971 479 c
971 587 944 672 891 734 c
838 796 767 827 676 827 c

1077 1460 m
1077 1276 l
1026 1300 975 1318 923 1331 c
872 1344 821 1350 770 1350 c
637 1350 535 1305 464 1215 c
394 1125 354 989 344 807 c
383 865 433 909 492 940 c
551 971 617 987 688 987 c
838 987 956 941 1043 850 c
1130 759 1174 636 1174 479 c
1174 326 1129 203 1038 110 c
947 17 827 -29 676 -29 c
503 -29 371 37 280 169 c
189 302 143 494 143 745 c
143 981 199 1169 311 1309 c
423 1450 573 1520 762 1520 c
813 1520 864 1515 915 1505 c
967 1495 1021 1480 1077 1460 c

ce} _d
/D{1577 0 201 0 1456 1493 sc
403 1327 m
403 166 l
647 166 l
853 166 1004 213 1099 306 c
1195 399 1243 547 1243 748 c
1243 948 1195 1094 1099 1187 c
1004 1280 853 1327 647 1327 c
403 1327 l

201 1493 m
616 1493 l
905 1493 1118 1433 1253 1312 c
1388 1192 1456 1004 1456 748 c
1456 491 1388 302 1252 181 c
1116 60 904 0 616 0 c
201 0 l
201 1493 l

ce} _d
/L{1141 0 201 0 1130 1493 sc
201 1493 m
403 1493 l
403 170 l
1130 170 l
1130 0 l
201 0 l
201 1493 l

ce} _d
/P{1235 0 201 0 1165 1493 sc
403 1327 m
403 766 l
657 766 l
751 766 824 790 875 839 c
926 888 952 957 952 1047 c
952 1136 926 1205 875 1254 c
824 1303 751 1327 657 1327 c
403 1327 l

201 1493 m
657 1493 l
824 1493 951 1455 1036 1379 c
1122 1304 1165 1193 1165 1047 c
1165 900 1122 788 1036 713 c
951 638 824 600 657 600 c
403 600 l
403 0 l
201 0 l
201 1493 l

ce} _d
/S{1300 0 135 -29 1186 1520 sc
1096 1444 m
1096 1247 l
1019 1284 947 1311 879 1329 c
811 1347 745 1356 682 1356 c
572 1356 487 1335 427 1292 c
368 1249 338 1189 338 1110 c
338 1044 358 994 397 960 c
437 927 512 900 623 879 c
745 854 l
896 825 1007 775 1078 702 c
1150 630 1186 533 1186 412 c
1186 267 1137 158 1040 83 c
943 8 801 -29 614 -29 c
543 -29 468 -21 388 -5 c
309 11 226 35 141 66 c
141 274 l
223 228 303 193 382 170 c
461 147 538 135 614 135 c
729 135 818 158 881 203 c
944 248 975 313 975 397 c
975 470 952 528 907 569 c
862 610 789 641 686 662 c
563 686 l
412 716 303 763 236 827 c
169 891 135 980 135 1094 c
135 1226 181 1330 274 1406 c
367 1482 496 1520 659 1520 c
729 1520 800 1514 873 1501 c
946 1488 1020 1469 1096 1444 c

ce} _d
/a{1255 0 123 -29 1069 1147 sc
702 563 m
553 563 450 546 393 512 c
336 478 307 420 307 338 c
307 273 328 221 371 182 c
414 144 473 125 547 125 c
649 125 731 161 792 233 c
854 306 885 402 885 522 c
885 563 l
702 563 l

1069 639 m
1069 0 l
885 0 l
885 170 l
843 102 791 52 728 19 c
665 -13 589 -29 498 -29 c
383 -29 292 3 224 67 c
157 132 123 218 123 326 c
123 452 165 547 249 611 c
334 675 460 707 627 707 c
885 707 l
885 725 l
885 810 857 875 801 921 c
746 968 668 991 567 991 c
503 991 441 983 380 968 c
319 953 261 930 205 899 c
205 1069 l
272 1095 338 1114 401 1127 c
464 1140 526 1147 586 1147 c
748 1147 869 1105 949 1021 c
1029 937 1069 810 1069 639 c

ce} _d
/c{1126 0 113 -29 999 1147 sc
999 1077 m
999 905 l
947 934 895 955 842 969 c
790 984 737 991 684 991 c
565 991 472 953 406 877 c
340 802 307 696 307 559 c
307 422 340 316 406 240 c
472 165 565 127 684 127 c
737 127 790 134 842 148 c
895 163 947 184 999 213 c
999 43 l
948 19 894 1 839 -11 c
784 -23 726 -29 664 -29 c
495 -29 361 24 262 130 c
163 236 113 379 113 559 c
113 742 163 885 263 990 c
364 1095 501 1147 676 1147 c
733 1147 788 1141 842 1129 c
896 1118 948 1100 999 1077 c

ce} _d
/e{1260 0 113 -29 1151 1147 sc
1151 606 m
1151 516 l
305 516 l
313 389 351 293 419 226 c
488 160 583 127 705 127 c
776 127 844 136 910 153 c
977 170 1043 196 1108 231 c
1108 57 l
1042 29 974 8 905 -7 c
836 -22 765 -29 694 -29 c
515 -29 374 23 269 127 c
165 231 113 372 113 549 c
113 732 162 878 261 985 c
360 1093 494 1147 662 1147 c
813 1147 932 1098 1019 1001 c
1107 904 1151 773 1151 606 c

967 660 m
966 761 937 841 882 901 c
827 961 755 991 664 991 c
561 991 479 962 417 904 c
356 846 320 764 311 659 c
967 660 l

ce} _d
/i{569 0 193 0 377 1556 sc
193 1120 m
377 1120 l
377 0 l
193 0 l
193 1120 l

193 1556 m
377 1556 l
377 1323 l
193 1323 l
193 1556 l

ce} _d
/n{1298 0 186 0 1124 1147 sc
1124 676 m
1124 0 l
940 0 l
940 670 l
940 776 919 855 878 908 c
837 961 775 987 692 987 c
593 987 514 955 457 892 c
400 829 371 742 371 633 c
371 0 l
186 0 l
186 1120 l
371 1120 l
371 946 l
415 1013 467 1064 526 1097 c
586 1130 655 1147 733 1147 c
862 1147 959 1107 1025 1027 c
1091 948 1124 831 1124 676 c

ce} _d
/s{1067 0 111 -29 967 1147 sc
907 1087 m
907 913 l
855 940 801 960 745 973 c
689 986 631 993 571 993 c
480 993 411 979 365 951 c
320 923 297 881 297 825 c
297 782 313 749 346 724 c
379 700 444 677 543 655 c
606 641 l
737 613 829 573 884 522 c
939 471 967 400 967 309 c
967 205 926 123 843 62 c
761 1 648 -29 504 -29 c
444 -29 381 -23 316 -11 c
251 0 183 18 111 41 c
111 231 l
179 196 246 169 312 151 c
378 134 443 125 508 125 c
595 125 661 140 708 169 c
755 199 778 241 778 295 c
778 345 761 383 727 410 c
694 437 620 462 506 487 c
442 502 l
328 526 246 563 195 612 c
144 662 119 730 119 817 c
119 922 156 1004 231 1061 c
306 1118 412 1147 549 1147 c
617 1147 681 1142 741 1132 c
801 1122 856 1107 907 1087 c

ce} _d
/t{803 0 55 0 754 1438 sc
375 1438 m
375 1120 l
754 1120 l
754 977 l
375 977 l
375 369 l
375 278 387 219 412 193 c
437 167 488 154 565 154 c
754 154 l
754 0 l
565 0 l
423 0 325 26 271 79 c
217 132 190 229 190 369 c
190 977 l
55 977 l
55 1120 l
190 1120 l
190 1438 l
375 1438 l

ce} _d
/y{1212 0 61 -426 1151 1120 sc
659 -104 m
607 -237 556 -324 507 -365 c
458 -406 392 -426 309 -426 c
162 -426 l
162 -272 l
270 -272 l
321 -272 360 -260 388 -236 c
416 -212 447 -155 481 -66 c
514 18 l
61 1120 l
256 1120 l
606 244 l
956 1120 l
1151 1120 l
659 -104 l

ce} _d
end readonly def

/BuildGlyph {
 exch begin
 CharStrings exch
 2 copy known not {pop /.notdef} if
 true 3 1 roll get exec
 end
} _d

/BuildChar {
 1 index /Encoding get exch get
 1 index /BuildGlyph get exec
} _d

FontName currentdict end definefont pop
end
%%EndProlog
mpldict begin
235.976 324.504 translate
140.047 142.992 0 0 clipbox
gsave
0 0 m
140.047159 0 l
140.047159 142.991875 l
0 142.991875 l
cl
1.000 setgray
fill
grestore
gsave
27.12625 31.391875 m
133.14625 31.391875 l
133.14625 142.271875 l
27.12625 142.271875 l
cl
1.000 setgray
fill
grestore
0.800 setlinewidth
1 setlinejoin
0 setlinecap
[2.96 1.28] 0 setdash
0.690 setgray
gsave
106.02 110.88 27.126 31.392 clipbox
56.905974 31.391875 m
56.905974 142.271875 l
stroke
grestore
[] 0 setdash
0.000 setgray
gsave
/o {
gsave
newpath
translate
0.8 setlinewidth
1 setlinejoin

0 setlinecap

0 0 m
0 -3.5 l

gsave
0.000 setgray
fill
grestore
stroke
grestore
} bind def
56.906 31.3919 o
grestore
gsave
45.905974 16.266875 translate
0.000000 rotate
/DejaVuSans 9.0 selectfont
0.000000 0.873438 moveto
/one glyphshow
5.726074 0.873438 moveto
/zero glyphshow
/DejaVuSans 6.3 selectfont
11.538281 4.318750 moveto
/minus glyphshow
16.816992 4.318750 moveto
/three glyphshow
grestore
[2.96 1.28] 0 setdash
0.690 setgray
gsave
106.02 110.88 27.126 31.392 clipbox
92.616567 31.391875 m
92.616567 142.271875 l
stroke
grestore
[] 0 setdash
0.000 setgray
gsave
/o {
gsave
newpath
translate
0.8 setlinewidth
1 setlinejoin

0 setlinecap

0 0 m
0 -3.5 l

gsave
0.000 setgray
fill
grestore
stroke
grestore
} bind def
92.6166 31.3919 o
grestore
gsave
81.616567 16.266875 translate
0.000000 rotate
/DejaVuSans 9.0 selectfont
0.000000 0.873438 moveto
/one glyphshow
5.726074 0.873438 moveto
/zero glyphshow
/DejaVuSans 6.3 selectfont
11.538281 4.318750 moveto
/minus glyphshow
16.816992 4.318750 moveto
/two glyphshow
grestore
[2.96 1.28] 0 setdash
0.690 setgray
gsave
106.02 110.88 27.126 31.392 clipbox
128.327159 31.391875 m
128.327159 142.271875 l
stroke
grestore
[] 0 setdash
0.000 setgray
gsave
/o {
gsave
newpath
translate
0.8 setlinewidth
1 setlinejoin

0 setlinecap

0 0 m
0 -3.5 l

gsave
0.000 setgray
fill
grestore
stroke
grestore
} bind def
128.327 31.3919 o
grestore
gsave
117.327159 16.266875 translate
0.000000 rotate
/DejaVuSans 9.0 selectfont
0.000000 0.960938 moveto
/one glyphshow
5.726074 0.960938 moveto
/zero glyphshow
/DejaVuSans 6.3 selectfont
11.538281 4.406250 moveto
/minus glyphshow
16.816992 4.406250 moveto
/one glyphshow
grestore
[2.96 1.28] 0 setdash
0.690 setgray
gsave
106.02 110.88 27.126 31.392 clipbox
31.945341 31.391875 m
31.945341 142.271875 l
stroke
grestore
0.600 setlinewidth
[] 0 setdash
0.000 setgray
gsave
/o {
gsave
newpath
translate
0.6 setlinewidth
1 setlinejoin

0 setlinecap

0 0 m
0 -2 l

gsave
0.000 setgray
fill
grestore
stroke
grestore
} bind def
31.9453 31.3919 o
grestore
0.800 setlinewidth
[2.96 1.28] 0 setdash
0.690 setgray
gsave
106.02 110.88 27.126 31.392 clipbox
38.233664 31.391875 m
38.233664 142.271875 l
stroke
grestore
0.600 setlinewidth
[] 0 setdash
0.000 setgray
gsave
/o {
gsave
newpath
translate
0.6 setlinewidth
1 setlinejoin

0 setlinecap

0 0 m
0 -2 l

gsave
0.000 setgray
fill
grestore
stroke
grestore
} bind def
38.2337 31.3919 o
grestore
0.800 setlinewidth
[2.96 1.28] 0 setdash
0.690 setgray
gsave
106.02 110.88 27.126 31.392 clipbox
42.6953 31.391875 m
42.6953 142.271875 l
stroke
grestore
0.600 setlinewidth
[] 0 setdash
0.000 setgray
gsave
/o {
gsave
newpath
translate
0.6 setlinewidth
1 setlinejoin

0 setlinecap

0 0 m
0 -2 l

gsave
0.000 setgray
fill
grestore
stroke
grestore
} bind def
42.6953 31.3919 o
grestore
0.800 setlinewidth
[2.96 1.28] 0 setdash
0.690 setgray
gsave
106.02 110.88 27.126 31.392 clipbox
46.156014 31.391875 m
46.156014 142.271875 l
stroke
grestore
0.600 setlinewidth
[] 0 setdash
0.000 setgray
gsave
/o {
gsave
newpath
translate
0.6 setlinewidth
1 setlinejoin

0 setlinecap

0 0 m
0 -2 l

gsave
0.000 setgray
fill
grestore
stroke
grestore
} bind def
46.156 31.3919 o
grestore
0.800 setlinewidth
[2.96 1.28] 0 setdash
0.690 setgray
gsave
106.02 110.88 27.126 31.392 clipbox
48.983624 31.391875 m
48.983624 142.271875 l
stroke
grestore
0.600 setlinewidth
[] 0 setdash
0.000 setgray
gsave
/o {
gsave
newpath
translate
0.6 setlinewidth
1 setlinejoin

0 setlinecap

0 0 m
0 -2 l

gsave
0.000 setgray
fill
grestore
stroke
grestore
} bind def
48.9836 31.3919 o
grestore
0.800 setlinewidth
[2.96 1.28] 0 setdash
0.690 setgray
gsave
106.02 110.88 27.126 31.392 clipbox
51.374333 31.391875 m
51.374333 142.271875 l
stroke
grestore
0.600 setlinewidth
[] 0 setdash
0.000 setgray
gsave
/o {
gsave
newpath
translate
0.6 setlinewidth
1 setlinejoin

0 setlinecap

0 0 m
0 -2 l

gsave
0.000 setgray
fill
grestore
stroke
grestore
} bind def
51.3743 31.3919 o
grestore
0.800 setlinewidth
[2.96 1.28] 0 setdash
0.690 setgray
gsave
106.02 110.88 27.126 31.392 clipbox
53.44526 31.391875 m
53.44526 142.271875 l
stroke
grestore
0.600 setlinewidth
[] 0 setdash
0.000 setgray
gsave
/o {
gsave
newpath
translate
0.6 setlinewidth
1 setlinejoin

0 setlinecap

0 0 m
0 -2 l

gsave
0.000 setgray
fill
grestore
stroke
grestore
} bind def
53.4453 31.3919 o
grestore
0.800 setlinewidth
[2.96 1.28] 0 setdash
0.690 setgray
gsave
106.02 110.88 27.126 31.392 clipbox
55.271947 31.391875 m
55.271947 142.271875 l
stroke
grestore
0.600 setlinewidth
[] 0 setdash
0.000 setgray
gsave
/o {
gsave
newpath
translate
0.6 setlinewidth
1 setlinejoin

0 setlinecap

0 0 m
0 -2 l

gsave
0.000 setgray
fill
grestore
stroke
grestore
} bind def
55.2719 31.3919 o
grestore
0.800 setlinewidth
[2.96 1.28] 0 setdash
0.690 setgray
gsave
106.02 110.88 27.126 31.392 clipbox
67.655933 31.391875 m
67.655933 142.271875 l
stroke
grestore
0.600 setlinewidth
[] 0 setdash
0.000 setgray
gsave
/o {
gsave
newpath
translate
0.6 setlinewidth
1 setlinejoin

0 setlinecap

0 0 m
0 -2 l

gsave
0.000 setgray
fill
grestore
stroke
grestore
} bind def
67.6559 31.3919 o
grestore
0.800 setlinewidth
[2.96 1.28] 0 setdash
0.690 setgray
gsave
106.02 110.88 27.126 31.392 clipbox
73.944257 31.391875 m
73.944257 142.271875 l
stroke
grestore
0.600 setlinewidth
[] 0 setdash
0.000 setgray
gsave
/o {
gsave
newpath
translate
0.6 setlinewidth
1 setlinejoin

0 setlinecap

0 0 m
0 -2 l

gsave
0.000 setgray
fill
grestore
stroke
grestore
} bind def
73.9443 31.3919 o
grestore
0.800 setlinewidth
[2.96 1.28] 0 setdash
0.690 setgray
gsave
106.02 110.88 27.126 31.392 clipbox
78.405893 31.391875 m
78.405893 142.271875 l
stroke
grestore
0.600 setlinewidth
[] 0 setdash
0.000 setgray
gsave
/o {
gsave
newpath
translate
0.6 setlinewidth
1 setlinejoin

0 setlinecap

0 0 m
0 -2 l

gsave
0.000 setgray
fill
grestore
stroke
grestore
} bind def
78.4059 31.3919 o
grestore
0.800 setlinewidth
[2.96 1.28] 0 setdash
0.690 setgray
gsave
106.02 110.88 27.126 31.392 clipbox
81.866607 31.391875 m
81.866607 142.271875 l
stroke
grestore
0.600 setlinewidth
[] 0 setdash
0.000 setgray
gsave
/o {
gsave
newpath
translate
0.6 setlinewidth
1 setlinejoin

0 setlinecap

0 0 m
0 -2 l

gsave
0.000 setgray
fill
grestore
stroke
grestore
} bind def
81.8666 31.3919 o
grestore
0.800 setlinewidth
[2.96 1.28] 0 setdash
0.690 setgray
gsave
106.02 110.88 27.126 31.392 clipbox
84.694216 31.391875 m
84.694216 142.271875 l
stroke
grestore
0.600 setlinewidth
[] 0 setdash
0.000 setgray
gsave
/o {
gsave
newpath
translate
0.6 setlinewidth
1 setlinejoin

0 setlinecap

0 0 m
0 -2 l

gsave
0.000 setgray
fill
grestore
stroke
grestore
} bind def
84.6942 31.3919 o
grestore
0.800 setlinewidth
[2.96 1.28] 0 setdash
0.690 setgray
gsave
106.02 110.88 27.126 31.392 clipbox
87.084926 31.391875 m
87.084926 142.271875 l
stroke
grestore
0.600 setlinewidth
[] 0 setdash
0.000 setgray
gsave
/o {
gsave
newpath
translate
0.6 setlinewidth
1 setlinejoin

0 setlinecap

0 0 m
0 -2 l

gsave
0.000 setgray
fill
grestore
stroke
grestore
} bind def
87.0849 31.3919 o
grestore
0.800 setlinewidth
[2.96 1.28] 0 setdash
0.690 setgray
gsave
106.02 110.88 27.126 31.392 clipbox
89.155853 31.391875 m
89.155853 142.271875 l
stroke
grestore
0.600 setlinewidth
[] 0 setdash
0.000 setgray
gsave
/o {
gsave
newpath
translate
0.6 setlinewidth
1 setlinejoin

0 setlinecap

0 0 m
0 -2 l

gsave
0.000 setgray
fill
grestore
stroke
grestore
} bind def
89.1559 31.3919 o
grestore
0.800 setlinewidth
[2.96 1.28] 0 setdash
0.690 setgray
gsave
106.02 110.88 27.126 31.392 clipbox
90.982539 31.391875 m
90.982539 142.271875 l
stroke
grestore
0.600 setlinewidth
[] 0 setdash
0.000 setgray
gsave
/o {
gsave
newpath
translate
0.6 setlinewidth
1 setlinejoin

0 setlinecap

0 0 m
0 -2 l

gsave
0.000 setgray
fill
grestore
stroke
grestore
} bind def
90.9825 31.3919 o
grestore
0.800 setlinewidth
[2.96 1.28] 0 setdash
0.690 setgray
gsave
106.02 110.88 27.126 31.392 clipbox
103.366526 31.391875 m
103.366526 142.271875 l
stroke
grestore
0.600 setlinewidth
[] 0 setdash
0.000 setgray
gsave
/o {
gsave
newpath
translate
0.6 setlinewidth
1 setlinejoin

0 setlinecap

0 0 m
0 -2 l

gsave
0.000 setgray
fill
grestore
stroke
grestore
} bind def
103.367 31.3919 o
grestore
0.800 setlinewidth
[2.96 1.28] 0 setdash
0.690 setgray
gsave
106.02 110.88 27.126 31.392 clipbox
109.654849 31.391875 m
109.654849 142.271875 l
stroke
grestore
0.600 setlinewidth
[] 0 setdash
0.000 setgray
gsave
/o {
gsave
newpath
translate
0.6 setlinewidth
1 setlinejoin

0 setlinecap

0 0 m
0 -2 l

gsave
0.000 setgray
fill
grestore
stroke
grestore
} bind def
109.655 31.3919 o
grestore
0.800 setlinewidth
[2.96 1.28] 0 setdash
0.690 setgray
gsave
106.02 110.88 27.126 31.392 clipbox
114.116486 31.391875 m
114.116486 142.271875 l
stroke
grestore
0.600 setlinewidth
[] 0 setdash
0.000 setgray
gsave
/o {
gsave
newpath
translate
0.6 setlinewidth
1 setlinejoin

0 setlinecap

0 0 m
0 -2 l

gsave
0.000 setgray
fill
grestore
stroke
grestore
} bind def
114.116 31.3919 o
grestore
0.800 setlinewidth
[2.96 1.28] 0 setdash
0.690 setgray
gsave
106.02 110.88 27.126 31.392 clipbox
117.5772 31.391875 m
117.5772 142.271875 l
stroke
grestore
0.600 setlinewidth
[] 0 setdash
0.000 setgray
gsave
/o {
gsave
newpath
translate
0.6 setlinewidth
1 setlinejoin

0 setlinecap

0 0 m
0 -2 l

gsave
0.000 setgray
fill
grestore
stroke
grestore
} bind def
117.577 31.3919 o
grestore
0.800 setlinewidth
[2.96 1.28] 0 setdash
0.690 setgray
gsave
106.02 110.88 27.126 31.392 clipbox
120.404809 31.391875 m
120.404809 142.271875 l
stroke
grestore
0.600 setlinewidth
[] 0 setdash
0.000 setgray
gsave
/o {
gsave
newpath
translate
0.6 setlinewidth
1 setlinejoin

0 setlinecap

0 0 m
0 -2 l

gsave
0.000 setgray
fill
grestore
stroke
grestore
} bind def
120.405 31.3919 o
grestore
0.800 setlinewidth
[2.96 1.28] 0 setdash
0.690 setgray
gsave
106.02 110.88 27.126 31.392 clipbox
122.795518 31.391875 m
122.795518 142.271875 l
stroke
grestore
0.600 setlinewidth
[] 0 setdash
0.000 setgray
gsave
/o {
gsave
newpath
translate
0.6 setlinewidth
1 setlinejoin

0 setlinecap

0 0 m
0 -2 l

gsave
0.000 setgray
fill
grestore
stroke
grestore
} bind def
122.796 31.3919 o
grestore
0.800 setlinewidth
[2.96 1.28] 0 setdash
0.690 setgray
gsave
106.02 110.88 27.126 31.392 clipbox
124.866445 31.391875 m
124.866445 142.271875 l
stroke
grestore
0.600 setlinewidth
[] 0 setdash
0.000 setgray
gsave
/o {
gsave
newpath
translate
0.6 setlinewidth
1 setlinejoin

0 setlinecap

0 0 m
0 -2 l

gsave
0.000 setgray
fill
grestore
stroke
grestore
} bind def
124.866 31.3919 o
grestore
0.800 setlinewidth
[2.96 1.28] 0 setdash
0.690 setgray
gsave
106.02 110.88 27.126 31.392 clipbox
126.693132 31.391875 m
126.693132 142.271875 l
stroke
grestore
0.600 setlinewidth
[] 0 setdash
0.000 setgray
gsave
/o {
gsave
newpath
translate
0.6 setlinewidth
1 setlinejoin

0 setlinecap

0 0 m
0 -2 l

gsave
0.000 setgray
fill
grestore
stroke
grestore
} bind def
126.693 31.3919 o
grestore
/DejaVuSans 10.000 selectfont
gsave

61.112813 2.798125 translate
0.000000 rotate
0.000000 0 m /D glyphshow
7.700195 0 m /e glyphshow
13.852539 0 m /n glyphshow
20.190430 0 m /s glyphshow
25.400391 0 m /i glyphshow
28.178711 0 m /t glyphshow
32.099609 0 m /y glyphshow
grestore
0.800 setlinewidth
[2.96 1.28] 0 setdash
0.690 setgray
gsave
106.02 110.88 27.126 31.392 clipbox
27.12625 31.391875 m
133.14625 31.391875 l
stroke
grestore
[] 0 setdash
0.000 setgray
gsave
/o {
gsave
newpath
translate
0.8 setlinewidth
1 setlinejoin

0 setlinecap

-0 0 m
-3.5 0 l

gsave
0.000 setgray
fill
grestore
stroke
grestore
} bind def
27.1263 31.3919 o
grestore
/DejaVuSans 9.000 selectfont
gsave

14.391875 27.970000 translate
0.000000 rotate
0.000000 0 m /zero glyphshow
grestore
[2.96 1.28] 0 setdash
0.690 setgray
gsave
106.02 110.88 27.126 31.392 clipbox
27.12625 63.544758 m
133.14625 63.544758 l
stroke
grestore
[] 0 setdash
0.000 setgray
gsave
/o {
gsave
newpath
translate
0.8 setlinewidth
1 setlinejoin

0 setlinecap

-0 0 m
-3.5 0 l

gsave
0.000 setgray
fill
grestore
stroke
grestore
} bind def
27.1263 63.5448 o
grestore
gsave

14.391875 60.122883 translate
0.000000 rotate
0.000000 0 m /two glyphshow
grestore
[2.96 1.28] 0 setdash
0.690 setgray
gsave
106.02 110.88 27.126 31.392 clipbox
27.12625 95.697642 m
133.14625 95.697642 l
stroke
grestore
[] 0 setdash
0.000 setgray
gsave
/o {
gsave
newpath
translate
0.8 setlinewidth
1 setlinejoin

0 setlinecap

-0 0 m
-3.5 0 l

gsave
0.000 setgray
fill
grestore
stroke
grestore
} bind def
27.1263 95.6976 o
grestore
gsave

14.391875 92.275767 translate
0.000000 rotate
0.000000 0 m /four glyphshow
grestore
[2.96 1.28] 0 setdash
0.690 setgray
gsave
106.02 110.88 27.126 31.392 clipbox
27.12625 127.850525 m
133.14625 127.850525 l
stroke
grestore
[] 0 setdash
0.000 setgray
gsave
/o {
gsave
newpath
translate
0.8 setlinewidth
1 setlinejoin

0 setlinecap

-0 0 m
-3.5 0 l

gsave
0.000 setgray
fill
grestore
stroke
grestore
} bind def
27.1263 127.851 o
grestore
gsave

14.391875 124.428650 translate
0.000000 rotate
0.000000 0 m /six glyphshow
grestore
/DejaVuSans 10.000 selectfont
gsave

8.313750 67.058437 translate
90.000000 rotate
0.000000 0 m /L glyphshow
5.571289 0 m /a glyphshow
11.699219 0 m /t glyphshow
15.620117 0 m /e glyphshow
21.772461 0 m /n glyphshow
28.110352 0 m /c glyphshow
33.608398 0 m /y glyphshow
grestore
0.750 setlinewidth
2 setlinecap
0.976 0.004 0.004 setrgbcolor
gsave
106.02 110.88 27.126 31.392 clipbox
31.945341 72.067643 m
38.233664 74.736093 l
42.6953 76.648431 l
46.156014 78.202119 l
48.983624 79.524035 l
53.44526 81.676776 l
56.905974 83.357843 l
67.655933 88.259692 l
73.944257 90.903745 l
78.405893 92.813234 l
81.866607 94.363226 l
84.694216 95.679078 l
89.155853 97.817289 l
92.616567 99.485247 l
103.366526 104.3574 l
109.654849 106.995868 l
114.116486 108.903828 l
117.5772 110.452697 l
120.404809 111.767363 l
124.866445 113.903223 l
128.327159 115.569213 l
stroke
grestore
1.000 setlinewidth
0 setlinejoin
0 setlinecap
gsave
106.02 110.88 27.126 31.392 clipbox
/o {
gsave
newpath
translate
1.0 setlinewidth
0 setlinejoin

0 setlinecap

0 3 m
-3 -3 l
3 -3 l
cl

gsave
grestore
stroke
grestore
} bind def
31.9453 72.0676 o
38.2337 74.7361 o
42.6953 76.6484 o
46.156 78.2021 o
48.9836 79.524 o
53.4453 81.6768 o
56.906 83.3578 o
67.6559 88.2597 o
73.9443 90.9037 o
78.4059 92.8132 o
81.8666 94.3632 o
84.6942 95.6791 o
89.1559 97.8173 o
92.6166 99.4852 o
103.367 104.357 o
109.655 106.996 o
114.116 108.904 o
117.577 110.453 o
120.405 111.767 o
124.866 113.903 o
128.327 115.569 o
grestore
0.750 setlinewidth
1 setlinejoin
2 setlinecap
0.008 0.400 0.784 setrgbcolor
gsave
106.02 110.88 27.126 31.392 clipbox
31.945341 138.448239 m
38.233664 138.173935 l
42.6953 137.96566 l
46.156014 137.861753 l
48.983624 137.83101 l
53.44526 137.876781 l
56.905974 137.963534 l
67.655933 138.112455 l
73.944257 137.972484 l
78.405893 137.855505 l
81.866607 137.810976 l
84.694216 137.821129 l
89.155853 137.922233 l
92.616567 138.04996 l
103.366526 138.365143 l
109.654849 138.359568 l
114.116486 138.345021 l
117.5772 138.381152 l
120.404809 138.459636 l
124.866445 138.682501 l
128.327159 138.928816 l
stroke
grestore
1.000 setlinewidth
0 setlinejoin
0 setlinecap
gsave
106.02 110.88 27.126 31.392 clipbox
/o {
gsave
newpath
translate
1.0 setlinewidth
0 setlinejoin

0 setlinecap

-3 -3 m
3 -3 l
3 3 l
-3 3 l
cl

gsave
grestore
stroke
grestore
} bind def
31.9453 138.448 o
38.2337 138.174 o
42.6953 137.966 o
46.156 137.862 o
48.9836 137.831 o
53.4453 137.877 o
56.906 137.964 o
67.6559 138.112 o
73.9443 137.972 o
78.4059 137.856 o
81.8666 137.811 o
84.6942 137.821 o
89.1559 137.922 o
92.6166 138.05 o
103.367 138.365 o
109.655 138.36 o
114.116 138.345 o
117.577 138.381 o
120.405 138.46 o
124.866 138.683 o
128.327 138.929 o
grestore
0.800 setlinewidth
2 setlinecap
0.000 setgray
gsave
27.12625 31.391875 m
27.12625 142.271875 l
stroke
grestore
gsave
27.12625 31.391875 m
133.14625 31.391875 l
stroke
grestore
1.000 setlinewidth
0 setlinecap
gsave
34.12625 36.391875 m
69.47 36.391875 l
70.803333 36.391875 71.47 37.058542 71.47 38.391875 c
71.47 66.735625 l
71.47 68.068958 70.803333 68.735625 69.47 68.735625 c
34.12625 68.735625 l
32.792917 68.735625 32.12625 68.068958 32.12625 66.735625 c
32.12625 38.391875 l
32.12625 37.058542 32.792917 36.391875 34.12625 36.391875 c
cl
gsave
1.000 setgray
fill
grestore
stroke
grestore
0.750 setlinewidth
1 setlinejoin
2 setlinecap
0.976 0.004 0.004 setrgbcolor
gsave
36.12625 60.641875 m
46.12625 60.641875 l
56.12625 60.641875 l
stroke
grestore
1.000 setlinewidth
0 setlinejoin
0 setlinecap
gsave
/o {
gsave
newpath
translate
1.0 setlinewidth
0 setlinejoin

0 setlinecap

0 3 m
-3 -3 l
3 -3 l
cl

gsave
grestore
stroke
grestore
} bind def
46.1262 60.6419 o
grestore
0.000 setgray
gsave

61.126250 57.141875 translate
0.000000 rotate
0.000000 0 m /P glyphshow
grestore
0.750 setlinewidth
1 setlinejoin
2 setlinecap
0.008 0.400 0.784 setrgbcolor
gsave
36.12625 45.97 m
46.12625 45.97 l
56.12625 45.97 l
stroke
grestore
1.000 setlinewidth
0 setlinejoin
0 setlinecap
gsave
/o {
gsave
newpath
translate
1.0 setlinewidth
0 setlinejoin

0 setlinecap

-3 -3 m
3 -3 l
3 3 l
-3 3 l
cl

gsave
grestore
stroke
grestore
} bind def
46.1262 45.97 o
grestore
0.000 setgray
gsave

61.126250 42.470000 translate
0.000000 rotate
0.000000 0 m /S glyphshow
grestore

end
showpage
