%!PS-Adobe-3.0 EPSF-3.0
%%Title: expe_blockchain_dissemination.eps
%%Creator: Matplotlib v3.5.2, https://matplotlib.org/
%%CreationDate: Wed Sep 21 20:02:17 2022
%%Orientation: portrait
%%BoundingBox: 147 325 465 467
%%HiResBoundingBox: 147.743640 325.144687 464.256360 466.855312
%%EndComments
%%BeginProlog
/mpldict 11 dict def
mpldict begin
/_d { bind def } bind def
/m { moveto } _d
/l { lineto } _d
/r { rlineto } _d
/c { curveto } _d
/cl { closepath } _d
/ce { closepath eofill } _d
/box {
      m
      1 index 0 r
      0 exch r
      neg 0 r
      cl
    } _d
/clipbox {
      box
      clip
      newpath
    } _d
/sc { setcachedevice } _d
%!PS-Adobe-3.0 Resource-Font
%%Creator: Converted from TrueType to Type 3 by Matplotlib.
10 dict begin
/FontName /DejaVuSans def
/PaintType 0 def
/FontMatrix [0.00048828125 0 0 0.00048828125 0 0] def
/FontBBox [-2090 -948 3673 2524] def
/FontType 3 def
/Encoding [/space /percent /period /zero /one /two /three /five /seven /colon /C /D /F /G /P /S /T /U /bracketleft /bracketright /c /d /e /f /i /l /m /n /o /r /s /t /u /y] def
/CharStrings 35 dict dup begin
/.notdef 0 def
/space{651 0 0 0 0 0 sc
ce} _d
/percent{1946 0 113 -29 1833 1520 sc
1489 657 m
1431 657 1385 632 1352 583 c
1319 534 1303 465 1303 377 c
1303 290 1319 222 1352 172 c
1385 123 1431 98 1489 98 c
1546 98 1590 123 1623 172 c
1656 222 1673 290 1673 377 c
1673 464 1656 533 1623 582 c
1590 632 1546 657 1489 657 c

1489 784 m
1594 784 1678 747 1740 674 c
1802 601 1833 502 1833 377 c
1833 252 1802 153 1739 80 c
1677 7 1594 -29 1489 -29 c
1382 -29 1298 7 1236 80 c
1174 153 1143 252 1143 377 c
1143 502 1174 601 1236 674 c
1299 747 1383 784 1489 784 c

457 1393 m
400 1393 354 1368 321 1318 c
288 1269 272 1201 272 1114 c
272 1026 288 957 321 908 c
354 859 399 834 457 834 c
515 834 560 859 593 908 c
626 957 643 1026 643 1114 c
643 1200 626 1268 593 1318 c
560 1368 514 1393 457 1393 c

1360 1520 m
1520 1520 l
586 -29 l
426 -29 l
1360 1520 l

457 1520 m
562 1520 646 1483 709 1410 c
772 1337 803 1239 803 1114 c
803 988 772 889 709 816 c
647 743 563 707 457 707 c
351 707 267 743 205 816 c
144 889 113 989 113 1114 c
113 1238 144 1337 206 1410 c
268 1483 352 1520 457 1520 c

ce} _d
/period{651 0 219 0 430 254 sc
219 254 m
430 254 l
430 0 l
219 0 l
219 254 l

ce} _d
/zero{1303 0 135 -29 1167 1520 sc
651 1360 m
547 1360 469 1309 416 1206 c
364 1104 338 950 338 745 c
338 540 364 387 416 284 c
469 182 547 131 651 131 c
756 131 834 182 886 284 c
939 387 965 540 965 745 c
965 950 939 1104 886 1206 c
834 1309 756 1360 651 1360 c

651 1520 m
818 1520 946 1454 1034 1321 c
1123 1189 1167 997 1167 745 c
1167 494 1123 302 1034 169 c
946 37 818 -29 651 -29 c
484 -29 356 37 267 169 c
179 302 135 494 135 745 c
135 997 179 1189 267 1321 c
356 1454 484 1520 651 1520 c

ce} _d
/one{1303 0 225 0 1114 1493 sc
254 170 m
584 170 l
584 1309 l
225 1237 l
225 1421 l
582 1493 l
784 1493 l
784 170 l
1114 170 l
1114 0 l
254 0 l
254 170 l

ce} _d
/two{1303 0 150 0 1098 1520 sc
393 170 m
1098 170 l
1098 0 l
150 0 l
150 170 l
227 249 331 356 463 489 c
596 623 679 709 713 748 c
778 821 823 882 848 932 c
874 983 887 1032 887 1081 c
887 1160 859 1225 803 1275 c
748 1325 675 1350 586 1350 c
523 1350 456 1339 385 1317 c
315 1295 240 1262 160 1217 c
160 1421 l
241 1454 317 1478 388 1495 c
459 1512 523 1520 582 1520 c
737 1520 860 1481 952 1404 c
1044 1327 1090 1223 1090 1094 c
1090 1033 1078 974 1055 919 c
1032 864 991 800 930 725 c
913 706 860 650 771 557 c
682 465 556 336 393 170 c

ce} _d
/three{1303 0 156 -29 1139 1520 sc
831 805 m
928 784 1003 741 1057 676 c
1112 611 1139 530 1139 434 c
1139 287 1088 173 987 92 c
886 11 742 -29 555 -29 c
492 -29 428 -23 361 -10 c
295 2 227 20 156 45 c
156 240 l
212 207 273 183 340 166 c
407 149 476 141 549 141 c
676 141 772 166 838 216 c
905 266 938 339 938 434 c
938 522 907 591 845 640 c
784 690 698 715 588 715 c
414 715 l
414 881 l
596 881 l
695 881 771 901 824 940 c
877 980 903 1037 903 1112 c
903 1189 876 1247 821 1288 c
767 1329 689 1350 588 1350 c
533 1350 473 1344 410 1332 c
347 1320 277 1301 201 1276 c
201 1456 l
278 1477 349 1493 416 1504 c
483 1515 547 1520 606 1520 c
759 1520 881 1485 970 1415 c
1059 1346 1104 1252 1104 1133 c
1104 1050 1080 980 1033 923 c
986 866 918 827 831 805 c

ce} _d
/five{1303 0 158 -29 1124 1493 sc
221 1493 m
1014 1493 l
1014 1323 l
406 1323 l
406 957 l
435 967 465 974 494 979 c
523 984 553 987 582 987 c
749 987 881 941 978 850 c
1075 759 1124 635 1124 479 c
1124 318 1074 193 974 104 c
874 15 733 -29 551 -29 c
488 -29 424 -24 359 -13 c
294 -2 227 14 158 35 c
158 238 l
218 205 280 181 344 165 c
408 149 476 141 547 141 c
662 141 754 171 821 232 c
888 293 922 375 922 479 c
922 583 888 665 821 726 c
754 787 662 817 547 817 c
493 817 439 811 385 799 c
332 787 277 768 221 743 c
221 1493 l

ce} _d
/seven{1303 0 168 0 1128 1493 sc
168 1493 m
1128 1493 l
1128 1407 l
586 0 l
375 0 l
885 1323 l
168 1323 l
168 1493 l

ce} _d
/colon{690 0 240 0 451 1059 sc
240 254 m
451 254 l
451 0 l
240 0 l
240 254 l

240 1059 m
451 1059 l
451 805 l
240 805 l
240 1059 l

ce} _d
/C{1430 0 115 -29 1319 1520 sc
1319 1378 m
1319 1165 l
1251 1228 1178 1276 1101 1307 c
1024 1338 943 1354 856 1354 c
685 1354 555 1302 464 1197 c
373 1093 328 942 328 745 c
328 548 373 398 464 293 c
555 189 685 137 856 137 c
943 137 1024 153 1101 184 c
1178 215 1251 263 1319 326 c
1319 115 l
1248 67 1173 31 1094 7 c
1015 -17 932 -29 844 -29 c
618 -29 440 40 310 178 c
180 317 115 506 115 745 c
115 985 180 1174 310 1312 c
440 1451 618 1520 844 1520 c
933 1520 1017 1508 1096 1484 c
1175 1461 1250 1425 1319 1378 c

ce} _d
/D{1577 0 201 0 1456 1493 sc
403 1327 m
403 166 l
647 166 l
853 166 1004 213 1099 306 c
1195 399 1243 547 1243 748 c
1243 948 1195 1094 1099 1187 c
1004 1280 853 1327 647 1327 c
403 1327 l

201 1493 m
616 1493 l
905 1493 1118 1433 1253 1312 c
1388 1192 1456 1004 1456 748 c
1456 491 1388 302 1252 181 c
1116 60 904 0 616 0 c
201 0 l
201 1493 l

ce} _d
/F{1178 0 201 0 1059 1493 sc
201 1493 m
1059 1493 l
1059 1323 l
403 1323 l
403 883 l
995 883 l
995 713 l
403 713 l
403 0 l
201 0 l
201 1493 l

ce} _d
/G{1587 0 115 -29 1419 1520 sc
1219 213 m
1219 614 l
889 614 l
889 780 l
1419 780 l
1419 139 l
1341 84 1255 42 1161 13 c
1067 -15 967 -29 860 -29 c
627 -29 444 39 312 175 c
181 312 115 502 115 745 c
115 989 181 1179 312 1315 c
444 1452 627 1520 860 1520 c
957 1520 1050 1508 1137 1484 c
1225 1460 1306 1425 1380 1378 c
1380 1163 l
1305 1226 1226 1274 1142 1306 c
1058 1338 970 1354 877 1354 c
694 1354 557 1303 465 1201 c
374 1099 328 947 328 745 c
328 544 374 392 465 290 c
557 188 694 137 877 137 c
948 137 1012 143 1068 155 c
1124 168 1174 187 1219 213 c

ce} _d
/P{1235 0 201 0 1165 1493 sc
403 1327 m
403 766 l
657 766 l
751 766 824 790 875 839 c
926 888 952 957 952 1047 c
952 1136 926 1205 875 1254 c
824 1303 751 1327 657 1327 c
403 1327 l

201 1493 m
657 1493 l
824 1493 951 1455 1036 1379 c
1122 1304 1165 1193 1165 1047 c
1165 900 1122 788 1036 713 c
951 638 824 600 657 600 c
403 600 l
403 0 l
201 0 l
201 1493 l

ce} _d
/S{1300 0 135 -29 1186 1520 sc
1096 1444 m
1096 1247 l
1019 1284 947 1311 879 1329 c
811 1347 745 1356 682 1356 c
572 1356 487 1335 427 1292 c
368 1249 338 1189 338 1110 c
338 1044 358 994 397 960 c
437 927 512 900 623 879 c
745 854 l
896 825 1007 775 1078 702 c
1150 630 1186 533 1186 412 c
1186 267 1137 158 1040 83 c
943 8 801 -29 614 -29 c
543 -29 468 -21 388 -5 c
309 11 226 35 141 66 c
141 274 l
223 228 303 193 382 170 c
461 147 538 135 614 135 c
729 135 818 158 881 203 c
944 248 975 313 975 397 c
975 470 952 528 907 569 c
862 610 789 641 686 662 c
563 686 l
412 716 303 763 236 827 c
169 891 135 980 135 1094 c
135 1226 181 1330 274 1406 c
367 1482 496 1520 659 1520 c
729 1520 800 1514 873 1501 c
946 1488 1020 1469 1096 1444 c

ce} _d
/T{1251 0 -6 0 1257 1493 sc
-6 1493 m
1257 1493 l
1257 1323 l
727 1323 l
727 0 l
524 0 l
524 1323 l
-6 1323 l
-6 1493 l

ce} _d
/U{1499 0 178 -29 1321 1493 sc
178 1493 m
381 1493 l
381 586 l
381 426 410 311 468 240 c
526 170 620 135 750 135 c
879 135 973 170 1031 240 c
1089 311 1118 426 1118 586 c
1118 1493 l
1321 1493 l
1321 561 l
1321 366 1273 219 1176 120 c
1080 21 938 -29 750 -29 c
561 -29 419 21 322 120 c
226 219 178 366 178 561 c
178 1493 l

ce} _d
/bracketleft{799 0 176 -270 600 1556 sc
176 1556 m
600 1556 l
600 1413 l
360 1413 l
360 -127 l
600 -127 l
600 -270 l
176 -270 l
176 1556 l

ce} _d
/bracketright{799 0 199 -270 623 1556 sc
623 1556 m
623 -270 l
199 -270 l
199 -127 l
438 -127 l
438 1413 l
199 1413 l
199 1556 l
623 1556 l

ce} _d
/c{1126 0 113 -29 999 1147 sc
999 1077 m
999 905 l
947 934 895 955 842 969 c
790 984 737 991 684 991 c
565 991 472 953 406 877 c
340 802 307 696 307 559 c
307 422 340 316 406 240 c
472 165 565 127 684 127 c
737 127 790 134 842 148 c
895 163 947 184 999 213 c
999 43 l
948 19 894 1 839 -11 c
784 -23 726 -29 664 -29 c
495 -29 361 24 262 130 c
163 236 113 379 113 559 c
113 742 163 885 263 990 c
364 1095 501 1147 676 1147 c
733 1147 788 1141 842 1129 c
896 1118 948 1100 999 1077 c

ce} _d
/d{1300 0 113 -29 1114 1556 sc
930 950 m
930 1556 l
1114 1556 l
1114 0 l
930 0 l
930 168 l
891 101 842 52 783 19 c
724 -13 654 -29 571 -29 c
436 -29 325 25 240 133 c
155 241 113 383 113 559 c
113 735 155 877 240 985 c
325 1093 436 1147 571 1147 c
654 1147 724 1131 783 1098 c
842 1066 891 1017 930 950 c

303 559 m
303 424 331 317 386 240 c
442 163 519 125 616 125 c
713 125 790 163 846 240 c
902 317 930 424 930 559 c
930 694 902 800 846 877 c
790 954 713 993 616 993 c
519 993 442 954 386 877 c
331 800 303 694 303 559 c

ce} _d
/e{1260 0 113 -29 1151 1147 sc
1151 606 m
1151 516 l
305 516 l
313 389 351 293 419 226 c
488 160 583 127 705 127 c
776 127 844 136 910 153 c
977 170 1043 196 1108 231 c
1108 57 l
1042 29 974 8 905 -7 c
836 -22 765 -29 694 -29 c
515 -29 374 23 269 127 c
165 231 113 372 113 549 c
113 732 162 878 261 985 c
360 1093 494 1147 662 1147 c
813 1147 932 1098 1019 1001 c
1107 904 1151 773 1151 606 c

967 660 m
966 761 937 841 882 901 c
827 961 755 991 664 991 c
561 991 479 962 417 904 c
356 846 320 764 311 659 c
967 660 l

ce} _d
/f{721 0 47 0 760 1556 sc
760 1556 m
760 1403 l
584 1403 l
518 1403 472 1390 446 1363 c
421 1336 408 1288 408 1219 c
408 1120 l
711 1120 l
711 977 l
408 977 l
408 0 l
223 0 l
223 977 l
47 977 l
47 1120 l
223 1120 l
223 1198 l
223 1323 252 1413 310 1470 c
368 1527 460 1556 586 1556 c
760 1556 l

ce} _d
/i{569 0 193 0 377 1556 sc
193 1120 m
377 1120 l
377 0 l
193 0 l
193 1120 l

193 1556 m
377 1556 l
377 1323 l
193 1323 l
193 1556 l

ce} _d
/l{569 0 193 0 377 1556 sc
193 1556 m
377 1556 l
377 0 l
193 0 l
193 1556 l

ce} _d
/m{1995 0 186 0 1821 1147 sc
1065 905 m
1111 988 1166 1049 1230 1088 c
1294 1127 1369 1147 1456 1147 c
1573 1147 1663 1106 1726 1024 c
1789 943 1821 827 1821 676 c
1821 0 l
1636 0 l
1636 670 l
1636 777 1617 857 1579 909 c
1541 961 1483 987 1405 987 c
1310 987 1234 955 1179 892 c
1124 829 1096 742 1096 633 c
1096 0 l
911 0 l
911 670 l
911 778 892 858 854 909 c
816 961 757 987 678 987 c
584 987 509 955 454 891 c
399 828 371 742 371 633 c
371 0 l
186 0 l
186 1120 l
371 1120 l
371 946 l
413 1015 463 1065 522 1098 c
581 1131 650 1147 731 1147 c
812 1147 881 1126 938 1085 c
995 1044 1038 984 1065 905 c

ce} _d
/n{1298 0 186 0 1124 1147 sc
1124 676 m
1124 0 l
940 0 l
940 670 l
940 776 919 855 878 908 c
837 961 775 987 692 987 c
593 987 514 955 457 892 c
400 829 371 742 371 633 c
371 0 l
186 0 l
186 1120 l
371 1120 l
371 946 l
415 1013 467 1064 526 1097 c
586 1130 655 1147 733 1147 c
862 1147 959 1107 1025 1027 c
1091 948 1124 831 1124 676 c

ce} _d
/o{1253 0 113 -29 1141 1147 sc
627 991 m
528 991 450 952 393 875 c
336 798 307 693 307 559 c
307 425 335 319 392 242 c
449 165 528 127 627 127 c
725 127 803 166 860 243 c
917 320 946 426 946 559 c
946 692 917 797 860 874 c
803 952 725 991 627 991 c

627 1147 m
787 1147 913 1095 1004 991 c
1095 887 1141 743 1141 559 c
1141 376 1095 232 1004 127 c
913 23 787 -29 627 -29 c
466 -29 340 23 249 127 c
158 232 113 376 113 559 c
113 743 158 887 249 991 c
340 1095 466 1147 627 1147 c

ce} _d
/r{842 0 186 0 842 1147 sc
842 948 m
821 960 799 969 774 974 c
750 980 723 983 694 983 c
590 983 510 949 454 881 c
399 814 371 717 371 590 c
371 0 l
186 0 l
186 1120 l
371 1120 l
371 946 l
410 1014 460 1064 522 1097 c
584 1130 659 1147 748 1147 c
761 1147 775 1146 790 1144 c
805 1143 822 1140 841 1137 c
842 948 l

ce} _d
/s{1067 0 111 -29 967 1147 sc
907 1087 m
907 913 l
855 940 801 960 745 973 c
689 986 631 993 571 993 c
480 993 411 979 365 951 c
320 923 297 881 297 825 c
297 782 313 749 346 724 c
379 700 444 677 543 655 c
606 641 l
737 613 829 573 884 522 c
939 471 967 400 967 309 c
967 205 926 123 843 62 c
761 1 648 -29 504 -29 c
444 -29 381 -23 316 -11 c
251 0 183 18 111 41 c
111 231 l
179 196 246 169 312 151 c
378 134 443 125 508 125 c
595 125 661 140 708 169 c
755 199 778 241 778 295 c
778 345 761 383 727 410 c
694 437 620 462 506 487 c
442 502 l
328 526 246 563 195 612 c
144 662 119 730 119 817 c
119 922 156 1004 231 1061 c
306 1118 412 1147 549 1147 c
617 1147 681 1142 741 1132 c
801 1122 856 1107 907 1087 c

ce} _d
/t{803 0 55 0 754 1438 sc
375 1438 m
375 1120 l
754 1120 l
754 977 l
375 977 l
375 369 l
375 278 387 219 412 193 c
437 167 488 154 565 154 c
754 154 l
754 0 l
565 0 l
423 0 325 26 271 79 c
217 132 190 229 190 369 c
190 977 l
55 977 l
55 1120 l
190 1120 l
190 1438 l
375 1438 l

ce} _d
/u{1298 0 174 -29 1112 1147 sc
174 442 m
174 1120 l
358 1120 l
358 449 l
358 343 379 263 420 210 c
461 157 523 131 606 131 c
705 131 784 163 841 226 c
899 289 928 376 928 485 c
928 1120 l
1112 1120 l
1112 0 l
928 0 l
928 172 l
883 104 831 53 772 20 c
713 -13 645 -29 567 -29 c
438 -29 341 11 274 91 c
207 171 174 288 174 442 c

637 1147 m
637 1147 l

ce} _d
/y{1212 0 61 -426 1151 1120 sc
659 -104 m
607 -237 556 -324 507 -365 c
458 -406 392 -426 309 -426 c
162 -426 l
162 -272 l
270 -272 l
321 -272 360 -260 388 -236 c
416 -212 447 -155 481 -66 c
514 18 l
61 1120 l
256 1120 l
606 244 l
956 1120 l
1151 1120 l
659 -104 l

ce} _d
end readonly def

/BuildGlyph {
 exch begin
 CharStrings exch
 2 copy known not {pop /.notdef} if
 true 3 1 roll get exec
 end
} _d

/BuildChar {
 1 index /Encoding get exch get
 1 index /BuildGlyph get exec
} _d

FontName currentdict end definefont pop
end
%%EndProlog
mpldict begin
147.744 325.145 translate
316.513 141.711 0 0 clipbox
gsave
0 0 m
316.512721 0 l
316.512721 141.710625 l
0 141.710625 l
cl
1.000 setgray
fill
grestore
gsave
47.141875 30.110625 m
125.918346 30.110625 l
125.918346 140.990625 l
47.141875 140.990625 l
cl
1.000 setgray
fill
grestore
0.800 setlinewidth
1 setlinejoin
0 setlinecap
[2.96 1.28] 0 setdash
0.690 setgray
gsave
78.776 110.88 47.142 30.111 clipbox
47.141875 30.110625 m
47.141875 140.990625 l
stroke
grestore
[] 0 setdash
0.000 setgray
gsave
/o {
gsave
newpath
translate
0.8 setlinewidth
1 setlinejoin

0 setlinecap

0 0 m
0 -3.5 l

gsave
0.000 setgray
fill
grestore
stroke
grestore
} bind def
47.1419 30.1106 o
grestore
/DejaVuSans 9.000 selectfont
gsave

39.977813 16.266875 translate
0.000000 rotate
0.000000 0 m /zero glyphshow
5.726074 0 m /period glyphshow
8.586914 0 m /five glyphshow
grestore
[2.96 1.28] 0 setdash
0.690 setgray
gsave
78.776 110.88 47.142 30.111 clipbox
82.949362 30.110625 m
82.949362 140.990625 l
stroke
grestore
[] 0 setdash
0.000 setgray
gsave
/o {
gsave
newpath
translate
0.8 setlinewidth
1 setlinejoin

0 setlinecap

0 0 m
0 -3.5 l

gsave
0.000 setgray
fill
grestore
stroke
grestore
} bind def
82.9494 30.1106 o
grestore
gsave

75.785299 16.266875 translate
0.000000 rotate
0.000000 0 m /one glyphshow
5.726074 0 m /period glyphshow
8.586914 0 m /zero glyphshow
grestore
[2.96 1.28] 0 setdash
0.690 setgray
gsave
78.776 110.88 47.142 30.111 clipbox
118.756848 30.110625 m
118.756848 140.990625 l
stroke
grestore
[] 0 setdash
0.000 setgray
gsave
/o {
gsave
newpath
translate
0.8 setlinewidth
1 setlinejoin

0 setlinecap

0 0 m
0 -3.5 l

gsave
0.000 setgray
fill
grestore
stroke
grestore
} bind def
118.757 30.1106 o
grestore
gsave

111.592786 16.266875 translate
0.000000 rotate
0.000000 0 m /one glyphshow
5.726074 0 m /period glyphshow
8.586914 0 m /five glyphshow
grestore
[2.96 1.28] 0 setdash
0.690 setgray
gsave
78.776 110.88 47.142 30.111 clipbox
47.141875 30.110625 m
125.918346 30.110625 l
stroke
grestore
[] 0 setdash
0.000 setgray
gsave
/o {
gsave
newpath
translate
0.8 setlinewidth
1 setlinejoin

0 setlinecap

-0 0 m
-3.5 0 l

gsave
0.000 setgray
fill
grestore
stroke
grestore
} bind def
47.1419 30.1106 o
grestore
gsave

25.860625 26.688750 translate
0.000000 rotate
0.000000 0 m /zero glyphshow
5.726074 0 m /percent glyphshow
grestore
[2.96 1.28] 0 setdash
0.690 setgray
gsave
78.776 110.88 47.142 30.111 clipbox
47.141875 51.433702 m
125.918346 51.433702 l
stroke
grestore
[] 0 setdash
0.000 setgray
gsave
/o {
gsave
newpath
translate
0.8 setlinewidth
1 setlinejoin

0 setlinecap

-0 0 m
-3.5 0 l

gsave
0.000 setgray
fill
grestore
stroke
grestore
} bind def
47.1419 51.4337 o
grestore
gsave

20.126250 48.011827 translate
0.000000 rotate
0.000000 0 m /two glyphshow
5.726074 0 m /five glyphshow
11.452148 0 m /percent glyphshow
grestore
[2.96 1.28] 0 setdash
0.690 setgray
gsave
78.776 110.88 47.142 30.111 clipbox
47.141875 72.756779 m
125.918346 72.756779 l
stroke
grestore
[] 0 setdash
0.000 setgray
gsave
/o {
gsave
newpath
translate
0.8 setlinewidth
1 setlinejoin

0 setlinecap

-0 0 m
-3.5 0 l

gsave
0.000 setgray
fill
grestore
stroke
grestore
} bind def
47.1419 72.7568 o
grestore
gsave

20.126250 69.334904 translate
0.000000 rotate
0.000000 0 m /five glyphshow
5.726074 0 m /zero glyphshow
11.452148 0 m /percent glyphshow
grestore
[2.96 1.28] 0 setdash
0.690 setgray
gsave
78.776 110.88 47.142 30.111 clipbox
47.141875 94.079856 m
125.918346 94.079856 l
stroke
grestore
[] 0 setdash
0.000 setgray
gsave
/o {
gsave
newpath
translate
0.8 setlinewidth
1 setlinejoin

0 setlinecap

-0 0 m
-3.5 0 l

gsave
0.000 setgray
fill
grestore
stroke
grestore
} bind def
47.1419 94.0799 o
grestore
gsave

20.126250 90.657981 translate
0.000000 rotate
0.000000 0 m /seven glyphshow
5.726074 0 m /five glyphshow
11.452148 0 m /percent glyphshow
grestore
[2.96 1.28] 0 setdash
0.690 setgray
gsave
78.776 110.88 47.142 30.111 clipbox
47.141875 115.402933 m
125.918346 115.402933 l
stroke
grestore
[] 0 setdash
0.000 setgray
gsave
/o {
gsave
newpath
translate
0.8 setlinewidth
1 setlinejoin

0 setlinecap

-0 0 m
-3.5 0 l

gsave
0.000 setgray
fill
grestore
stroke
grestore
} bind def
47.1419 115.403 o
grestore
gsave

14.391875 111.981058 translate
0.000000 rotate
0.000000 0 m /one glyphshow
5.726074 0 m /zero glyphshow
11.452148 0 m /zero glyphshow
17.178223 0 m /percent glyphshow
grestore
/DejaVuSans 10.000 selectfont
gsave

8.313750 18.740625 translate
90.000000 rotate
0.000000 0 m /C glyphshow
6.982422 0 m /D glyphshow
14.682617 0 m /F glyphshow
20.434570 0 m /space glyphshow
23.613281 0 m /f glyphshow
27.133789 0 m /u glyphshow
33.471680 0 m /l glyphshow
36.250000 0 m /l glyphshow
39.028320 0 m /y glyphshow
44.946289 0 m /space glyphshow
48.125000 0 m /i glyphshow
50.903320 0 m /n glyphshow
57.241211 0 m /f glyphshow
60.761719 0 m /e glyphshow
66.914062 0 m /c glyphshow
72.412109 0 m /t glyphshow
76.333008 0 m /e glyphshow
82.485352 0 m /d glyphshow
88.833008 0 m /space glyphshow
92.011719 0 m /n glyphshow
98.349609 0 m /o glyphshow
104.467773 0 m /d glyphshow
110.815430 0 m /e glyphshow
116.967773 0 m /s glyphshow
grestore
1.500 setlinewidth
gsave
78.776 110.88 47.142 30.111 clipbox
11.334388 30.110625 m
11.334388 30.110625 l
stroke
grestore
gsave
78.776 110.88 47.142 30.111 clipbox
29.238132 30.110625 m
29.238132 30.110625 l
stroke
grestore
gsave
78.776 110.88 47.142 30.111 clipbox
47.141875 30.110625 m
47.141875 30.110625 l
stroke
grestore
gsave
78.776 110.88 47.142 30.111 clipbox
65.045618 30.110576 m
65.045618 30.112084 l
stroke
grestore
gsave
78.776 110.88 47.142 30.111 clipbox
82.949362 46.457995 m
82.949362 53.377156 l
stroke
grestore
gsave
78.776 110.88 47.142 30.111 clipbox
100.853105 112.554022 m
100.853105 114.633656 l
stroke
grestore
gsave
78.776 110.88 47.142 30.111 clipbox
118.756848 115.090857 m
118.756848 115.103169 l
stroke
grestore
gsave
78.776 110.88 47.142 30.111 clipbox
136.660592 115.10217 m
136.660592 115.113382 l
stroke
grestore
1.000 0.000 0.000 setrgbcolor
gsave
78.776 110.88 47.142 30.111 clipbox
11.334388 30.110625 m
11.334388 30.110625 l
stroke
grestore
gsave
78.776 110.88 47.142 30.111 clipbox
29.238132 30.110625 m
29.238132 30.110625 l
stroke
grestore
gsave
78.776 110.88 47.142 30.111 clipbox
47.141875 30.110625 m
47.141875 30.110625 l
stroke
grestore
gsave
78.776 110.88 47.142 30.111 clipbox
65.045618 30.623274 m
65.045618 31.22061 l
stroke
grestore
gsave
78.776 110.88 47.142 30.111 clipbox
82.949362 103.356773 m
82.949362 108.778398 l
stroke
grestore
gsave
78.776 110.88 47.142 30.111 clipbox
100.853105 115.019797 m
100.853105 115.151577 l
stroke
grestore
gsave
78.776 110.88 47.142 30.111 clipbox
118.756848 115.068747 m
118.756848 115.180638 l
stroke
grestore
gsave
78.776 110.88 47.142 30.111 clipbox
136.660592 115.072018 m
136.660592 115.182568 l
stroke
grestore
0.122 0.467 0.706 setrgbcolor
gsave
78.776 110.88 47.142 30.111 clipbox
11.334388 30.110625 m
11.334388 30.110625 l
stroke
grestore
gsave
78.776 110.88 47.142 30.111 clipbox
29.238132 30.110625 m
29.238132 30.110625 l
stroke
grestore
gsave
78.776 110.88 47.142 30.111 clipbox
47.141875 30.110625 m
47.141875 30.110625 l
stroke
grestore
gsave
78.776 110.88 47.142 30.111 clipbox
65.045618 30.110625 m
65.045618 30.110625 l
stroke
grestore
gsave
78.776 110.88 47.142 30.111 clipbox
82.949362 42.466991 m
82.949362 47.645045 l
stroke
grestore
gsave
78.776 110.88 47.142 30.111 clipbox
100.853105 112.673184 m
100.853105 114.466776 l
stroke
grestore
gsave
78.776 110.88 47.142 30.111 clipbox
118.756848 115.126249 m
118.756848 115.139339 l
stroke
grestore
gsave
78.776 110.88 47.142 30.111 clipbox
136.660592 115.136174 m
136.660592 115.148239 l
stroke
grestore
[5.55 2.4] 0 setdash
0.000 setgray
gsave
78.776 110.88 47.142 30.111 clipbox
11.334388 30.110625 m
72.207116 30.21339 l
73.639415 30.399695 l
75.071715 30.84412 l
75.787864 31.232429 l
76.504014 31.763214 l
77.220164 32.511628 l
77.936314 33.503984 l
78.652463 34.77602 l
79.368613 36.372681 l
80.084763 38.326625 l
80.800912 40.653589 l
82.233212 46.452924 l
83.665511 53.705034 l
85.813961 66.361971 l
88.678559 83.56302 l
90.110859 91.018952 l
91.543158 97.312776 l
92.975458 102.325769 l
94.407757 106.167225 l
95.840057 108.969862 l
97.272356 110.955092 l
98.704656 112.307997 l
100.136955 113.245871 l
101.569255 113.870737 l
103.717704 114.465319 l
105.866153 114.783745 l
109.446902 115.008165 l
115.892249 115.089776 l
153.848185 115.111153 l
153.848185 115.111153 l
stroke
grestore
1.000 setlinewidth
[] 0 setdash
gsave
78.776 110.88 47.142 30.111 clipbox
/o {
gsave
newpath
translate
1.0 setlinewidth
1 setlinejoin

0 setlinecap

-3 0 m
3 0 l
0 -3 m
0 3 l

gsave
grestore
stroke
grestore
} bind def
11.3344 30.1106 o
29.2381 30.1106 o
47.1419 30.1106 o
65.0456 30.1113 o
82.9494 49.9176 o
100.853 113.594 o
118.757 115.097 o
136.661 115.108 o
grestore
1.500 setlinewidth
[1.5 2.475] 0 setdash
1.000 0.000 0.000 setrgbcolor
gsave
78.776 110.88 47.142 30.111 clipbox
11.334388 30.110625 m
62.181019 30.219841 l
63.613319 30.42007 l
65.045618 30.921942 l
65.761768 31.384809 l
66.477918 32.011499 l
67.194068 32.929432 l
67.910217 34.102201 l
68.626367 35.561011 l
69.342517 37.578903 l
70.774816 42.888869 l
72.207116 50.060704 l
73.639415 58.543128 l
77.220164 82.131132 l
78.652463 90.252103 l
80.084763 97.007878 l
81.517062 102.294441 l
82.949362 106.067586 l
84.381661 108.909796 l
85.813961 111.0161 l
87.24626 112.399499 l
89.394709 113.645079 l
91.543158 114.432993 l
93.691608 114.789244 l
97.272356 115.007676 l
102.285404 115.096088 l
114.45995 115.122092 l
153.848185 115.127293 l
153.848185 115.127293 l
stroke
grestore
1.000 setlinewidth
0 setlinejoin
[] 0 setdash
gsave
78.776 110.88 47.142 30.111 clipbox
/o {
gsave
newpath
translate
1.0 setlinewidth
0 setlinejoin

0 setlinecap

0 3 m
-3 -3 l
3 -3 l
cl

gsave
grestore
stroke
grestore
} bind def
11.3344 30.1106 o
29.2381 30.1106 o
47.1419 30.1106 o
65.0456 30.9219 o
82.9494 106.068 o
100.853 115.086 o
118.757 115.125 o
136.661 115.127 o
grestore
1.500 setlinewidth
1 setlinejoin
[1.5 2.475] 0 setdash
0.122 0.467 0.706 setrgbcolor
gsave
78.776 110.88 47.142 30.111 clipbox
11.334388 30.110625 m
72.923265 30.191083 l
75.071715 30.44748 l
76.504014 30.914829 l
77.220164 31.320018 l
77.936314 31.896139 l
78.652463 32.698949 l
79.368613 33.77958 l
80.084763 35.193488 l
80.800912 36.983369 l
81.517062 39.202987 l
82.233212 41.895941 l
83.665511 48.670041 l
85.097811 57.04935 l
89.394709 84.442849 l
90.827009 92.071944 l
92.259308 98.354109 l
93.691608 103.239197 l
95.123907 106.91267 l
96.556207 109.555549 l
97.988506 111.406348 l
99.420805 112.693338 l
100.853105 113.56998 l
102.285404 114.15717 l
104.433854 114.663148 l
106.582303 114.9116 l
110.163051 115.068224 l
119.472998 115.134112 l
153.848185 115.144993 l
153.848185 115.144993 l
stroke
grestore
1.000 setlinewidth
[] 0 setdash
gsave
78.776 110.88 47.142 30.111 clipbox
/o {
gsave
newpath
translate
1.0 setlinewidth
1 setlinejoin

0 setlinecap

0 -3 m
0.795609 -3 1.55874 -2.683901 2.12132 -2.12132 c
2.683901 -1.55874 3 -0.795609 3 0 c
3 0.795609 2.683901 1.55874 2.12132 2.12132 c
1.55874 2.683901 0.795609 3 0 3 c
-0.795609 3 -1.55874 2.683901 -2.12132 2.12132 c
-2.683901 1.55874 -3 0.795609 -3 0 c
-3 -0.795609 -2.683901 -1.55874 -2.12132 -2.12132 c
-1.55874 -2.683901 -0.795609 -3 0 -3 c
cl

gsave
grestore
stroke
grestore
} bind def
11.3344 30.1106 o
29.2381 30.1106 o
47.1419 30.1106 o
65.0456 30.1106 o
82.9494 45.056 o
100.853 113.57 o
118.757 115.133 o
136.661 115.142 o
grestore
0.800 setlinewidth
0 setlinejoin
2 setlinecap
0.000 setgray
gsave
47.141875 30.110625 m
47.141875 140.990625 l
stroke
grestore
gsave
47.141875 30.110625 m
125.918346 30.110625 l
stroke
grestore
gsave
141.67364 30.110625 m
220.45011 30.110625 l
220.45011 140.990625 l
141.67364 140.990625 l
cl
1.000 setgray
fill
grestore
1 setlinejoin
0 setlinecap
[2.96 1.28] 0 setdash
0.690 setgray
gsave
78.776 110.88 141.674 30.111 clipbox
141.67364 30.110625 m
141.67364 140.990625 l
stroke
grestore
[] 0 setdash
0.000 setgray
gsave
/o {
gsave
newpath
translate
0.8 setlinewidth
1 setlinejoin

0 setlinecap

0 0 m
0 -3.5 l

gsave
0.000 setgray
fill
grestore
stroke
grestore
} bind def
141.674 30.1106 o
grestore
/DejaVuSans 9.000 selectfont
gsave

134.509577 16.266875 translate
0.000000 rotate
0.000000 0 m /one glyphshow
5.726074 0 m /period glyphshow
8.586914 0 m /zero glyphshow
grestore
[2.96 1.28] 0 setdash
0.690 setgray
gsave
78.776 110.88 141.674 30.111 clipbox
166.291287 30.110625 m
166.291287 140.990625 l
stroke
grestore
[] 0 setdash
0.000 setgray
gsave
/o {
gsave
newpath
translate
0.8 setlinewidth
1 setlinejoin

0 setlinecap

0 0 m
0 -3.5 l

gsave
0.000 setgray
fill
grestore
stroke
grestore
} bind def
166.291 30.1106 o
grestore
gsave

159.127224 16.266875 translate
0.000000 rotate
0.000000 0 m /one glyphshow
5.726074 0 m /period glyphshow
8.586914 0 m /five glyphshow
grestore
[2.96 1.28] 0 setdash
0.690 setgray
gsave
78.776 110.88 141.674 30.111 clipbox
190.908934 30.110625 m
190.908934 140.990625 l
stroke
grestore
[] 0 setdash
0.000 setgray
gsave
/o {
gsave
newpath
translate
0.8 setlinewidth
1 setlinejoin

0 setlinecap

0 0 m
0 -3.5 l

gsave
0.000 setgray
fill
grestore
stroke
grestore
} bind def
190.909 30.1106 o
grestore
gsave

183.744871 16.266875 translate
0.000000 rotate
0.000000 0 m /two glyphshow
5.726074 0 m /period glyphshow
8.586914 0 m /zero glyphshow
grestore
[2.96 1.28] 0 setdash
0.690 setgray
gsave
78.776 110.88 141.674 30.111 clipbox
215.526581 30.110625 m
215.526581 140.990625 l
stroke
grestore
[] 0 setdash
0.000 setgray
gsave
/o {
gsave
newpath
translate
0.8 setlinewidth
1 setlinejoin

0 setlinecap

0 0 m
0 -3.5 l

gsave
0.000 setgray
fill
grestore
stroke
grestore
} bind def
215.527 30.1106 o
grestore
gsave

208.362518 16.266875 translate
0.000000 rotate
0.000000 0 m /two glyphshow
5.726074 0 m /period glyphshow
8.586914 0 m /five glyphshow
grestore
/DejaVuSans 10.000 selectfont
gsave

160.679062 2.798125 translate
0.000000 rotate
0.000000 0 m /T glyphshow
5.858398 0 m /i glyphshow
8.636719 0 m /m glyphshow
18.377930 0 m /e glyphshow
24.530273 0 m /space glyphshow
27.708984 0 m /bracketleft glyphshow
31.610352 0 m /s glyphshow
36.820312 0 m /bracketright glyphshow
grestore
[2.96 1.28] 0 setdash
0.690 setgray
gsave
78.776 110.88 141.674 30.111 clipbox
141.67364 30.110625 m
220.45011 30.110625 l
stroke
grestore
[] 0 setdash
0.000 setgray
gsave
/o {
gsave
newpath
translate
0.8 setlinewidth
1 setlinejoin

0 setlinecap

-0 0 m
-3.5 0 l

gsave
0.000 setgray
fill
grestore
stroke
grestore
} bind def
141.674 30.1106 o
grestore
[2.96 1.28] 0 setdash
0.690 setgray
gsave
78.776 110.88 141.674 30.111 clipbox
141.67364 51.433702 m
220.45011 51.433702 l
stroke
grestore
[] 0 setdash
0.000 setgray
gsave
/o {
gsave
newpath
translate
0.8 setlinewidth
1 setlinejoin

0 setlinecap

-0 0 m
-3.5 0 l

gsave
0.000 setgray
fill
grestore
stroke
grestore
} bind def
141.674 51.4337 o
grestore
[2.96 1.28] 0 setdash
0.690 setgray
gsave
78.776 110.88 141.674 30.111 clipbox
141.67364 72.756779 m
220.45011 72.756779 l
stroke
grestore
[] 0 setdash
0.000 setgray
gsave
/o {
gsave
newpath
translate
0.8 setlinewidth
1 setlinejoin

0 setlinecap

-0 0 m
-3.5 0 l

gsave
0.000 setgray
fill
grestore
stroke
grestore
} bind def
141.674 72.7568 o
grestore
[2.96 1.28] 0 setdash
0.690 setgray
gsave
78.776 110.88 141.674 30.111 clipbox
141.67364 94.079856 m
220.45011 94.079856 l
stroke
grestore
[] 0 setdash
0.000 setgray
gsave
/o {
gsave
newpath
translate
0.8 setlinewidth
1 setlinejoin

0 setlinecap

-0 0 m
-3.5 0 l

gsave
0.000 setgray
fill
grestore
stroke
grestore
} bind def
141.674 94.0799 o
grestore
[2.96 1.28] 0 setdash
0.690 setgray
gsave
78.776 110.88 141.674 30.111 clipbox
141.67364 115.402933 m
220.45011 115.402933 l
stroke
grestore
[] 0 setdash
0.000 setgray
gsave
/o {
gsave
newpath
translate
0.8 setlinewidth
1 setlinejoin

0 setlinecap

-0 0 m
-3.5 0 l

gsave
0.000 setgray
fill
grestore
stroke
grestore
} bind def
141.674 115.403 o
grestore
1.500 setlinewidth
gsave
78.776 110.88 141.674 30.111 clipbox
92.438346 30.110625 m
92.438346 30.110625 l
stroke
grestore
gsave
78.776 110.88 141.674 30.111 clipbox
104.747169 30.110625 m
104.747169 30.110625 l
stroke
grestore
gsave
78.776 110.88 141.674 30.111 clipbox
117.055993 30.110625 m
117.055993 30.110625 l
stroke
grestore
gsave
78.776 110.88 141.674 30.111 clipbox
129.364816 30.110625 m
129.364816 30.110625 l
stroke
grestore
gsave
78.776 110.88 141.674 30.111 clipbox
141.67364 30.110625 m
141.67364 30.110625 l
stroke
grestore
gsave
78.776 110.88 141.674 30.111 clipbox
153.982463 30.110625 m
153.982463 30.110625 l
stroke
grestore
gsave
78.776 110.88 141.674 30.111 clipbox
166.291287 30.460072 m
166.291287 30.94047 l
stroke
grestore
gsave
78.776 110.88 141.674 30.111 clipbox
178.60011 80.193961 m
178.60011 91.175094 l
stroke
grestore
gsave
78.776 110.88 141.674 30.111 clipbox
190.908934 112.363525 m
190.908934 115.522836 l
stroke
grestore
gsave
78.776 110.88 141.674 30.111 clipbox
203.217757 115.062265 m
203.217757 115.132132 l
stroke
grestore
gsave
78.776 110.88 141.674 30.111 clipbox
215.526581 115.111536 m
215.526581 115.124575 l
stroke
grestore
gsave
78.776 110.88 141.674 30.111 clipbox
227.835404 115.113475 m
227.835404 115.126423 l
stroke
grestore
gsave
78.776 110.88 141.674 30.111 clipbox
240.144228 115.114713 m
240.144228 115.127708 l
stroke
grestore
gsave
78.776 110.88 141.674 30.111 clipbox
252.453051 115.115808 m
252.453051 115.128765 l
stroke
grestore
gsave
78.776 110.88 141.674 30.111 clipbox
264.761875 115.116702 m
264.761875 115.129653 l
stroke
grestore
gsave
78.776 110.88 141.674 30.111 clipbox
277.070699 115.117416 m
277.070699 115.130275 l
stroke
grestore
gsave
78.776 110.88 141.674 30.111 clipbox
289.379522 115.117956 m
289.379522 115.130774 l
stroke
grestore
gsave
78.776 110.88 141.674 30.111 clipbox
301.688346 115.118447 m
301.688346 115.131248 l
stroke
grestore
gsave
78.776 110.88 141.674 30.111 clipbox
313.997169 115.118785 m
313.997169 115.131652 l
stroke
grestore
gsave
78.776 110.88 141.674 30.111 clipbox

stroke
grestore
gsave
78.776 110.88 141.674 30.111 clipbox

stroke
grestore
gsave
78.776 110.88 141.674 30.111 clipbox

stroke
grestore
gsave
78.776 110.88 141.674 30.111 clipbox

stroke
grestore
gsave
78.776 110.88 141.674 30.111 clipbox

stroke
grestore
gsave
78.776 110.88 141.674 30.111 clipbox

stroke
grestore
gsave
78.776 110.88 141.674 30.111 clipbox

stroke
grestore
gsave
78.776 110.88 141.674 30.111 clipbox

stroke
grestore
gsave
78.776 110.88 141.674 30.111 clipbox

stroke
grestore
gsave
78.776 110.88 141.674 30.111 clipbox

stroke
grestore
gsave
78.776 110.88 141.674 30.111 clipbox

stroke
grestore
gsave
78.776 110.88 141.674 30.111 clipbox

stroke
grestore
gsave
78.776 110.88 141.674 30.111 clipbox

stroke
grestore
gsave
78.776 110.88 141.674 30.111 clipbox

stroke
grestore
gsave
78.776 110.88 141.674 30.111 clipbox

stroke
grestore
gsave
78.776 110.88 141.674 30.111 clipbox

stroke
grestore
gsave
78.776 110.88 141.674 30.111 clipbox

stroke
grestore
gsave
78.776 110.88 141.674 30.111 clipbox

stroke
grestore
gsave
78.776 110.88 141.674 30.111 clipbox

stroke
grestore
gsave
78.776 110.88 141.674 30.111 clipbox

stroke
grestore
gsave
78.776 110.88 141.674 30.111 clipbox

stroke
grestore
1.000 0.000 0.000 setrgbcolor
gsave
78.776 110.88 141.674 30.111 clipbox
92.438346 30.110625 m
92.438346 30.110625 l
stroke
grestore
gsave
78.776 110.88 141.674 30.111 clipbox
104.747169 30.110625 m
104.747169 30.110625 l
stroke
grestore
gsave
78.776 110.88 141.674 30.111 clipbox
117.055993 30.110625 m
117.055993 30.110625 l
stroke
grestore
gsave
78.776 110.88 141.674 30.111 clipbox
129.364816 30.110625 m
129.364816 30.110625 l
stroke
grestore
gsave
78.776 110.88 141.674 30.111 clipbox
141.67364 30.110625 m
141.67364 30.110625 l
stroke
grestore
gsave
78.776 110.88 141.674 30.111 clipbox
153.982463 30.114415 m
153.982463 30.158843 l
stroke
grestore
gsave
78.776 110.88 141.674 30.111 clipbox
166.291287 50.702618 m
166.291287 60.210347 l
stroke
grestore
gsave
78.776 110.88 141.674 30.111 clipbox
178.60011 109.531935 m
178.60011 113.618426 l
stroke
grestore
gsave
78.776 110.88 141.674 30.111 clipbox
190.908934 115.077734 m
190.908934 115.182052 l
stroke
grestore
gsave
78.776 110.88 141.674 30.111 clipbox
203.217757 115.100846 m
203.217757 115.195346 l
stroke
grestore
gsave
78.776 110.88 141.674 30.111 clipbox
215.526581 115.100846 m
215.526581 115.195346 l
stroke
grestore
gsave
78.776 110.88 141.674 30.111 clipbox
227.835404 115.100846 m
227.835404 115.195346 l
stroke
grestore
gsave
78.776 110.88 141.674 30.111 clipbox
240.144228 115.100846 m
240.144228 115.195346 l
stroke
grestore
gsave
78.776 110.88 141.674 30.111 clipbox
252.453051 115.100846 m
252.453051 115.195346 l
stroke
grestore
gsave
78.776 110.88 141.674 30.111 clipbox
264.761875 115.100846 m
264.761875 115.195346 l
stroke
grestore
gsave
78.776 110.88 141.674 30.111 clipbox
277.070699 115.100846 m
277.070699 115.195346 l
stroke
grestore
gsave
78.776 110.88 141.674 30.111 clipbox
289.379522 115.100846 m
289.379522 115.195346 l
stroke
grestore
gsave
78.776 110.88 141.674 30.111 clipbox
301.688346 115.100846 m
301.688346 115.195346 l
stroke
grestore
gsave
78.776 110.88 141.674 30.111 clipbox
313.997169 115.100846 m
313.997169 115.195346 l
stroke
grestore
gsave
78.776 110.88 141.674 30.111 clipbox

stroke
grestore
gsave
78.776 110.88 141.674 30.111 clipbox

stroke
grestore
gsave
78.776 110.88 141.674 30.111 clipbox

stroke
grestore
gsave
78.776 110.88 141.674 30.111 clipbox

stroke
grestore
gsave
78.776 110.88 141.674 30.111 clipbox

stroke
grestore
gsave
78.776 110.88 141.674 30.111 clipbox

stroke
grestore
gsave
78.776 110.88 141.674 30.111 clipbox

stroke
grestore
gsave
78.776 110.88 141.674 30.111 clipbox

stroke
grestore
gsave
78.776 110.88 141.674 30.111 clipbox

stroke
grestore
gsave
78.776 110.88 141.674 30.111 clipbox

stroke
grestore
gsave
78.776 110.88 141.674 30.111 clipbox

stroke
grestore
gsave
78.776 110.88 141.674 30.111 clipbox

stroke
grestore
gsave
78.776 110.88 141.674 30.111 clipbox

stroke
grestore
gsave
78.776 110.88 141.674 30.111 clipbox

stroke
grestore
gsave
78.776 110.88 141.674 30.111 clipbox

stroke
grestore
gsave
78.776 110.88 141.674 30.111 clipbox

stroke
grestore
gsave
78.776 110.88 141.674 30.111 clipbox

stroke
grestore
gsave
78.776 110.88 141.674 30.111 clipbox

stroke
grestore
gsave
78.776 110.88 141.674 30.111 clipbox

stroke
grestore
gsave
78.776 110.88 141.674 30.111 clipbox

stroke
grestore
gsave
78.776 110.88 141.674 30.111 clipbox

stroke
grestore
0.122 0.467 0.706 setrgbcolor
gsave
78.776 110.88 141.674 30.111 clipbox
92.438346 30.110625 m
92.438346 30.110625 l
stroke
grestore
gsave
78.776 110.88 141.674 30.111 clipbox
104.747169 30.110625 m
104.747169 30.110625 l
stroke
grestore
gsave
78.776 110.88 141.674 30.111 clipbox
117.055993 30.110625 m
117.055993 30.110625 l
stroke
grestore
gsave
78.776 110.88 141.674 30.111 clipbox
129.364816 30.110625 m
129.364816 30.110625 l
stroke
grestore
gsave
78.776 110.88 141.674 30.111 clipbox
141.67364 30.110625 m
141.67364 30.110625 l
stroke
grestore
gsave
78.776 110.88 141.674 30.111 clipbox
153.982463 30.110625 m
153.982463 30.110625 l
stroke
grestore
gsave
78.776 110.88 141.674 30.111 clipbox
166.291287 30.390153 m
166.291287 30.790946 l
stroke
grestore
gsave
78.776 110.88 141.674 30.111 clipbox
178.60011 78.467004 m
178.60011 89.287763 l
stroke
grestore
gsave
78.776 110.88 141.674 30.111 clipbox
190.908934 113.86683 m
190.908934 115.159471 l
stroke
grestore
gsave
78.776 110.88 141.674 30.111 clipbox
203.217757 115.12863 m
203.217757 115.142982 l
stroke
grestore
gsave
78.776 110.88 141.674 30.111 clipbox
215.526581 115.133354 m
215.526581 115.146767 l
stroke
grestore
gsave
78.776 110.88 141.674 30.111 clipbox
227.835404 115.135054 m
227.835404 115.148456 l
stroke
grestore
gsave
78.776 110.88 141.674 30.111 clipbox
240.144228 115.136341 m
240.144228 115.149804 l
stroke
grestore
gsave
78.776 110.88 141.674 30.111 clipbox
252.453051 115.13734 m
252.453051 115.150762 l
stroke
grestore
gsave
78.776 110.88 141.674 30.111 clipbox
264.761875 115.138268 m
264.761875 115.151717 l
stroke
grestore
gsave
78.776 110.88 141.674 30.111 clipbox
277.070699 115.138981 m
277.070699 115.152435 l
stroke
grestore
gsave
78.776 110.88 141.674 30.111 clipbox
289.379522 115.139511 m
289.379522 115.152958 l
stroke
grestore
gsave
78.776 110.88 141.674 30.111 clipbox
301.688346 115.139772 m
301.688346 115.15315 l
stroke
grestore
gsave
78.776 110.88 141.674 30.111 clipbox
313.997169 115.140302 m
313.997169 115.153599 l
stroke
grestore
gsave
78.776 110.88 141.674 30.111 clipbox

stroke
grestore
gsave
78.776 110.88 141.674 30.111 clipbox

stroke
grestore
gsave
78.776 110.88 141.674 30.111 clipbox

stroke
grestore
gsave
78.776 110.88 141.674 30.111 clipbox

stroke
grestore
gsave
78.776 110.88 141.674 30.111 clipbox

stroke
grestore
gsave
78.776 110.88 141.674 30.111 clipbox

stroke
grestore
gsave
78.776 110.88 141.674 30.111 clipbox

stroke
grestore
gsave
78.776 110.88 141.674 30.111 clipbox

stroke
grestore
gsave
78.776 110.88 141.674 30.111 clipbox

stroke
grestore
gsave
78.776 110.88 141.674 30.111 clipbox

stroke
grestore
gsave
78.776 110.88 141.674 30.111 clipbox

stroke
grestore
gsave
78.776 110.88 141.674 30.111 clipbox

stroke
grestore
gsave
78.776 110.88 141.674 30.111 clipbox

stroke
grestore
gsave
78.776 110.88 141.674 30.111 clipbox

stroke
grestore
gsave
78.776 110.88 141.674 30.111 clipbox

stroke
grestore
gsave
78.776 110.88 141.674 30.111 clipbox

stroke
grestore
gsave
78.776 110.88 141.674 30.111 clipbox

stroke
grestore
gsave
78.776 110.88 141.674 30.111 clipbox

stroke
grestore
gsave
78.776 110.88 141.674 30.111 clipbox

stroke
grestore
gsave
78.776 110.88 141.674 30.111 clipbox

stroke
grestore
gsave
78.776 110.88 141.674 30.111 clipbox

stroke
grestore
[5.55 2.4] 0 setdash
0.000 setgray
gsave
78.776 110.88 141.674 30.111 clipbox
92.438346 30.110625 m
163.829522 30.193757 l
165.306581 30.390417 l
166.291287 30.700271 l
167.275993 31.263975 l
168.260699 32.250726 l
169.245404 33.842525 l
170.23011 36.26253 l
171.214816 39.692222 l
172.199522 44.175617 l
173.184228 49.661795 l
174.661287 59.302995 l
178.107757 82.784099 l
179.584816 90.978574 l
181.061875 97.57995 l
182.046581 101.152192 l
183.031287 104.152602 l
184.015993 106.654255 l
185.000699 108.714935 l
185.985404 110.372795 l
186.97011 111.650806 l
187.954816 112.593505 l
188.939522 113.243087 l
189.924228 113.678604 l
191.401287 114.038783 l
194.847757 114.47237 l
199.771287 114.997069 l
203.217757 115.097199 l
218.480699 115.118501 l
317.512721 115.125293 l
317.512721 115.125293 l
stroke
grestore
1.000 setlinewidth
[] 0 setdash
gsave
78.776 110.88 141.674 30.111 clipbox
/o {
gsave
newpath
translate
1.0 setlinewidth
1 setlinejoin

0 setlinecap

-3 0 m
3 0 l
0 -3 m
0 3 l

gsave
grestore
stroke
grestore
} bind def
92.4383 30.1106 o
104.747 30.1106 o
117.056 30.1106 o
129.365 30.1106 o
141.674 30.1106 o
153.982 30.1106 o
166.291 30.7003 o
178.6 85.6845 o
190.909 113.943 o
203.218 115.097 o
215.527 115.118 o
227.835 115.12 o
240.144 115.121 o
252.453 115.122 o
264.762 115.123 o
277.071 115.124 o
289.38 115.124 o
301.688 115.125 o
313.997 115.125 o
317.513 115.125 o
grestore
1.500 setlinewidth
[1.5 2.475] 0 setdash
1.000 0.000 0.000 setrgbcolor
gsave
78.776 110.88 141.674 30.111 clipbox
92.438346 30.110625 m
155.459522 30.188636 l
156.936581 30.373263 l
157.921287 30.612497 l
158.905993 31.096167 l
159.398346 31.452419 l
160.383051 32.539375 l
161.367757 34.193214 l
162.352463 36.624565 l
163.337169 40.064861 l
164.321875 44.475098 l
166.291287 55.456482 l
168.260699 68.403751 l
171.214816 86.934025 l
173.184228 97.197706 l
174.168934 101.431117 l
175.15364 104.775199 l
176.138346 107.300164 l
177.615404 110.144974 l
178.107757 110.969293 l
179.584816 112.643935 l
180.569522 113.44225 l
182.538934 114.328978 l
184.015993 114.742437 l
185.493051 114.955668 l
188.939522 115.10909 l
198.294228 115.148096 l
317.512721 115.148096 l
317.512721 115.148096 l
stroke
grestore
1.000 setlinewidth
0 setlinejoin
[] 0 setdash
gsave
78.776 110.88 141.674 30.111 clipbox
/o {
gsave
newpath
translate
1.0 setlinewidth
0 setlinejoin

0 setlinecap

0 3 m
-3 -3 l
3 -3 l
cl

gsave
grestore
stroke
grestore
} bind def
92.4383 30.1106 o
104.747 30.1106 o
117.056 30.1106 o
129.365 30.1106 o
141.674 30.1106 o
153.982 30.1366 o
166.291 55.4565 o
178.6 111.575 o
190.909 115.13 o
203.218 115.148 o
215.527 115.148 o
227.835 115.148 o
240.144 115.148 o
252.453 115.148 o
264.762 115.148 o
277.071 115.148 o
289.38 115.148 o
301.688 115.148 o
313.997 115.148 o
317.513 115.148 o
grestore
1.500 setlinewidth
1 setlinejoin
[1.5 2.475] 0 setdash
0.122 0.467 0.706 setrgbcolor
gsave
78.776 110.88 141.674 30.111 clipbox
92.438346 30.110625 m
164.321875 30.206369 l
165.798934 30.437766 l
166.78364 30.797323 l
167.768346 31.459624 l
168.753051 32.597106 l
169.737757 34.415225 l
170.722463 37.090219 l
171.707169 40.771523 l
172.691875 45.409363 l
174.168934 54.035882 l
176.138346 67.308297 l
178.60011 83.877384 l
180.077169 92.445996 l
181.554228 99.44035 l
182.538934 103.149176 l
183.52364 106.144534 l
184.508346 108.51174 l
185.493051 110.327073 l
186.477757 111.699076 l
187.462463 112.707532 l
188.447169 113.447015 l
189.924228 114.192485 l
191.401287 114.6354 l
193.370699 114.947217 l
196.324816 115.097478 l
204.202463 115.136935 l
317.512721 115.147026 l
317.512721 115.147026 l
stroke
grestore
1.000 setlinewidth
[] 0 setdash
gsave
78.776 110.88 141.674 30.111 clipbox
/o {
gsave
newpath
translate
1.0 setlinewidth
1 setlinejoin

0 setlinecap

0 -3 m
0.795609 -3 1.55874 -2.683901 2.12132 -2.12132 c
2.683901 -1.55874 3 -0.795609 3 0 c
3 0.795609 2.683901 1.55874 2.12132 2.12132 c
1.55874 2.683901 0.795609 3 0 3 c
-0.795609 3 -1.55874 2.683901 -2.12132 2.12132 c
-2.683901 1.55874 -3 0.795609 -3 0 c
-3 -0.795609 -2.683901 -1.55874 -2.12132 -2.12132 c
-1.55874 -2.683901 -0.795609 -3 0 -3 c
cl

gsave
grestore
stroke
grestore
} bind def
92.4383 30.1106 o
104.747 30.1106 o
117.056 30.1106 o
129.365 30.1106 o
141.674 30.1106 o
153.982 30.1106 o
166.291 30.5905 o
178.6 83.8774 o
190.909 114.513 o
203.218 115.136 o
215.527 115.14 o
227.835 115.142 o
240.144 115.143 o
252.453 115.144 o
264.762 115.145 o
277.071 115.146 o
289.38 115.146 o
301.688 115.146 o
313.997 115.147 o
317.513 115.147 o
grestore
0.800 setlinewidth
0 setlinejoin
2 setlinecap
0.000 setgray
gsave
141.67364 30.110625 m
220.45011 30.110625 l
stroke
grestore
gsave
236.205404 30.110625 m
314.981875 30.110625 l
314.981875 140.990625 l
236.205404 140.990625 l
cl
1.000 setgray
fill
grestore
1 setlinejoin
0 setlinecap
[2.96 1.28] 0 setdash
0.690 setgray
gsave
78.776 110.88 236.205 30.111 clipbox
236.205404 30.110625 m
236.205404 140.990625 l
stroke
grestore
[] 0 setdash
0.000 setgray
gsave
/o {
gsave
newpath
translate
0.8 setlinewidth
1 setlinejoin

0 setlinecap

0 0 m
0 -3.5 l

gsave
0.000 setgray
fill
grestore
stroke
grestore
} bind def
236.205 30.1106 o
grestore
/DejaVuSans 9.000 selectfont
gsave

230.471029 16.266875 translate
0.000000 rotate
0.000000 0 m /one glyphshow
5.726074 0 m /one glyphshow
grestore
[2.96 1.28] 0 setdash
0.690 setgray
gsave
78.776 110.88 236.205 30.111 clipbox
260.823051 30.110625 m
260.823051 140.990625 l
stroke
grestore
[] 0 setdash
0.000 setgray
gsave
/o {
gsave
newpath
translate
0.8 setlinewidth
1 setlinejoin

0 setlinecap

0 0 m
0 -3.5 l

gsave
0.000 setgray
fill
grestore
stroke
grestore
} bind def
260.823 30.1106 o
grestore
gsave

255.088676 16.266875 translate
0.000000 rotate
0.000000 0 m /one glyphshow
5.726074 0 m /three glyphshow
grestore
[2.96 1.28] 0 setdash
0.690 setgray
gsave
78.776 110.88 236.205 30.111 clipbox
285.440699 30.110625 m
285.440699 140.990625 l
stroke
grestore
[] 0 setdash
0.000 setgray
gsave
/o {
gsave
newpath
translate
0.8 setlinewidth
1 setlinejoin

0 setlinecap

0 0 m
0 -3.5 l

gsave
0.000 setgray
fill
grestore
stroke
grestore
} bind def
285.441 30.1106 o
grestore
gsave

279.706324 16.266875 translate
0.000000 rotate
0.000000 0 m /one glyphshow
5.726074 0 m /five glyphshow
grestore
[2.96 1.28] 0 setdash
0.690 setgray
gsave
78.776 110.88 236.205 30.111 clipbox
310.058346 30.110625 m
310.058346 140.990625 l
stroke
grestore
[] 0 setdash
0.000 setgray
gsave
/o {
gsave
newpath
translate
0.8 setlinewidth
1 setlinejoin

0 setlinecap

0 0 m
0 -3.5 l

gsave
0.000 setgray
fill
grestore
stroke
grestore
} bind def
310.058 30.1106 o
grestore
gsave

304.323971 16.266875 translate
0.000000 rotate
0.000000 0 m /one glyphshow
5.726074 0 m /seven glyphshow
grestore
[2.96 1.28] 0 setdash
0.690 setgray
gsave
78.776 110.88 236.205 30.111 clipbox
236.205404 30.110625 m
314.981875 30.110625 l
stroke
grestore
[] 0 setdash
0.000 setgray
gsave
/o {
gsave
newpath
translate
0.8 setlinewidth
1 setlinejoin

0 setlinecap

-0 0 m
-3.5 0 l

gsave
0.000 setgray
fill
grestore
stroke
grestore
} bind def
236.205 30.1106 o
grestore
[2.96 1.28] 0 setdash
0.690 setgray
gsave
78.776 110.88 236.205 30.111 clipbox
236.205404 51.433702 m
314.981875 51.433702 l
stroke
grestore
[] 0 setdash
0.000 setgray
gsave
/o {
gsave
newpath
translate
0.8 setlinewidth
1 setlinejoin

0 setlinecap

-0 0 m
-3.5 0 l

gsave
0.000 setgray
fill
grestore
stroke
grestore
} bind def
236.205 51.4337 o
grestore
[2.96 1.28] 0 setdash
0.690 setgray
gsave
78.776 110.88 236.205 30.111 clipbox
236.205404 72.756779 m
314.981875 72.756779 l
stroke
grestore
[] 0 setdash
0.000 setgray
gsave
/o {
gsave
newpath
translate
0.8 setlinewidth
1 setlinejoin

0 setlinecap

-0 0 m
-3.5 0 l

gsave
0.000 setgray
fill
grestore
stroke
grestore
} bind def
236.205 72.7568 o
grestore
[2.96 1.28] 0 setdash
0.690 setgray
gsave
78.776 110.88 236.205 30.111 clipbox
236.205404 94.079856 m
314.981875 94.079856 l
stroke
grestore
[] 0 setdash
0.000 setgray
gsave
/o {
gsave
newpath
translate
0.8 setlinewidth
1 setlinejoin

0 setlinecap

-0 0 m
-3.5 0 l

gsave
0.000 setgray
fill
grestore
stroke
grestore
} bind def
236.205 94.0799 o
grestore
[2.96 1.28] 0 setdash
0.690 setgray
gsave
78.776 110.88 236.205 30.111 clipbox
236.205404 115.402933 m
314.981875 115.402933 l
stroke
grestore
[] 0 setdash
0.000 setgray
gsave
/o {
gsave
newpath
translate
0.8 setlinewidth
1 setlinejoin

0 setlinecap

-0 0 m
-3.5 0 l

gsave
0.000 setgray
fill
grestore
stroke
grestore
} bind def
236.205 115.403 o
grestore
1.500 setlinewidth
gsave
78.776 110.88 236.205 30.111 clipbox
100.808346 30.110625 m
100.808346 30.110625 l
stroke
grestore
gsave
78.776 110.88 236.205 30.111 clipbox
113.117169 30.110625 m
113.117169 30.110625 l
stroke
grestore
gsave
78.776 110.88 236.205 30.111 clipbox
125.425993 30.110625 m
125.425993 30.110625 l
stroke
grestore
gsave
78.776 110.88 236.205 30.111 clipbox
137.734816 30.110625 m
137.734816 30.110625 l
stroke
grestore
gsave
78.776 110.88 236.205 30.111 clipbox
150.04364 30.110625 m
150.04364 30.110625 l
stroke
grestore
gsave
78.776 110.88 236.205 30.111 clipbox
162.352463 30.110625 m
162.352463 30.110625 l
stroke
grestore
gsave
78.776 110.88 236.205 30.111 clipbox
174.661287 30.110625 m
174.661287 30.110625 l
stroke
grestore
gsave
78.776 110.88 236.205 30.111 clipbox
186.97011 30.110625 m
186.97011 30.110625 l
stroke
grestore
gsave
78.776 110.88 236.205 30.111 clipbox
199.278934 30.110625 m
199.278934 30.110625 l
stroke
grestore
gsave
78.776 110.88 236.205 30.111 clipbox
211.587757 30.110625 m
211.587757 30.110625 l
stroke
grestore
gsave
78.776 110.88 236.205 30.111 clipbox
223.896581 30.110625 m
223.896581 30.110625 l
stroke
grestore
gsave
78.776 110.88 236.205 30.111 clipbox
236.205404 30.110625 m
236.205404 30.110625 l
stroke
grestore
gsave
78.776 110.88 236.205 30.111 clipbox
248.514228 30.110625 m
248.514228 30.110625 l
stroke
grestore
gsave
78.776 110.88 236.205 30.111 clipbox
260.823051 37.327938 m
260.823051 48.425707 l
stroke
grestore
gsave
78.776 110.88 236.205 30.111 clipbox
273.131875 77.724998 m
273.131875 93.187274 l
stroke
grestore
gsave
78.776 110.88 236.205 30.111 clipbox
285.440699 102.397202 m
285.440699 111.849961 l
stroke
grestore
gsave
78.776 110.88 236.205 30.111 clipbox
297.749522 114.211485 m
297.749522 115.35118 l
stroke
grestore
gsave
78.776 110.88 236.205 30.111 clipbox
310.058346 115.117159 m
310.058346 115.129419 l
stroke
grestore
gsave
78.776 110.88 236.205 30.111 clipbox

stroke
grestore
gsave
78.776 110.88 236.205 30.111 clipbox

stroke
grestore
gsave
78.776 110.88 236.205 30.111 clipbox

stroke
grestore
gsave
78.776 110.88 236.205 30.111 clipbox

stroke
grestore
gsave
78.776 110.88 236.205 30.111 clipbox

stroke
grestore
gsave
78.776 110.88 236.205 30.111 clipbox

stroke
grestore
gsave
78.776 110.88 236.205 30.111 clipbox

stroke
grestore
gsave
78.776 110.88 236.205 30.111 clipbox

stroke
grestore
gsave
78.776 110.88 236.205 30.111 clipbox

stroke
grestore
gsave
78.776 110.88 236.205 30.111 clipbox

stroke
grestore
gsave
78.776 110.88 236.205 30.111 clipbox

stroke
grestore
gsave
78.776 110.88 236.205 30.111 clipbox

stroke
grestore
1.000 0.000 0.000 setrgbcolor
gsave
78.776 110.88 236.205 30.111 clipbox
100.808346 30.110625 m
100.808346 30.110625 l
stroke
grestore
gsave
78.776 110.88 236.205 30.111 clipbox
113.117169 30.110625 m
113.117169 30.110625 l
stroke
grestore
gsave
78.776 110.88 236.205 30.111 clipbox
125.425993 30.110625 m
125.425993 30.110625 l
stroke
grestore
gsave
78.776 110.88 236.205 30.111 clipbox
137.734816 30.110625 m
137.734816 30.110625 l
stroke
grestore
gsave
78.776 110.88 236.205 30.111 clipbox
150.04364 30.110625 m
150.04364 30.110625 l
stroke
grestore
gsave
78.776 110.88 236.205 30.111 clipbox
162.352463 30.110625 m
162.352463 30.110625 l
stroke
grestore
gsave
78.776 110.88 236.205 30.111 clipbox
174.661287 30.110625 m
174.661287 30.110625 l
stroke
grestore
gsave
78.776 110.88 236.205 30.111 clipbox
186.97011 30.110625 m
186.97011 30.110625 l
stroke
grestore
gsave
78.776 110.88 236.205 30.111 clipbox
199.278934 30.110625 m
199.278934 30.110625 l
stroke
grestore
gsave
78.776 110.88 236.205 30.111 clipbox
211.587757 30.110625 m
211.587757 30.110625 l
stroke
grestore
gsave
78.776 110.88 236.205 30.111 clipbox
223.896581 30.110625 m
223.896581 30.110625 l
stroke
grestore
gsave
78.776 110.88 236.205 30.111 clipbox
236.205404 30.110625 m
236.205404 30.110625 l
stroke
grestore
gsave
78.776 110.88 236.205 30.111 clipbox
248.514228 30.110625 m
248.514228 30.110625 l
stroke
grestore
gsave
78.776 110.88 236.205 30.111 clipbox
260.823051 46.404171 m
260.823051 60.623833 l
stroke
grestore
gsave
78.776 110.88 236.205 30.111 clipbox
273.131875 88.15819 m
273.131875 101.99861 l
stroke
grestore
gsave
78.776 110.88 236.205 30.111 clipbox
285.440699 106.84395 m
285.440699 113.763244 l
stroke
grestore
gsave
78.776 110.88 236.205 30.111 clipbox
297.749522 115.13428 m
297.749522 115.224321 l
stroke
grestore
gsave
78.776 110.88 236.205 30.111 clipbox
310.058346 115.13428 m
310.058346 115.224321 l
stroke
grestore
gsave
78.776 110.88 236.205 30.111 clipbox

stroke
grestore
gsave
78.776 110.88 236.205 30.111 clipbox

stroke
grestore
gsave
78.776 110.88 236.205 30.111 clipbox

stroke
grestore
gsave
78.776 110.88 236.205 30.111 clipbox

stroke
grestore
gsave
78.776 110.88 236.205 30.111 clipbox

stroke
grestore
gsave
78.776 110.88 236.205 30.111 clipbox

stroke
grestore
gsave
78.776 110.88 236.205 30.111 clipbox

stroke
grestore
gsave
78.776 110.88 236.205 30.111 clipbox

stroke
grestore
gsave
78.776 110.88 236.205 30.111 clipbox

stroke
grestore
gsave
78.776 110.88 236.205 30.111 clipbox

stroke
grestore
gsave
78.776 110.88 236.205 30.111 clipbox

stroke
grestore
gsave
78.776 110.88 236.205 30.111 clipbox

stroke
grestore
0.122 0.467 0.706 setrgbcolor
gsave
78.776 110.88 236.205 30.111 clipbox
100.808346 30.110625 m
100.808346 30.110625 l
stroke
grestore
gsave
78.776 110.88 236.205 30.111 clipbox
113.117169 30.110625 m
113.117169 30.110625 l
stroke
grestore
gsave
78.776 110.88 236.205 30.111 clipbox
125.425993 30.110625 m
125.425993 30.110625 l
stroke
grestore
gsave
78.776 110.88 236.205 30.111 clipbox
137.734816 30.110625 m
137.734816 30.110625 l
stroke
grestore
gsave
78.776 110.88 236.205 30.111 clipbox
150.04364 30.110625 m
150.04364 30.110625 l
stroke
grestore
gsave
78.776 110.88 236.205 30.111 clipbox
162.352463 30.110625 m
162.352463 30.110625 l
stroke
grestore
gsave
78.776 110.88 236.205 30.111 clipbox
174.661287 30.110625 m
174.661287 30.110625 l
stroke
grestore
gsave
78.776 110.88 236.205 30.111 clipbox
186.97011 30.110625 m
186.97011 30.110625 l
stroke
grestore
gsave
78.776 110.88 236.205 30.111 clipbox
199.278934 30.110625 m
199.278934 30.110625 l
stroke
grestore
gsave
78.776 110.88 236.205 30.111 clipbox
211.587757 30.110625 m
211.587757 30.110625 l
stroke
grestore
gsave
78.776 110.88 236.205 30.111 clipbox
223.896581 30.110625 m
223.896581 30.110625 l
stroke
grestore
gsave
78.776 110.88 236.205 30.111 clipbox
236.205404 30.110625 m
236.205404 30.110625 l
stroke
grestore
gsave
78.776 110.88 236.205 30.111 clipbox
248.514228 30.110625 m
248.514228 30.110625 l
stroke
grestore
gsave
78.776 110.88 236.205 30.111 clipbox
260.823051 40.857917 m
260.823051 53.451039 l
stroke
grestore
gsave
78.776 110.88 236.205 30.111 clipbox
273.131875 84.28975 m
273.131875 98.750164 l
stroke
grestore
gsave
78.776 110.88 236.205 30.111 clipbox
285.440699 102.843489 m
285.440699 111.971443 l
stroke
grestore
gsave
78.776 110.88 236.205 30.111 clipbox
297.749522 115.104515 m
297.749522 115.159717 l
stroke
grestore
gsave
78.776 110.88 236.205 30.111 clipbox
310.058346 115.141836 m
310.058346 115.154249 l
stroke
grestore
gsave
78.776 110.88 236.205 30.111 clipbox

stroke
grestore
gsave
78.776 110.88 236.205 30.111 clipbox

stroke
grestore
gsave
78.776 110.88 236.205 30.111 clipbox

stroke
grestore
gsave
78.776 110.88 236.205 30.111 clipbox

stroke
grestore
gsave
78.776 110.88 236.205 30.111 clipbox

stroke
grestore
gsave
78.776 110.88 236.205 30.111 clipbox

stroke
grestore
gsave
78.776 110.88 236.205 30.111 clipbox

stroke
grestore
gsave
78.776 110.88 236.205 30.111 clipbox

stroke
grestore
gsave
78.776 110.88 236.205 30.111 clipbox

stroke
grestore
gsave
78.776 110.88 236.205 30.111 clipbox

stroke
grestore
gsave
78.776 110.88 236.205 30.111 clipbox

stroke
grestore
gsave
78.776 110.88 236.205 30.111 clipbox

stroke
grestore
[5.55 2.4] 0 setdash
0.000 setgray
gsave
78.776 110.88 236.205 30.111 clipbox
100.808346 30.110625 m
252.945404 30.210087 l
253.560846 30.4364 l
254.299375 30.986632 l
257.253493 33.709588 l
257.992022 34.925361 l
258.607463 36.400181 l
260.823051 42.876822 l
263.284816 50.223607 l
265.500404 56.259758 l
268.331434 67.350875 l
271.039375 78.986658 l
272.024081 82.646226 l
272.885699 84.903492 l
273.993493 87.639251 l
274.978199 90.996388 l
275.716728 93.260483 l
276.209081 94.177276 l
276.824522 94.822406 l
277.563051 95.651169 l
278.424669 97.132891 l
279.286287 98.512777 l
280.024816 99.24527 l
281.624963 100.602702 l
282.240404 101.721463 l
284.332904 105.892072 l
285.071434 106.785671 l
286.425404 107.92013 l
287.287022 108.33364 l
288.025551 108.719574 l
288.640993 109.326737 l
289.871875 110.614918 l
292.33364 112.443941 l
293.318346 112.592465 l
294.303051 112.803822 l
296.026287 113.610651 l
296.887904 114.181147 l
298.118787 114.941919 l
298.980404 115.093376 l
301.319081 115.122435 l
317.512721 115.123474 l
317.512721 115.123474 l
stroke
grestore
1.000 setlinewidth
[] 0 setdash
gsave
78.776 110.88 236.205 30.111 clipbox
/o {
gsave
newpath
translate
1.0 setlinewidth
1 setlinejoin

0 setlinecap

-3 0 m
3 0 l
0 -3 m
0 3 l

gsave
grestore
stroke
grestore
} bind def
100.808 30.1106 o
113.117 30.1106 o
125.426 30.1106 o
137.735 30.1106 o
150.044 30.1106 o
162.352 30.1106 o
174.661 30.1106 o
186.97 30.1106 o
199.279 30.1106 o
211.588 30.1106 o
223.897 30.1106 o
236.205 30.1106 o
248.514 30.1106 o
260.823 42.8768 o
273.132 85.4561 o
285.441 107.124 o
297.75 114.781 o
310.058 115.123 o
317.513 115.123 o
grestore
1.500 setlinewidth
[1.5 2.475] 0 setdash
1.000 0.000 0.000 setrgbcolor
gsave
78.776 110.88 236.205 30.111 clipbox
100.808346 30.110625 m
251.222169 30.219841 l
251.714522 30.417469 l
252.329963 31.023357 l
252.822316 31.907484 l
254.176287 34.497458 l
254.914816 35.810648 l
255.776434 38.317409 l
258.730551 46.945454 l
259.469081 49.590036 l
260.084522 51.467507 l
261.069228 54.47094 l
262.669375 61.356734 l
264.146434 65.727965 l
265.13114 70.380036 l
266.238934 76.57933 l
266.854375 79.169304 l
267.592904 81.42383 l
270.547022 90.070077 l
272.024081 93.224332 l
273.008787 94.839165 l
273.50114 95.621878 l
274.116581 96.199162 l
275.347463 97.002678 l
276.332169 98.289863 l
277.070699 99.400224 l
278.917022 100.973451 l
280.763346 103.321589 l
281.624963 104.099102 l
283.102022 106.507049 l
284.086728 107.895649 l
284.702169 108.816182 l
286.671581 112.248678 l
287.040846 112.487912 l
289.50261 113.431848 l
292.210551 113.704888 l
292.825993 114.00133 l
293.318346 114.292572 l
293.933787 114.576013 l
294.918493 115.028479 l
295.903199 115.171499 l
317.512721 115.1793 l
317.512721 115.1793 l
stroke
grestore
1.000 setlinewidth
0 setlinejoin
[] 0 setdash
gsave
78.776 110.88 236.205 30.111 clipbox
/o {
gsave
newpath
translate
1.0 setlinewidth
0 setlinejoin

0 setlinecap

0 3 m
-3 -3 l
3 -3 l
cl

gsave
grestore
stroke
grestore
} bind def
100.808 30.1106 o
113.117 30.1106 o
125.426 30.1106 o
137.735 30.1106 o
150.044 30.1106 o
162.352 30.1106 o
174.661 30.1106 o
186.97 30.1106 o
199.279 30.1106 o
211.588 30.1106 o
223.897 30.1106 o
236.205 30.1106 o
248.514 30.1106 o
260.823 53.514 o
273.132 95.0784 o
285.441 110.304 o
297.75 115.179 o
310.058 115.179 o
317.513 115.179 o
grestore
1.500 setlinewidth
1 setlinejoin
[1.5 2.475] 0 setdash
0.122 0.467 0.706 setrgbcolor
gsave
78.776 110.88 236.205 30.111 clipbox
100.808346 30.110625 m
253.314669 30.217325 l
253.807022 30.443752 l
254.299375 30.967388 l
254.914816 32.062288 l
256.02261 34.112029 l
256.76114 35.370895 l
257.499669 37.270563 l
260.330699 45.466139 l
262.177022 51.455915 l
263.03864 54.073117 l
263.777169 57.424984 l
264.515699 60.581183 l
265.377316 63.09609 l
266.115846 65.422898 l
266.854375 68.508014 l
267.715993 73.287907 l
268.57761 77.724433 l
269.31614 80.436061 l
270.423934 83.599828 l
271.654816 87.197737 l
273.131875 91.519957 l
273.870404 92.969708 l
275.716728 95.824933 l
276.332169 96.291341 l
277.439963 96.933199 l
277.932316 97.547421 l
279.286287 99.532856 l
280.763346 100.841419 l
282.486581 103.039991 l
283.594375 104.04758 l
284.209816 105.050651 l
285.686875 107.7517 l
287.287022 109.78672 l
288.517904 111.936121 l
289.133346 112.469922 l
290.610404 113.2361 l
291.472022 113.412565 l
294.303051 113.65394 l
295.164669 114.124527 l
296.764816 115.004859 l
297.626434 115.127448 l
301.072904 115.147779 l
317.512721 115.148193 l
317.512721 115.148193 l
stroke
grestore
1.000 setlinewidth
[] 0 setdash
gsave
78.776 110.88 236.205 30.111 clipbox
/o {
gsave
newpath
translate
1.0 setlinewidth
1 setlinejoin

0 setlinecap

0 -3 m
0.795609 -3 1.55874 -2.683901 2.12132 -2.12132 c
2.683901 -1.55874 3 -0.795609 3 0 c
3 0.795609 2.683901 1.55874 2.12132 2.12132 c
1.55874 2.683901 0.795609 3 0 3 c
-0.795609 3 -1.55874 2.683901 -2.12132 2.12132 c
-2.683901 1.55874 -3 0.795609 -3 0 c
-3 -0.795609 -2.683901 -1.55874 -2.12132 -2.12132 c
-1.55874 -2.683901 -0.795609 -3 0 -3 c
cl

gsave
grestore
stroke
grestore
} bind def
100.808 30.1106 o
113.117 30.1106 o
125.426 30.1106 o
137.735 30.1106 o
150.044 30.1106 o
162.352 30.1106 o
174.661 30.1106 o
186.97 30.1106 o
199.279 30.1106 o
211.588 30.1106 o
223.897 30.1106 o
236.205 30.1106 o
248.514 30.1106 o
260.823 47.1545 o
273.132 91.52 o
285.441 107.407 o
297.75 115.132 o
310.058 115.148 o
317.513 115.148 o
grestore
0.800 setlinewidth
0 setlinejoin
2 setlinecap
0.000 setgray
gsave
236.205404 30.110625 m
314.981875 30.110625 l
stroke
grestore
1.000 setlinewidth
0 setlinecap
gsave
68.772812 121.08035 m
293.350937 121.08035 l
294.684271 121.08035 295.350937 121.747017 295.350937 123.08035 c
295.350937 136.752225 l
295.350937 138.085558 294.684271 138.752225 293.350937 138.752225 c
68.772812 138.752225 l
67.439479 138.752225 66.772812 138.085558 66.772812 136.752225 c
66.772812 123.08035 l
66.772812 121.747017 67.439479 121.08035 68.772812 121.08035 c
cl
gsave
1.000 setgray
fill
grestore
stroke
grestore
1.500 setlinewidth
1 setlinejoin
gsave
80.772812 125.658475 m
80.772812 135.658475 l
stroke
grestore
[5.55 2.4] 0 setdash
gsave
70.772812 130.658475 m
90.772812 130.658475 l
stroke
grestore
1.000 setlinewidth
[] 0 setdash
gsave
/o {
gsave
newpath
translate
1.0 setlinewidth
1 setlinejoin

0 setlinecap

-3 0 m
3 0 l
0 -3 m
0 3 l

gsave
grestore
stroke
grestore
} bind def
80.7728 130.658 o
grestore
/DejaVuSans 10.000 selectfont
gsave

95.772812 127.158475 translate
0.000000 rotate
0.000000 0 m /U glyphshow
7.319336 0 m /n glyphshow
13.657227 0 m /i glyphshow
16.435547 0 m /f glyphshow
19.956055 0 m /o glyphshow
26.074219 0 m /r glyphshow
30.060547 0 m /m glyphshow
grestore
1.500 setlinewidth
1.000 0.000 0.000 setrgbcolor
gsave
165.600937 125.658475 m
165.600937 135.658475 l
stroke
grestore
[1.5 2.475] 0 setdash
gsave
155.600937 130.658475 m
175.600937 130.658475 l
stroke
grestore
1.000 setlinewidth
0 setlinejoin
[] 0 setdash
gsave
/o {
gsave
newpath
translate
1.0 setlinewidth
0 setlinejoin

0 setlinecap

0 3 m
-3 -3 l
3 -3 l
cl

gsave
grestore
stroke
grestore
} bind def
165.601 130.658 o
grestore
0.000 setgray
gsave

180.600937 127.158475 translate
0.000000 rotate
0.000000 0 m /G glyphshow
7.749023 0 m /P glyphshow
13.779297 0 m /S glyphshow
20.126953 0 m /colon glyphshow
23.496094 0 m /space glyphshow
26.674805 0 m /P glyphshow
grestore
1.500 setlinewidth
1 setlinejoin
0.122 0.467 0.706 setrgbcolor
gsave
243.319687 125.658475 m
243.319687 135.658475 l
stroke
grestore
[1.5 2.475] 0 setdash
gsave
233.319687 130.658475 m
253.319687 130.658475 l
stroke
grestore
1.000 setlinewidth
[] 0 setdash
gsave
/o {
gsave
newpath
translate
1.0 setlinewidth
1 setlinejoin

0 setlinecap

0 -3 m
0.795609 -3 1.55874 -2.683901 2.12132 -2.12132 c
2.683901 -1.55874 3 -0.795609 3 0 c
3 0.795609 2.683901 1.55874 2.12132 2.12132 c
1.55874 2.683901 0.795609 3 0 3 c
-0.795609 3 -1.55874 2.683901 -2.12132 2.12132 c
-2.683901 1.55874 -3 0.795609 -3 0 c
-3 -0.795609 -2.683901 -1.55874 -2.12132 -2.12132 c
-1.55874 -2.683901 -0.795609 -3 0 -3 c
cl

gsave
grestore
stroke
grestore
} bind def
243.32 130.658 o
grestore
0.000 setgray
gsave

258.319687 127.158475 translate
0.000000 rotate
0.000000 0 m /G glyphshow
7.749023 0 m /P glyphshow
13.779297 0 m /S glyphshow
20.126953 0 m /colon glyphshow
23.496094 0 m /space glyphshow
26.674805 0 m /S glyphshow
grestore

end
showpage
