%!PS-Adobe-3.0 EPSF-3.0
%%Title: expe_jitter.eps
%%Creator: Matplotlib v3.5.2, https://matplotlib.org/
%%CreationDate: Wed Sep 21 20:02:16 2022
%%Orientation: portrait
%%BoundingBox: 234 325 378 467
%%HiResBoundingBox: 234.770000 325.144687 377.230000 466.855312
%%EndComments
%%BeginProlog
/mpldict 11 dict def
mpldict begin
/_d { bind def } bind def
/m { moveto } _d
/l { lineto } _d
/r { rlineto } _d
/c { curveto } _d
/cl { closepath } _d
/ce { closepath eofill } _d
/box {
      m
      1 index 0 r
      0 exch r
      neg 0 r
      cl
    } _d
/clipbox {
      box
      clip
      newpath
    } _d
/sc { setcachedevice } _d
%!PS-Adobe-3.0 Resource-Font
%%Creator: Converted from TrueType to Type 3 by Matplotlib.
10 dict begin
/FontName /DejaVuSans def
/PaintType 0 def
/FontMatrix [0.00048828125 0 0 0.00048828125 0 0] def
/FontBBox [-2090 -948 3673 2524] def
/FontType 3 def
/Encoding [/space /period /zero /one /two /three /four /five /six /seven /equal /L /N /P /S /U /a /c /d /e /f /i /l /m /n /o /r /s /t /v /y] def
/CharStrings 32 dict dup begin
/.notdef 0 def
/space{651 0 0 0 0 0 sc
ce} _d
/period{651 0 219 0 430 254 sc
219 254 m
430 254 l
430 0 l
219 0 l
219 254 l

ce} _d
/zero{1303 0 135 -29 1167 1520 sc
651 1360 m
547 1360 469 1309 416 1206 c
364 1104 338 950 338 745 c
338 540 364 387 416 284 c
469 182 547 131 651 131 c
756 131 834 182 886 284 c
939 387 965 540 965 745 c
965 950 939 1104 886 1206 c
834 1309 756 1360 651 1360 c

651 1520 m
818 1520 946 1454 1034 1321 c
1123 1189 1167 997 1167 745 c
1167 494 1123 302 1034 169 c
946 37 818 -29 651 -29 c
484 -29 356 37 267 169 c
179 302 135 494 135 745 c
135 997 179 1189 267 1321 c
356 1454 484 1520 651 1520 c

ce} _d
/one{1303 0 225 0 1114 1493 sc
254 170 m
584 170 l
584 1309 l
225 1237 l
225 1421 l
582 1493 l
784 1493 l
784 170 l
1114 170 l
1114 0 l
254 0 l
254 170 l

ce} _d
/two{1303 0 150 0 1098 1520 sc
393 170 m
1098 170 l
1098 0 l
150 0 l
150 170 l
227 249 331 356 463 489 c
596 623 679 709 713 748 c
778 821 823 882 848 932 c
874 983 887 1032 887 1081 c
887 1160 859 1225 803 1275 c
748 1325 675 1350 586 1350 c
523 1350 456 1339 385 1317 c
315 1295 240 1262 160 1217 c
160 1421 l
241 1454 317 1478 388 1495 c
459 1512 523 1520 582 1520 c
737 1520 860 1481 952 1404 c
1044 1327 1090 1223 1090 1094 c
1090 1033 1078 974 1055 919 c
1032 864 991 800 930 725 c
913 706 860 650 771 557 c
682 465 556 336 393 170 c

ce} _d
/three{1303 0 156 -29 1139 1520 sc
831 805 m
928 784 1003 741 1057 676 c
1112 611 1139 530 1139 434 c
1139 287 1088 173 987 92 c
886 11 742 -29 555 -29 c
492 -29 428 -23 361 -10 c
295 2 227 20 156 45 c
156 240 l
212 207 273 183 340 166 c
407 149 476 141 549 141 c
676 141 772 166 838 216 c
905 266 938 339 938 434 c
938 522 907 591 845 640 c
784 690 698 715 588 715 c
414 715 l
414 881 l
596 881 l
695 881 771 901 824 940 c
877 980 903 1037 903 1112 c
903 1189 876 1247 821 1288 c
767 1329 689 1350 588 1350 c
533 1350 473 1344 410 1332 c
347 1320 277 1301 201 1276 c
201 1456 l
278 1477 349 1493 416 1504 c
483 1515 547 1520 606 1520 c
759 1520 881 1485 970 1415 c
1059 1346 1104 1252 1104 1133 c
1104 1050 1080 980 1033 923 c
986 866 918 827 831 805 c

ce} _d
/four{1303 0 100 0 1188 1493 sc
774 1317 m
264 520 l
774 520 l
774 1317 l

721 1493 m
975 1493 l
975 520 l
1188 520 l
1188 352 l
975 352 l
975 0 l
774 0 l
774 352 l
100 352 l
100 547 l
721 1493 l

ce} _d
/five{1303 0 158 -29 1124 1493 sc
221 1493 m
1014 1493 l
1014 1323 l
406 1323 l
406 957 l
435 967 465 974 494 979 c
523 984 553 987 582 987 c
749 987 881 941 978 850 c
1075 759 1124 635 1124 479 c
1124 318 1074 193 974 104 c
874 15 733 -29 551 -29 c
488 -29 424 -24 359 -13 c
294 -2 227 14 158 35 c
158 238 l
218 205 280 181 344 165 c
408 149 476 141 547 141 c
662 141 754 171 821 232 c
888 293 922 375 922 479 c
922 583 888 665 821 726 c
754 787 662 817 547 817 c
493 817 439 811 385 799 c
332 787 277 768 221 743 c
221 1493 l

ce} _d
/six{1303 0 143 -29 1174 1520 sc
676 827 m
585 827 513 796 460 734 c
407 672 381 587 381 479 c
381 372 407 287 460 224 c
513 162 585 131 676 131 c
767 131 838 162 891 224 c
944 287 971 372 971 479 c
971 587 944 672 891 734 c
838 796 767 827 676 827 c

1077 1460 m
1077 1276 l
1026 1300 975 1318 923 1331 c
872 1344 821 1350 770 1350 c
637 1350 535 1305 464 1215 c
394 1125 354 989 344 807 c
383 865 433 909 492 940 c
551 971 617 987 688 987 c
838 987 956 941 1043 850 c
1130 759 1174 636 1174 479 c
1174 326 1129 203 1038 110 c
947 17 827 -29 676 -29 c
503 -29 371 37 280 169 c
189 302 143 494 143 745 c
143 981 199 1169 311 1309 c
423 1450 573 1520 762 1520 c
813 1520 864 1515 915 1505 c
967 1495 1021 1480 1077 1460 c

ce} _d
/seven{1303 0 168 0 1128 1493 sc
168 1493 m
1128 1493 l
1128 1407 l
586 0 l
375 0 l
885 1323 l
168 1323 l
168 1493 l

ce} _d
/equal{1716 0 217 352 1499 930 sc
217 930 m
1499 930 l
1499 762 l
217 762 l
217 930 l

217 522 m
1499 522 l
1499 352 l
217 352 l
217 522 l

ce} _d
/L{1141 0 201 0 1130 1493 sc
201 1493 m
403 1493 l
403 170 l
1130 170 l
1130 0 l
201 0 l
201 1493 l

ce} _d
/N{1532 0 201 0 1331 1493 sc
201 1493 m
473 1493 l
1135 244 l
1135 1493 l
1331 1493 l
1331 0 l
1059 0 l
397 1249 l
397 0 l
201 0 l
201 1493 l

ce} _d
/P{1235 0 201 0 1165 1493 sc
403 1327 m
403 766 l
657 766 l
751 766 824 790 875 839 c
926 888 952 957 952 1047 c
952 1136 926 1205 875 1254 c
824 1303 751 1327 657 1327 c
403 1327 l

201 1493 m
657 1493 l
824 1493 951 1455 1036 1379 c
1122 1304 1165 1193 1165 1047 c
1165 900 1122 788 1036 713 c
951 638 824 600 657 600 c
403 600 l
403 0 l
201 0 l
201 1493 l

ce} _d
/S{1300 0 135 -29 1186 1520 sc
1096 1444 m
1096 1247 l
1019 1284 947 1311 879 1329 c
811 1347 745 1356 682 1356 c
572 1356 487 1335 427 1292 c
368 1249 338 1189 338 1110 c
338 1044 358 994 397 960 c
437 927 512 900 623 879 c
745 854 l
896 825 1007 775 1078 702 c
1150 630 1186 533 1186 412 c
1186 267 1137 158 1040 83 c
943 8 801 -29 614 -29 c
543 -29 468 -21 388 -5 c
309 11 226 35 141 66 c
141 274 l
223 228 303 193 382 170 c
461 147 538 135 614 135 c
729 135 818 158 881 203 c
944 248 975 313 975 397 c
975 470 952 528 907 569 c
862 610 789 641 686 662 c
563 686 l
412 716 303 763 236 827 c
169 891 135 980 135 1094 c
135 1226 181 1330 274 1406 c
367 1482 496 1520 659 1520 c
729 1520 800 1514 873 1501 c
946 1488 1020 1469 1096 1444 c

ce} _d
/U{1499 0 178 -29 1321 1493 sc
178 1493 m
381 1493 l
381 586 l
381 426 410 311 468 240 c
526 170 620 135 750 135 c
879 135 973 170 1031 240 c
1089 311 1118 426 1118 586 c
1118 1493 l
1321 1493 l
1321 561 l
1321 366 1273 219 1176 120 c
1080 21 938 -29 750 -29 c
561 -29 419 21 322 120 c
226 219 178 366 178 561 c
178 1493 l

ce} _d
/a{1255 0 123 -29 1069 1147 sc
702 563 m
553 563 450 546 393 512 c
336 478 307 420 307 338 c
307 273 328 221 371 182 c
414 144 473 125 547 125 c
649 125 731 161 792 233 c
854 306 885 402 885 522 c
885 563 l
702 563 l

1069 639 m
1069 0 l
885 0 l
885 170 l
843 102 791 52 728 19 c
665 -13 589 -29 498 -29 c
383 -29 292 3 224 67 c
157 132 123 218 123 326 c
123 452 165 547 249 611 c
334 675 460 707 627 707 c
885 707 l
885 725 l
885 810 857 875 801 921 c
746 968 668 991 567 991 c
503 991 441 983 380 968 c
319 953 261 930 205 899 c
205 1069 l
272 1095 338 1114 401 1127 c
464 1140 526 1147 586 1147 c
748 1147 869 1105 949 1021 c
1029 937 1069 810 1069 639 c

ce} _d
/c{1126 0 113 -29 999 1147 sc
999 1077 m
999 905 l
947 934 895 955 842 969 c
790 984 737 991 684 991 c
565 991 472 953 406 877 c
340 802 307 696 307 559 c
307 422 340 316 406 240 c
472 165 565 127 684 127 c
737 127 790 134 842 148 c
895 163 947 184 999 213 c
999 43 l
948 19 894 1 839 -11 c
784 -23 726 -29 664 -29 c
495 -29 361 24 262 130 c
163 236 113 379 113 559 c
113 742 163 885 263 990 c
364 1095 501 1147 676 1147 c
733 1147 788 1141 842 1129 c
896 1118 948 1100 999 1077 c

ce} _d
/d{1300 0 113 -29 1114 1556 sc
930 950 m
930 1556 l
1114 1556 l
1114 0 l
930 0 l
930 168 l
891 101 842 52 783 19 c
724 -13 654 -29 571 -29 c
436 -29 325 25 240 133 c
155 241 113 383 113 559 c
113 735 155 877 240 985 c
325 1093 436 1147 571 1147 c
654 1147 724 1131 783 1098 c
842 1066 891 1017 930 950 c

303 559 m
303 424 331 317 386 240 c
442 163 519 125 616 125 c
713 125 790 163 846 240 c
902 317 930 424 930 559 c
930 694 902 800 846 877 c
790 954 713 993 616 993 c
519 993 442 954 386 877 c
331 800 303 694 303 559 c

ce} _d
/e{1260 0 113 -29 1151 1147 sc
1151 606 m
1151 516 l
305 516 l
313 389 351 293 419 226 c
488 160 583 127 705 127 c
776 127 844 136 910 153 c
977 170 1043 196 1108 231 c
1108 57 l
1042 29 974 8 905 -7 c
836 -22 765 -29 694 -29 c
515 -29 374 23 269 127 c
165 231 113 372 113 549 c
113 732 162 878 261 985 c
360 1093 494 1147 662 1147 c
813 1147 932 1098 1019 1001 c
1107 904 1151 773 1151 606 c

967 660 m
966 761 937 841 882 901 c
827 961 755 991 664 991 c
561 991 479 962 417 904 c
356 846 320 764 311 659 c
967 660 l

ce} _d
/f{721 0 47 0 760 1556 sc
760 1556 m
760 1403 l
584 1403 l
518 1403 472 1390 446 1363 c
421 1336 408 1288 408 1219 c
408 1120 l
711 1120 l
711 977 l
408 977 l
408 0 l
223 0 l
223 977 l
47 977 l
47 1120 l
223 1120 l
223 1198 l
223 1323 252 1413 310 1470 c
368 1527 460 1556 586 1556 c
760 1556 l

ce} _d
/i{569 0 193 0 377 1556 sc
193 1120 m
377 1120 l
377 0 l
193 0 l
193 1120 l

193 1556 m
377 1556 l
377 1323 l
193 1323 l
193 1556 l

ce} _d
/l{569 0 193 0 377 1556 sc
193 1556 m
377 1556 l
377 0 l
193 0 l
193 1556 l

ce} _d
/m{1995 0 186 0 1821 1147 sc
1065 905 m
1111 988 1166 1049 1230 1088 c
1294 1127 1369 1147 1456 1147 c
1573 1147 1663 1106 1726 1024 c
1789 943 1821 827 1821 676 c
1821 0 l
1636 0 l
1636 670 l
1636 777 1617 857 1579 909 c
1541 961 1483 987 1405 987 c
1310 987 1234 955 1179 892 c
1124 829 1096 742 1096 633 c
1096 0 l
911 0 l
911 670 l
911 778 892 858 854 909 c
816 961 757 987 678 987 c
584 987 509 955 454 891 c
399 828 371 742 371 633 c
371 0 l
186 0 l
186 1120 l
371 1120 l
371 946 l
413 1015 463 1065 522 1098 c
581 1131 650 1147 731 1147 c
812 1147 881 1126 938 1085 c
995 1044 1038 984 1065 905 c

ce} _d
/n{1298 0 186 0 1124 1147 sc
1124 676 m
1124 0 l
940 0 l
940 670 l
940 776 919 855 878 908 c
837 961 775 987 692 987 c
593 987 514 955 457 892 c
400 829 371 742 371 633 c
371 0 l
186 0 l
186 1120 l
371 1120 l
371 946 l
415 1013 467 1064 526 1097 c
586 1130 655 1147 733 1147 c
862 1147 959 1107 1025 1027 c
1091 948 1124 831 1124 676 c

ce} _d
/o{1253 0 113 -29 1141 1147 sc
627 991 m
528 991 450 952 393 875 c
336 798 307 693 307 559 c
307 425 335 319 392 242 c
449 165 528 127 627 127 c
725 127 803 166 860 243 c
917 320 946 426 946 559 c
946 692 917 797 860 874 c
803 952 725 991 627 991 c

627 1147 m
787 1147 913 1095 1004 991 c
1095 887 1141 743 1141 559 c
1141 376 1095 232 1004 127 c
913 23 787 -29 627 -29 c
466 -29 340 23 249 127 c
158 232 113 376 113 559 c
113 743 158 887 249 991 c
340 1095 466 1147 627 1147 c

ce} _d
/r{842 0 186 0 842 1147 sc
842 948 m
821 960 799 969 774 974 c
750 980 723 983 694 983 c
590 983 510 949 454 881 c
399 814 371 717 371 590 c
371 0 l
186 0 l
186 1120 l
371 1120 l
371 946 l
410 1014 460 1064 522 1097 c
584 1130 659 1147 748 1147 c
761 1147 775 1146 790 1144 c
805 1143 822 1140 841 1137 c
842 948 l

ce} _d
/s{1067 0 111 -29 967 1147 sc
907 1087 m
907 913 l
855 940 801 960 745 973 c
689 986 631 993 571 993 c
480 993 411 979 365 951 c
320 923 297 881 297 825 c
297 782 313 749 346 724 c
379 700 444 677 543 655 c
606 641 l
737 613 829 573 884 522 c
939 471 967 400 967 309 c
967 205 926 123 843 62 c
761 1 648 -29 504 -29 c
444 -29 381 -23 316 -11 c
251 0 183 18 111 41 c
111 231 l
179 196 246 169 312 151 c
378 134 443 125 508 125 c
595 125 661 140 708 169 c
755 199 778 241 778 295 c
778 345 761 383 727 410 c
694 437 620 462 506 487 c
442 502 l
328 526 246 563 195 612 c
144 662 119 730 119 817 c
119 922 156 1004 231 1061 c
306 1118 412 1147 549 1147 c
617 1147 681 1142 741 1132 c
801 1122 856 1107 907 1087 c

ce} _d
/t{803 0 55 0 754 1438 sc
375 1438 m
375 1120 l
754 1120 l
754 977 l
375 977 l
375 369 l
375 278 387 219 412 193 c
437 167 488 154 565 154 c
754 154 l
754 0 l
565 0 l
423 0 325 26 271 79 c
217 132 190 229 190 369 c
190 977 l
55 977 l
55 1120 l
190 1120 l
190 1438 l
375 1438 l

ce} _d
/v{1212 0 61 0 1151 1120 sc
61 1120 m
256 1120 l
606 180 l
956 1120 l
1151 1120 l
731 0 l
481 0 l
61 1120 l

ce} _d
/y{1212 0 61 -426 1151 1120 sc
659 -104 m
607 -237 556 -324 507 -365 c
458 -406 392 -426 309 -426 c
162 -426 l
162 -272 l
270 -272 l
321 -272 360 -260 388 -236 c
416 -212 447 -155 481 -66 c
514 18 l
61 1120 l
256 1120 l
606 244 l
956 1120 l
1151 1120 l
659 -104 l

ce} _d
end readonly def

/BuildGlyph {
 exch begin
 CharStrings exch
 2 copy known not {pop /.notdef} if
 true 3 1 roll get exec
 end
} _d

/BuildChar {
 1 index /Encoding get exch get
 1 index /BuildGlyph get exec
} _d

FontName currentdict end definefont pop
end
%%EndProlog
mpldict begin
234.77 325.145 translate
142.46 141.711 0 0 clipbox
gsave
0 0 m
142.46 0 l
142.46 141.710625 l
0 141.710625 l
cl
1.000 setgray
fill
grestore
gsave
35.72 30.110625 m
141.74 30.110625 l
141.74 140.990625 l
35.72 140.990625 l
cl
1.000 setgray
fill
grestore
1.500 setlinewidth
1 setlinejoin
0 setlinecap
[5.55 2.4] 0 setdash
0.000 setgray
gsave
106.02 110.88 35.72 30.111 clipbox
35.72 131.348392 m
141.74 131.348392 l
stroke
grestore
0.800 setlinewidth
[] 0 setdash
gsave
/o {
gsave
newpath
translate
0.8 setlinewidth
1 setlinejoin

0 setlinecap

0 0 m
0 -3.5 l

gsave
0.000 setgray
fill
grestore
stroke
grestore
} bind def
61.1923 30.1106 o
grestore
/DejaVuSans 9.000 selectfont
gsave

43.786088 16.266875 translate
0.000000 rotate
0.000000 0 m /P glyphshow
5.302246 0 m /r glyphshow
9.002441 0 m /i glyphshow
11.502930 0 m /m glyphshow
20.270020 0 m /a glyphshow
25.785156 0 m /r glyphshow
29.485352 0 m /y glyphshow
grestore
gsave
/o {
gsave
newpath
translate
0.8 setlinewidth
1 setlinejoin

0 setlinecap

0 0 m
0 -3.5 l

gsave
0.000 setgray
fill
grestore
stroke
grestore
} bind def
116.268 30.1106 o
grestore
gsave

92.431725 16.266875 translate
0.000000 rotate
0.000000 0 m /S glyphshow
5.712891 0 m /e glyphshow
11.250000 0 m /c glyphshow
16.198242 0 m /o glyphshow
21.704590 0 m /n glyphshow
27.408691 0 m /d glyphshow
33.121582 0 m /a glyphshow
38.636719 0 m /r glyphshow
42.336914 0 m /y glyphshow
grestore
/DejaVuSans 10.000 selectfont
gsave

61.659688 2.798125 translate
0.000000 rotate
0.000000 0 m /N glyphshow
7.480469 0 m /o glyphshow
13.598633 0 m /d glyphshow
19.946289 0 m /e glyphshow
26.098633 0 m /space glyphshow
29.277344 0 m /c glyphshow
34.775391 0 m /l glyphshow
37.553711 0 m /a glyphshow
43.681641 0 m /s glyphshow
48.891602 0 m /s glyphshow
grestore
[2.96 1.28] 0 setdash
0.690 setgray
gsave
106.02 110.88 35.72 30.111 clipbox
35.72 30.110625 m
141.74 30.110625 l
stroke
grestore
[] 0 setdash
0.000 setgray
gsave
/o {
gsave
newpath
translate
0.8 setlinewidth
1 setlinejoin

0 setlinecap

-0 0 m
-3.5 0 l

gsave
0.000 setgray
fill
grestore
stroke
grestore
} bind def
35.72 30.1106 o
grestore
/DejaVuSans 9.000 selectfont
gsave

14.391875 26.688750 translate
0.000000 rotate
0.000000 0 m /zero glyphshow
5.726074 0 m /period glyphshow
8.586914 0 m /zero glyphshow
grestore
[2.96 1.28] 0 setdash
0.690 setgray
gsave
106.02 110.88 35.72 30.111 clipbox
35.72 45.299666 m
141.74 45.299666 l
stroke
grestore
[] 0 setdash
0.000 setgray
gsave
/o {
gsave
newpath
translate
0.8 setlinewidth
1 setlinejoin

0 setlinecap

-0 0 m
-3.5 0 l

gsave
0.000 setgray
fill
grestore
stroke
grestore
} bind def
35.72 45.2997 o
grestore
gsave

14.391875 41.877791 translate
0.000000 rotate
0.000000 0 m /zero glyphshow
5.726074 0 m /period glyphshow
8.586914 0 m /one glyphshow
grestore
[2.96 1.28] 0 setdash
0.690 setgray
gsave
106.02 110.88 35.72 30.111 clipbox
35.72 60.488707 m
141.74 60.488707 l
stroke
grestore
[] 0 setdash
0.000 setgray
gsave
/o {
gsave
newpath
translate
0.8 setlinewidth
1 setlinejoin

0 setlinecap

-0 0 m
-3.5 0 l

gsave
0.000 setgray
fill
grestore
stroke
grestore
} bind def
35.72 60.4887 o
grestore
gsave

14.391875 57.066832 translate
0.000000 rotate
0.000000 0 m /zero glyphshow
5.726074 0 m /period glyphshow
8.586914 0 m /two glyphshow
grestore
[2.96 1.28] 0 setdash
0.690 setgray
gsave
106.02 110.88 35.72 30.111 clipbox
35.72 75.677748 m
141.74 75.677748 l
stroke
grestore
[] 0 setdash
0.000 setgray
gsave
/o {
gsave
newpath
translate
0.8 setlinewidth
1 setlinejoin

0 setlinecap

-0 0 m
-3.5 0 l

gsave
0.000 setgray
fill
grestore
stroke
grestore
} bind def
35.72 75.6777 o
grestore
gsave

14.391875 72.255873 translate
0.000000 rotate
0.000000 0 m /zero glyphshow
5.726074 0 m /period glyphshow
8.586914 0 m /three glyphshow
grestore
[2.96 1.28] 0 setdash
0.690 setgray
gsave
106.02 110.88 35.72 30.111 clipbox
35.72 90.866789 m
141.74 90.866789 l
stroke
grestore
[] 0 setdash
0.000 setgray
gsave
/o {
gsave
newpath
translate
0.8 setlinewidth
1 setlinejoin

0 setlinecap

-0 0 m
-3.5 0 l

gsave
0.000 setgray
fill
grestore
stroke
grestore
} bind def
35.72 90.8668 o
grestore
gsave

14.391875 87.444914 translate
0.000000 rotate
0.000000 0 m /zero glyphshow
5.726074 0 m /period glyphshow
8.586914 0 m /four glyphshow
grestore
[2.96 1.28] 0 setdash
0.690 setgray
gsave
106.02 110.88 35.72 30.111 clipbox
35.72 106.05583 m
141.74 106.05583 l
stroke
grestore
[] 0 setdash
0.000 setgray
gsave
/o {
gsave
newpath
translate
0.8 setlinewidth
1 setlinejoin

0 setlinecap

-0 0 m
-3.5 0 l

gsave
0.000 setgray
fill
grestore
stroke
grestore
} bind def
35.72 106.056 o
grestore
gsave

14.391875 102.633955 translate
0.000000 rotate
0.000000 0 m /zero glyphshow
5.726074 0 m /period glyphshow
8.586914 0 m /five glyphshow
grestore
[2.96 1.28] 0 setdash
0.690 setgray
gsave
106.02 110.88 35.72 30.111 clipbox
35.72 121.244872 m
141.74 121.244872 l
stroke
grestore
[] 0 setdash
0.000 setgray
gsave
/o {
gsave
newpath
translate
0.8 setlinewidth
1 setlinejoin

0 setlinecap

-0 0 m
-3.5 0 l

gsave
0.000 setgray
fill
grestore
stroke
grestore
} bind def
35.72 121.245 o
grestore
gsave

14.391875 117.822997 translate
0.000000 rotate
0.000000 0 m /zero glyphshow
5.726074 0 m /period glyphshow
8.586914 0 m /six glyphshow
grestore
[2.96 1.28] 0 setdash
0.690 setgray
gsave
106.02 110.88 35.72 30.111 clipbox
35.72 136.433913 m
141.74 136.433913 l
stroke
grestore
[] 0 setdash
0.000 setgray
gsave
/o {
gsave
newpath
translate
0.8 setlinewidth
1 setlinejoin

0 setlinecap

-0 0 m
-3.5 0 l

gsave
0.000 setgray
fill
grestore
stroke
grestore
} bind def
35.72 136.434 o
grestore
gsave

14.391875 133.012038 translate
0.000000 rotate
0.000000 0 m /zero glyphshow
5.726074 0 m /period glyphshow
8.586914 0 m /seven glyphshow
grestore
/DejaVuSans 10.000 selectfont
gsave

8.313750 4.162500 translate
90.000000 rotate
0.000000 0 m /L glyphshow
5.571289 0 m /a glyphshow
11.699219 0 m /t glyphshow
15.620117 0 m /e glyphshow
21.772461 0 m /n glyphshow
28.110352 0 m /c glyphshow
33.608398 0 m /y glyphshow
39.526367 0 m /space glyphshow
42.705078 0 m /s glyphshow
47.915039 0 m /t glyphshow
51.835938 0 m /a glyphshow
57.963867 0 m /n glyphshow
64.301758 0 m /d glyphshow
70.649414 0 m /a glyphshow
76.777344 0 m /r glyphshow
80.763672 0 m /d glyphshow
87.111328 0 m /space glyphshow
90.290039 0 m /d glyphshow
96.637695 0 m /e glyphshow
102.790039 0 m /v glyphshow
108.708008 0 m /i glyphshow
111.486328 0 m /a glyphshow
117.614258 0 m /t glyphshow
121.535156 0 m /i glyphshow
124.313477 0 m /o glyphshow
130.431641 0 m /n glyphshow
grestore
1.000 setlinewidth
0 setlinejoin
0.173 0.627 0.173 setrgbcolor
gsave
106.02 110.88 35.72 30.111 clipbox
40.539091 30.110625 m
54.307922 30.110625 l
54.307922 129.806647 l
40.539091 129.806647 l
cl
gsave
1.000 setgray
fill
grestore
  << /PatternType 1
     /PaintType 2
     /TilingType 2
     /BBox[0 0 72 72]
     /XStep 72
     /YStep 72

     /PaintProc {
        pop
        1.000000 setlinewidth
-36 36 m
36 108 l
-30 30 m
42 102 l
-24 24 m
48 96 l
-18 18 m
54 90 l
-12 12 m
60 84 l
-6 6 m
66 78 l
0 0 m
72 72 l
6 -6 m
78 66 l
12 -12 m
84 60 l
18 -18 m
90 54 l
24 -24 m
96 48 l
30 -30 m
102 42 l
36 -36 m
108 36 l

        gsave
        fill
        grestore
        stroke
     } bind
   >>
   matrix
   0.0 141.710625 translate
   makepattern
   /H0 exch def
gsave
0.172549 0.627451 0.172549 H0 setpattern fill grestore
stroke
grestore
gsave
106.02 110.88 35.72 30.111 clipbox
95.614416 30.110625 m
109.383247 30.110625 l
109.383247 125.02584 l
95.614416 125.02584 l
cl
gsave
1.000 setgray
fill
grestore
gsave
0.172549 0.627451 0.172549 H0 setpattern fill grestore
stroke
grestore
0.122 0.467 0.706 setrgbcolor
gsave
106.02 110.88 35.72 30.111 clipbox
54.307922 30.110625 m
68.076753 30.110625 l
68.076753 131.111975 l
54.307922 131.111975 l
cl
gsave
1.000 setgray
fill
grestore
  << /PatternType 1
     /PaintType 2
     /TilingType 2
     /BBox[0 0 72 72]
     /XStep 72
     /YStep 72

     /PaintProc {
        pop
        1.000000 setlinewidth
-36 36 m
36 108 l
-30 30 m
42 102 l
-24 24 m
48 96 l
-18 18 m
54 90 l
-12 12 m
60 84 l
-6 6 m
66 78 l
0 0 m
72 72 l
6 -6 m
78 66 l
12 -12 m
84 60 l
18 -18 m
90 54 l
24 -24 m
96 48 l
30 -30 m
102 42 l
36 -36 m
108 36 l
-36 36 m
36 -36 l
-30 42 m
42 -30 l
-24 48 m
48 -24 l
-18 54 m
54 -18 l
-12 60 m
60 -12 l
-6 66 m
66 -6 l
0 72 m
72 0 l
6 78 m
78 6 l
12 84 m
84 12 l
18 90 m
90 18 l
24 96 m
96 24 l
30 102 m
102 30 l
36 108 m
108 36 l

        gsave
        fill
        grestore
        stroke
     } bind
   >>
   matrix
   0.0 141.710625 translate
   makepattern
   /H1 exch def
gsave
0.121569 0.466667 0.705882 H1 setpattern fill grestore
stroke
grestore
gsave
106.02 110.88 35.72 30.111 clipbox
109.383247 30.110625 m
123.152078 30.110625 l
123.152078 120.474903 l
109.383247 120.474903 l
cl
gsave
1.000 setgray
fill
grestore
gsave
0.121569 0.466667 0.705882 H1 setpattern fill grestore
stroke
grestore
1.000 0.000 0.000 setrgbcolor
gsave
106.02 110.88 35.72 30.111 clipbox
68.076753 30.110625 m
81.845584 30.110625 l
81.845584 131.320997 l
68.076753 131.320997 l
cl
gsave
1.000 setgray
fill
grestore
  << /PatternType 1
     /PaintType 2
     /TilingType 2
     /BBox[0 0 72 72]
     /XStep 72
     /YStep 72

     /PaintProc {
        pop
        1.000000 setlinewidth
0 -4.2 m
1.113853 -4.2 2.182235 -3.757462 2.969848 -2.969848 c
3.757462 -2.182235 4.2 -1.113853 4.2 0 c
4.2 1.113853 3.757462 2.182235 2.969848 2.969848 c
2.182235 3.757462 1.113853 4.2 0 4.2 c
-1.113853 4.2 -2.182235 3.757462 -2.969848 2.969848 c
-3.757462 2.182235 -4.2 1.113853 -4.2 0 c
-4.2 -1.113853 -3.757462 -2.182235 -2.969848 -2.969848 c
-2.182235 -3.757462 -1.113853 -4.2 0 -4.2 c
cl
0 -3.78 m
0 -3.78 -1.002468 -3.78 -1.964012 -3.381715 c
-2.672864 -2.672864 -3.381715 -1.964012 -3.78 -1.002468 c
-3.78 0 -3.78 1.002468 -3.381715 1.964012 c
-2.672864 2.672864 -1.964012 3.381715 -1.002468 3.78 c
0 3.78 1.002468 3.78 1.964012 3.381715 c
2.672864 2.672864 3.381715 1.964012 3.78 1.002468 c
3.78 0 3.78 -1.002468 3.381715 -1.964012 c
2.672864 -2.672864 1.964012 -3.381715 1.002468 -3.78 c
cl
12 -4.2 m
13.113853 -4.2 14.182235 -3.757462 14.969848 -2.969848 c
15.757462 -2.182235 16.2 -1.113853 16.2 0 c
16.2 1.113853 15.757462 2.182235 14.969848 2.969848 c
14.182235 3.757462 13.113853 4.2 12 4.2 c
10.886147 4.2 9.817765 3.757462 9.030152 2.969848 c
8.242538 2.182235 7.8 1.113853 7.8 0 c
7.8 -1.113853 8.242538 -2.182235 9.030152 -2.969848 c
9.817765 -3.757462 10.886147 -4.2 12 -4.2 c
cl
12 -3.78 m
12 -3.78 10.997532 -3.78 10.035988 -3.381715 c
9.327136 -2.672864 8.618285 -1.964012 8.22 -1.002468 c
8.22 0 8.22 1.002468 8.618285 1.964012 c
9.327136 2.672864 10.035988 3.381715 10.997532 3.78 c
12 3.78 13.002468 3.78 13.964012 3.381715 c
14.672864 2.672864 15.381715 1.964012 15.78 1.002468 c
15.78 0 15.78 -1.002468 15.381715 -1.964012 c
14.672864 -2.672864 13.964012 -3.381715 13.002468 -3.78 c
cl
24 -4.2 m
25.113853 -4.2 26.182235 -3.757462 26.969848 -2.969848 c
27.757462 -2.182235 28.2 -1.113853 28.2 0 c
28.2 1.113853 27.757462 2.182235 26.969848 2.969848 c
26.182235 3.757462 25.113853 4.2 24 4.2 c
22.886147 4.2 21.817765 3.757462 21.030152 2.969848 c
20.242538 2.182235 19.8 1.113853 19.8 0 c
19.8 -1.113853 20.242538 -2.182235 21.030152 -2.969848 c
21.817765 -3.757462 22.886147 -4.2 24 -4.2 c
cl
24 -3.78 m
24 -3.78 22.997532 -3.78 22.035988 -3.381715 c
21.327136 -2.672864 20.618285 -1.964012 20.22 -1.002468 c
20.22 0 20.22 1.002468 20.618285 1.964012 c
21.327136 2.672864 22.035988 3.381715 22.997532 3.78 c
24 3.78 25.002468 3.78 25.964012 3.381715 c
26.672864 2.672864 27.381715 1.964012 27.78 1.002468 c
27.78 0 27.78 -1.002468 27.381715 -1.964012 c
26.672864 -2.672864 25.964012 -3.381715 25.002468 -3.78 c
cl
36 -4.2 m
37.113853 -4.2 38.182235 -3.757462 38.969848 -2.969848 c
39.757462 -2.182235 40.2 -1.113853 40.2 0 c
40.2 1.113853 39.757462 2.182235 38.969848 2.969848 c
38.182235 3.757462 37.113853 4.2 36 4.2 c
34.886147 4.2 33.817765 3.757462 33.030152 2.969848 c
32.242538 2.182235 31.8 1.113853 31.8 0 c
31.8 -1.113853 32.242538 -2.182235 33.030152 -2.969848 c
33.817765 -3.757462 34.886147 -4.2 36 -4.2 c
cl
36 -3.78 m
36 -3.78 34.997532 -3.78 34.035988 -3.381715 c
33.327136 -2.672864 32.618285 -1.964012 32.22 -1.002468 c
32.22 0 32.22 1.002468 32.618285 1.964012 c
33.327136 2.672864 34.035988 3.381715 34.997532 3.78 c
36 3.78 37.002468 3.78 37.964012 3.381715 c
38.672864 2.672864 39.381715 1.964012 39.78 1.002468 c
39.78 0 39.78 -1.002468 39.381715 -1.964012 c
38.672864 -2.672864 37.964012 -3.381715 37.002468 -3.78 c
cl
48 -4.2 m
49.113853 -4.2 50.182235 -3.757462 50.969848 -2.969848 c
51.757462 -2.182235 52.2 -1.113853 52.2 0 c
52.2 1.113853 51.757462 2.182235 50.969848 2.969848 c
50.182235 3.757462 49.113853 4.2 48 4.2 c
46.886147 4.2 45.817765 3.757462 45.030152 2.969848 c
44.242538 2.182235 43.8 1.113853 43.8 0 c
43.8 -1.113853 44.242538 -2.182235 45.030152 -2.969848 c
45.817765 -3.757462 46.886147 -4.2 48 -4.2 c
cl
48 -3.78 m
48 -3.78 46.997532 -3.78 46.035988 -3.381715 c
45.327136 -2.672864 44.618285 -1.964012 44.22 -1.002468 c
44.22 0 44.22 1.002468 44.618285 1.964012 c
45.327136 2.672864 46.035988 3.381715 46.997532 3.78 c
48 3.78 49.002468 3.78 49.964012 3.381715 c
50.672864 2.672864 51.381715 1.964012 51.78 1.002468 c
51.78 0 51.78 -1.002468 51.381715 -1.964012 c
50.672864 -2.672864 49.964012 -3.381715 49.002468 -3.78 c
cl
60 -4.2 m
61.113853 -4.2 62.182235 -3.757462 62.969848 -2.969848 c
63.757462 -2.182235 64.2 -1.113853 64.2 0 c
64.2 1.113853 63.757462 2.182235 62.969848 2.969848 c
62.182235 3.757462 61.113853 4.2 60 4.2 c
58.886147 4.2 57.817765 3.757462 57.030152 2.969848 c
56.242538 2.182235 55.8 1.113853 55.8 0 c
55.8 -1.113853 56.242538 -2.182235 57.030152 -2.969848 c
57.817765 -3.757462 58.886147 -4.2 60 -4.2 c
cl
60 -3.78 m
60 -3.78 58.997532 -3.78 58.035988 -3.381715 c
57.327136 -2.672864 56.618285 -1.964012 56.22 -1.002468 c
56.22 0 56.22 1.002468 56.618285 1.964012 c
57.327136 2.672864 58.035988 3.381715 58.997532 3.78 c
60 3.78 61.002468 3.78 61.964012 3.381715 c
62.672864 2.672864 63.381715 1.964012 63.78 1.002468 c
63.78 0 63.78 -1.002468 63.381715 -1.964012 c
62.672864 -2.672864 61.964012 -3.381715 61.002468 -3.78 c
cl
72 -4.2 m
73.113853 -4.2 74.182235 -3.757462 74.969848 -2.969848 c
75.757462 -2.182235 76.2 -1.113853 76.2 0 c
76.2 1.113853 75.757462 2.182235 74.969848 2.969848 c
74.182235 3.757462 73.113853 4.2 72 4.2 c
70.886147 4.2 69.817765 3.757462 69.030152 2.969848 c
68.242538 2.182235 67.8 1.113853 67.8 0 c
67.8 -1.113853 68.242538 -2.182235 69.030152 -2.969848 c
69.817765 -3.757462 70.886147 -4.2 72 -4.2 c
cl
72 -3.78 m
72 -3.78 70.997532 -3.78 70.035988 -3.381715 c
69.327136 -2.672864 68.618285 -1.964012 68.22 -1.002468 c
68.22 0 68.22 1.002468 68.618285 1.964012 c
69.327136 2.672864 70.035988 3.381715 70.997532 3.78 c
72 3.78 73.002468 3.78 73.964012 3.381715 c
74.672864 2.672864 75.381715 1.964012 75.78 1.002468 c
75.78 0 75.78 -1.002468 75.381715 -1.964012 c
74.672864 -2.672864 73.964012 -3.381715 73.002468 -3.78 c
cl
6 7.8 m
7.113853 7.8 8.182235 8.242538 8.969848 9.030152 c
9.757462 9.817765 10.2 10.886147 10.2 12 c
10.2 13.113853 9.757462 14.182235 8.969848 14.969848 c
8.182235 15.757462 7.113853 16.2 6 16.2 c
4.886147 16.2 3.817765 15.757462 3.030152 14.969848 c
2.242538 14.182235 1.8 13.113853 1.8 12 c
1.8 10.886147 2.242538 9.817765 3.030152 9.030152 c
3.817765 8.242538 4.886147 7.8 6 7.8 c
cl
6 8.22 m
6 8.22 4.997532 8.22 4.035988 8.618285 c
3.327136 9.327136 2.618285 10.035988 2.22 10.997532 c
2.22 12 2.22 13.002468 2.618285 13.964012 c
3.327136 14.672864 4.035988 15.381715 4.997532 15.78 c
6 15.78 7.002468 15.78 7.964012 15.381715 c
8.672864 14.672864 9.381715 13.964012 9.78 13.002468 c
9.78 12 9.78 10.997532 9.381715 10.035988 c
8.672864 9.327136 7.964012 8.618285 7.002468 8.22 c
cl
18 7.8 m
19.113853 7.8 20.182235 8.242538 20.969848 9.030152 c
21.757462 9.817765 22.2 10.886147 22.2 12 c
22.2 13.113853 21.757462 14.182235 20.969848 14.969848 c
20.182235 15.757462 19.113853 16.2 18 16.2 c
16.886147 16.2 15.817765 15.757462 15.030152 14.969848 c
14.242538 14.182235 13.8 13.113853 13.8 12 c
13.8 10.886147 14.242538 9.817765 15.030152 9.030152 c
15.817765 8.242538 16.886147 7.8 18 7.8 c
cl
18 8.22 m
18 8.22 16.997532 8.22 16.035988 8.618285 c
15.327136 9.327136 14.618285 10.035988 14.22 10.997532 c
14.22 12 14.22 13.002468 14.618285 13.964012 c
15.327136 14.672864 16.035988 15.381715 16.997532 15.78 c
18 15.78 19.002468 15.78 19.964012 15.381715 c
20.672864 14.672864 21.381715 13.964012 21.78 13.002468 c
21.78 12 21.78 10.997532 21.381715 10.035988 c
20.672864 9.327136 19.964012 8.618285 19.002468 8.22 c
cl
30 7.8 m
31.113853 7.8 32.182235 8.242538 32.969848 9.030152 c
33.757462 9.817765 34.2 10.886147 34.2 12 c
34.2 13.113853 33.757462 14.182235 32.969848 14.969848 c
32.182235 15.757462 31.113853 16.2 30 16.2 c
28.886147 16.2 27.817765 15.757462 27.030152 14.969848 c
26.242538 14.182235 25.8 13.113853 25.8 12 c
25.8 10.886147 26.242538 9.817765 27.030152 9.030152 c
27.817765 8.242538 28.886147 7.8 30 7.8 c
cl
30 8.22 m
30 8.22 28.997532 8.22 28.035988 8.618285 c
27.327136 9.327136 26.618285 10.035988 26.22 10.997532 c
26.22 12 26.22 13.002468 26.618285 13.964012 c
27.327136 14.672864 28.035988 15.381715 28.997532 15.78 c
30 15.78 31.002468 15.78 31.964012 15.381715 c
32.672864 14.672864 33.381715 13.964012 33.78 13.002468 c
33.78 12 33.78 10.997532 33.381715 10.035988 c
32.672864 9.327136 31.964012 8.618285 31.002468 8.22 c
cl
42 7.8 m
43.113853 7.8 44.182235 8.242538 44.969848 9.030152 c
45.757462 9.817765 46.2 10.886147 46.2 12 c
46.2 13.113853 45.757462 14.182235 44.969848 14.969848 c
44.182235 15.757462 43.113853 16.2 42 16.2 c
40.886147 16.2 39.817765 15.757462 39.030152 14.969848 c
38.242538 14.182235 37.8 13.113853 37.8 12 c
37.8 10.886147 38.242538 9.817765 39.030152 9.030152 c
39.817765 8.242538 40.886147 7.8 42 7.8 c
cl
42 8.22 m
42 8.22 40.997532 8.22 40.035988 8.618285 c
39.327136 9.327136 38.618285 10.035988 38.22 10.997532 c
38.22 12 38.22 13.002468 38.618285 13.964012 c
39.327136 14.672864 40.035988 15.381715 40.997532 15.78 c
42 15.78 43.002468 15.78 43.964012 15.381715 c
44.672864 14.672864 45.381715 13.964012 45.78 13.002468 c
45.78 12 45.78 10.997532 45.381715 10.035988 c
44.672864 9.327136 43.964012 8.618285 43.002468 8.22 c
cl
54 7.8 m
55.113853 7.8 56.182235 8.242538 56.969848 9.030152 c
57.757462 9.817765 58.2 10.886147 58.2 12 c
58.2 13.113853 57.757462 14.182235 56.969848 14.969848 c
56.182235 15.757462 55.113853 16.2 54 16.2 c
52.886147 16.2 51.817765 15.757462 51.030152 14.969848 c
50.242538 14.182235 49.8 13.113853 49.8 12 c
49.8 10.886147 50.242538 9.817765 51.030152 9.030152 c
51.817765 8.242538 52.886147 7.8 54 7.8 c
cl
54 8.22 m
54 8.22 52.997532 8.22 52.035988 8.618285 c
51.327136 9.327136 50.618285 10.035988 50.22 10.997532 c
50.22 12 50.22 13.002468 50.618285 13.964012 c
51.327136 14.672864 52.035988 15.381715 52.997532 15.78 c
54 15.78 55.002468 15.78 55.964012 15.381715 c
56.672864 14.672864 57.381715 13.964012 57.78 13.002468 c
57.78 12 57.78 10.997532 57.381715 10.035988 c
56.672864 9.327136 55.964012 8.618285 55.002468 8.22 c
cl
66 7.8 m
67.113853 7.8 68.182235 8.242538 68.969848 9.030152 c
69.757462 9.817765 70.2 10.886147 70.2 12 c
70.2 13.113853 69.757462 14.182235 68.969848 14.969848 c
68.182235 15.757462 67.113853 16.2 66 16.2 c
64.886147 16.2 63.817765 15.757462 63.030152 14.969848 c
62.242538 14.182235 61.8 13.113853 61.8 12 c
61.8 10.886147 62.242538 9.817765 63.030152 9.030152 c
63.817765 8.242538 64.886147 7.8 66 7.8 c
cl
66 8.22 m
66 8.22 64.997532 8.22 64.035988 8.618285 c
63.327136 9.327136 62.618285 10.035988 62.22 10.997532 c
62.22 12 62.22 13.002468 62.618285 13.964012 c
63.327136 14.672864 64.035988 15.381715 64.997532 15.78 c
66 15.78 67.002468 15.78 67.964012 15.381715 c
68.672864 14.672864 69.381715 13.964012 69.78 13.002468 c
69.78 12 69.78 10.997532 69.381715 10.035988 c
68.672864 9.327136 67.964012 8.618285 67.002468 8.22 c
cl
0 19.8 m
1.113853 19.8 2.182235 20.242538 2.969848 21.030152 c
3.757462 21.817765 4.2 22.886147 4.2 24 c
4.2 25.113853 3.757462 26.182235 2.969848 26.969848 c
2.182235 27.757462 1.113853 28.2 0 28.2 c
-1.113853 28.2 -2.182235 27.757462 -2.969848 26.969848 c
-3.757462 26.182235 -4.2 25.113853 -4.2 24 c
-4.2 22.886147 -3.757462 21.817765 -2.969848 21.030152 c
-2.182235 20.242538 -1.113853 19.8 0 19.8 c
cl
0 20.22 m
0 20.22 -1.002468 20.22 -1.964012 20.618285 c
-2.672864 21.327136 -3.381715 22.035988 -3.78 22.997532 c
-3.78 24 -3.78 25.002468 -3.381715 25.964012 c
-2.672864 26.672864 -1.964012 27.381715 -1.002468 27.78 c
0 27.78 1.002468 27.78 1.964012 27.381715 c
2.672864 26.672864 3.381715 25.964012 3.78 25.002468 c
3.78 24 3.78 22.997532 3.381715 22.035988 c
2.672864 21.327136 1.964012 20.618285 1.002468 20.22 c
cl
12 19.8 m
13.113853 19.8 14.182235 20.242538 14.969848 21.030152 c
15.757462 21.817765 16.2 22.886147 16.2 24 c
16.2 25.113853 15.757462 26.182235 14.969848 26.969848 c
14.182235 27.757462 13.113853 28.2 12 28.2 c
10.886147 28.2 9.817765 27.757462 9.030152 26.969848 c
8.242538 26.182235 7.8 25.113853 7.8 24 c
7.8 22.886147 8.242538 21.817765 9.030152 21.030152 c
9.817765 20.242538 10.886147 19.8 12 19.8 c
cl
12 20.22 m
12 20.22 10.997532 20.22 10.035988 20.618285 c
9.327136 21.327136 8.618285 22.035988 8.22 22.997532 c
8.22 24 8.22 25.002468 8.618285 25.964012 c
9.327136 26.672864 10.035988 27.381715 10.997532 27.78 c
12 27.78 13.002468 27.78 13.964012 27.381715 c
14.672864 26.672864 15.381715 25.964012 15.78 25.002468 c
15.78 24 15.78 22.997532 15.381715 22.035988 c
14.672864 21.327136 13.964012 20.618285 13.002468 20.22 c
cl
24 19.8 m
25.113853 19.8 26.182235 20.242538 26.969848 21.030152 c
27.757462 21.817765 28.2 22.886147 28.2 24 c
28.2 25.113853 27.757462 26.182235 26.969848 26.969848 c
26.182235 27.757462 25.113853 28.2 24 28.2 c
22.886147 28.2 21.817765 27.757462 21.030152 26.969848 c
20.242538 26.182235 19.8 25.113853 19.8 24 c
19.8 22.886147 20.242538 21.817765 21.030152 21.030152 c
21.817765 20.242538 22.886147 19.8 24 19.8 c
cl
24 20.22 m
24 20.22 22.997532 20.22 22.035988 20.618285 c
21.327136 21.327136 20.618285 22.035988 20.22 22.997532 c
20.22 24 20.22 25.002468 20.618285 25.964012 c
21.327136 26.672864 22.035988 27.381715 22.997532 27.78 c
24 27.78 25.002468 27.78 25.964012 27.381715 c
26.672864 26.672864 27.381715 25.964012 27.78 25.002468 c
27.78 24 27.78 22.997532 27.381715 22.035988 c
26.672864 21.327136 25.964012 20.618285 25.002468 20.22 c
cl
36 19.8 m
37.113853 19.8 38.182235 20.242538 38.969848 21.030152 c
39.757462 21.817765 40.2 22.886147 40.2 24 c
40.2 25.113853 39.757462 26.182235 38.969848 26.969848 c
38.182235 27.757462 37.113853 28.2 36 28.2 c
34.886147 28.2 33.817765 27.757462 33.030152 26.969848 c
32.242538 26.182235 31.8 25.113853 31.8 24 c
31.8 22.886147 32.242538 21.817765 33.030152 21.030152 c
33.817765 20.242538 34.886147 19.8 36 19.8 c
cl
36 20.22 m
36 20.22 34.997532 20.22 34.035988 20.618285 c
33.327136 21.327136 32.618285 22.035988 32.22 22.997532 c
32.22 24 32.22 25.002468 32.618285 25.964012 c
33.327136 26.672864 34.035988 27.381715 34.997532 27.78 c
36 27.78 37.002468 27.78 37.964012 27.381715 c
38.672864 26.672864 39.381715 25.964012 39.78 25.002468 c
39.78 24 39.78 22.997532 39.381715 22.035988 c
38.672864 21.327136 37.964012 20.618285 37.002468 20.22 c
cl
48 19.8 m
49.113853 19.8 50.182235 20.242538 50.969848 21.030152 c
51.757462 21.817765 52.2 22.886147 52.2 24 c
52.2 25.113853 51.757462 26.182235 50.969848 26.969848 c
50.182235 27.757462 49.113853 28.2 48 28.2 c
46.886147 28.2 45.817765 27.757462 45.030152 26.969848 c
44.242538 26.182235 43.8 25.113853 43.8 24 c
43.8 22.886147 44.242538 21.817765 45.030152 21.030152 c
45.817765 20.242538 46.886147 19.8 48 19.8 c
cl
48 20.22 m
48 20.22 46.997532 20.22 46.035988 20.618285 c
45.327136 21.327136 44.618285 22.035988 44.22 22.997532 c
44.22 24 44.22 25.002468 44.618285 25.964012 c
45.327136 26.672864 46.035988 27.381715 46.997532 27.78 c
48 27.78 49.002468 27.78 49.964012 27.381715 c
50.672864 26.672864 51.381715 25.964012 51.78 25.002468 c
51.78 24 51.78 22.997532 51.381715 22.035988 c
50.672864 21.327136 49.964012 20.618285 49.002468 20.22 c
cl
60 19.8 m
61.113853 19.8 62.182235 20.242538 62.969848 21.030152 c
63.757462 21.817765 64.2 22.886147 64.2 24 c
64.2 25.113853 63.757462 26.182235 62.969848 26.969848 c
62.182235 27.757462 61.113853 28.2 60 28.2 c
58.886147 28.2 57.817765 27.757462 57.030152 26.969848 c
56.242538 26.182235 55.8 25.113853 55.8 24 c
55.8 22.886147 56.242538 21.817765 57.030152 21.030152 c
57.817765 20.242538 58.886147 19.8 60 19.8 c
cl
60 20.22 m
60 20.22 58.997532 20.22 58.035988 20.618285 c
57.327136 21.327136 56.618285 22.035988 56.22 22.997532 c
56.22 24 56.22 25.002468 56.618285 25.964012 c
57.327136 26.672864 58.035988 27.381715 58.997532 27.78 c
60 27.78 61.002468 27.78 61.964012 27.381715 c
62.672864 26.672864 63.381715 25.964012 63.78 25.002468 c
63.78 24 63.78 22.997532 63.381715 22.035988 c
62.672864 21.327136 61.964012 20.618285 61.002468 20.22 c
cl
72 19.8 m
73.113853 19.8 74.182235 20.242538 74.969848 21.030152 c
75.757462 21.817765 76.2 22.886147 76.2 24 c
76.2 25.113853 75.757462 26.182235 74.969848 26.969848 c
74.182235 27.757462 73.113853 28.2 72 28.2 c
70.886147 28.2 69.817765 27.757462 69.030152 26.969848 c
68.242538 26.182235 67.8 25.113853 67.8 24 c
67.8 22.886147 68.242538 21.817765 69.030152 21.030152 c
69.817765 20.242538 70.886147 19.8 72 19.8 c
cl
72 20.22 m
72 20.22 70.997532 20.22 70.035988 20.618285 c
69.327136 21.327136 68.618285 22.035988 68.22 22.997532 c
68.22 24 68.22 25.002468 68.618285 25.964012 c
69.327136 26.672864 70.035988 27.381715 70.997532 27.78 c
72 27.78 73.002468 27.78 73.964012 27.381715 c
74.672864 26.672864 75.381715 25.964012 75.78 25.002468 c
75.78 24 75.78 22.997532 75.381715 22.035988 c
74.672864 21.327136 73.964012 20.618285 73.002468 20.22 c
cl
6 31.8 m
7.113853 31.8 8.182235 32.242538 8.969848 33.030152 c
9.757462 33.817765 10.2 34.886147 10.2 36 c
10.2 37.113853 9.757462 38.182235 8.969848 38.969848 c
8.182235 39.757462 7.113853 40.2 6 40.2 c
4.886147 40.2 3.817765 39.757462 3.030152 38.969848 c
2.242538 38.182235 1.8 37.113853 1.8 36 c
1.8 34.886147 2.242538 33.817765 3.030152 33.030152 c
3.817765 32.242538 4.886147 31.8 6 31.8 c
cl
6 32.22 m
6 32.22 4.997532 32.22 4.035988 32.618285 c
3.327136 33.327136 2.618285 34.035988 2.22 34.997532 c
2.22 36 2.22 37.002468 2.618285 37.964012 c
3.327136 38.672864 4.035988 39.381715 4.997532 39.78 c
6 39.78 7.002468 39.78 7.964012 39.381715 c
8.672864 38.672864 9.381715 37.964012 9.78 37.002468 c
9.78 36 9.78 34.997532 9.381715 34.035988 c
8.672864 33.327136 7.964012 32.618285 7.002468 32.22 c
cl
18 31.8 m
19.113853 31.8 20.182235 32.242538 20.969848 33.030152 c
21.757462 33.817765 22.2 34.886147 22.2 36 c
22.2 37.113853 21.757462 38.182235 20.969848 38.969848 c
20.182235 39.757462 19.113853 40.2 18 40.2 c
16.886147 40.2 15.817765 39.757462 15.030152 38.969848 c
14.242538 38.182235 13.8 37.113853 13.8 36 c
13.8 34.886147 14.242538 33.817765 15.030152 33.030152 c
15.817765 32.242538 16.886147 31.8 18 31.8 c
cl
18 32.22 m
18 32.22 16.997532 32.22 16.035988 32.618285 c
15.327136 33.327136 14.618285 34.035988 14.22 34.997532 c
14.22 36 14.22 37.002468 14.618285 37.964012 c
15.327136 38.672864 16.035988 39.381715 16.997532 39.78 c
18 39.78 19.002468 39.78 19.964012 39.381715 c
20.672864 38.672864 21.381715 37.964012 21.78 37.002468 c
21.78 36 21.78 34.997532 21.381715 34.035988 c
20.672864 33.327136 19.964012 32.618285 19.002468 32.22 c
cl
30 31.8 m
31.113853 31.8 32.182235 32.242538 32.969848 33.030152 c
33.757462 33.817765 34.2 34.886147 34.2 36 c
34.2 37.113853 33.757462 38.182235 32.969848 38.969848 c
32.182235 39.757462 31.113853 40.2 30 40.2 c
28.886147 40.2 27.817765 39.757462 27.030152 38.969848 c
26.242538 38.182235 25.8 37.113853 25.8 36 c
25.8 34.886147 26.242538 33.817765 27.030152 33.030152 c
27.817765 32.242538 28.886147 31.8 30 31.8 c
cl
30 32.22 m
30 32.22 28.997532 32.22 28.035988 32.618285 c
27.327136 33.327136 26.618285 34.035988 26.22 34.997532 c
26.22 36 26.22 37.002468 26.618285 37.964012 c
27.327136 38.672864 28.035988 39.381715 28.997532 39.78 c
30 39.78 31.002468 39.78 31.964012 39.381715 c
32.672864 38.672864 33.381715 37.964012 33.78 37.002468 c
33.78 36 33.78 34.997532 33.381715 34.035988 c
32.672864 33.327136 31.964012 32.618285 31.002468 32.22 c
cl
42 31.8 m
43.113853 31.8 44.182235 32.242538 44.969848 33.030152 c
45.757462 33.817765 46.2 34.886147 46.2 36 c
46.2 37.113853 45.757462 38.182235 44.969848 38.969848 c
44.182235 39.757462 43.113853 40.2 42 40.2 c
40.886147 40.2 39.817765 39.757462 39.030152 38.969848 c
38.242538 38.182235 37.8 37.113853 37.8 36 c
37.8 34.886147 38.242538 33.817765 39.030152 33.030152 c
39.817765 32.242538 40.886147 31.8 42 31.8 c
cl
42 32.22 m
42 32.22 40.997532 32.22 40.035988 32.618285 c
39.327136 33.327136 38.618285 34.035988 38.22 34.997532 c
38.22 36 38.22 37.002468 38.618285 37.964012 c
39.327136 38.672864 40.035988 39.381715 40.997532 39.78 c
42 39.78 43.002468 39.78 43.964012 39.381715 c
44.672864 38.672864 45.381715 37.964012 45.78 37.002468 c
45.78 36 45.78 34.997532 45.381715 34.035988 c
44.672864 33.327136 43.964012 32.618285 43.002468 32.22 c
cl
54 31.8 m
55.113853 31.8 56.182235 32.242538 56.969848 33.030152 c
57.757462 33.817765 58.2 34.886147 58.2 36 c
58.2 37.113853 57.757462 38.182235 56.969848 38.969848 c
56.182235 39.757462 55.113853 40.2 54 40.2 c
52.886147 40.2 51.817765 39.757462 51.030152 38.969848 c
50.242538 38.182235 49.8 37.113853 49.8 36 c
49.8 34.886147 50.242538 33.817765 51.030152 33.030152 c
51.817765 32.242538 52.886147 31.8 54 31.8 c
cl
54 32.22 m
54 32.22 52.997532 32.22 52.035988 32.618285 c
51.327136 33.327136 50.618285 34.035988 50.22 34.997532 c
50.22 36 50.22 37.002468 50.618285 37.964012 c
51.327136 38.672864 52.035988 39.381715 52.997532 39.78 c
54 39.78 55.002468 39.78 55.964012 39.381715 c
56.672864 38.672864 57.381715 37.964012 57.78 37.002468 c
57.78 36 57.78 34.997532 57.381715 34.035988 c
56.672864 33.327136 55.964012 32.618285 55.002468 32.22 c
cl
66 31.8 m
67.113853 31.8 68.182235 32.242538 68.969848 33.030152 c
69.757462 33.817765 70.2 34.886147 70.2 36 c
70.2 37.113853 69.757462 38.182235 68.969848 38.969848 c
68.182235 39.757462 67.113853 40.2 66 40.2 c
64.886147 40.2 63.817765 39.757462 63.030152 38.969848 c
62.242538 38.182235 61.8 37.113853 61.8 36 c
61.8 34.886147 62.242538 33.817765 63.030152 33.030152 c
63.817765 32.242538 64.886147 31.8 66 31.8 c
cl
66 32.22 m
66 32.22 64.997532 32.22 64.035988 32.618285 c
63.327136 33.327136 62.618285 34.035988 62.22 34.997532 c
62.22 36 62.22 37.002468 62.618285 37.964012 c
63.327136 38.672864 64.035988 39.381715 64.997532 39.78 c
66 39.78 67.002468 39.78 67.964012 39.381715 c
68.672864 38.672864 69.381715 37.964012 69.78 37.002468 c
69.78 36 69.78 34.997532 69.381715 34.035988 c
68.672864 33.327136 67.964012 32.618285 67.002468 32.22 c
cl
0 43.8 m
1.113853 43.8 2.182235 44.242538 2.969848 45.030152 c
3.757462 45.817765 4.2 46.886147 4.2 48 c
4.2 49.113853 3.757462 50.182235 2.969848 50.969848 c
2.182235 51.757462 1.113853 52.2 0 52.2 c
-1.113853 52.2 -2.182235 51.757462 -2.969848 50.969848 c
-3.757462 50.182235 -4.2 49.113853 -4.2 48 c
-4.2 46.886147 -3.757462 45.817765 -2.969848 45.030152 c
-2.182235 44.242538 -1.113853 43.8 0 43.8 c
cl
0 44.22 m
0 44.22 -1.002468 44.22 -1.964012 44.618285 c
-2.672864 45.327136 -3.381715 46.035988 -3.78 46.997532 c
-3.78 48 -3.78 49.002468 -3.381715 49.964012 c
-2.672864 50.672864 -1.964012 51.381715 -1.002468 51.78 c
0 51.78 1.002468 51.78 1.964012 51.381715 c
2.672864 50.672864 3.381715 49.964012 3.78 49.002468 c
3.78 48 3.78 46.997532 3.381715 46.035988 c
2.672864 45.327136 1.964012 44.618285 1.002468 44.22 c
cl
12 43.8 m
13.113853 43.8 14.182235 44.242538 14.969848 45.030152 c
15.757462 45.817765 16.2 46.886147 16.2 48 c
16.2 49.113853 15.757462 50.182235 14.969848 50.969848 c
14.182235 51.757462 13.113853 52.2 12 52.2 c
10.886147 52.2 9.817765 51.757462 9.030152 50.969848 c
8.242538 50.182235 7.8 49.113853 7.8 48 c
7.8 46.886147 8.242538 45.817765 9.030152 45.030152 c
9.817765 44.242538 10.886147 43.8 12 43.8 c
cl
12 44.22 m
12 44.22 10.997532 44.22 10.035988 44.618285 c
9.327136 45.327136 8.618285 46.035988 8.22 46.997532 c
8.22 48 8.22 49.002468 8.618285 49.964012 c
9.327136 50.672864 10.035988 51.381715 10.997532 51.78 c
12 51.78 13.002468 51.78 13.964012 51.381715 c
14.672864 50.672864 15.381715 49.964012 15.78 49.002468 c
15.78 48 15.78 46.997532 15.381715 46.035988 c
14.672864 45.327136 13.964012 44.618285 13.002468 44.22 c
cl
24 43.8 m
25.113853 43.8 26.182235 44.242538 26.969848 45.030152 c
27.757462 45.817765 28.2 46.886147 28.2 48 c
28.2 49.113853 27.757462 50.182235 26.969848 50.969848 c
26.182235 51.757462 25.113853 52.2 24 52.2 c
22.886147 52.2 21.817765 51.757462 21.030152 50.969848 c
20.242538 50.182235 19.8 49.113853 19.8 48 c
19.8 46.886147 20.242538 45.817765 21.030152 45.030152 c
21.817765 44.242538 22.886147 43.8 24 43.8 c
cl
24 44.22 m
24 44.22 22.997532 44.22 22.035988 44.618285 c
21.327136 45.327136 20.618285 46.035988 20.22 46.997532 c
20.22 48 20.22 49.002468 20.618285 49.964012 c
21.327136 50.672864 22.035988 51.381715 22.997532 51.78 c
24 51.78 25.002468 51.78 25.964012 51.381715 c
26.672864 50.672864 27.381715 49.964012 27.78 49.002468 c
27.78 48 27.78 46.997532 27.381715 46.035988 c
26.672864 45.327136 25.964012 44.618285 25.002468 44.22 c
cl
36 43.8 m
37.113853 43.8 38.182235 44.242538 38.969848 45.030152 c
39.757462 45.817765 40.2 46.886147 40.2 48 c
40.2 49.113853 39.757462 50.182235 38.969848 50.969848 c
38.182235 51.757462 37.113853 52.2 36 52.2 c
34.886147 52.2 33.817765 51.757462 33.030152 50.969848 c
32.242538 50.182235 31.8 49.113853 31.8 48 c
31.8 46.886147 32.242538 45.817765 33.030152 45.030152 c
33.817765 44.242538 34.886147 43.8 36 43.8 c
cl
36 44.22 m
36 44.22 34.997532 44.22 34.035988 44.618285 c
33.327136 45.327136 32.618285 46.035988 32.22 46.997532 c
32.22 48 32.22 49.002468 32.618285 49.964012 c
33.327136 50.672864 34.035988 51.381715 34.997532 51.78 c
36 51.78 37.002468 51.78 37.964012 51.381715 c
38.672864 50.672864 39.381715 49.964012 39.78 49.002468 c
39.78 48 39.78 46.997532 39.381715 46.035988 c
38.672864 45.327136 37.964012 44.618285 37.002468 44.22 c
cl
48 43.8 m
49.113853 43.8 50.182235 44.242538 50.969848 45.030152 c
51.757462 45.817765 52.2 46.886147 52.2 48 c
52.2 49.113853 51.757462 50.182235 50.969848 50.969848 c
50.182235 51.757462 49.113853 52.2 48 52.2 c
46.886147 52.2 45.817765 51.757462 45.030152 50.969848 c
44.242538 50.182235 43.8 49.113853 43.8 48 c
43.8 46.886147 44.242538 45.817765 45.030152 45.030152 c
45.817765 44.242538 46.886147 43.8 48 43.8 c
cl
48 44.22 m
48 44.22 46.997532 44.22 46.035988 44.618285 c
45.327136 45.327136 44.618285 46.035988 44.22 46.997532 c
44.22 48 44.22 49.002468 44.618285 49.964012 c
45.327136 50.672864 46.035988 51.381715 46.997532 51.78 c
48 51.78 49.002468 51.78 49.964012 51.381715 c
50.672864 50.672864 51.381715 49.964012 51.78 49.002468 c
51.78 48 51.78 46.997532 51.381715 46.035988 c
50.672864 45.327136 49.964012 44.618285 49.002468 44.22 c
cl
60 43.8 m
61.113853 43.8 62.182235 44.242538 62.969848 45.030152 c
63.757462 45.817765 64.2 46.886147 64.2 48 c
64.2 49.113853 63.757462 50.182235 62.969848 50.969848 c
62.182235 51.757462 61.113853 52.2 60 52.2 c
58.886147 52.2 57.817765 51.757462 57.030152 50.969848 c
56.242538 50.182235 55.8 49.113853 55.8 48 c
55.8 46.886147 56.242538 45.817765 57.030152 45.030152 c
57.817765 44.242538 58.886147 43.8 60 43.8 c
cl
60 44.22 m
60 44.22 58.997532 44.22 58.035988 44.618285 c
57.327136 45.327136 56.618285 46.035988 56.22 46.997532 c
56.22 48 56.22 49.002468 56.618285 49.964012 c
57.327136 50.672864 58.035988 51.381715 58.997532 51.78 c
60 51.78 61.002468 51.78 61.964012 51.381715 c
62.672864 50.672864 63.381715 49.964012 63.78 49.002468 c
63.78 48 63.78 46.997532 63.381715 46.035988 c
62.672864 45.327136 61.964012 44.618285 61.002468 44.22 c
cl
72 43.8 m
73.113853 43.8 74.182235 44.242538 74.969848 45.030152 c
75.757462 45.817765 76.2 46.886147 76.2 48 c
76.2 49.113853 75.757462 50.182235 74.969848 50.969848 c
74.182235 51.757462 73.113853 52.2 72 52.2 c
70.886147 52.2 69.817765 51.757462 69.030152 50.969848 c
68.242538 50.182235 67.8 49.113853 67.8 48 c
67.8 46.886147 68.242538 45.817765 69.030152 45.030152 c
69.817765 44.242538 70.886147 43.8 72 43.8 c
cl
72 44.22 m
72 44.22 70.997532 44.22 70.035988 44.618285 c
69.327136 45.327136 68.618285 46.035988 68.22 46.997532 c
68.22 48 68.22 49.002468 68.618285 49.964012 c
69.327136 50.672864 70.035988 51.381715 70.997532 51.78 c
72 51.78 73.002468 51.78 73.964012 51.381715 c
74.672864 50.672864 75.381715 49.964012 75.78 49.002468 c
75.78 48 75.78 46.997532 75.381715 46.035988 c
74.672864 45.327136 73.964012 44.618285 73.002468 44.22 c
cl
6 55.8 m
7.113853 55.8 8.182235 56.242538 8.969848 57.030152 c
9.757462 57.817765 10.2 58.886147 10.2 60 c
10.2 61.113853 9.757462 62.182235 8.969848 62.969848 c
8.182235 63.757462 7.113853 64.2 6 64.2 c
4.886147 64.2 3.817765 63.757462 3.030152 62.969848 c
2.242538 62.182235 1.8 61.113853 1.8 60 c
1.8 58.886147 2.242538 57.817765 3.030152 57.030152 c
3.817765 56.242538 4.886147 55.8 6 55.8 c
cl
6 56.22 m
6 56.22 4.997532 56.22 4.035988 56.618285 c
3.327136 57.327136 2.618285 58.035988 2.22 58.997532 c
2.22 60 2.22 61.002468 2.618285 61.964012 c
3.327136 62.672864 4.035988 63.381715 4.997532 63.78 c
6 63.78 7.002468 63.78 7.964012 63.381715 c
8.672864 62.672864 9.381715 61.964012 9.78 61.002468 c
9.78 60 9.78 58.997532 9.381715 58.035988 c
8.672864 57.327136 7.964012 56.618285 7.002468 56.22 c
cl
18 55.8 m
19.113853 55.8 20.182235 56.242538 20.969848 57.030152 c
21.757462 57.817765 22.2 58.886147 22.2 60 c
22.2 61.113853 21.757462 62.182235 20.969848 62.969848 c
20.182235 63.757462 19.113853 64.2 18 64.2 c
16.886147 64.2 15.817765 63.757462 15.030152 62.969848 c
14.242538 62.182235 13.8 61.113853 13.8 60 c
13.8 58.886147 14.242538 57.817765 15.030152 57.030152 c
15.817765 56.242538 16.886147 55.8 18 55.8 c
cl
18 56.22 m
18 56.22 16.997532 56.22 16.035988 56.618285 c
15.327136 57.327136 14.618285 58.035988 14.22 58.997532 c
14.22 60 14.22 61.002468 14.618285 61.964012 c
15.327136 62.672864 16.035988 63.381715 16.997532 63.78 c
18 63.78 19.002468 63.78 19.964012 63.381715 c
20.672864 62.672864 21.381715 61.964012 21.78 61.002468 c
21.78 60 21.78 58.997532 21.381715 58.035988 c
20.672864 57.327136 19.964012 56.618285 19.002468 56.22 c
cl
30 55.8 m
31.113853 55.8 32.182235 56.242538 32.969848 57.030152 c
33.757462 57.817765 34.2 58.886147 34.2 60 c
34.2 61.113853 33.757462 62.182235 32.969848 62.969848 c
32.182235 63.757462 31.113853 64.2 30 64.2 c
28.886147 64.2 27.817765 63.757462 27.030152 62.969848 c
26.242538 62.182235 25.8 61.113853 25.8 60 c
25.8 58.886147 26.242538 57.817765 27.030152 57.030152 c
27.817765 56.242538 28.886147 55.8 30 55.8 c
cl
30 56.22 m
30 56.22 28.997532 56.22 28.035988 56.618285 c
27.327136 57.327136 26.618285 58.035988 26.22 58.997532 c
26.22 60 26.22 61.002468 26.618285 61.964012 c
27.327136 62.672864 28.035988 63.381715 28.997532 63.78 c
30 63.78 31.002468 63.78 31.964012 63.381715 c
32.672864 62.672864 33.381715 61.964012 33.78 61.002468 c
33.78 60 33.78 58.997532 33.381715 58.035988 c
32.672864 57.327136 31.964012 56.618285 31.002468 56.22 c
cl
42 55.8 m
43.113853 55.8 44.182235 56.242538 44.969848 57.030152 c
45.757462 57.817765 46.2 58.886147 46.2 60 c
46.2 61.113853 45.757462 62.182235 44.969848 62.969848 c
44.182235 63.757462 43.113853 64.2 42 64.2 c
40.886147 64.2 39.817765 63.757462 39.030152 62.969848 c
38.242538 62.182235 37.8 61.113853 37.8 60 c
37.8 58.886147 38.242538 57.817765 39.030152 57.030152 c
39.817765 56.242538 40.886147 55.8 42 55.8 c
cl
42 56.22 m
42 56.22 40.997532 56.22 40.035988 56.618285 c
39.327136 57.327136 38.618285 58.035988 38.22 58.997532 c
38.22 60 38.22 61.002468 38.618285 61.964012 c
39.327136 62.672864 40.035988 63.381715 40.997532 63.78 c
42 63.78 43.002468 63.78 43.964012 63.381715 c
44.672864 62.672864 45.381715 61.964012 45.78 61.002468 c
45.78 60 45.78 58.997532 45.381715 58.035988 c
44.672864 57.327136 43.964012 56.618285 43.002468 56.22 c
cl
54 55.8 m
55.113853 55.8 56.182235 56.242538 56.969848 57.030152 c
57.757462 57.817765 58.2 58.886147 58.2 60 c
58.2 61.113853 57.757462 62.182235 56.969848 62.969848 c
56.182235 63.757462 55.113853 64.2 54 64.2 c
52.886147 64.2 51.817765 63.757462 51.030152 62.969848 c
50.242538 62.182235 49.8 61.113853 49.8 60 c
49.8 58.886147 50.242538 57.817765 51.030152 57.030152 c
51.817765 56.242538 52.886147 55.8 54 55.8 c
cl
54 56.22 m
54 56.22 52.997532 56.22 52.035988 56.618285 c
51.327136 57.327136 50.618285 58.035988 50.22 58.997532 c
50.22 60 50.22 61.002468 50.618285 61.964012 c
51.327136 62.672864 52.035988 63.381715 52.997532 63.78 c
54 63.78 55.002468 63.78 55.964012 63.381715 c
56.672864 62.672864 57.381715 61.964012 57.78 61.002468 c
57.78 60 57.78 58.997532 57.381715 58.035988 c
56.672864 57.327136 55.964012 56.618285 55.002468 56.22 c
cl
66 55.8 m
67.113853 55.8 68.182235 56.242538 68.969848 57.030152 c
69.757462 57.817765 70.2 58.886147 70.2 60 c
70.2 61.113853 69.757462 62.182235 68.969848 62.969848 c
68.182235 63.757462 67.113853 64.2 66 64.2 c
64.886147 64.2 63.817765 63.757462 63.030152 62.969848 c
62.242538 62.182235 61.8 61.113853 61.8 60 c
61.8 58.886147 62.242538 57.817765 63.030152 57.030152 c
63.817765 56.242538 64.886147 55.8 66 55.8 c
cl
66 56.22 m
66 56.22 64.997532 56.22 64.035988 56.618285 c
63.327136 57.327136 62.618285 58.035988 62.22 58.997532 c
62.22 60 62.22 61.002468 62.618285 61.964012 c
63.327136 62.672864 64.035988 63.381715 64.997532 63.78 c
66 63.78 67.002468 63.78 67.964012 63.381715 c
68.672864 62.672864 69.381715 61.964012 69.78 61.002468 c
69.78 60 69.78 58.997532 69.381715 58.035988 c
68.672864 57.327136 67.964012 56.618285 67.002468 56.22 c
cl
0 67.8 m
1.113853 67.8 2.182235 68.242538 2.969848 69.030152 c
3.757462 69.817765 4.2 70.886147 4.2 72 c
4.2 73.113853 3.757462 74.182235 2.969848 74.969848 c
2.182235 75.757462 1.113853 76.2 0 76.2 c
-1.113853 76.2 -2.182235 75.757462 -2.969848 74.969848 c
-3.757462 74.182235 -4.2 73.113853 -4.2 72 c
-4.2 70.886147 -3.757462 69.817765 -2.969848 69.030152 c
-2.182235 68.242538 -1.113853 67.8 0 67.8 c
cl
0 68.22 m
0 68.22 -1.002468 68.22 -1.964012 68.618285 c
-2.672864 69.327136 -3.381715 70.035988 -3.78 70.997532 c
-3.78 72 -3.78 73.002468 -3.381715 73.964012 c
-2.672864 74.672864 -1.964012 75.381715 -1.002468 75.78 c
0 75.78 1.002468 75.78 1.964012 75.381715 c
2.672864 74.672864 3.381715 73.964012 3.78 73.002468 c
3.78 72 3.78 70.997532 3.381715 70.035988 c
2.672864 69.327136 1.964012 68.618285 1.002468 68.22 c
cl
12 67.8 m
13.113853 67.8 14.182235 68.242538 14.969848 69.030152 c
15.757462 69.817765 16.2 70.886147 16.2 72 c
16.2 73.113853 15.757462 74.182235 14.969848 74.969848 c
14.182235 75.757462 13.113853 76.2 12 76.2 c
10.886147 76.2 9.817765 75.757462 9.030152 74.969848 c
8.242538 74.182235 7.8 73.113853 7.8 72 c
7.8 70.886147 8.242538 69.817765 9.030152 69.030152 c
9.817765 68.242538 10.886147 67.8 12 67.8 c
cl
12 68.22 m
12 68.22 10.997532 68.22 10.035988 68.618285 c
9.327136 69.327136 8.618285 70.035988 8.22 70.997532 c
8.22 72 8.22 73.002468 8.618285 73.964012 c
9.327136 74.672864 10.035988 75.381715 10.997532 75.78 c
12 75.78 13.002468 75.78 13.964012 75.381715 c
14.672864 74.672864 15.381715 73.964012 15.78 73.002468 c
15.78 72 15.78 70.997532 15.381715 70.035988 c
14.672864 69.327136 13.964012 68.618285 13.002468 68.22 c
cl
24 67.8 m
25.113853 67.8 26.182235 68.242538 26.969848 69.030152 c
27.757462 69.817765 28.2 70.886147 28.2 72 c
28.2 73.113853 27.757462 74.182235 26.969848 74.969848 c
26.182235 75.757462 25.113853 76.2 24 76.2 c
22.886147 76.2 21.817765 75.757462 21.030152 74.969848 c
20.242538 74.182235 19.8 73.113853 19.8 72 c
19.8 70.886147 20.242538 69.817765 21.030152 69.030152 c
21.817765 68.242538 22.886147 67.8 24 67.8 c
cl
24 68.22 m
24 68.22 22.997532 68.22 22.035988 68.618285 c
21.327136 69.327136 20.618285 70.035988 20.22 70.997532 c
20.22 72 20.22 73.002468 20.618285 73.964012 c
21.327136 74.672864 22.035988 75.381715 22.997532 75.78 c
24 75.78 25.002468 75.78 25.964012 75.381715 c
26.672864 74.672864 27.381715 73.964012 27.78 73.002468 c
27.78 72 27.78 70.997532 27.381715 70.035988 c
26.672864 69.327136 25.964012 68.618285 25.002468 68.22 c
cl
36 67.8 m
37.113853 67.8 38.182235 68.242538 38.969848 69.030152 c
39.757462 69.817765 40.2 70.886147 40.2 72 c
40.2 73.113853 39.757462 74.182235 38.969848 74.969848 c
38.182235 75.757462 37.113853 76.2 36 76.2 c
34.886147 76.2 33.817765 75.757462 33.030152 74.969848 c
32.242538 74.182235 31.8 73.113853 31.8 72 c
31.8 70.886147 32.242538 69.817765 33.030152 69.030152 c
33.817765 68.242538 34.886147 67.8 36 67.8 c
cl
36 68.22 m
36 68.22 34.997532 68.22 34.035988 68.618285 c
33.327136 69.327136 32.618285 70.035988 32.22 70.997532 c
32.22 72 32.22 73.002468 32.618285 73.964012 c
33.327136 74.672864 34.035988 75.381715 34.997532 75.78 c
36 75.78 37.002468 75.78 37.964012 75.381715 c
38.672864 74.672864 39.381715 73.964012 39.78 73.002468 c
39.78 72 39.78 70.997532 39.381715 70.035988 c
38.672864 69.327136 37.964012 68.618285 37.002468 68.22 c
cl
48 67.8 m
49.113853 67.8 50.182235 68.242538 50.969848 69.030152 c
51.757462 69.817765 52.2 70.886147 52.2 72 c
52.2 73.113853 51.757462 74.182235 50.969848 74.969848 c
50.182235 75.757462 49.113853 76.2 48 76.2 c
46.886147 76.2 45.817765 75.757462 45.030152 74.969848 c
44.242538 74.182235 43.8 73.113853 43.8 72 c
43.8 70.886147 44.242538 69.817765 45.030152 69.030152 c
45.817765 68.242538 46.886147 67.8 48 67.8 c
cl
48 68.22 m
48 68.22 46.997532 68.22 46.035988 68.618285 c
45.327136 69.327136 44.618285 70.035988 44.22 70.997532 c
44.22 72 44.22 73.002468 44.618285 73.964012 c
45.327136 74.672864 46.035988 75.381715 46.997532 75.78 c
48 75.78 49.002468 75.78 49.964012 75.381715 c
50.672864 74.672864 51.381715 73.964012 51.78 73.002468 c
51.78 72 51.78 70.997532 51.381715 70.035988 c
50.672864 69.327136 49.964012 68.618285 49.002468 68.22 c
cl
60 67.8 m
61.113853 67.8 62.182235 68.242538 62.969848 69.030152 c
63.757462 69.817765 64.2 70.886147 64.2 72 c
64.2 73.113853 63.757462 74.182235 62.969848 74.969848 c
62.182235 75.757462 61.113853 76.2 60 76.2 c
58.886147 76.2 57.817765 75.757462 57.030152 74.969848 c
56.242538 74.182235 55.8 73.113853 55.8 72 c
55.8 70.886147 56.242538 69.817765 57.030152 69.030152 c
57.817765 68.242538 58.886147 67.8 60 67.8 c
cl
60 68.22 m
60 68.22 58.997532 68.22 58.035988 68.618285 c
57.327136 69.327136 56.618285 70.035988 56.22 70.997532 c
56.22 72 56.22 73.002468 56.618285 73.964012 c
57.327136 74.672864 58.035988 75.381715 58.997532 75.78 c
60 75.78 61.002468 75.78 61.964012 75.381715 c
62.672864 74.672864 63.381715 73.964012 63.78 73.002468 c
63.78 72 63.78 70.997532 63.381715 70.035988 c
62.672864 69.327136 61.964012 68.618285 61.002468 68.22 c
cl
72 67.8 m
73.113853 67.8 74.182235 68.242538 74.969848 69.030152 c
75.757462 69.817765 76.2 70.886147 76.2 72 c
76.2 73.113853 75.757462 74.182235 74.969848 74.969848 c
74.182235 75.757462 73.113853 76.2 72 76.2 c
70.886147 76.2 69.817765 75.757462 69.030152 74.969848 c
68.242538 74.182235 67.8 73.113853 67.8 72 c
67.8 70.886147 68.242538 69.817765 69.030152 69.030152 c
69.817765 68.242538 70.886147 67.8 72 67.8 c
cl
72 68.22 m
72 68.22 70.997532 68.22 70.035988 68.618285 c
69.327136 69.327136 68.618285 70.035988 68.22 70.997532 c
68.22 72 68.22 73.002468 68.618285 73.964012 c
69.327136 74.672864 70.035988 75.381715 70.997532 75.78 c
72 75.78 73.002468 75.78 73.964012 75.381715 c
74.672864 74.672864 75.381715 73.964012 75.78 73.002468 c
75.78 72 75.78 70.997532 75.381715 70.035988 c
74.672864 69.327136 73.964012 68.618285 73.002468 68.22 c
cl

        gsave
        fill
        grestore
        stroke
     } bind
   >>
   matrix
   0.0 141.710625 translate
   makepattern
   /H2 exch def
gsave
1.000000 0.000000 0.000000 H2 setpattern fill grestore
stroke
grestore
gsave
106.02 110.88 35.72 30.111 clipbox
123.152078 30.110625 m
136.920909 30.110625 l
136.920909 107.02755 l
123.152078 107.02755 l
cl
gsave
1.000 setgray
fill
grestore
gsave
1.000000 0.000000 0.000000 H2 setpattern fill grestore
stroke
grestore
0.800 setlinewidth
2 setlinecap
0.000 setgray
gsave
35.72 30.110625 m
35.72 140.990625 l
stroke
grestore
gsave
35.72 30.110625 m
141.74 30.110625 l
stroke
grestore
1.000 setlinewidth
0 setlinecap
gsave
48.101875 34.610625 m
129.358125 34.610625 l
130.558125 34.610625 131.158125 35.210625 131.158125 36.410625 c
131.158125 88.385625 l
131.158125 89.585625 130.558125 90.185625 129.358125 90.185625 c
48.101875 90.185625 l
46.901875 90.185625 46.301875 89.585625 46.301875 88.385625 c
46.301875 36.410625 l
46.301875 35.210625 46.901875 34.610625 48.101875 34.610625 c
cl
gsave
1.000 setgray
fill
grestore
stroke
grestore
1.500 setlinewidth
1 setlinejoin
[5.55 2.4] 0 setdash
gsave
49.901875 82.891875 m
56.651875 82.891875 l
63.401875 82.891875 l
stroke
grestore
/DejaVuSans 9.000 selectfont
gsave

67.901875 79.741875 translate
0.000000 rotate
0.000000 0 m /U glyphshow
6.587402 0 m /n glyphshow
12.291504 0 m /i glyphshow
14.791992 0 m /f glyphshow
17.960449 0 m /o glyphshow
23.466797 0 m /r glyphshow
27.041992 0 m /m glyphshow
grestore
1.000 setlinewidth
0 setlinejoin
[] 0 setdash
0.173 0.627 0.173 setrgbcolor
gsave
49.901875 66.523125 m
63.401875 66.523125 l
63.401875 72.823125 l
49.901875 72.823125 l
cl
gsave
1.000 setgray
fill
grestore
gsave
0.172549 0.627451 0.172549 H0 setpattern fill grestore
stroke
grestore
0.000 setgray
gsave

67.901875 66.523125 translate
0.000000 rotate
0.000000 0 m /U glyphshow
6.587402 0 m /P glyphshow
12.014648 0 m /S glyphshow
17.727539 0 m /space glyphshow
20.588379 0 m /d glyphshow
26.301270 0 m /equal glyphshow
33.842285 0 m /zero glyphshow
39.568359 0 m /period glyphshow
42.429199 0 m /zero glyphshow
48.155273 0 m /zero glyphshow
53.881348 0 m /one glyphshow
grestore
0.122 0.467 0.706 setrgbcolor
gsave
49.901875 53.304375 m
63.401875 53.304375 l
63.401875 59.604375 l
49.901875 59.604375 l
cl
gsave
1.000 setgray
fill
grestore
gsave
0.121569 0.466667 0.705882 H1 setpattern fill grestore
stroke
grestore
0.000 setgray
gsave

67.901875 53.304375 translate
0.000000 rotate
0.000000 0 m /U glyphshow
6.587402 0 m /P glyphshow
12.014648 0 m /S glyphshow
17.727539 0 m /space glyphshow
20.588379 0 m /d glyphshow
26.301270 0 m /equal glyphshow
33.842285 0 m /zero glyphshow
39.568359 0 m /period glyphshow
42.429199 0 m /zero glyphshow
48.155273 0 m /one glyphshow
grestore
1.000 0.000 0.000 setrgbcolor
gsave
49.901875 40.085625 m
63.401875 40.085625 l
63.401875 46.385625 l
49.901875 46.385625 l
cl
gsave
1.000 setgray
fill
grestore
gsave
1.000000 0.000000 0.000000 H2 setpattern fill grestore
stroke
grestore
0.000 setgray
gsave

67.901875 40.085625 translate
0.000000 rotate
0.000000 0 m /U glyphshow
6.587402 0 m /P glyphshow
12.014648 0 m /S glyphshow
17.727539 0 m /space glyphshow
20.588379 0 m /d glyphshow
26.301270 0 m /equal glyphshow
33.842285 0 m /zero glyphshow
39.568359 0 m /period glyphshow
42.429199 0 m /one glyphshow
grestore

end
showpage
