%!PS-Adobe-3.0 EPSF-3.0
%%Title: expe_dissemination.eps
%%Creator: Matplotlib v3.5.2, https://matplotlib.org/
%%CreationDate: Wed Sep 21 20:02:16 2022
%%Orientation: portrait
%%BoundingBox: 145 325 467 467
%%HiResBoundingBox: 145.281875 325.144687 466.718125 466.855312
%%EndComments
%%BeginProlog
/mpldict 11 dict def
mpldict begin
/_d { bind def } bind def
/m { moveto } _d
/l { lineto } _d
/r { rlineto } _d
/c { curveto } _d
/cl { closepath } _d
/ce { closepath eofill } _d
/box {
      m
      1 index 0 r
      0 exch r
      neg 0 r
      cl
    } _d
/clipbox {
      box
      clip
      newpath
    } _d
/sc { setcachedevice } _d
%!PS-Adobe-3.0 Resource-Font
%%Creator: Converted from TrueType to Type 3 by Matplotlib.
10 dict begin
/FontName /DejaVuSans def
/PaintType 0 def
/FontMatrix [0.00048828125 0 0 0.00048828125 0 0] def
/FontBBox [-2090 -948 3673 2524] def
/FontType 3 def
/Encoding [/space /percent /period /zero /one /two /four /six /eight /equal /C /D /F /P /R /S /U /c /d /e /f /i /l /m /n /o /r /s /t /u /y] def
/CharStrings 32 dict dup begin
/.notdef 0 def
/space{651 0 0 0 0 0 sc
ce} _d
/percent{1946 0 113 -29 1833 1520 sc
1489 657 m
1431 657 1385 632 1352 583 c
1319 534 1303 465 1303 377 c
1303 290 1319 222 1352 172 c
1385 123 1431 98 1489 98 c
1546 98 1590 123 1623 172 c
1656 222 1673 290 1673 377 c
1673 464 1656 533 1623 582 c
1590 632 1546 657 1489 657 c

1489 784 m
1594 784 1678 747 1740 674 c
1802 601 1833 502 1833 377 c
1833 252 1802 153 1739 80 c
1677 7 1594 -29 1489 -29 c
1382 -29 1298 7 1236 80 c
1174 153 1143 252 1143 377 c
1143 502 1174 601 1236 674 c
1299 747 1383 784 1489 784 c

457 1393 m
400 1393 354 1368 321 1318 c
288 1269 272 1201 272 1114 c
272 1026 288 957 321 908 c
354 859 399 834 457 834 c
515 834 560 859 593 908 c
626 957 643 1026 643 1114 c
643 1200 626 1268 593 1318 c
560 1368 514 1393 457 1393 c

1360 1520 m
1520 1520 l
586 -29 l
426 -29 l
1360 1520 l

457 1520 m
562 1520 646 1483 709 1410 c
772 1337 803 1239 803 1114 c
803 988 772 889 709 816 c
647 743 563 707 457 707 c
351 707 267 743 205 816 c
144 889 113 989 113 1114 c
113 1238 144 1337 206 1410 c
268 1483 352 1520 457 1520 c

ce} _d
/period{651 0 219 0 430 254 sc
219 254 m
430 254 l
430 0 l
219 0 l
219 254 l

ce} _d
/zero{1303 0 135 -29 1167 1520 sc
651 1360 m
547 1360 469 1309 416 1206 c
364 1104 338 950 338 745 c
338 540 364 387 416 284 c
469 182 547 131 651 131 c
756 131 834 182 886 284 c
939 387 965 540 965 745 c
965 950 939 1104 886 1206 c
834 1309 756 1360 651 1360 c

651 1520 m
818 1520 946 1454 1034 1321 c
1123 1189 1167 997 1167 745 c
1167 494 1123 302 1034 169 c
946 37 818 -29 651 -29 c
484 -29 356 37 267 169 c
179 302 135 494 135 745 c
135 997 179 1189 267 1321 c
356 1454 484 1520 651 1520 c

ce} _d
/one{1303 0 225 0 1114 1493 sc
254 170 m
584 170 l
584 1309 l
225 1237 l
225 1421 l
582 1493 l
784 1493 l
784 170 l
1114 170 l
1114 0 l
254 0 l
254 170 l

ce} _d
/two{1303 0 150 0 1098 1520 sc
393 170 m
1098 170 l
1098 0 l
150 0 l
150 170 l
227 249 331 356 463 489 c
596 623 679 709 713 748 c
778 821 823 882 848 932 c
874 983 887 1032 887 1081 c
887 1160 859 1225 803 1275 c
748 1325 675 1350 586 1350 c
523 1350 456 1339 385 1317 c
315 1295 240 1262 160 1217 c
160 1421 l
241 1454 317 1478 388 1495 c
459 1512 523 1520 582 1520 c
737 1520 860 1481 952 1404 c
1044 1327 1090 1223 1090 1094 c
1090 1033 1078 974 1055 919 c
1032 864 991 800 930 725 c
913 706 860 650 771 557 c
682 465 556 336 393 170 c

ce} _d
/four{1303 0 100 0 1188 1493 sc
774 1317 m
264 520 l
774 520 l
774 1317 l

721 1493 m
975 1493 l
975 520 l
1188 520 l
1188 352 l
975 352 l
975 0 l
774 0 l
774 352 l
100 352 l
100 547 l
721 1493 l

ce} _d
/six{1303 0 143 -29 1174 1520 sc
676 827 m
585 827 513 796 460 734 c
407 672 381 587 381 479 c
381 372 407 287 460 224 c
513 162 585 131 676 131 c
767 131 838 162 891 224 c
944 287 971 372 971 479 c
971 587 944 672 891 734 c
838 796 767 827 676 827 c

1077 1460 m
1077 1276 l
1026 1300 975 1318 923 1331 c
872 1344 821 1350 770 1350 c
637 1350 535 1305 464 1215 c
394 1125 354 989 344 807 c
383 865 433 909 492 940 c
551 971 617 987 688 987 c
838 987 956 941 1043 850 c
1130 759 1174 636 1174 479 c
1174 326 1129 203 1038 110 c
947 17 827 -29 676 -29 c
503 -29 371 37 280 169 c
189 302 143 494 143 745 c
143 981 199 1169 311 1309 c
423 1450 573 1520 762 1520 c
813 1520 864 1515 915 1505 c
967 1495 1021 1480 1077 1460 c

ce} _d
/eight{1303 0 139 -29 1163 1520 sc
651 709 m
555 709 479 683 424 632 c
369 581 342 510 342 420 c
342 330 369 259 424 208 c
479 157 555 131 651 131 c
747 131 823 157 878 208 c
933 260 961 331 961 420 c
961 510 933 581 878 632 c
823 683 748 709 651 709 c

449 795 m
362 816 295 857 246 916 c
198 975 174 1048 174 1133 c
174 1252 216 1347 301 1416 c
386 1485 503 1520 651 1520 c
800 1520 916 1485 1001 1416 c
1086 1347 1128 1252 1128 1133 c
1128 1048 1104 975 1055 916 c
1007 857 940 816 854 795 c
951 772 1027 728 1081 662 c
1136 596 1163 515 1163 420 c
1163 275 1119 164 1030 87 c
942 10 816 -29 651 -29 c
486 -29 360 10 271 87 c
183 164 139 275 139 420 c
139 515 166 596 221 662 c
276 728 352 772 449 795 c

375 1114 m
375 1037 399 976 447 933 c
496 890 564 868 651 868 c
738 868 805 890 854 933 c
903 976 928 1037 928 1114 c
928 1191 903 1252 854 1295 c
805 1338 738 1360 651 1360 c
564 1360 496 1338 447 1295 c
399 1252 375 1191 375 1114 c

ce} _d
/equal{1716 0 217 352 1499 930 sc
217 930 m
1499 930 l
1499 762 l
217 762 l
217 930 l

217 522 m
1499 522 l
1499 352 l
217 352 l
217 522 l

ce} _d
/C{1430 0 115 -29 1319 1520 sc
1319 1378 m
1319 1165 l
1251 1228 1178 1276 1101 1307 c
1024 1338 943 1354 856 1354 c
685 1354 555 1302 464 1197 c
373 1093 328 942 328 745 c
328 548 373 398 464 293 c
555 189 685 137 856 137 c
943 137 1024 153 1101 184 c
1178 215 1251 263 1319 326 c
1319 115 l
1248 67 1173 31 1094 7 c
1015 -17 932 -29 844 -29 c
618 -29 440 40 310 178 c
180 317 115 506 115 745 c
115 985 180 1174 310 1312 c
440 1451 618 1520 844 1520 c
933 1520 1017 1508 1096 1484 c
1175 1461 1250 1425 1319 1378 c

ce} _d
/D{1577 0 201 0 1456 1493 sc
403 1327 m
403 166 l
647 166 l
853 166 1004 213 1099 306 c
1195 399 1243 547 1243 748 c
1243 948 1195 1094 1099 1187 c
1004 1280 853 1327 647 1327 c
403 1327 l

201 1493 m
616 1493 l
905 1493 1118 1433 1253 1312 c
1388 1192 1456 1004 1456 748 c
1456 491 1388 302 1252 181 c
1116 60 904 0 616 0 c
201 0 l
201 1493 l

ce} _d
/F{1178 0 201 0 1059 1493 sc
201 1493 m
1059 1493 l
1059 1323 l
403 1323 l
403 883 l
995 883 l
995 713 l
403 713 l
403 0 l
201 0 l
201 1493 l

ce} _d
/P{1235 0 201 0 1165 1493 sc
403 1327 m
403 766 l
657 766 l
751 766 824 790 875 839 c
926 888 952 957 952 1047 c
952 1136 926 1205 875 1254 c
824 1303 751 1327 657 1327 c
403 1327 l

201 1493 m
657 1493 l
824 1493 951 1455 1036 1379 c
1122 1304 1165 1193 1165 1047 c
1165 900 1122 788 1036 713 c
951 638 824 600 657 600 c
403 600 l
403 0 l
201 0 l
201 1493 l

ce} _d
/R{1423 0 201 0 1364 1493 sc
909 700 m
952 685 994 654 1035 606 c
1076 558 1118 492 1159 408 c
1364 0 l
1147 0 l
956 383 l
907 483 859 549 812 582 c
766 615 703 631 623 631 c
403 631 l
403 0 l
201 0 l
201 1493 l
657 1493 l
828 1493 955 1457 1039 1386 c
1123 1315 1165 1207 1165 1063 c
1165 969 1143 891 1099 829 c
1056 767 992 724 909 700 c

403 1327 m
403 797 l
657 797 l
754 797 828 819 877 864 c
927 909 952 976 952 1063 c
952 1150 927 1216 877 1260 c
828 1305 754 1327 657 1327 c
403 1327 l

ce} _d
/S{1300 0 135 -29 1186 1520 sc
1096 1444 m
1096 1247 l
1019 1284 947 1311 879 1329 c
811 1347 745 1356 682 1356 c
572 1356 487 1335 427 1292 c
368 1249 338 1189 338 1110 c
338 1044 358 994 397 960 c
437 927 512 900 623 879 c
745 854 l
896 825 1007 775 1078 702 c
1150 630 1186 533 1186 412 c
1186 267 1137 158 1040 83 c
943 8 801 -29 614 -29 c
543 -29 468 -21 388 -5 c
309 11 226 35 141 66 c
141 274 l
223 228 303 193 382 170 c
461 147 538 135 614 135 c
729 135 818 158 881 203 c
944 248 975 313 975 397 c
975 470 952 528 907 569 c
862 610 789 641 686 662 c
563 686 l
412 716 303 763 236 827 c
169 891 135 980 135 1094 c
135 1226 181 1330 274 1406 c
367 1482 496 1520 659 1520 c
729 1520 800 1514 873 1501 c
946 1488 1020 1469 1096 1444 c

ce} _d
/U{1499 0 178 -29 1321 1493 sc
178 1493 m
381 1493 l
381 586 l
381 426 410 311 468 240 c
526 170 620 135 750 135 c
879 135 973 170 1031 240 c
1089 311 1118 426 1118 586 c
1118 1493 l
1321 1493 l
1321 561 l
1321 366 1273 219 1176 120 c
1080 21 938 -29 750 -29 c
561 -29 419 21 322 120 c
226 219 178 366 178 561 c
178 1493 l

ce} _d
/c{1126 0 113 -29 999 1147 sc
999 1077 m
999 905 l
947 934 895 955 842 969 c
790 984 737 991 684 991 c
565 991 472 953 406 877 c
340 802 307 696 307 559 c
307 422 340 316 406 240 c
472 165 565 127 684 127 c
737 127 790 134 842 148 c
895 163 947 184 999 213 c
999 43 l
948 19 894 1 839 -11 c
784 -23 726 -29 664 -29 c
495 -29 361 24 262 130 c
163 236 113 379 113 559 c
113 742 163 885 263 990 c
364 1095 501 1147 676 1147 c
733 1147 788 1141 842 1129 c
896 1118 948 1100 999 1077 c

ce} _d
/d{1300 0 113 -29 1114 1556 sc
930 950 m
930 1556 l
1114 1556 l
1114 0 l
930 0 l
930 168 l
891 101 842 52 783 19 c
724 -13 654 -29 571 -29 c
436 -29 325 25 240 133 c
155 241 113 383 113 559 c
113 735 155 877 240 985 c
325 1093 436 1147 571 1147 c
654 1147 724 1131 783 1098 c
842 1066 891 1017 930 950 c

303 559 m
303 424 331 317 386 240 c
442 163 519 125 616 125 c
713 125 790 163 846 240 c
902 317 930 424 930 559 c
930 694 902 800 846 877 c
790 954 713 993 616 993 c
519 993 442 954 386 877 c
331 800 303 694 303 559 c

ce} _d
/e{1260 0 113 -29 1151 1147 sc
1151 606 m
1151 516 l
305 516 l
313 389 351 293 419 226 c
488 160 583 127 705 127 c
776 127 844 136 910 153 c
977 170 1043 196 1108 231 c
1108 57 l
1042 29 974 8 905 -7 c
836 -22 765 -29 694 -29 c
515 -29 374 23 269 127 c
165 231 113 372 113 549 c
113 732 162 878 261 985 c
360 1093 494 1147 662 1147 c
813 1147 932 1098 1019 1001 c
1107 904 1151 773 1151 606 c

967 660 m
966 761 937 841 882 901 c
827 961 755 991 664 991 c
561 991 479 962 417 904 c
356 846 320 764 311 659 c
967 660 l

ce} _d
/f{721 0 47 0 760 1556 sc
760 1556 m
760 1403 l
584 1403 l
518 1403 472 1390 446 1363 c
421 1336 408 1288 408 1219 c
408 1120 l
711 1120 l
711 977 l
408 977 l
408 0 l
223 0 l
223 977 l
47 977 l
47 1120 l
223 1120 l
223 1198 l
223 1323 252 1413 310 1470 c
368 1527 460 1556 586 1556 c
760 1556 l

ce} _d
/i{569 0 193 0 377 1556 sc
193 1120 m
377 1120 l
377 0 l
193 0 l
193 1120 l

193 1556 m
377 1556 l
377 1323 l
193 1323 l
193 1556 l

ce} _d
/l{569 0 193 0 377 1556 sc
193 1556 m
377 1556 l
377 0 l
193 0 l
193 1556 l

ce} _d
/m{1995 0 186 0 1821 1147 sc
1065 905 m
1111 988 1166 1049 1230 1088 c
1294 1127 1369 1147 1456 1147 c
1573 1147 1663 1106 1726 1024 c
1789 943 1821 827 1821 676 c
1821 0 l
1636 0 l
1636 670 l
1636 777 1617 857 1579 909 c
1541 961 1483 987 1405 987 c
1310 987 1234 955 1179 892 c
1124 829 1096 742 1096 633 c
1096 0 l
911 0 l
911 670 l
911 778 892 858 854 909 c
816 961 757 987 678 987 c
584 987 509 955 454 891 c
399 828 371 742 371 633 c
371 0 l
186 0 l
186 1120 l
371 1120 l
371 946 l
413 1015 463 1065 522 1098 c
581 1131 650 1147 731 1147 c
812 1147 881 1126 938 1085 c
995 1044 1038 984 1065 905 c

ce} _d
/n{1298 0 186 0 1124 1147 sc
1124 676 m
1124 0 l
940 0 l
940 670 l
940 776 919 855 878 908 c
837 961 775 987 692 987 c
593 987 514 955 457 892 c
400 829 371 742 371 633 c
371 0 l
186 0 l
186 1120 l
371 1120 l
371 946 l
415 1013 467 1064 526 1097 c
586 1130 655 1147 733 1147 c
862 1147 959 1107 1025 1027 c
1091 948 1124 831 1124 676 c

ce} _d
/o{1253 0 113 -29 1141 1147 sc
627 991 m
528 991 450 952 393 875 c
336 798 307 693 307 559 c
307 425 335 319 392 242 c
449 165 528 127 627 127 c
725 127 803 166 860 243 c
917 320 946 426 946 559 c
946 692 917 797 860 874 c
803 952 725 991 627 991 c

627 1147 m
787 1147 913 1095 1004 991 c
1095 887 1141 743 1141 559 c
1141 376 1095 232 1004 127 c
913 23 787 -29 627 -29 c
466 -29 340 23 249 127 c
158 232 113 376 113 559 c
113 743 158 887 249 991 c
340 1095 466 1147 627 1147 c

ce} _d
/r{842 0 186 0 842 1147 sc
842 948 m
821 960 799 969 774 974 c
750 980 723 983 694 983 c
590 983 510 949 454 881 c
399 814 371 717 371 590 c
371 0 l
186 0 l
186 1120 l
371 1120 l
371 946 l
410 1014 460 1064 522 1097 c
584 1130 659 1147 748 1147 c
761 1147 775 1146 790 1144 c
805 1143 822 1140 841 1137 c
842 948 l

ce} _d
/s{1067 0 111 -29 967 1147 sc
907 1087 m
907 913 l
855 940 801 960 745 973 c
689 986 631 993 571 993 c
480 993 411 979 365 951 c
320 923 297 881 297 825 c
297 782 313 749 346 724 c
379 700 444 677 543 655 c
606 641 l
737 613 829 573 884 522 c
939 471 967 400 967 309 c
967 205 926 123 843 62 c
761 1 648 -29 504 -29 c
444 -29 381 -23 316 -11 c
251 0 183 18 111 41 c
111 231 l
179 196 246 169 312 151 c
378 134 443 125 508 125 c
595 125 661 140 708 169 c
755 199 778 241 778 295 c
778 345 761 383 727 410 c
694 437 620 462 506 487 c
442 502 l
328 526 246 563 195 612 c
144 662 119 730 119 817 c
119 922 156 1004 231 1061 c
306 1118 412 1147 549 1147 c
617 1147 681 1142 741 1132 c
801 1122 856 1107 907 1087 c

ce} _d
/t{803 0 55 0 754 1438 sc
375 1438 m
375 1120 l
754 1120 l
754 977 l
375 977 l
375 369 l
375 278 387 219 412 193 c
437 167 488 154 565 154 c
754 154 l
754 0 l
565 0 l
423 0 325 26 271 79 c
217 132 190 229 190 369 c
190 977 l
55 977 l
55 1120 l
190 1120 l
190 1438 l
375 1438 l

ce} _d
/u{1298 0 174 -29 1112 1147 sc
174 442 m
174 1120 l
358 1120 l
358 449 l
358 343 379 263 420 210 c
461 157 523 131 606 131 c
705 131 784 163 841 226 c
899 289 928 376 928 485 c
928 1120 l
1112 1120 l
1112 0 l
928 0 l
928 172 l
883 104 831 53 772 20 c
713 -13 645 -29 567 -29 c
438 -29 341 11 274 91 c
207 171 174 288 174 442 c

637 1147 m
637 1147 l

ce} _d
/y{1212 0 61 -426 1151 1120 sc
659 -104 m
607 -237 556 -324 507 -365 c
458 -406 392 -426 309 -426 c
162 -426 l
162 -272 l
270 -272 l
321 -272 360 -260 388 -236 c
416 -212 447 -155 481 -66 c
514 18 l
61 1120 l
256 1120 l
606 244 l
956 1120 l
1151 1120 l
659 -104 l

ce} _d
end readonly def

/BuildGlyph {
 exch begin
 CharStrings exch
 2 copy known not {pop /.notdef} if
 true 3 1 roll get exec
 end
} _d

/BuildChar {
 1 index /Encoding get exch get
 1 index /BuildGlyph get exec
} _d

FontName currentdict end definefont pop
end
%%EndProlog
mpldict begin
145.282 325.145 translate
321.436 141.711 0 0 clipbox
gsave
0 0 m
321.43625 0 l
321.43625 141.710625 l
0 141.710625 l
cl
1.000 setgray
fill
grestore
gsave
47.141875 30.110625 m
168.88733 30.110625 l
168.88733 140.990625 l
47.141875 140.990625 l
cl
1.000 setgray
fill
grestore
0.800 setlinewidth
1 setlinejoin
0 setlinecap
[2.96 1.28] 0 setdash
0.690 setgray
gsave
121.745 110.88 47.142 30.111 clipbox
47.141875 30.110625 m
47.141875 140.990625 l
stroke
grestore
[] 0 setdash
0.000 setgray
gsave
/o {
gsave
newpath
translate
0.8 setlinewidth
1 setlinejoin

0 setlinecap

0 0 m
0 -3.5 l

gsave
0.000 setgray
fill
grestore
stroke
grestore
} bind def
47.1419 30.1106 o
grestore
/DejaVuSans 9.000 selectfont
gsave

44.274688 16.266875 translate
0.000000 rotate
0.000000 0 m /eight glyphshow
grestore
[2.96 1.28] 0 setdash
0.690 setgray
gsave
121.745 110.88 47.142 30.111 clipbox
71.490966 30.110625 m
71.490966 140.990625 l
stroke
grestore
[] 0 setdash
0.000 setgray
gsave
/o {
gsave
newpath
translate
0.8 setlinewidth
1 setlinejoin

0 setlinecap

0 0 m
0 -3.5 l

gsave
0.000 setgray
fill
grestore
stroke
grestore
} bind def
71.491 30.1106 o
grestore
gsave

65.756591 16.266875 translate
0.000000 rotate
0.000000 0 m /one glyphshow
5.726074 0 m /zero glyphshow
grestore
[2.96 1.28] 0 setdash
0.690 setgray
gsave
121.745 110.88 47.142 30.111 clipbox
95.840057 30.110625 m
95.840057 140.990625 l
stroke
grestore
[] 0 setdash
0.000 setgray
gsave
/o {
gsave
newpath
translate
0.8 setlinewidth
1 setlinejoin

0 setlinecap

0 0 m
0 -3.5 l

gsave
0.000 setgray
fill
grestore
stroke
grestore
} bind def
95.8401 30.1106 o
grestore
gsave

90.105682 16.266875 translate
0.000000 rotate
0.000000 0 m /one glyphshow
5.726074 0 m /two glyphshow
grestore
[2.96 1.28] 0 setdash
0.690 setgray
gsave
121.745 110.88 47.142 30.111 clipbox
120.189148 30.110625 m
120.189148 140.990625 l
stroke
grestore
[] 0 setdash
0.000 setgray
gsave
/o {
gsave
newpath
translate
0.8 setlinewidth
1 setlinejoin

0 setlinecap

0 0 m
0 -3.5 l

gsave
0.000 setgray
fill
grestore
stroke
grestore
} bind def
120.189 30.1106 o
grestore
gsave

114.454773 16.266875 translate
0.000000 rotate
0.000000 0 m /one glyphshow
5.726074 0 m /four glyphshow
grestore
[2.96 1.28] 0 setdash
0.690 setgray
gsave
121.745 110.88 47.142 30.111 clipbox
144.538239 30.110625 m
144.538239 140.990625 l
stroke
grestore
[] 0 setdash
0.000 setgray
gsave
/o {
gsave
newpath
translate
0.8 setlinewidth
1 setlinejoin

0 setlinecap

0 0 m
0 -3.5 l

gsave
0.000 setgray
fill
grestore
stroke
grestore
} bind def
144.538 30.1106 o
grestore
gsave

138.803864 16.266875 translate
0.000000 rotate
0.000000 0 m /one glyphshow
5.726074 0 m /six glyphshow
grestore
[2.96 1.28] 0 setdash
0.690 setgray
gsave
121.745 110.88 47.142 30.111 clipbox
168.88733 30.110625 m
168.88733 140.990625 l
stroke
grestore
[] 0 setdash
0.000 setgray
gsave
/o {
gsave
newpath
translate
0.8 setlinewidth
1 setlinejoin

0 setlinecap

0 0 m
0 -3.5 l

gsave
0.000 setgray
fill
grestore
stroke
grestore
} bind def
168.887 30.1106 o
grestore
gsave

163.152955 16.266875 translate
0.000000 rotate
0.000000 0 m /one glyphshow
5.726074 0 m /eight glyphshow
grestore
/DejaVuSans 10.000 selectfont
gsave

89.600540 2.798125 translate
0.000000 rotate
0.000000 0 m /R glyphshow
6.448242 0 m /o glyphshow
12.566406 0 m /u glyphshow
18.904297 0 m /n glyphshow
25.242188 0 m /d glyphshow
31.589844 0 m /s glyphshow
grestore
[2.96 1.28] 0 setdash
0.690 setgray
gsave
121.745 110.88 47.142 30.111 clipbox
47.141875 35.150625 m
168.88733 35.150625 l
stroke
grestore
[] 0 setdash
0.000 setgray
gsave
/o {
gsave
newpath
translate
0.8 setlinewidth
1 setlinejoin

0 setlinecap

-0 0 m
-3.5 0 l

gsave
0.000 setgray
fill
grestore
stroke
grestore
} bind def
47.1419 35.1506 o
grestore
/DejaVuSans 9.000 selectfont
gsave

25.860625 31.728750 translate
0.000000 rotate
0.000000 0 m /zero glyphshow
5.726074 0 m /percent glyphshow
grestore
[2.96 1.28] 0 setdash
0.690 setgray
gsave
121.745 110.88 47.142 30.111 clipbox
47.141875 55.310625 m
168.88733 55.310625 l
stroke
grestore
[] 0 setdash
0.000 setgray
gsave
/o {
gsave
newpath
translate
0.8 setlinewidth
1 setlinejoin

0 setlinecap

-0 0 m
-3.5 0 l

gsave
0.000 setgray
fill
grestore
stroke
grestore
} bind def
47.1419 55.3106 o
grestore
gsave

20.126250 51.888750 translate
0.000000 rotate
0.000000 0 m /two glyphshow
5.726074 0 m /zero glyphshow
11.452148 0 m /percent glyphshow
grestore
[2.96 1.28] 0 setdash
0.690 setgray
gsave
121.745 110.88 47.142 30.111 clipbox
47.141875 75.470625 m
168.88733 75.470625 l
stroke
grestore
[] 0 setdash
0.000 setgray
gsave
/o {
gsave
newpath
translate
0.8 setlinewidth
1 setlinejoin

0 setlinecap

-0 0 m
-3.5 0 l

gsave
0.000 setgray
fill
grestore
stroke
grestore
} bind def
47.1419 75.4706 o
grestore
gsave

20.126250 72.048750 translate
0.000000 rotate
0.000000 0 m /four glyphshow
5.726074 0 m /zero glyphshow
11.452148 0 m /percent glyphshow
grestore
[2.96 1.28] 0 setdash
0.690 setgray
gsave
121.745 110.88 47.142 30.111 clipbox
47.141875 95.630625 m
168.88733 95.630625 l
stroke
grestore
[] 0 setdash
0.000 setgray
gsave
/o {
gsave
newpath
translate
0.8 setlinewidth
1 setlinejoin

0 setlinecap

-0 0 m
-3.5 0 l

gsave
0.000 setgray
fill
grestore
stroke
grestore
} bind def
47.1419 95.6306 o
grestore
gsave

20.126250 92.208750 translate
0.000000 rotate
0.000000 0 m /six glyphshow
5.726074 0 m /zero glyphshow
11.452148 0 m /percent glyphshow
grestore
[2.96 1.28] 0 setdash
0.690 setgray
gsave
121.745 110.88 47.142 30.111 clipbox
47.141875 115.790625 m
168.88733 115.790625 l
stroke
grestore
[] 0 setdash
0.000 setgray
gsave
/o {
gsave
newpath
translate
0.8 setlinewidth
1 setlinejoin

0 setlinecap

-0 0 m
-3.5 0 l

gsave
0.000 setgray
fill
grestore
stroke
grestore
} bind def
47.1419 115.791 o
grestore
gsave

20.126250 112.368750 translate
0.000000 rotate
0.000000 0 m /eight glyphshow
5.726074 0 m /zero glyphshow
11.452148 0 m /percent glyphshow
grestore
[2.96 1.28] 0 setdash
0.690 setgray
gsave
121.745 110.88 47.142 30.111 clipbox
47.141875 135.950625 m
168.88733 135.950625 l
stroke
grestore
[] 0 setdash
0.000 setgray
gsave
/o {
gsave
newpath
translate
0.8 setlinewidth
1 setlinejoin

0 setlinecap

-0 0 m
-3.5 0 l

gsave
0.000 setgray
fill
grestore
stroke
grestore
} bind def
47.1419 135.951 o
grestore
gsave

14.391875 132.528750 translate
0.000000 rotate
0.000000 0 m /one glyphshow
5.726074 0 m /zero glyphshow
11.452148 0 m /zero glyphshow
17.178223 0 m /percent glyphshow
grestore
/DejaVuSans 10.000 selectfont
gsave

8.313750 18.740625 translate
90.000000 rotate
0.000000 0 m /C glyphshow
6.982422 0 m /D glyphshow
14.682617 0 m /F glyphshow
20.434570 0 m /space glyphshow
23.613281 0 m /f glyphshow
27.133789 0 m /u glyphshow
33.471680 0 m /l glyphshow
36.250000 0 m /l glyphshow
39.028320 0 m /y glyphshow
44.946289 0 m /space glyphshow
48.125000 0 m /i glyphshow
50.903320 0 m /n glyphshow
57.241211 0 m /f glyphshow
60.761719 0 m /e glyphshow
66.914062 0 m /c glyphshow
72.412109 0 m /t glyphshow
76.333008 0 m /e glyphshow
82.485352 0 m /d glyphshow
88.833008 0 m /space glyphshow
92.011719 0 m /n glyphshow
98.349609 0 m /o glyphshow
104.467773 0 m /d glyphshow
110.815430 0 m /e glyphshow
116.967773 0 m /s glyphshow
grestore
1.500 setlinewidth
gsave
121.745 110.88 47.142 30.111 clipbox

stroke
grestore
gsave
121.745 110.88 47.142 30.111 clipbox

stroke
grestore
gsave
121.745 110.88 47.142 30.111 clipbox

stroke
grestore
gsave
121.745 110.88 47.142 30.111 clipbox

stroke
grestore
gsave
121.745 110.88 47.142 30.111 clipbox

stroke
grestore
gsave
121.745 110.88 47.142 30.111 clipbox
10.618239 35.150625 m
10.618239 35.150625 l
stroke
grestore
gsave
121.745 110.88 47.142 30.111 clipbox
22.792784 35.150625 m
22.792784 35.150625 l
stroke
grestore
gsave
121.745 110.88 47.142 30.111 clipbox
34.96733 35.150625 m
34.96733 35.150625 l
stroke
grestore
gsave
121.745 110.88 47.142 30.111 clipbox
47.141875 35.150625 m
47.141875 35.150625 l
stroke
grestore
gsave
121.745 110.88 47.142 30.111 clipbox
59.31642 35.150625 m
59.31642 35.150625 l
stroke
grestore
gsave
121.745 110.88 47.142 30.111 clipbox
71.490966 35.150625 m
71.490966 35.150625 l
stroke
grestore
gsave
121.745 110.88 47.142 30.111 clipbox
83.665511 35.150625 m
83.665511 35.150625 l
stroke
grestore
gsave
121.745 110.88 47.142 30.111 clipbox
95.840057 35.150625 m
95.840057 35.150927 l
stroke
grestore
gsave
121.745 110.88 47.142 30.111 clipbox
108.014602 35.228342 m
108.014602 35.239732 l
stroke
grestore
gsave
121.745 110.88 47.142 30.111 clipbox
120.189148 42.008251 m
120.189148 42.333633 l
stroke
grestore
gsave
121.745 110.88 47.142 30.111 clipbox
132.363693 100.476787 m
132.363693 101.251939 l
stroke
grestore
gsave
121.745 110.88 47.142 30.111 clipbox
144.538239 135.748622 m
144.538239 135.768278 l
stroke
grestore
gsave
121.745 110.88 47.142 30.111 clipbox
156.712784 135.901939 m
156.712784 135.907785 l
stroke
grestore
gsave
121.745 110.88 47.142 30.111 clipbox
168.88733 135.901939 m
168.88733 135.907785 l
stroke
grestore
gsave
121.745 110.88 47.142 30.111 clipbox
181.061875 135.901939 m
181.061875 135.907785 l
stroke
grestore
gsave
121.745 110.88 47.142 30.111 clipbox
193.23642 135.901939 m
193.23642 135.907785 l
stroke
grestore
gsave
121.745 110.88 47.142 30.111 clipbox
205.410966 135.901939 m
205.410966 135.907785 l
stroke
grestore
gsave
121.745 110.88 47.142 30.111 clipbox
217.585511 135.901939 m
217.585511 135.907785 l
stroke
grestore
gsave
121.745 110.88 47.142 30.111 clipbox
229.760057 135.901939 m
229.760057 135.907785 l
stroke
grestore
gsave
121.745 110.88 47.142 30.111 clipbox
241.934602 135.901939 m
241.934602 135.907785 l
stroke
grestore
gsave
121.745 110.88 47.142 30.111 clipbox
254.109148 135.901939 m
254.109148 135.907785 l
stroke
grestore
0.173 0.627 0.173 setrgbcolor
gsave
121.745 110.88 47.142 30.111 clipbox

stroke
grestore
gsave
121.745 110.88 47.142 30.111 clipbox

stroke
grestore
gsave
121.745 110.88 47.142 30.111 clipbox

stroke
grestore
gsave
121.745 110.88 47.142 30.111 clipbox

stroke
grestore
gsave
121.745 110.88 47.142 30.111 clipbox

stroke
grestore
gsave
121.745 110.88 47.142 30.111 clipbox
10.618239 35.150625 m
10.618239 35.150625 l
stroke
grestore
gsave
121.745 110.88 47.142 30.111 clipbox
22.792784 35.150625 m
22.792784 35.150625 l
stroke
grestore
gsave
121.745 110.88 47.142 30.111 clipbox
34.96733 35.150625 m
34.96733 35.150625 l
stroke
grestore
gsave
121.745 110.88 47.142 30.111 clipbox
47.141875 35.150625 m
47.141875 35.150625 l
stroke
grestore
gsave
121.745 110.88 47.142 30.111 clipbox
59.31642 35.150625 m
59.31642 35.150625 l
stroke
grestore
gsave
121.745 110.88 47.142 30.111 clipbox
71.490966 35.150625 m
71.490966 35.352225 l
stroke
grestore
gsave
121.745 110.88 47.142 30.111 clipbox
83.665511 41.299425 m
83.665511 44.323425 l
stroke
grestore
gsave
121.745 110.88 47.142 30.111 clipbox
95.840057 99.461025 m
95.840057 103.694625 l
stroke
grestore
gsave
121.745 110.88 47.142 30.111 clipbox
108.014602 135.345825 m
108.014602 135.950625 l
stroke
grestore
gsave
121.745 110.88 47.142 30.111 clipbox
120.189148 135.749025 m
120.189148 135.950625 l
stroke
grestore
gsave
121.745 110.88 47.142 30.111 clipbox
132.363693 135.749025 m
132.363693 135.950625 l
stroke
grestore
gsave
121.745 110.88 47.142 30.111 clipbox
144.538239 135.749025 m
144.538239 135.950625 l
stroke
grestore
gsave
121.745 110.88 47.142 30.111 clipbox
156.712784 135.749025 m
156.712784 135.950625 l
stroke
grestore
gsave
121.745 110.88 47.142 30.111 clipbox
168.88733 135.749025 m
168.88733 135.950625 l
stroke
grestore
gsave
121.745 110.88 47.142 30.111 clipbox
181.061875 135.749025 m
181.061875 135.950625 l
stroke
grestore
gsave
121.745 110.88 47.142 30.111 clipbox
193.23642 135.749025 m
193.23642 135.950625 l
stroke
grestore
gsave
121.745 110.88 47.142 30.111 clipbox
205.410966 135.749025 m
205.410966 135.950625 l
stroke
grestore
gsave
121.745 110.88 47.142 30.111 clipbox
217.585511 135.749025 m
217.585511 135.950625 l
stroke
grestore
gsave
121.745 110.88 47.142 30.111 clipbox
229.760057 135.749025 m
229.760057 135.950625 l
stroke
grestore
gsave
121.745 110.88 47.142 30.111 clipbox
241.934602 135.749025 m
241.934602 135.950625 l
stroke
grestore
gsave
121.745 110.88 47.142 30.111 clipbox
254.109148 135.749025 m
254.109148 135.950625 l
stroke
grestore
0.122 0.467 0.706 setrgbcolor
gsave
121.745 110.88 47.142 30.111 clipbox

stroke
grestore
gsave
121.745 110.88 47.142 30.111 clipbox

stroke
grestore
gsave
121.745 110.88 47.142 30.111 clipbox

stroke
grestore
gsave
121.745 110.88 47.142 30.111 clipbox

stroke
grestore
gsave
121.745 110.88 47.142 30.111 clipbox

stroke
grestore
gsave
121.745 110.88 47.142 30.111 clipbox
10.618239 35.150625 m
10.618239 35.150625 l
stroke
grestore
gsave
121.745 110.88 47.142 30.111 clipbox
22.792784 35.150625 m
22.792784 35.150625 l
stroke
grestore
gsave
121.745 110.88 47.142 30.111 clipbox
34.96733 35.150625 m
34.96733 35.150625 l
stroke
grestore
gsave
121.745 110.88 47.142 30.111 clipbox
47.141875 35.150625 m
47.141875 35.150625 l
stroke
grestore
gsave
121.745 110.88 47.142 30.111 clipbox
59.31642 35.150625 m
59.31642 35.150625 l
stroke
grestore
gsave
121.745 110.88 47.142 30.111 clipbox
71.490966 35.150625 m
71.490966 35.150625 l
stroke
grestore
gsave
121.745 110.88 47.142 30.111 clipbox
83.665511 35.190945 m
83.665511 35.311905 l
stroke
grestore
gsave
121.745 110.88 47.142 30.111 clipbox
95.840057 42.075585 m
95.840057 42.579585 l
stroke
grestore
gsave
121.745 110.88 47.142 30.111 clipbox
108.014602 100.237185 m
108.014602 101.910465 l
stroke
grestore
gsave
121.745 110.88 47.142 30.111 clipbox
120.189148 135.698625 m
120.189148 135.839745 l
stroke
grestore
gsave
121.745 110.88 47.142 30.111 clipbox
132.363693 135.849825 m
132.363693 135.940545 l
stroke
grestore
gsave
121.745 110.88 47.142 30.111 clipbox
144.538239 135.849825 m
144.538239 135.940545 l
stroke
grestore
gsave
121.745 110.88 47.142 30.111 clipbox
156.712784 135.849825 m
156.712784 135.940545 l
stroke
grestore
gsave
121.745 110.88 47.142 30.111 clipbox
168.88733 135.849825 m
168.88733 135.940545 l
stroke
grestore
gsave
121.745 110.88 47.142 30.111 clipbox
181.061875 135.849825 m
181.061875 135.940545 l
stroke
grestore
gsave
121.745 110.88 47.142 30.111 clipbox
193.23642 135.849825 m
193.23642 135.940545 l
stroke
grestore
gsave
121.745 110.88 47.142 30.111 clipbox
205.410966 135.849825 m
205.410966 135.940545 l
stroke
grestore
gsave
121.745 110.88 47.142 30.111 clipbox
217.585511 135.849825 m
217.585511 135.940545 l
stroke
grestore
gsave
121.745 110.88 47.142 30.111 clipbox
229.760057 135.849825 m
229.760057 135.940545 l
stroke
grestore
gsave
121.745 110.88 47.142 30.111 clipbox
241.934602 135.849825 m
241.934602 135.940545 l
stroke
grestore
gsave
121.745 110.88 47.142 30.111 clipbox
254.109148 135.849825 m
254.109148 135.940545 l
stroke
grestore
1.000 0.000 0.000 setrgbcolor
gsave
121.745 110.88 47.142 30.111 clipbox

stroke
grestore
gsave
121.745 110.88 47.142 30.111 clipbox

stroke
grestore
gsave
121.745 110.88 47.142 30.111 clipbox

stroke
grestore
gsave
121.745 110.88 47.142 30.111 clipbox

stroke
grestore
gsave
121.745 110.88 47.142 30.111 clipbox

stroke
grestore
gsave
121.745 110.88 47.142 30.111 clipbox
10.618239 35.150625 m
10.618239 35.150625 l
stroke
grestore
gsave
121.745 110.88 47.142 30.111 clipbox
22.792784 35.150625 m
22.792784 35.150625 l
stroke
grestore
gsave
121.745 110.88 47.142 30.111 clipbox
34.96733 35.150625 m
34.96733 35.150625 l
stroke
grestore
gsave
121.745 110.88 47.142 30.111 clipbox
47.141875 35.150625 m
47.141875 35.150625 l
stroke
grestore
gsave
121.745 110.88 47.142 30.111 clipbox
59.31642 35.150625 m
59.31642 35.150625 l
stroke
grestore
gsave
121.745 110.88 47.142 30.111 clipbox
71.490966 35.150625 m
71.490966 35.150625 l
stroke
grestore
gsave
121.745 110.88 47.142 30.111 clipbox
83.665511 35.150625 m
83.665511 35.151633 l
stroke
grestore
gsave
121.745 110.88 47.142 30.111 clipbox
95.840057 35.216145 m
95.840057 35.244369 l
stroke
grestore
gsave
121.745 110.88 47.142 30.111 clipbox
108.014602 41.988897 m
108.014602 42.378993 l
stroke
grestore
gsave
121.745 110.88 47.142 30.111 clipbox
120.189148 100.301697 m
120.189148 101.435697 l
stroke
grestore
gsave
121.745 110.88 47.142 30.111 clipbox
132.363693 135.716769 m
132.363693 135.778257 l
stroke
grestore
gsave
121.745 110.88 47.142 30.111 clipbox
144.538239 135.881073 m
144.538239 135.923409 l
stroke
grestore
gsave
121.745 110.88 47.142 30.111 clipbox
156.712784 135.881073 m
156.712784 135.923409 l
stroke
grestore
gsave
121.745 110.88 47.142 30.111 clipbox
168.88733 135.881073 m
168.88733 135.923409 l
stroke
grestore
gsave
121.745 110.88 47.142 30.111 clipbox
181.061875 135.881073 m
181.061875 135.923409 l
stroke
grestore
gsave
121.745 110.88 47.142 30.111 clipbox
193.23642 135.881073 m
193.23642 135.923409 l
stroke
grestore
gsave
121.745 110.88 47.142 30.111 clipbox
205.410966 135.881073 m
205.410966 135.923409 l
stroke
grestore
gsave
121.745 110.88 47.142 30.111 clipbox
217.585511 135.881073 m
217.585511 135.923409 l
stroke
grestore
gsave
121.745 110.88 47.142 30.111 clipbox
229.760057 135.881073 m
229.760057 135.923409 l
stroke
grestore
gsave
121.745 110.88 47.142 30.111 clipbox
241.934602 135.881073 m
241.934602 135.923409 l
stroke
grestore
gsave
121.745 110.88 47.142 30.111 clipbox
254.109148 135.881073 m
254.109148 135.923409 l
stroke
grestore
[5.55 2.4] 0 setdash
0.000 setgray
gsave
121.745 110.88 47.142 30.111 clipbox
-1 35.150625 m
10.618239 35.150625 l
22.792784 35.150625 l
34.96733 35.150625 l
47.141875 35.150625 l
59.31642 35.150625 l
71.490966 35.150625 l
83.665511 35.150625 l
95.840057 35.150706 l
108.014602 35.233491 l
120.189148 42.268343 l
132.363693 101.058721 l
144.538239 135.757803 l
156.712784 135.904773 l
168.88733 135.904813 l
181.061875 135.904813 l
193.23642 135.904813 l
205.410966 135.904813 l
217.585511 135.904813 l
229.760057 135.904813 l
241.934602 135.904813 l
254.109148 135.904813 l
stroke
grestore
1.000 setlinewidth
[] 0 setdash
gsave
121.745 110.88 47.142 30.111 clipbox
/o {
gsave
newpath
translate
1.0 setlinewidth
1 setlinejoin

0 setlinecap

-3 0 m
3 0 l
0 -3 m
0 3 l

gsave
grestore
stroke
grestore
} bind def
-1 35.1506 o
10.6182 35.1506 o
22.7928 35.1506 o
34.9673 35.1506 o
47.1419 35.1506 o
59.3164 35.1506 o
71.491 35.1506 o
83.6655 35.1506 o
95.8401 35.1507 o
108.015 35.2335 o
120.189 42.2683 o
132.364 101.059 o
144.538 135.758 o
156.713 135.905 o
168.887 135.905 o
181.062 135.905 o
193.236 135.905 o
205.411 135.905 o
217.586 135.905 o
229.76 135.905 o
241.935 135.905 o
254.109 135.905 o
grestore
1.500 setlinewidth
[1.5 2.475] 0 setdash
0.173 0.627 0.173 setrgbcolor
gsave
121.745 110.88 47.142 30.111 clipbox
-1 35.150625 m
10.618239 35.150625 l
22.792784 35.150625 l
34.96733 35.150625 l
47.141875 35.150625 l
59.31642 35.150625 l
71.490966 35.199009 l
83.665511 42.311457 l
95.840057 101.597985 l
108.014602 135.789345 l
120.189148 135.918369 l
132.363693 135.918369 l
144.538239 135.918369 l
156.712784 135.918369 l
168.88733 135.918369 l
181.061875 135.918369 l
193.23642 135.918369 l
205.410966 135.918369 l
217.585511 135.918369 l
229.760057 135.918369 l
241.934602 135.918369 l
254.109148 135.918369 l
stroke
grestore
1.000 setlinewidth
0 setlinejoin
[] 0 setdash
gsave
121.745 110.88 47.142 30.111 clipbox
/o {
gsave
newpath
translate
1.0 setlinewidth
0 setlinejoin

0 setlinecap

-3 -3 m
3 -3 l
3 3 l
-3 3 l
cl

gsave
grestore
stroke
grestore
} bind def
-1 35.1506 o
10.6182 35.1506 o
22.7928 35.1506 o
34.9673 35.1506 o
47.1419 35.1506 o
59.3164 35.1506 o
71.491 35.199 o
83.6655 42.3115 o
95.8401 101.598 o
108.015 135.789 o
120.189 135.918 o
132.364 135.918 o
144.538 135.918 o
156.713 135.918 o
168.887 135.918 o
181.062 135.918 o
193.236 135.918 o
205.411 135.918 o
217.586 135.918 o
229.76 135.918 o
241.935 135.918 o
254.109 135.918 o
grestore
1.500 setlinewidth
1 setlinejoin
[1.5 2.475] 0 setdash
0.122 0.467 0.706 setrgbcolor
gsave
121.745 110.88 47.142 30.111 clipbox
-1 35.150625 m
10.618239 35.150625 l
22.792784 35.150625 l
34.96733 35.150625 l
47.141875 35.150625 l
59.31642 35.150625 l
71.490966 35.150625 l
83.665511 35.242555 l
95.840057 42.352987 l
108.014602 101.184705 l
120.189148 135.760315 l
132.363693 135.906676 l
144.538239 135.906676 l
156.712784 135.906676 l
168.88733 135.906676 l
181.061875 135.906676 l
193.23642 135.906676 l
205.410966 135.906676 l
217.585511 135.906676 l
229.760057 135.906676 l
241.934602 135.906676 l
254.109148 135.906676 l
stroke
grestore
1.000 setlinewidth
[] 0 setdash
gsave
121.745 110.88 47.142 30.111 clipbox
/o {
gsave
newpath
translate
1.0 setlinewidth
1 setlinejoin

0 setlinecap

0 -3 m
0.795609 -3 1.55874 -2.683901 2.12132 -2.12132 c
2.683901 -1.55874 3 -0.795609 3 0 c
3 0.795609 2.683901 1.55874 2.12132 2.12132 c
1.55874 2.683901 0.795609 3 0 3 c
-0.795609 3 -1.55874 2.683901 -2.12132 2.12132 c
-2.683901 1.55874 -3 0.795609 -3 0 c
-3 -0.795609 -2.683901 -1.55874 -2.12132 -2.12132 c
-1.55874 -2.683901 -0.795609 -3 0 -3 c
cl

gsave
grestore
stroke
grestore
} bind def
-1 35.1506 o
10.6182 35.1506 o
22.7928 35.1506 o
34.9673 35.1506 o
47.1419 35.1506 o
59.3164 35.1506 o
71.491 35.1506 o
83.6655 35.2426 o
95.8401 42.353 o
108.015 101.185 o
120.189 135.76 o
132.364 135.907 o
144.538 135.907 o
156.713 135.907 o
168.887 135.907 o
181.062 135.907 o
193.236 135.907 o
205.411 135.907 o
217.586 135.907 o
229.76 135.907 o
241.935 135.907 o
254.109 135.907 o
grestore
1.500 setlinewidth
[1.5 2.475] 0 setdash
1.000 0.000 0.000 setrgbcolor
gsave
121.745 110.88 47.142 30.111 clipbox
-1 35.150625 m
10.618239 35.150625 l
22.792784 35.150625 l
34.96733 35.150625 l
47.141875 35.150625 l
59.31642 35.150625 l
71.490966 35.150625 l
83.665511 35.150665 l
95.840057 35.232676 l
108.014602 42.241824 l
120.189148 100.971332 l
132.363693 135.756565 l
144.538239 135.904136 l
156.712784 135.904176 l
168.88733 135.904176 l
181.061875 135.904176 l
193.23642 135.904176 l
205.410966 135.904176 l
217.585511 135.904176 l
229.760057 135.904176 l
241.934602 135.904176 l
254.109148 135.904176 l
stroke
grestore
1.000 setlinewidth
0 setlinejoin
[] 0 setdash
gsave
121.745 110.88 47.142 30.111 clipbox
/o {
gsave
newpath
translate
1.0 setlinewidth
0 setlinejoin

0 setlinecap

0 3 m
-3 -3 l
3 -3 l
cl

gsave
grestore
stroke
grestore
} bind def
-1 35.1506 o
10.6182 35.1506 o
22.7928 35.1506 o
34.9673 35.1506 o
47.1419 35.1506 o
59.3164 35.1506 o
71.491 35.1506 o
83.6655 35.1507 o
95.8401 35.2327 o
108.015 42.2418 o
120.189 100.971 o
132.364 135.757 o
144.538 135.904 o
156.713 135.904 o
168.887 135.904 o
181.062 135.904 o
193.236 135.904 o
205.411 135.904 o
217.586 135.904 o
229.76 135.904 o
241.935 135.904 o
254.109 135.904 o
grestore
0.800 setlinewidth
2 setlinecap
0.000 setgray
gsave
47.141875 30.110625 m
47.141875 140.990625 l
stroke
grestore
gsave
47.141875 30.110625 m
168.88733 30.110625 l
stroke
grestore
gsave
193.23642 30.110625 m
314.981875 30.110625 l
314.981875 140.990625 l
193.23642 140.990625 l
cl
1.000 setgray
fill
grestore
1 setlinejoin
0 setlinecap
[2.96 1.28] 0 setdash
0.690 setgray
gsave
121.745 110.88 193.236 30.111 clipbox
193.23642 30.110625 m
193.23642 140.990625 l
stroke
grestore
[] 0 setdash
0.000 setgray
gsave
/o {
gsave
newpath
translate
0.8 setlinewidth
1 setlinejoin

0 setlinecap

0 0 m
0 -3.5 l

gsave
0.000 setgray
fill
grestore
stroke
grestore
} bind def
193.236 30.1106 o
grestore
/DejaVuSans 9.000 selectfont
gsave

190.369233 16.266875 translate
0.000000 rotate
0.000000 0 m /eight glyphshow
grestore
[2.96 1.28] 0 setdash
0.690 setgray
gsave
121.745 110.88 193.236 30.111 clipbox
217.585511 30.110625 m
217.585511 140.990625 l
stroke
grestore
[] 0 setdash
0.000 setgray
gsave
/o {
gsave
newpath
translate
0.8 setlinewidth
1 setlinejoin

0 setlinecap

0 0 m
0 -3.5 l

gsave
0.000 setgray
fill
grestore
stroke
grestore
} bind def
217.586 30.1106 o
grestore
gsave

211.851136 16.266875 translate
0.000000 rotate
0.000000 0 m /one glyphshow
5.726074 0 m /zero glyphshow
grestore
[2.96 1.28] 0 setdash
0.690 setgray
gsave
121.745 110.88 193.236 30.111 clipbox
241.934602 30.110625 m
241.934602 140.990625 l
stroke
grestore
[] 0 setdash
0.000 setgray
gsave
/o {
gsave
newpath
translate
0.8 setlinewidth
1 setlinejoin

0 setlinecap

0 0 m
0 -3.5 l

gsave
0.000 setgray
fill
grestore
stroke
grestore
} bind def
241.935 30.1106 o
grestore
gsave

236.200227 16.266875 translate
0.000000 rotate
0.000000 0 m /one glyphshow
5.726074 0 m /two glyphshow
grestore
[2.96 1.28] 0 setdash
0.690 setgray
gsave
121.745 110.88 193.236 30.111 clipbox
266.283693 30.110625 m
266.283693 140.990625 l
stroke
grestore
[] 0 setdash
0.000 setgray
gsave
/o {
gsave
newpath
translate
0.8 setlinewidth
1 setlinejoin

0 setlinecap

0 0 m
0 -3.5 l

gsave
0.000 setgray
fill
grestore
stroke
grestore
} bind def
266.284 30.1106 o
grestore
gsave

260.549318 16.266875 translate
0.000000 rotate
0.000000 0 m /one glyphshow
5.726074 0 m /four glyphshow
grestore
[2.96 1.28] 0 setdash
0.690 setgray
gsave
121.745 110.88 193.236 30.111 clipbox
290.632784 30.110625 m
290.632784 140.990625 l
stroke
grestore
[] 0 setdash
0.000 setgray
gsave
/o {
gsave
newpath
translate
0.8 setlinewidth
1 setlinejoin

0 setlinecap

0 0 m
0 -3.5 l

gsave
0.000 setgray
fill
grestore
stroke
grestore
} bind def
290.633 30.1106 o
grestore
gsave

284.898409 16.266875 translate
0.000000 rotate
0.000000 0 m /one glyphshow
5.726074 0 m /six glyphshow
grestore
[2.96 1.28] 0 setdash
0.690 setgray
gsave
121.745 110.88 193.236 30.111 clipbox
314.981875 30.110625 m
314.981875 140.990625 l
stroke
grestore
[] 0 setdash
0.000 setgray
gsave
/o {
gsave
newpath
translate
0.8 setlinewidth
1 setlinejoin

0 setlinecap

0 0 m
0 -3.5 l

gsave
0.000 setgray
fill
grestore
stroke
grestore
} bind def
314.982 30.1106 o
grestore
gsave

309.247500 16.266875 translate
0.000000 rotate
0.000000 0 m /one glyphshow
5.726074 0 m /eight glyphshow
grestore
/DejaVuSans 10.000 selectfont
gsave

235.695085 2.798125 translate
0.000000 rotate
0.000000 0 m /R glyphshow
6.448242 0 m /o glyphshow
12.566406 0 m /u glyphshow
18.904297 0 m /n glyphshow
25.242188 0 m /d glyphshow
31.589844 0 m /s glyphshow
grestore
[2.96 1.28] 0 setdash
0.690 setgray
gsave
121.745 110.88 193.236 30.111 clipbox
193.23642 35.150625 m
314.981875 35.150625 l
stroke
grestore
[] 0 setdash
0.000 setgray
gsave
/o {
gsave
newpath
translate
0.8 setlinewidth
1 setlinejoin

0 setlinecap

-0 0 m
-3.5 0 l

gsave
0.000 setgray
fill
grestore
stroke
grestore
} bind def
193.236 35.1506 o
grestore
[2.96 1.28] 0 setdash
0.690 setgray
gsave
121.745 110.88 193.236 30.111 clipbox
193.23642 55.313 m
314.981875 55.313 l
stroke
grestore
[] 0 setdash
0.000 setgray
gsave
/o {
gsave
newpath
translate
0.8 setlinewidth
1 setlinejoin

0 setlinecap

-0 0 m
-3.5 0 l

gsave
0.000 setgray
fill
grestore
stroke
grestore
} bind def
193.236 55.313 o
grestore
[2.96 1.28] 0 setdash
0.690 setgray
gsave
121.745 110.88 193.236 30.111 clipbox
193.23642 75.475374 m
314.981875 75.475374 l
stroke
grestore
[] 0 setdash
0.000 setgray
gsave
/o {
gsave
newpath
translate
0.8 setlinewidth
1 setlinejoin

0 setlinecap

-0 0 m
-3.5 0 l

gsave
0.000 setgray
fill
grestore
stroke
grestore
} bind def
193.236 75.4754 o
grestore
[2.96 1.28] 0 setdash
0.690 setgray
gsave
121.745 110.88 193.236 30.111 clipbox
193.23642 95.637749 m
314.981875 95.637749 l
stroke
grestore
[] 0 setdash
0.000 setgray
gsave
/o {
gsave
newpath
translate
0.8 setlinewidth
1 setlinejoin

0 setlinecap

-0 0 m
-3.5 0 l

gsave
0.000 setgray
fill
grestore
stroke
grestore
} bind def
193.236 95.6377 o
grestore
[2.96 1.28] 0 setdash
0.690 setgray
gsave
121.745 110.88 193.236 30.111 clipbox
193.23642 115.800124 m
314.981875 115.800124 l
stroke
grestore
[] 0 setdash
0.000 setgray
gsave
/o {
gsave
newpath
translate
0.8 setlinewidth
1 setlinejoin

0 setlinecap

-0 0 m
-3.5 0 l

gsave
0.000 setgray
fill
grestore
stroke
grestore
} bind def
193.236 115.8 o
grestore
[2.96 1.28] 0 setdash
0.690 setgray
gsave
121.745 110.88 193.236 30.111 clipbox
193.23642 135.962499 m
314.981875 135.962499 l
stroke
grestore
[] 0 setdash
0.000 setgray
gsave
/o {
gsave
newpath
translate
0.8 setlinewidth
1 setlinejoin

0 setlinecap

-0 0 m
-3.5 0 l

gsave
0.000 setgray
fill
grestore
stroke
grestore
} bind def
193.236 135.962 o
grestore
1.500 setlinewidth
gsave
121.745 110.88 193.236 30.111 clipbox
95.840057 35.150625 m
95.840057 35.150625 l
stroke
grestore
gsave
121.745 110.88 193.236 30.111 clipbox
108.014602 35.150625 m
108.014602 35.150625 l
stroke
grestore
gsave
121.745 110.88 193.236 30.111 clipbox
120.189148 35.150625 m
120.189148 35.150625 l
stroke
grestore
gsave
121.745 110.88 193.236 30.111 clipbox
132.363693 35.150625 m
132.363693 35.150625 l
stroke
grestore
gsave
121.745 110.88 193.236 30.111 clipbox
144.538239 35.150625 m
144.538239 35.150625 l
stroke
grestore
gsave
121.745 110.88 193.236 30.111 clipbox
156.712784 35.150625 m
156.712784 35.150625 l
stroke
grestore
gsave
121.745 110.88 193.236 30.111 clipbox
168.88733 35.150625 m
168.88733 35.150625 l
stroke
grestore
gsave
121.745 110.88 193.236 30.111 clipbox
181.061875 35.150625 m
181.061875 35.150625 l
stroke
grestore
gsave
121.745 110.88 193.236 30.111 clipbox
193.23642 35.150625 m
193.23642 35.150625 l
stroke
grestore
gsave
121.745 110.88 193.236 30.111 clipbox
205.410966 35.150625 m
205.410966 35.150625 l
stroke
grestore
gsave
121.745 110.88 193.236 30.111 clipbox
217.585511 35.150625 m
217.585511 35.150625 l
stroke
grestore
gsave
121.745 110.88 193.236 30.111 clipbox
229.760057 35.150625 m
229.760057 35.150625 l
stroke
grestore
gsave
121.745 110.88 193.236 30.111 clipbox
241.934602 35.150625 m
241.934602 35.150927 l
stroke
grestore
gsave
121.745 110.88 193.236 30.111 clipbox
254.109148 35.228351 m
254.109148 35.239743 l
stroke
grestore
gsave
121.745 110.88 193.236 30.111 clipbox
266.283693 42.009058 m
266.283693 42.334479 l
stroke
grestore
gsave
121.745 110.88 193.236 30.111 clipbox
278.458239 100.484482 m
278.458239 101.259725 l
stroke
grestore
gsave
121.745 110.88 193.236 30.111 clipbox
290.632784 135.760472 m
290.632784 135.78013 l
stroke
grestore
gsave
121.745 110.88 193.236 30.111 clipbox
302.80733 135.913806 m
302.80733 135.919654 l
stroke
grestore
gsave
121.745 110.88 193.236 30.111 clipbox
314.981875 135.913806 m
314.981875 135.919654 l
stroke
grestore
gsave
121.745 110.88 193.236 30.111 clipbox

stroke
grestore
gsave
121.745 110.88 193.236 30.111 clipbox

stroke
grestore
gsave
121.745 110.88 193.236 30.111 clipbox

stroke
grestore
gsave
121.745 110.88 193.236 30.111 clipbox

stroke
grestore
gsave
121.745 110.88 193.236 30.111 clipbox

stroke
grestore
gsave
121.745 110.88 193.236 30.111 clipbox

stroke
grestore
gsave
121.745 110.88 193.236 30.111 clipbox

stroke
grestore
0.173 0.627 0.173 setrgbcolor
gsave
121.745 110.88 193.236 30.111 clipbox
95.840057 35.150625 m
95.840057 35.150625 l
stroke
grestore
gsave
121.745 110.88 193.236 30.111 clipbox
108.014602 35.150625 m
108.014602 35.150625 l
stroke
grestore
gsave
121.745 110.88 193.236 30.111 clipbox
120.189148 35.150625 m
120.189148 35.150625 l
stroke
grestore
gsave
121.745 110.88 193.236 30.111 clipbox
132.363693 35.150625 m
132.363693 35.150625 l
stroke
grestore
gsave
121.745 110.88 193.236 30.111 clipbox
144.538239 35.150625 m
144.538239 35.150625 l
stroke
grestore
gsave
121.745 110.88 193.236 30.111 clipbox
156.712784 35.150625 m
156.712784 35.150625 l
stroke
grestore
gsave
121.745 110.88 193.236 30.111 clipbox
168.88733 35.150625 m
168.88733 35.150625 l
stroke
grestore
gsave
121.745 110.88 193.236 30.111 clipbox
181.061875 35.150625 m
181.061875 35.150625 l
stroke
grestore
gsave
121.745 110.88 193.236 30.111 clipbox
193.23642 35.150625 m
193.23642 35.150625 l
stroke
grestore
gsave
121.745 110.88 193.236 30.111 clipbox
205.410966 35.150625 m
205.410966 35.150625 l
stroke
grestore
gsave
121.745 110.88 193.236 30.111 clipbox
217.585511 35.150625 m
217.585511 35.150625 l
stroke
grestore
gsave
121.745 110.88 193.236 30.111 clipbox
229.760057 35.150625 m
229.760057 35.150625 l
stroke
grestore
gsave
121.745 110.88 193.236 30.111 clipbox
241.934602 35.150625 m
241.934602 35.150726 l
stroke
grestore
gsave
121.745 110.88 193.236 30.111 clipbox
254.109148 35.166771 m
254.109148 35.172927 l
stroke
grestore
gsave
121.745 110.88 193.236 30.111 clipbox
266.283693 36.650593 m
266.283693 36.909232 l
stroke
grestore
gsave
121.745 110.88 193.236 30.111 clipbox
278.458239 68.94995 m
278.458239 72.103778 l
stroke
grestore
gsave
121.745 110.88 193.236 30.111 clipbox
290.632784 132.625212 m
290.632784 133.527271 l
stroke
grestore
gsave
121.745 110.88 193.236 30.111 clipbox
302.80733 135.911033 m
302.80733 135.919106 l
stroke
grestore
gsave
121.745 110.88 193.236 30.111 clipbox
314.981875 135.912951 m
314.981875 135.920115 l
stroke
grestore
gsave
121.745 110.88 193.236 30.111 clipbox

stroke
grestore
gsave
121.745 110.88 193.236 30.111 clipbox

stroke
grestore
gsave
121.745 110.88 193.236 30.111 clipbox

stroke
grestore
gsave
121.745 110.88 193.236 30.111 clipbox

stroke
grestore
gsave
121.745 110.88 193.236 30.111 clipbox

stroke
grestore
gsave
121.745 110.88 193.236 30.111 clipbox

stroke
grestore
gsave
121.745 110.88 193.236 30.111 clipbox

stroke
grestore
0.122 0.467 0.706 setrgbcolor
gsave
121.745 110.88 193.236 30.111 clipbox
95.840057 35.150625 m
95.840057 35.150625 l
stroke
grestore
gsave
121.745 110.88 193.236 30.111 clipbox
108.014602 35.150625 m
108.014602 35.150625 l
stroke
grestore
gsave
121.745 110.88 193.236 30.111 clipbox
120.189148 35.150625 m
120.189148 35.150625 l
stroke
grestore
gsave
121.745 110.88 193.236 30.111 clipbox
132.363693 35.150625 m
132.363693 35.150625 l
stroke
grestore
gsave
121.745 110.88 193.236 30.111 clipbox
144.538239 35.150625 m
144.538239 35.150625 l
stroke
grestore
gsave
121.745 110.88 193.236 30.111 clipbox
156.712784 35.150625 m
156.712784 35.150625 l
stroke
grestore
gsave
121.745 110.88 193.236 30.111 clipbox
168.88733 35.150625 m
168.88733 35.150625 l
stroke
grestore
gsave
121.745 110.88 193.236 30.111 clipbox
181.061875 35.150625 m
181.061875 35.150625 l
stroke
grestore
gsave
121.745 110.88 193.236 30.111 clipbox
193.23642 35.150625 m
193.23642 35.150625 l
stroke
grestore
gsave
121.745 110.88 193.236 30.111 clipbox
205.410966 35.150625 m
205.410966 35.150625 l
stroke
grestore
gsave
121.745 110.88 193.236 30.111 clipbox
217.585511 35.150625 m
217.585511 35.150625 l
stroke
grestore
gsave
121.745 110.88 193.236 30.111 clipbox
229.760057 35.150625 m
229.760057 35.150625 l
stroke
grestore
gsave
121.745 110.88 193.236 30.111 clipbox
241.934602 35.150625 m
241.934602 35.150625 l
stroke
grestore
gsave
121.745 110.88 193.236 30.111 clipbox
254.109148 35.151643 m
254.109148 35.153985 l
stroke
grestore
gsave
121.745 110.88 193.236 30.111 clipbox
266.283693 36.533071 m
266.283693 36.665247 l
stroke
grestore
gsave
121.745 110.88 193.236 30.111 clipbox
278.458239 70.259328 m
278.458239 72.019869 l
stroke
grestore
gsave
121.745 110.88 193.236 30.111 clipbox
290.632784 133.214509 m
290.632784 133.636188 l
stroke
grestore
gsave
121.745 110.88 193.236 30.111 clipbox
302.80733 135.917082 m
302.80733 135.922174 l
stroke
grestore
gsave
121.745 110.88 193.236 30.111 clipbox
314.981875 135.918101 m
314.981875 135.923294 l
stroke
grestore
gsave
121.745 110.88 193.236 30.111 clipbox

stroke
grestore
gsave
121.745 110.88 193.236 30.111 clipbox

stroke
grestore
gsave
121.745 110.88 193.236 30.111 clipbox

stroke
grestore
gsave
121.745 110.88 193.236 30.111 clipbox

stroke
grestore
gsave
121.745 110.88 193.236 30.111 clipbox

stroke
grestore
gsave
121.745 110.88 193.236 30.111 clipbox

stroke
grestore
gsave
121.745 110.88 193.236 30.111 clipbox

stroke
grestore
1.000 0.000 0.000 setrgbcolor
gsave
121.745 110.88 193.236 30.111 clipbox
95.840057 35.150625 m
95.840057 35.150625 l
stroke
grestore
gsave
121.745 110.88 193.236 30.111 clipbox
108.014602 35.150625 m
108.014602 35.150625 l
stroke
grestore
gsave
121.745 110.88 193.236 30.111 clipbox
120.189148 35.150625 m
120.189148 35.150625 l
stroke
grestore
gsave
121.745 110.88 193.236 30.111 clipbox
132.363693 35.150625 m
132.363693 35.150625 l
stroke
grestore
gsave
121.745 110.88 193.236 30.111 clipbox
144.538239 35.150625 m
144.538239 35.150625 l
stroke
grestore
gsave
121.745 110.88 193.236 30.111 clipbox
156.712784 35.150625 m
156.712784 35.150625 l
stroke
grestore
gsave
121.745 110.88 193.236 30.111 clipbox
168.88733 35.150625 m
168.88733 35.150625 l
stroke
grestore
gsave
121.745 110.88 193.236 30.111 clipbox
181.061875 35.150625 m
181.061875 35.150625 l
stroke
grestore
gsave
121.745 110.88 193.236 30.111 clipbox
193.23642 35.150625 m
193.23642 35.150625 l
stroke
grestore
gsave
121.745 110.88 193.236 30.111 clipbox
205.410966 35.150625 m
205.410966 35.150625 l
stroke
grestore
gsave
121.745 110.88 193.236 30.111 clipbox
217.585511 35.150625 m
217.585511 35.150625 l
stroke
grestore
gsave
121.745 110.88 193.236 30.111 clipbox
229.760057 35.150625 m
229.760057 35.150625 l
stroke
grestore
gsave
121.745 110.88 193.236 30.111 clipbox
241.934602 35.150625 m
241.934602 35.150625 l
stroke
grestore
gsave
121.745 110.88 193.236 30.111 clipbox
254.109148 35.150625 m
254.109148 35.150961 l
stroke
grestore
gsave
121.745 110.88 193.236 30.111 clipbox
266.283693 35.371739 m
266.283693 35.467622 l
stroke
grestore
gsave
121.745 110.88 193.236 30.111 clipbox
278.458239 66.704741 m
278.458239 68.265085 l
stroke
grestore
gsave
121.745 110.88 193.236 30.111 clipbox
290.632784 134.514504 m
290.632784 134.645111 l
stroke
grestore
gsave
121.745 110.88 193.236 30.111 clipbox
302.80733 135.944688 m
302.80733 135.950401 l
stroke
grestore
gsave
121.745 110.88 193.236 30.111 clipbox
314.981875 135.944913 m
314.981875 135.950625 l
stroke
grestore
gsave
121.745 110.88 193.236 30.111 clipbox

stroke
grestore
gsave
121.745 110.88 193.236 30.111 clipbox

stroke
grestore
gsave
121.745 110.88 193.236 30.111 clipbox

stroke
grestore
gsave
121.745 110.88 193.236 30.111 clipbox

stroke
grestore
gsave
121.745 110.88 193.236 30.111 clipbox

stroke
grestore
gsave
121.745 110.88 193.236 30.111 clipbox

stroke
grestore
gsave
121.745 110.88 193.236 30.111 clipbox

stroke
grestore
[5.55 2.4] 0 setdash
0.000 setgray
gsave
121.745 110.88 193.236 30.111 clipbox
95.840057 35.150625 m
108.014602 35.150625 l
120.189148 35.150625 l
132.363693 35.150625 l
144.538239 35.150625 l
156.712784 35.150625 l
168.88733 35.150625 l
181.061875 35.150625 l
193.23642 35.150625 l
205.410966 35.150625 l
217.585511 35.150625 l
229.760057 35.150625 l
241.934602 35.150706 l
254.109148 35.2335 l
266.283693 42.269181 l
278.458239 101.066485 l
290.632784 135.769654 l
302.80733 135.916641 l
314.981875 135.916682 l
322.43625 135.916682 l
stroke
grestore
1.000 setlinewidth
[] 0 setdash
gsave
121.745 110.88 193.236 30.111 clipbox
/o {
gsave
newpath
translate
1.0 setlinewidth
1 setlinejoin

0 setlinecap

-3 0 m
3 0 l
0 -3 m
0 3 l

gsave
grestore
stroke
grestore
} bind def
95.8401 35.1506 o
108.015 35.1506 o
120.189 35.1506 o
132.364 35.1506 o
144.538 35.1506 o
156.713 35.1506 o
168.887 35.1506 o
181.062 35.1506 o
193.236 35.1506 o
205.411 35.1506 o
217.586 35.1506 o
229.76 35.1506 o
241.935 35.1507 o
254.109 35.2335 o
266.284 42.2692 o
278.458 101.066 o
290.633 135.77 o
302.807 135.917 o
314.982 135.917 o
322.436 135.917 o
grestore
1.500 setlinewidth
[1.5 2.475] 0 setdash
0.173 0.627 0.173 setrgbcolor
gsave
121.745 110.88 193.236 30.111 clipbox
95.840057 35.150625 m
108.014602 35.150625 l
120.189148 35.150625 l
132.363693 35.150625 l
144.538239 35.150625 l
156.712784 35.150625 l
168.88733 35.150625 l
181.061875 35.150625 l
193.23642 35.150625 l
205.410966 35.150625 l
217.585511 35.150625 l
229.760057 35.150625 l
241.934602 35.150629 l
254.109148 35.168604 l
266.283693 36.795463 l
278.458239 70.484587 l
290.632784 133.062491 l
302.80733 135.915433 l
314.981875 135.916894 l
322.43625 135.916894 l
stroke
grestore
1.000 setlinewidth
0 setlinejoin
[] 0 setdash
gsave
121.745 110.88 193.236 30.111 clipbox
/o {
gsave
newpath
translate
1.0 setlinewidth
0 setlinejoin

0 setlinecap

-3 -3 m
3 -3 l
3 3 l
-3 3 l
cl

gsave
grestore
stroke
grestore
} bind def
95.8401 35.1506 o
108.015 35.1506 o
120.189 35.1506 o
132.364 35.1506 o
144.538 35.1506 o
156.713 35.1506 o
168.887 35.1506 o
181.062 35.1506 o
193.236 35.1506 o
205.411 35.1506 o
217.586 35.1506 o
229.76 35.1506 o
241.935 35.1506 o
254.109 35.1686 o
266.284 36.7955 o
278.458 70.4846 o
290.633 133.062 o
302.807 135.915 o
314.982 135.917 o
322.436 135.917 o
grestore
1.500 setlinewidth
1 setlinejoin
[1.5 2.475] 0 setdash
0.122 0.467 0.706 setrgbcolor
gsave
121.745 110.88 193.236 30.111 clipbox
95.840057 35.150625 m
108.014602 35.150625 l
120.189148 35.150625 l
132.363693 35.150625 l
144.538239 35.150625 l
156.712784 35.150625 l
168.88733 35.150625 l
181.061875 35.150625 l
193.23642 35.150625 l
205.410966 35.150625 l
217.585511 35.150625 l
229.760057 35.150625 l
241.934602 35.150625 l
254.109148 35.152608 l
266.283693 36.601648 l
278.458239 71.016533 l
290.632784 133.414235 l
302.80733 135.919808 l
314.981875 135.920989 l
322.43625 135.920989 l
stroke
grestore
1.000 setlinewidth
[] 0 setdash
gsave
121.745 110.88 193.236 30.111 clipbox
/o {
gsave
newpath
translate
1.0 setlinewidth
1 setlinejoin

0 setlinecap

0 -3 m
0.795609 -3 1.55874 -2.683901 2.12132 -2.12132 c
2.683901 -1.55874 3 -0.795609 3 0 c
3 0.795609 2.683901 1.55874 2.12132 2.12132 c
1.55874 2.683901 0.795609 3 0 3 c
-0.795609 3 -1.55874 2.683901 -2.12132 2.12132 c
-2.683901 1.55874 -3 0.795609 -3 0 c
-3 -0.795609 -2.683901 -1.55874 -2.12132 -2.12132 c
-1.55874 -2.683901 -0.795609 -3 0 -3 c
cl

gsave
grestore
stroke
grestore
} bind def
95.8401 35.1506 o
108.015 35.1506 o
120.189 35.1506 o
132.364 35.1506 o
144.538 35.1506 o
156.713 35.1506 o
168.887 35.1506 o
181.062 35.1506 o
193.236 35.1506 o
205.411 35.1506 o
217.586 35.1506 o
229.76 35.1506 o
241.935 35.1506 o
254.109 35.1526 o
266.284 36.6016 o
278.458 71.0165 o
290.633 133.414 o
302.807 135.92 o
314.982 135.921 o
322.436 135.921 o
grestore
1.500 setlinewidth
[1.5 2.475] 0 setdash
1.000 0.000 0.000 setrgbcolor
gsave
121.745 110.88 193.236 30.111 clipbox
95.840057 35.150625 m
108.014602 35.150625 l
120.189148 35.150625 l
132.363693 35.150625 l
144.538239 35.150625 l
156.712784 35.150625 l
168.88733 35.150625 l
181.061875 35.150625 l
193.23642 35.150625 l
205.410966 35.150625 l
217.585511 35.150625 l
229.760057 35.150625 l
241.934602 35.150625 l
254.109148 35.150656 l
266.283693 35.429376 l
278.458239 67.577109 l
290.632784 134.574427 l
302.80733 135.947399 l
314.981875 135.94765 l
322.43625 135.94765 l
stroke
grestore
1.000 setlinewidth
0 setlinejoin
[] 0 setdash
gsave
121.745 110.88 193.236 30.111 clipbox
/o {
gsave
newpath
translate
1.0 setlinewidth
0 setlinejoin

0 setlinecap

0 3 m
-3 -3 l
3 -3 l
cl

gsave
grestore
stroke
grestore
} bind def
95.8401 35.1506 o
108.015 35.1506 o
120.189 35.1506 o
132.364 35.1506 o
144.538 35.1506 o
156.713 35.1506 o
168.887 35.1506 o
181.062 35.1506 o
193.236 35.1506 o
205.411 35.1506 o
217.586 35.1506 o
229.76 35.1506 o
241.935 35.1506 o
254.109 35.1507 o
266.284 35.4294 o
278.458 67.5771 o
290.633 134.574 o
302.807 135.947 o
314.982 135.948 o
322.436 135.948 o
grestore
0.800 setlinewidth
2 setlinecap
0.000 setgray
gsave
193.23642 30.110625 m
314.981875 30.110625 l
stroke
grestore
1.000 setlinewidth
0 setlinecap
gsave
145.619233 54.344725 m
240.853608 54.344725 l
242.186941 54.344725 242.853608 55.011392 242.853608 56.344725 c
242.853608 114.032225 l
242.853608 115.365558 242.186941 116.032225 240.853608 116.032225 c
145.619233 116.032225 l
144.2859 116.032225 143.619233 115.365558 143.619233 114.032225 c
143.619233 56.344725 l
143.619233 55.011392 144.2859 54.344725 145.619233 54.344725 c
cl
gsave
1.000 setgray
fill
grestore
stroke
grestore
1.500 setlinewidth
1 setlinejoin
gsave
157.619233 102.938475 m
157.619233 112.938475 l
stroke
grestore
[5.55 2.4] 0 setdash
gsave
147.619233 107.938475 m
167.619233 107.938475 l
stroke
grestore
1.000 setlinewidth
[] 0 setdash
gsave
/o {
gsave
newpath
translate
1.0 setlinewidth
1 setlinejoin

0 setlinecap

-3 0 m
3 0 l
0 -3 m
0 3 l

gsave
grestore
stroke
grestore
} bind def
157.619 107.938 o
grestore
gsave

172.619233 104.438475 translate
0.000000 rotate
0.000000 0 m /U glyphshow
7.319336 0 m /n glyphshow
13.657227 0 m /i glyphshow
16.435547 0 m /f glyphshow
19.956055 0 m /o glyphshow
26.074219 0 m /r glyphshow
30.060547 0 m /m glyphshow
grestore
1.500 setlinewidth
0.173 0.627 0.173 setrgbcolor
gsave
157.619233 88.2666 m
157.619233 98.2666 l
stroke
grestore
[1.5 2.475] 0 setdash
gsave
147.619233 93.2666 m
167.619233 93.2666 l
stroke
grestore
1.000 setlinewidth
0 setlinejoin
[] 0 setdash
gsave
/o {
gsave
newpath
translate
1.0 setlinewidth
0 setlinejoin

0 setlinecap

-3 -3 m
3 -3 l
3 3 l
-3 3 l
cl

gsave
grestore
stroke
grestore
} bind def
157.619 93.2666 o
grestore
0.000 setgray
gsave

172.619233 89.766600 translate
0.000000 rotate
0.000000 0 m /U glyphshow
7.319336 0 m /P glyphshow
13.349609 0 m /S glyphshow
19.697266 0 m /space glyphshow
22.875977 0 m /d glyphshow
29.223633 0 m /equal glyphshow
37.602539 0 m /zero glyphshow
43.964844 0 m /period glyphshow
47.143555 0 m /zero glyphshow
53.505859 0 m /zero glyphshow
59.868164 0 m /one glyphshow
grestore
1.500 setlinewidth
1 setlinejoin
0.122 0.467 0.706 setrgbcolor
gsave
157.619233 73.594725 m
157.619233 83.594725 l
stroke
grestore
[1.5 2.475] 0 setdash
gsave
147.619233 78.594725 m
167.619233 78.594725 l
stroke
grestore
1.000 setlinewidth
[] 0 setdash
gsave
/o {
gsave
newpath
translate
1.0 setlinewidth
1 setlinejoin

0 setlinecap

0 -3 m
0.795609 -3 1.55874 -2.683901 2.12132 -2.12132 c
2.683901 -1.55874 3 -0.795609 3 0 c
3 0.795609 2.683901 1.55874 2.12132 2.12132 c
1.55874 2.683901 0.795609 3 0 3 c
-0.795609 3 -1.55874 2.683901 -2.12132 2.12132 c
-2.683901 1.55874 -3 0.795609 -3 0 c
-3 -0.795609 -2.683901 -1.55874 -2.12132 -2.12132 c
-1.55874 -2.683901 -0.795609 -3 0 -3 c
cl

gsave
grestore
stroke
grestore
} bind def
157.619 78.5947 o
grestore
0.000 setgray
gsave

172.619233 75.094725 translate
0.000000 rotate
0.000000 0 m /U glyphshow
7.319336 0 m /P glyphshow
13.349609 0 m /S glyphshow
19.697266 0 m /space glyphshow
22.875977 0 m /d glyphshow
29.223633 0 m /equal glyphshow
37.602539 0 m /zero glyphshow
43.964844 0 m /period glyphshow
47.143555 0 m /zero glyphshow
53.505859 0 m /one glyphshow
grestore
1.500 setlinewidth
1.000 0.000 0.000 setrgbcolor
gsave
157.619233 58.92285 m
157.619233 68.92285 l
stroke
grestore
[1.5 2.475] 0 setdash
gsave
147.619233 63.92285 m
167.619233 63.92285 l
stroke
grestore
1.000 setlinewidth
0 setlinejoin
[] 0 setdash
gsave
/o {
gsave
newpath
translate
1.0 setlinewidth
0 setlinejoin

0 setlinecap

0 3 m
-3 -3 l
3 -3 l
cl

gsave
grestore
stroke
grestore
} bind def
157.619 63.9228 o
grestore
0.000 setgray
gsave

172.619233 60.422850 translate
0.000000 rotate
0.000000 0 m /U glyphshow
7.319336 0 m /P glyphshow
13.349609 0 m /S glyphshow
19.697266 0 m /space glyphshow
22.875977 0 m /d glyphshow
29.223633 0 m /equal glyphshow
37.602539 0 m /zero glyphshow
43.964844 0 m /period glyphshow
47.143555 0 m /one glyphshow
grestore

end
showpage
