gossips,p2p mean,p2p std,p2p min,p2p q1,p2p q2,p2p q3,p2p max,p2s mean,p2s std,p2s min,p2s q1,p2s q2,p2s q3,p2s max,s2s mean,s2s std,s2s min,s2s q1,s2s q2,s2s q3,s2s max
1,49.41599999999998,1.5167619017718847,47.1,48.1,49.5,50.6,51.8,58.304,1.6422748450447215,54.7,57.5,58.4,59.4,61.8,4.367379280000001,0.13274864420510404,4.098398,4.268468,4.354555,4.404905,4.68959
2,22.508000000000003,1.3215899515356493,19.7,21.9,22.5,23.4,25.0,20.62,1.4083086782851737,18.4,19.5,20.7,21.4,23.2,0.03363768000000001,0.002216667782957113,0.027927999999999998,0.032533,0.033634,0.035335000000000005,0.036837
3,2.008,0.29285946572830224,1.5,1.7,2.0,2.2,2.6,0.364,0.16041612554021287,0.1,0.3,0.3,0.5,0.8,0.0001,0.0,0.0001,0.0001,0.0001,0.0001,0.0001
4,0.175,0.05,0.1,0.17500000000000002,0.2,0.2,0.2,,,,,,,,,,,,,,
5,,,,,,,,,,,,,,,,,,,,,
