,P+S mean,P+S std,P+S min,P+S q1,P+S median,P+S q3,P+S max,P mean,P std,P min,P q1,P median,P q3,P max,S mean,S std,S min,S q1,S median,S q3,S max
10% nodes,33,0,33,33,33,33,33,29,0,29,29,29,29,29,33,0,33,33,33,33,33
50% nodes,34,0,34,34,34,34,34,30,0,30,30,30,30,30,34,0,34,34,34,34,34
99% nodes,35,0,35,35,35,35,35,31,0,31,31,31,31,31,35,0,35,35,35,35,35
