gossips,p2p mean,p2p std,p2p min,p2p q1,p2p q2,p2p q3,p2p max,p2s mean,p2s std,p2s min,p2s q1,p2s q2,p2s q3,p2s max,s2s mean,s2s std,s2s min,s2s q1,s2s q2,s2s q3,s2s max
1,0.22857142857142856,0.14540583599999396,0.1,0.1,0.2,0.3,0.6,3.524000000000001,0.6424432530063129,2.2,3.2,3.5,3.7,5.2,54.73695299999999,0.41213611850435256,53.970771,54.474875,54.763463,54.95705699999999,55.525325
2,,,,,,,,,,,,,,,19.492908879999995,0.5648497542198216,18.743844,19.039439,19.419219000000002,19.814815,20.730531
3,,,,,,,,,,,,,,,2.00676276,0.12944403350234673,1.813814,1.890691,2.018919,2.066066,2.282683
4,,,,,,,,,,,,,,,0.02824024,0.0021517237136770137,0.024625,0.026927,0.027927999999999998,0.02963,0.033033
5,,,,,,,,,,,,,,,0.0001,,0.0001,0.0001,0.0001,0.0001,0.0001
