gossips,p2p mean,p2p std,p2p min,p2p q1,p2p q2,p2p q3,p2p max,p2s mean,p2s std,p2s min,p2s q1,p2s q2,p2s q3,p2s max,s2s mean,s2s std,s2s min,s2s q1,s2s q2,s2s q3,s2s max
1,51.715999999999994,1.2947586647711615,49.1,50.5,51.9,52.6,53.9,58.104,1.296623821057339,55.8,57.1,58.2,58.6,60.9,32.851199120000004,0.5496063556484715,31.685484999999996,32.539439,32.832332,33.223023,33.902102
2,18.436,1.1996110480762785,16.2,17.5,18.4,19.2,21.0,19.916,1.1795761950802508,16.9,19.5,19.7,20.9,22.1,1.38355952,0.051808305277822014,1.236637,1.364865,1.384785,1.404204,1.519419
3,0.18235294117647066,0.12862393885688164,0.1,0.1,0.1,0.2,0.6,0.35909090909090907,0.14690162211523253,0.1,0.3,0.3,0.475,0.7,0.011859920000000001,0.001225979673567225,0.009109,0.010811,0.011712,0.013113,0.013513999999999998
4,,,,,,,,0.1,,0.1,0.1,0.1,0.1,0.1,0.0001,0.0,0.0001,0.0001,0.0001,0.0001,0.0001
5,,,,,,,,,,,,,,,,,,,,,
