gossips,p2p mean,p2p std,p2p min,p2p q1,p2p q2,p2p q3,p2p max,p2s mean,p2s std,p2s min,p2s q1,p2s q2,p2s q3,p2s max,s2s mean,s2s std,s2s min,s2s q1,s2s q2,s2s q3,s2s max
1,49.25188000000001,0.14047399522094103,48.959,49.164,49.25,49.358,49.471,49.25192000000001,0.14047357995960247,48.959,49.164,49.251,49.358,49.471,52.114311040000004,0.060808809904815624,51.998111,52.061444,52.126333,52.160333,52.210444
2,22.2784,0.09038989619052243,22.096,22.239,22.29,22.332,22.471,22.278360000000003,0.09034557727599848,22.096,22.239,22.29,22.332,22.471,22.411862240000005,0.05072767615026993,22.322,22.386556,22.402778,22.438444,22.505778
3,2.0438000000000005,0.038476183109381584,1.986,2.015,2.051,2.062,2.158,2.0438000000000005,0.038476183109381584,1.986,2.015,2.051,2.062,2.158,1.00947992,0.008395479065743275,0.991,1.002222,1.008667,1.015889,1.023111
4,0.02332000000000001,0.005088549236603035,0.015,0.019,0.023,0.027,0.033,0.02332000000000001,0.005088549236603035,0.015,0.019,0.023,0.027,0.033,0.010293200000000002,0.0010704592472392397,0.008556,0.009444,0.010222,0.010889,0.012778
5,0.001,,0.001,0.001,0.001,0.001,0.001,0.001,,0.001,0.001,0.001,0.001,0.001,0.00011100000000000001,,0.00011100000000000001,0.00011100000000000001,0.00011100000000000001,0.00011100000000000001,0.00011100000000000001
