round,nodes,nodesP,nodesS,recvOne,recvOneP,recvOneS,recvAll,recvAllP,recvAllS,msgSent,msgSentP,msgSentS,msgRecv,msgRecvP,msgRecvS,consist,consistP,consistS,Unnamed: 19
0,1000000.0,1000.0,999000.0,0.0,0.0,0.0,0.0,0.0,0.0,10.0,0.0,10.0,0.0,0.0,0.0,100.0,100.0,100.0,
1,1000000.0,1000.0,999000.0,0.0010760000000000004,1.0760000000000003,0.0,0.0,0.0,0.0,117.6,107.6,10.0,10.76,10.76,0.0,100.0,100.0,100.0,
2,1000000.0,1000.0,999000.0,0.011244,11.216,2.8000000000000003e-05,0.0,0.0,0.0,1188.8,1176.0,12.8,118.16,117.88,0.28,100.0,100.0,100.0,
3,1000000.0,1000.0,999000.0,0.07337600000000001,66.612,0.0067708,0.0,0.0,0.0,10328.0,9641.6,686.4,1164.44,1096.8,67.64,100.0,100.0,100.0,
4,1000000.0,1000.0,999000.0,0.4481480000000001,99.89600000000002,0.34860064,0.0,0.0,0.0,54719.2,19884.0,34835.2,10062.72,6574.84,3487.88,100.0,100.0,100.0,
5,1000000.0,1000.0,999000.0,4.580828,99.992,4.4853214,0.0,0.0,0.0,468088.8,19996.4,448092.4,55850.72,9999.6,45851.12,100.0,100.0,100.0,
6,1000000.0,1000.0,999000.0,36.472036,99.992,36.40845255999999,0.0,0.0,0.0,3657206.4,19996.4,3637210.0,462309.64,10009.2,452300.44,100.0,100.0,100.0,
7,1000000.0,1000.0,999000.0,97.14103200000001,99.992,97.13817812,0.0,0.0,0.0,9724100.8,19996.4,9704104.4,3561569.56,10009.2,3551560.36,100.0,100.0,100.0,
8,1000000.0,1000.0,999000.0,99.993828,99.992,99.99382976000001,0.0,0.0,0.0,10009380.0,19996.4,9989383.6,9712800.56,10009.2,9702791.36,100.0,100.0,100.0,
9,1000000.0,1000.0,999000.0,99.99538000000001,99.992,99.99538332,0.0,0.0,0.0,10009535.2,19996.4,9989538.8,10009380.52,10009.2,9999371.32,100.0,100.0,100.0,
10,1000000.0,1000.0,999000.0,99.99538000000001,99.992,99.99538332,0.0,0.0,0.0,10009547.6,19998.8,9989548.8,10009535.44,10009.44,9999526.0,100.0,100.0,100.0,
11,1000000.0,1000.0,999000.0,99.99538000000001,99.992,99.99538332,0.0,0.0,0.0,10009647.6,20098.8,9989548.8,10009545.44,10019.44,9999526.0,100.0,100.0,100.0,
12,1000000.0,1000.0,999000.0,99.99538400000002,99.99600000000001,99.99538332,0.0,0.0,0.0,10010695.6,21146.0,9989549.6,10009650.28,10124.2,9999526.08,99.999996,99.99600000000001,100.0,
13,1000000.0,1000.0,999000.0,99.995388,100.0,99.99538332,0.0,0.0,0.0,10019758.4,29598.4,9990160.0,10010682.24,11095.12,9999587.12,99.99999199999998,99.992,100.0,
14,1000000.0,1000.0,999000.0,99.995416,100.0,99.99541135999999,0.0,0.0,0.0,10064560.0,39872.8,10024687.2,10019625.4,16579.24,10003046.16,99.99996400000002,99.992,99.999972,
15,1000000.0,1000.0,999000.0,99.99558800000003,100.0,99.99558356000001,0.0,0.0,0.0,10479514.8,39990.0,10439524.8,10065566.08,20003.6,10045562.48,99.999792,99.992,99.9998,
16,1000000.0,1000.0,999000.0,99.997112,100.0,99.99710911999999,0.0,0.0,0.0,13668962.4,39990.0,13628972.4,10472195.92,20018.4,10452177.52,99.998268,99.992,99.99827419999998,
17,1000000.0,1000.0,999000.0,99.99985999999997,100.0,99.99985995999998,0.0,0.0,0.0,19739060.4,39990.0,19699070.4,13592151.68,20018.4,13572133.28,99.99552,99.992,99.99552348000002,
18,1000000.0,1000.0,999000.0,100.0,100.0,100.0,0.0,0.0,0.0,20018933.2,39990.0,19978943.2,19730853.24,20018.4,19710834.84,99.99538000000001,99.992,99.99538332,
19,1000000.0,1000.0,999000.0,100.0,100.0,100.0,0.0,0.0,0.0,20019076.0,39990.0,19979086.0,20018933.08,20018.4,19998914.68,99.99538000000001,99.992,99.99538332,
20,1000000.0,1000.0,999000.0,100.0,100.0,100.0,0.0,0.0,0.0,20019086.0,39990.0,19979096.0,20019076.0,20018.4,19999057.6,99.99538000000001,99.992,99.99538332,
21,1000000.0,1000.0,999000.0,100.0,100.0,100.0,0.0,0.0,0.0,20019194.4,40098.4,19979096.0,20019086.84,20029.24,19999057.6,99.99538000000001,99.992,99.99538332,
22,1000000.0,1000.0,999000.0,100.0,100.0,100.0,0.0,0.0,0.0,20020228.4,41130.8,19979097.6,20019190.44,20132.68,19999057.76,99.99538000000001,99.992,99.99538332,
23,1000000.0,1000.0,999000.0,100.0,100.0,100.0,0.0,0.0,0.0,20029298.8,49540.4,19979758.4,20020225.68,21101.84,19999123.84,99.99537600000002,99.98800000000001,99.99538332,
24,1000000.0,1000.0,999000.0,100.0,100.0,100.0,0.0,0.0,0.0,20073722.0,59876.8,20013845.2,20029144.68,26606.28,20002538.4,99.99536000000002,99.984,99.99537131999999,
25,1000000.0,1000.0,999000.0,100.0,100.0,100.0,0.0,0.0,0.0,20486368.4,59984.8,20426383.6,20074837.88,30016.52,20044821.36,99.99512799999998,99.984,99.99513907999999,
26,1000000.0,1000.0,999000.0,100.0,100.0,100.0,0.0,0.0,0.0,23653170.0,59984.8,23593185.2,20477791.96,30028.4,20447763.56,99.993616,99.984,99.99362556,
27,1000000.0,1000.0,999000.0,100.0,100.0,100.0,0.0,0.0,0.0,29740255.6,59984.8,29680270.8,23574391.04,30028.4,23544362.64,99.99092799999998,99.984,99.99093492,
28,1000000.0,1000.0,999000.0,100.0,100.0,100.0,0.0,0.0,0.0,30028480.8,59984.8,29968496.0,29731586.0,30028.4,29701557.6,99.990848,99.984,99.99085488,
29,1000000.0,1000.0,999000.0,100.0,100.0,100.0,0.0,0.0,0.0,30028626.4,59984.8,29968641.6,30028481.64,30028.4,29998453.24,99.99084400000001,99.984,99.99085088000001,
30,1000000.0,1000.0,999000.0,100.0,100.0,100.0,0.0,0.0,0.0,30028637.2,59985.6,29968651.6,30028626.48,30028.48,29998598.0,99.99084400000001,99.984,99.99085088000001,
31,1000000.0,1000.0,999000.0,100.0,100.0,100.0,0.0,0.0,0.0,30028742.4,60090.8,29968651.6,30028637.0,30039.0,29998598.0,99.99084400000001,99.984,99.99085088000001,
32,1000000.0,1000.0,999000.0,100.0,100.0,100.0,0.0,0.0,0.0,30029785.2,61129.6,29968655.6,30028741.4,30143.0,29998598.4,99.99084400000001,99.984,99.99085088000001,
33,1000000.0,1000.0,999000.0,100.0,100.0,100.0,0.0,0.0,0.0,30038902.0,69550.0,29969352.0,30029778.72,31110.68,29998668.04,99.99084400000001,99.984,99.99085088000001,
34,1000000.0,1000.0,999000.0,100.0,100.0,100.0,0.0,0.0,0.0,30084391.2,79867.6,30004523.6,30038742.2,36550.24,30002191.96,99.99082,99.984,99.99082687999999,
35,1000000.0,1000.0,999000.0,100.0,100.0,100.0,0.0,0.0,0.0,30505603.2,79981.6,30425621.6,30085401.64,40024.52,30045377.12,99.99062400000001,99.984,99.99063056000001,
36,1000000.0,1000.0,999000.0,100.0,100.0,100.0,0.0,0.0,0.0,33726690.0,79981.6,33646708.4,30497409.88,40038.0,30457371.88,99.98929199999999,99.984,99.98929723999998,
37,1000000.0,1000.0,999000.0,100.0,100.0,100.0,0.0,0.0,0.0,39768118.0,79981.6,39688136.4,33647799.6,40038.0,33607761.6,99.98654,99.984,99.98654252000004,
38,1000000.0,1000.0,999000.0,100.0,100.0,100.0,0.0,0.0,0.0,40038034.0,79981.6,39958052.4,39760131.76,40038.0,39720093.76,99.98640000000002,99.984,99.98640232,
39,1000000.0,1000.0,999000.0,100.0,100.0,100.0,0.0,0.0,0.0,40038171.6,79981.6,39958190.0,40038033.48,40038.0,39997995.48,99.98640000000002,99.984,99.98640232,
40,1000000.0,1000.0,999000.0,100.0,100.0,100.0,0.0,0.0,0.0,40038182.4,79982.4,39958200.0,40038171.68,40038.08,39998133.6,99.98640000000002,99.984,99.98640232,
41,1000000.0,1000.0,999000.0,100.0,100.0,100.0,0.0,0.0,0.0,40038286.0,80086.0,39958200.0,40038182.04,40048.44,39998133.6,99.98640000000002,99.984,99.98640232,
42,1000000.0,1000.0,999000.0,100.0,100.0,100.0,0.0,0.0,0.0,40039326.4,81123.2,39958203.2,40038286.2,40152.28,39998133.92,99.98640000000002,99.984,99.98640232,
43,1000000.0,1000.0,999000.0,100.0,100.0,100.0,0.0,0.0,0.0,40048426.4,89573.6,39958852.8,40039321.2,41122.32,39998198.88,99.98639600000003,99.98000000000002,99.98640232,
44,1000000.0,1000.0,999000.0,100.0,100.0,100.0,0.0,0.0,0.0,40093442.4,99862.4,39993580.0,40048287.36,46609.48,40001677.88,99.98639200000001,99.98000000000002,99.98639831999999,
45,1000000.0,1000.0,999000.0,100.0,100.0,100.0,0.0,0.0,0.0,40511376.4,99977.6,40411398.8,40094549.8,50036.08,40044513.72,99.98620400000001,99.98000000000002,99.98621016000001,
46,1000000.0,1000.0,999000.0,100.0,100.0,100.0,0.0,0.0,0.0,43706308.4,99978.0,43606330.4,40502148.72,50048.0,40452100.72,99.98487599999997,99.98000000000002,99.98488079999998,
47,1000000.0,1000.0,999000.0,100.0,100.0,100.0,0.0,0.0,0.0,49769094.8,99978.0,49669116.8,43624722.88,50048.0,43574674.88,99.98202800000001,99.98000000000002,99.98202992,
48,1000000.0,1000.0,999000.0,100.0,100.0,100.0,0.0,0.0,0.0,50047568.4,99978.0,49947590.4,49760808.72,50048.0,49710760.72,99.98187999999999,99.98000000000002,99.98188180000001,
49,1000000.0,1000.0,999000.0,100.0,100.0,100.0,0.0,0.0,0.0,50047716.0,99978.0,49947738.0,50047568.2,50048.0,49997520.2,99.98187999999999,99.98000000000002,99.98188180000001,
50,1000000.0,1000.0,999000.0,100.0,100.0,100.0,0.0,0.0,0.0,50047726.8,99978.8,49947748.0,50047716.08,50048.08,49997668.0,99.98187999999999,99.98000000000002,99.98188180000001,
51,1000000.0,1000.0,999000.0,100.0,100.0,100.0,0.0,0.0,0.0,50047830.8,100082.8,49947748.0,50047726.48,50058.48,49997668.0,99.98187999999999,99.98000000000002,99.98188180000001,
52,1000000.0,1000.0,999000.0,100.0,100.0,100.0,0.0,0.0,0.0,50048871.6,101120.4,49947751.2,50047830.64,50162.32,49997668.32,99.98187999999999,99.98000000000002,99.98188180000001,
53,1000000.0,1000.0,999000.0,100.0,100.0,100.0,0.0,0.0,0.0,50057968.0,109587.6,49948380.4,50048867.04,51135.8,49997731.24,99.98187999999999,99.98000000000002,99.98188180000001,
54,1000000.0,1000.0,999000.0,100.0,100.0,100.0,0.0,0.0,0.0,50102437.6,119859.2,49982578.4,50057804.8,56647.36,50001157.44,99.98186,99.98000000000002,99.98186180000002,
55,1000000.0,1000.0,999000.0,100.0,100.0,100.0,0.0,0.0,0.0,50516686.4,119971.6,50396714.8,50103649.88,60045.68,50043604.2,99.98164799999999,99.98000000000002,99.98164964000001,
56,1000000.0,1000.0,999000.0,100.0,100.0,100.0,0.0,0.0,0.0,53697827.2,119971.6,53577855.6,50508837.6,60056.8,50448780.8,99.98024399999998,99.98000000000002,99.98024416,
57,1000000.0,1000.0,999000.0,100.0,100.0,100.0,0.0,0.0,0.0,59772074.0,119971.6,59652102.4,53610417.84,60056.8,53550361.04,99.97752,99.98000000000002,99.9775176,
58,1000000.0,1000.0,999000.0,100.0,100.0,100.0,0.0,0.0,0.0,60057090.4,119971.6,59937118.8,59762784.32,60056.8,59702727.52,99.977364,99.98000000000002,99.97736132,
59,1000000.0,1000.0,999000.0,100.0,100.0,100.0,0.0,0.0,0.0,60057255.6,119971.6,59937284.0,60057091.16,60056.8,59997034.36,99.97735999999999,99.98000000000002,99.97735732,
60,1000000.0,1000.0,999000.0,100.0,100.0,100.0,0.0,0.0,0.0,60057266.4,119972.4,59937294.0,60057255.68,60056.88,59997198.8,99.97735999999999,99.98000000000002,99.97735732,
61,1000000.0,1000.0,999000.0,100.0,100.0,100.0,0.0,0.0,0.0,60057374.0,120080.0,59937294.0,60057266.44,60067.64,59997198.8,99.97735999999999,99.98000000000002,99.97735732,
62,1000000.0,1000.0,999000.0,100.0,100.0,100.0,0.0,0.0,0.0,60058412.4,121117.6,59937294.8,60057370.76,60171.88,59997198.88,99.977356,99.976,99.97735732,
63,1000000.0,1000.0,999000.0,100.0,100.0,100.0,0.0,0.0,0.0,60067499.2,129549.2,59937950.0,60058406.56,61142.16,59997264.4,99.977348,99.96800000000002,99.97735732,
64,1000000.0,1000.0,999000.0,100.0,100.0,100.0,0.0,0.0,0.0,60112119.6,139856.8,59972262.8,60067318.0,66615.36,60000702.64,99.97732400000001,99.96800000000002,99.97733328000002,
65,1000000.0,1000.0,999000.0,100.0,100.0,100.0,0.0,0.0,0.0,60527475.2,139966.8,60387508.4,60113304.4,70054.88,60043249.52,99.97712000000001,99.96800000000002,99.97712896000002,
66,1000000.0,1000.0,999000.0,100.0,100.0,100.0,0.0,0.0,0.0,63714181.6,139966.8,63574214.8,60519406.16,70066.0,60449340.16,99.97575599999999,99.96800000000002,99.97576375999999,
67,1000000.0,1000.0,999000.0,100.0,100.0,100.0,0.0,0.0,0.0,69782792.8,139966.8,69642826.0,63626299.08,70066.0,63556233.08,99.97294400000001,99.96800000000002,99.97294892,
68,1000000.0,1000.0,999000.0,100.0,100.0,100.0,0.0,0.0,0.0,70066631.6,139966.8,69926664.8,69773083.64,70066.0,69703017.64,99.97281199999999,99.96800000000002,99.97281675999999,
69,1000000.0,1000.0,999000.0,100.0,100.0,100.0,0.0,0.0,0.0,70066787.6,139966.8,69926820.8,70066632.04,70066.0,69996566.04,99.97281199999999,99.96800000000002,99.97281675999999,
70,1000000.0,1000.0,999000.0,100.0,100.0,100.0,0.0,0.0,0.0,70066798.8,139967.2,69926831.6,70066787.64,70066.04,69996721.6,99.97281199999999,99.96800000000002,99.97281675999999,
71,1000000.0,1000.0,999000.0,100.0,100.0,100.0,0.0,0.0,0.0,70066902.0,140070.4,69926831.6,70066798.76,70076.36,69996722.4,99.97281199999999,99.96800000000002,99.97281675999999,
72,1000000.0,1000.0,999000.0,100.0,100.0,100.0,0.0,0.0,0.0,70067936.8,141104.0,69926832.8,70066902.48,70179.96,69996722.52,99.97281199999999,99.96800000000002,99.97281675999999,
73,1000000.0,1000.0,999000.0,100.0,100.0,100.0,0.0,0.0,0.0,70077022.0,149514.4,69927507.6,70067933.2,71143.2,69996790.0,99.9728,99.96000000000002,99.97281275999998,
74,1000000.0,1000.0,999000.0,100.0,100.0,100.0,0.0,0.0,0.0,70122222.8,159851.6,69962371.2,70076888.08,76605.32,70000282.76,99.97279199999998,99.96000000000002,99.97280475999997,
75,1000000.0,1000.0,999000.0,100.0,100.0,100.0,0.0,0.0,0.0,70542053.2,159962.4,70382090.8,70123380.48,80062.92,70043317.56,99.97255200000001,99.96000000000002,99.97256456,
76,1000000.0,1000.0,999000.0,100.0,100.0,100.0,0.0,0.0,0.0,73748890.4,159962.4,73588928.0,70533061.84,80076.0,70452985.84,99.971044,99.96000000000002,99.97105496000002,
77,1000000.0,1000.0,999000.0,100.0,100.0,100.0,0.0,0.0,0.0,79802028.8,159962.4,79642066.4,73671294.24,80076.0,73591218.24,99.968292,99.96000000000002,99.96830035999997,
78,1000000.0,1000.0,999000.0,100.0,100.0,100.0,0.0,0.0,0.0,80076214.4,159962.4,79916252.0,79794204.96,80076.0,79714128.96,99.96818399999998,99.96000000000002,99.96819224,
79,1000000.0,1000.0,999000.0,100.0,100.0,100.0,0.0,0.0,0.0,80076359.6,159962.4,79916397.2,80076213.76,80076.0,79996137.76,99.96818399999998,99.96000000000002,99.96819224,
80,1000000.0,1000.0,999000.0,100.0,100.0,100.0,0.0,0.0,0.0,80076370.4,159963.2,79916407.2,80076359.68,80076.08,79996283.6,99.96818399999998,99.96000000000002,99.96819224,
81,1000000.0,1000.0,999000.0,100.0,100.0,100.0,0.0,0.0,0.0,80076474.0,160066.8,79916407.2,80076370.04,80086.44,79996283.6,99.96818399999998,99.96000000000002,99.96819224,
82,1000000.0,1000.0,999000.0,100.0,100.0,100.0,0.0,0.0,0.0,80077517.2,161106.4,79916410.8,80076474.8,80190.84,79996283.96,99.96818399999998,99.96000000000002,99.96819224,
83,1000000.0,1000.0,999000.0,100.0,100.0,100.0,0.0,0.0,0.0,80086569.6,169482.0,79917087.6,80077507.16,81155.52,79996351.64,99.96818399999998,99.96000000000002,99.96819224,
84,1000000.0,1000.0,999000.0,100.0,100.0,100.0,0.0,0.0,0.0,80131343.6,179841.2,79951502.4,80086428.72,86629.76,79999798.96,99.96816000000001,99.96000000000002,99.96816819999998,
85,1000000.0,1000.0,999000.0,100.0,100.0,100.0,0.0,0.0,0.0,80547583.6,179958.0,80367625.6,80132532.24,90075.36,80042456.88,99.967988,99.96000000000002,99.96799596000001,
86,1000000.0,1000.0,999000.0,100.0,100.0,100.0,0.0,0.0,0.0,83737778.4,179958.0,83557820.4,80539420.88,90085.2,80449335.68,99.966776,99.96000000000002,99.96678288,
87,1000000.0,1000.0,999000.0,100.0,100.0,100.0,0.0,0.0,0.0,89804235.6,179958.0,89624277.6,83652282.72,90085.2,83562197.52,99.96403599999998,99.96000000000002,99.96403996000001,
88,1000000.0,1000.0,999000.0,100.0,100.0,100.0,0.0,0.0,0.0,90085744.0,179958.0,89905786.0,89794792.44,90085.2,89704707.24,99.96393999999997,99.96000000000002,99.96394384000001,
89,1000000.0,1000.0,999000.0,100.0,100.0,100.0,0.0,0.0,0.0,90085910.0,179958.0,89905952.0,90085742.64,90085.2,89995657.44,99.96393999999997,99.96000000000002,99.96394384000001,
90,1000000.0,1000.0,999000.0,100.0,100.0,100.0,9.999999999999999e-05,0.0,9.999999999999999e-05,90085920.0,179958.0,89905962.0,90085910.0,90085.2,89995824.8,99.96393999999997,99.96000000000002,99.96394384000001,
91,1000000.0,1000.0,999000.0,100.0,100.0,100.0,0.001148,1.048,9.999999999999999e-05,90086024.8,180062.8,89905962.0,90085920.48,90095.68,89995824.8,99.96393999999997,99.96000000000002,99.96394384000001,
92,1000000.0,1000.0,999000.0,100.0,100.0,100.0,0.010995999999999999,10.868,0.000128,90087067.6,181102.8,89905964.8,90086024.96,90199.88,89995825.08,99.96393999999997,99.96000000000002,99.96394384000001,
93,1000000.0,1000.0,999000.0,100.0,100.0,100.0,0.07299599999999999,66.2,0.006802759999999999,90096175.2,189543.6,89906631.6,90087063.2,91171.44,89995891.76,99.96393599999998,99.95600000000002,99.96394384000001,
94,1000000.0,1000.0,999000.0,100.0,100.0,100.0,0.4540840000000001,99.78000000000002,0.35465864,90141227.6,199830.4,89941397.2,90096007.88,96633.4,89999374.48,99.96391199999998,99.95200000000001,99.96392380000003,
95,1000000.0,1000.0,999000.0,100.0,100.0,100.0,4.63114,99.94400000000002,4.53573172,90559198.0,199951.6,90359246.4,90142298.84,100077.68,90042221.16,99.96372799999999,99.95200000000001,99.96373971999999,
96,1000000.0,1000.0,999000.0,100.0,100.0,100.0,36.645052,99.94400000000002,36.58168968,93761897.6,199952.0,93561945.6,90551222.28,100094.4,90451127.88,99.96236400000004,99.95200000000001,99.96237431999998,
97,1000000.0,1000.0,999000.0,100.0,100.0,100.0,97.19700800000003,99.94400000000002,97.19425823999998,99819543.6,199952.0,99619591.6,93680914.88,100094.4,93580820.48,99.959608,99.95200000000001,99.95961563999998,
98,1000000.0,1000.0,999000.0,100.0,100.0,100.0,99.95328799999999,99.94400000000002,99.95329724,100095285.6,199952.0,99895333.6,99810953.92,100094.4,99710859.52,99.95947999999999,99.95200000000001,99.95948756,
99,1000000.0,1000.0,999000.0,100.0,100.0,100.0,99.954816,99.94400000000002,99.9548268,100095438.4,199952.0,99895486.4,100095286.28,100094.4,99995191.88,99.95947999999999,99.95200000000001,99.95948756,
100,1000000.0,1000.0,999000.0,100.0,100.0,100.0,99.954816,99.94400000000002,99.9548268,100095438.4,199952.0,99895486.4,100095438.4,100094.4,99995344.0,99.95947999999999,99.95200000000001,99.95948756,
101,1000000.0,1000.0,999000.0,100.0,100.0,100.0,99.954816,99.94400000000002,99.9548268,100095438.4,199952.0,99895486.4,100095438.4,100094.4,99995344.0,99.95947999999999,99.95200000000001,99.95948756,
102,1000000.0,1000.0,999000.0,100.0,100.0,100.0,99.954816,99.94400000000002,99.9548268,100095438.4,199952.0,99895486.4,100095438.4,100094.4,99995344.0,99.95947999999999,99.95200000000001,99.95948756,
103,1000000.0,1000.0,999000.0,100.0,100.0,100.0,99.954816,99.94400000000002,99.9548268,100095438.4,199952.0,99895486.4,100095438.4,100094.4,99995344.0,99.95947999999999,99.95200000000001,99.95948756,
104,1000000.0,1000.0,999000.0,100.0,100.0,100.0,99.954816,99.94400000000002,99.9548268,100095438.4,199952.0,99895486.4,100095438.4,100094.4,99995344.0,99.95947999999999,99.95200000000001,99.95948756,
105,1000000.0,1000.0,999000.0,100.0,100.0,100.0,99.954816,99.94400000000002,99.9548268,100095438.4,199952.0,99895486.4,100095438.4,100094.4,99995344.0,99.95947999999999,99.95200000000001,99.95948756,
106,1000000.0,1000.0,999000.0,100.0,100.0,100.0,99.954816,99.94400000000002,99.9548268,100095438.4,199952.0,99895486.4,100095438.4,100094.4,99995344.0,99.95947999999999,99.95200000000001,99.95948756,
107,1000000.0,1000.0,999000.0,100.0,100.0,100.0,99.954816,99.94400000000002,99.9548268,100095438.4,199952.0,99895486.4,100095438.4,100094.4,99995344.0,99.95947999999999,99.95200000000001,99.95948756,
108,1000000.0,1000.0,999000.0,100.0,100.0,100.0,99.954816,99.94400000000002,99.9548268,100095438.4,199952.0,99895486.4,100095438.4,100094.4,99995344.0,99.95947999999999,99.95200000000001,99.95948756,
109,1000000.0,1000.0,999000.0,100.0,100.0,100.0,99.954816,99.94400000000002,99.9548268,100095438.4,199952.0,99895486.4,100095438.4,100094.4,99995344.0,99.95947999999999,99.95200000000001,99.95948756,
110,1000000.0,1000.0,999000.0,100.0,100.0,100.0,99.954816,99.94400000000002,99.9548268,100095438.4,199952.0,99895486.4,100095438.4,100094.4,99995344.0,99.95947999999999,99.95200000000001,99.95948756,
111,1000000.0,1000.0,999000.0,100.0,100.0,100.0,99.954816,99.94400000000002,99.9548268,100095438.4,199952.0,99895486.4,100095438.4,100094.4,99995344.0,99.95947999999999,99.95200000000001,99.95948756,
112,1000000.0,1000.0,999000.0,100.0,100.0,100.0,99.954816,99.94400000000002,99.9548268,100095438.4,199952.0,99895486.4,100095438.4,100094.4,99995344.0,99.95947999999999,99.95200000000001,99.95948756,
113,1000000.0,1000.0,999000.0,100.0,100.0,100.0,99.954816,99.94400000000002,99.9548268,100095438.4,199952.0,99895486.4,100095438.4,100094.4,99995344.0,99.95947999999999,99.95200000000001,99.95948756,
114,1000000.0,1000.0,999000.0,100.0,100.0,100.0,99.954816,99.94400000000002,99.9548268,100095438.4,199952.0,99895486.4,100095438.4,100094.4,99995344.0,99.95947999999999,99.95200000000001,99.95948756,
115,1000000.0,1000.0,999000.0,100.0,100.0,100.0,99.954816,99.94400000000002,99.9548268,100095438.4,199952.0,99895486.4,100095438.4,100094.4,99995344.0,99.95947999999999,99.95200000000001,99.95948756,
116,1000000.0,1000.0,999000.0,100.0,100.0,100.0,99.954816,99.94400000000002,99.9548268,100095438.4,199952.0,99895486.4,100095438.4,100094.4,99995344.0,99.95947999999999,99.95200000000001,99.95948756,
117,1000000.0,1000.0,999000.0,100.0,100.0,100.0,99.954816,99.94400000000002,99.9548268,100095438.4,199952.0,99895486.4,100095438.4,100094.4,99995344.0,99.95947999999999,99.95200000000001,99.95948756,
118,1000000.0,1000.0,999000.0,100.0,100.0,100.0,99.954816,99.94400000000002,99.9548268,100095438.4,199952.0,99895486.4,100095438.4,100094.4,99995344.0,99.95947999999999,99.95200000000001,99.95948756,
119,1000000.0,1000.0,999000.0,100.0,100.0,100.0,99.954816,99.94400000000002,99.9548268,100095438.4,199952.0,99895486.4,100095438.4,100094.4,99995344.0,99.95947999999999,99.95200000000001,99.95948756,
120,1000000.0,1000.0,999000.0,100.0,100.0,100.0,99.954816,99.94400000000002,99.9548268,100095438.4,199952.0,99895486.4,100095438.4,100094.4,99995344.0,99.95947999999999,99.95200000000001,99.95948756,
121,1000000.0,1000.0,999000.0,100.0,100.0,100.0,99.954816,99.94400000000002,99.9548268,100095438.4,199952.0,99895486.4,100095438.4,100094.4,99995344.0,99.95947999999999,99.95200000000001,99.95948756,
122,1000000.0,1000.0,999000.0,100.0,100.0,100.0,99.954816,99.94400000000002,99.9548268,100095438.4,199952.0,99895486.4,100095438.4,100094.4,99995344.0,99.95947999999999,99.95200000000001,99.95948756,
123,1000000.0,1000.0,999000.0,100.0,100.0,100.0,99.954816,99.94400000000002,99.9548268,100095438.4,199952.0,99895486.4,100095438.4,100094.4,99995344.0,99.95947999999999,99.95200000000001,99.95948756,
