gossips,p2p mean,p2p std,p2p min,p2p q1,p2p q2,p2p q3,p2p max,p2s mean,p2s std,p2s min,p2s q1,p2s q2,p2s q3,p2s max,s2s mean,s2s std,s2s min,s2s q1,s2s q2,s2s q3,s2s max
1,1.0932000000000002,0.010295630140987026,1.07,1.09,1.1,1.1,1.1,0.012857142857142859,0.004879500364742666,0.01,0.01,0.01,0.015,0.02,,,,,,,
2,0.01,0.0,0.01,0.01,0.01,0.01,0.01,,,,,,,,,,,,,,
3,,,,,,,,,,,,,,,,,,,,,
4,,,,,,,,,,,,,,,,,,,,,
5,,,,,,,,,,,,,,,,,,,,,
