gossips,p2p mean,p2p std,p2p min,p2p q1,p2p q2,p2p q3,p2p max,p2s mean,p2s std,p2s min,p2s q1,p2s q2,p2s q3,p2s max,s2s mean,s2s std,s2s min,s2s q1,s2s q2,s2s q3,s2s max
1,0.001,0.0,0.001,0.001,0.001,0.001,0.001,0.0013076923076923079,0.0006304251719561152,0.001,0.001,0.001,0.001,0.003,1.36085324,0.03431376645419931,1.281111,1.339,1.3617780000000002,1.3854440000000001,1.422667
2,,,,,,,,,,,,,,,0.00011100000000000001,0.0,0.00011100000000000001,0.00011100000000000001,0.00011100000000000001,0.00011100000000000001,0.00011100000000000001
3,,,,,,,,,,,,,,,,,,,,,
4,,,,,,,,,,,,,,,,,,,,,
5,,,,,,,,,,,,,,,,,,,,,
