gossips,p2p mean,p2p std,p2p min,p2p q1,p2p q2,p2p q3,p2p max,p2s mean,p2s std,p2s min,p2s q1,p2s q2,p2s q3,p2s max,s2s mean,s2s std,s2s min,s2s q1,s2s q2,s2s q3,s2s max
1,53.79371999999999,0.16078181903851346,53.344,53.703,53.793,53.913,54.059,28.518079999999994,0.21100926519942184,27.754,28.426,28.56,28.631,28.771,0.8475155999999999,0.05922049644548752,0.788222,0.807333,0.841,0.8642219999999999,1.065556
2,5.8632800000000005,0.0650791313197506,5.742,5.814,5.868,5.919,5.957,0.17803999999999998,0.015867892109539948,0.135,0.172,0.178,0.187,0.201,0.00016145454545454547,9.104214808138441e-05,0.00011100000000000001,0.00011100000000000001,0.00011100000000000001,0.00016650000000000004,0.000333
3,0.06368,0.007904218283085726,0.051,0.059,0.063,0.067,0.087,,,,,,,,,,,,,,
4,0.001,0.0,0.001,0.001,0.001,0.001,0.001,,,,,,,,,,,,,,
5,,,,,,,,,,,,,,,,,,,,,
