gossips,p2p mean,p2p std,p2p min,p2p q1,p2p q2,p2p q3,p2p max,p2s mean,p2s std,p2s min,p2s q1,p2s q2,p2s q3,p2s max,s2s mean,s2s std,s2s min,s2s q1,s2s q2,s2s q3,s2s max
1,41.688399999999994,1.1190311285512424,37.53,41.28,41.83,42.4,43.0,42.705600000000004,1.0725984026341506,40.27,41.94,42.94,43.4,44.46,41.74747076,1.9524158626276582,36.959596000000005,41.285859,42.168182,43.211717,44.185455
2,19.7644,3.3808616751749345,10.33,18.04,19.13,21.71,25.99,20.232,4.42522033349753,9.72,18.44,20.37,23.92,27.78,14.243648480000001,2.8723727642512022,8.012424000000001,11.896869,14.615253,16.709091,18.92899
3,4.555600000000001,1.52818268977676,1.09,3.6,4.21,5.51,8.17,4.19,1.7591096232658916,0.89,3.26,3.75,5.7,8.23,1.9361333600000001,0.6417617630447636,0.726061,1.325556,2.063434,2.344949,3.086162
4,0.5664000000000001,0.30607569869777856,0.12,0.38,0.44,0.71,1.3,0.3516,0.2198423677698789,0.02,0.16,0.28,0.52,0.9,0.09711503999999999,0.04636647934255235,0.025758,0.061818,0.09404,0.13101,0.198182
5,0.03291666666666667,0.025788296412986612,0.01,0.01,0.025,0.04,0.1,0.025555555555555557,0.01423426777480905,0.01,0.0125,0.02,0.03,0.05,0.0017130000000000001,0.0013547140534690952,0.000303,0.0007070000000000001,0.001212,0.002525,0.0060609999999999995
6,0.01,0.0,0.01,0.01,0.01,0.01,0.01,,,,,,,,0.000101,0.0,0.000101,0.000101,0.000101,0.000101,0.000101
7,,,,,,,,,,,,,,,,,,,,,
