gossips,p2p mean,p2p std,p2p min,p2p q1,p2p q2,p2p q3,p2p max,p2s mean,p2s std,p2s min,p2s q1,p2s q2,p2s q3,p2s max,s2s mean,s2s std,s2s min,s2s q1,s2s q2,s2s q3,s2s max
1,49.32679999999999,0.48918912498133227,48.36,49.14,49.35,49.58,50.31,56.14959999999999,0.6459520106014068,55.05,55.61,56.13,56.6,57.36,6.450876799999999,0.06374200733556062,6.34596,6.39899,6.451919,6.500505,6.578989999999999
2,22.2724,0.4478679120752754,21.23,22.05,22.41,22.63,22.84,18.6076,0.5661734127750385,17.41,18.22,18.55,18.9,19.87,0.00417348,0.0008065583839169157,0.0029289999999999997,0.003636,0.00404,0.004646,0.006263
3,1.9903999999999997,0.1111860302975753,1.72,1.92,2.01,2.04,2.16,0.021111111111111115,0.009633818428657447,0.01,0.01,0.02,0.03,0.04,,,,,,,
4,0.024800000000000003,0.013266499161421601,0.01,0.01,0.02,0.03,0.05,,,,,,,,,,,,,,
5,,,,,,,,,,,,,,,,,,,,,
