gossips,p2p mean,p2p std,p2p min,p2p 05th,p2p 25th,p2p 50th,p2p 75th,p2p 95th,p2p max,p2s mean,p2s std,p2s min,p2s 05th,p2s 25th,p2s 50th,p2s 75th,p2s 95th,p2s max,s2s mean,s2s std,s2s min,s2s 05th,s2s 25th,s2s 50th,s2s 75th,s2s 95th,s2s max
1,51.62828,0.17900804898104433,51.088,51.4044,51.531,51.635,51.762,51.8648,51.873,58.614320000000006,0.26051406411170974,58.248,58.2982,58.481,58.543,58.794,59.0656,59.265,55.81215119999999,0.2717118279914958,55.425,55.446555599999996,55.700889000000004,55.752221999999996,55.844889,56.469600400000004,56.495
2,18.70812,0.17195123029510434,18.412,18.4832,18.562,18.695,18.82,18.969,19.099,20.01604,0.23994440689459728,19.448,19.6252,19.86,19.982,20.24,20.3428,20.395,21.41706224,0.19049870666842456,20.903333,21.0041554,21.326778,21.449556,21.558,21.592133599999997,21.725444
3,0.028520000000000018,0.0034654869787664765,0.023,0.023200000000000002,0.025,0.029,0.031,0.0338,0.035,0.20124000000000003,0.012719371053633114,0.166,0.1836,0.194,0.202,0.208,0.2216,0.224,0.44772,0.020436303188199178,0.40944400000000003,0.4118442,0.435,0.451556,0.46444399999999997,0.47577739999999996,0.48522200000000004
4,,,,,,,,,,,,,,,,,,,0.0023955600000000014,0.0005078606958605874,0.001333,0.0014886,0.002111,0.002444,0.002667,0.0031997999999999996,0.003222
5,,,,,,,,,,,,,,,,,,,,,,,,,,,
