round,nodes,nodesP,nodesS,nodesSent,nodesSentP,nodesSentS,nodesRecv,nodesRecvP,nodesRecvS,msgSent,msgSentP,msgSentS,msgRecv,msgRecvP,msgRecvS,msgInfect,msgInfectP,msgInfectS
00,100000.000000,10000.000000,90000.000000,0.000000,0.000000,0.000000,0.000000,0.000000,0.000000,0.000000,0.000000,0.000000,0.000000,0.000000,0.000000,0.000000,0.000000,0.000000
01,100000.000000,10000.000000,90000.000000,0.001200,0.012000,0.000000,0.001200,0.012000,0.000000,12.000000,12.000000,0.000000,1.200000,1.200000,0.000000,0.100000,1.000000,0.000000
02,100000.000000,10000.000000,90000.000000,0.011800,0.118000,0.000000,0.011800,0.118000,0.000000,118.000000,118.000000,0.000000,11.800000,11.800000,0.000000,0.100000,1.000000,0.000000
03,100000.000000,10000.000000,90000.000000,0.116600,1.166000,0.000000,0.116600,1.166000,0.000000,1166.000000,1166.000000,0.000000,117.200000,117.200000,0.000000,0.100000,1.000000,0.000000
04,100000.000000,10000.000000,90000.000000,1.092000,10.920000,0.000000,1.092000,10.920000,0.000000,10920.000000,10920.000000,0.000000,1154.100000,1154.100000,0.000000,0.100000,1.000000,0.000000
05,100000.000000,10000.000000,90000.000000,6.619700,66.197000,0.000000,6.619700,66.197000,0.000000,66197.000000,66197.000000,0.000000,10804.200000,10804.200000,0.000000,0.100000,1.000000,0.000000
06,100000.000000,10000.000000,90000.000000,10.092200,99.846000,0.119555,10.092200,99.846000,0.119555,100922.000000,99846.000000,1076.000000,65280.400000,65172.800000,107.600000,1.500000,6.000000,1.000000
07,100000.000000,10000.000000,90000.000000,26.596900,99.974000,18.443889,26.596900,99.974000,18.443889,265969.000000,99974.000000,165995.000000,100807.800000,82450.500000,18357.300000,1.700000,8.000000,1.000000
08,100000.000000,10000.000000,90000.000000,87.763900,99.974000,86.407222,87.763900,99.974000,86.407222,877639.000000,99974.000000,777665.000000,262065.900000,82450.500000,179615.400000,2.600000,8.000000,2.000000
09,100000.000000,10000.000000,90000.000000,99.983900,99.974000,99.985000,99.983900,99.974000,99.985000,999839.000000,99974.000000,899865.000000,872809.600000,82450.500000,790359.100000,8.000000,8.000000,8.000000
10,100000.000000,10000.000000,90000.000000,99.994000,99.974000,99.996222,99.994000,99.974000,99.996222,999940.000000,99974.000000,899966.000000,999837.300000,82450.500000,917386.800000,9.800000,8.000000,10.000000
11,100000.000000,10000.000000,90000.000000,99.994000,99.974000,99.996222,99.994000,99.974000,99.996222,999940.000000,99974.000000,899966.000000,999941.000000,82450.500000,917490.500000,9.800000,8.000000,10.000000
12,100000.000000,10000.000000,90000.000000,99.994000,99.974000,99.996222,99.994000,99.974000,99.996222,999940.000000,99974.000000,899966.000000,999941.000000,82450.500000,917490.500000,9.800000,8.000000,10.000000
13,100000.000000,10000.000000,90000.000000,99.994000,99.974000,99.996222,99.994000,99.974000,99.996222,999940.000000,99974.000000,899966.000000,999941.000000,82450.500000,917490.500000,9.800000,8.000000,10.000000
14,100000.000000,10000.000000,90000.000000,99.994000,99.974000,99.996222,99.994000,99.974000,99.996222,999940.000000,99974.000000,899966.000000,999941.000000,82450.500000,917490.500000,9.800000,8.000000,10.000000
15,100000.000000,10000.000000,90000.000000,99.994000,99.974000,99.996222,99.994000,99.974000,99.996222,999940.000000,99974.000000,899966.000000,999941.000000,82450.500000,917490.500000,9.800000,8.000000,10.000000
16,100000.000000,10000.000000,90000.000000,99.994000,99.974000,99.996222,99.994000,99.974000,99.996222,999940.000000,99974.000000,899966.000000,999941.000000,82450.500000,917490.500000,9.800000,8.000000,10.000000
17,100000.000000,10000.000000,90000.000000,99.994000,99.974000,99.996222,99.994000,99.974000,99.996222,999940.000000,99974.000000,899966.000000,999941.000000,82450.500000,917490.500000,9.800000,8.000000,10.000000
18,100000.000000,10000.000000,90000.000000,99.994000,99.974000,99.996222,99.994000,99.974000,99.996222,999940.000000,99974.000000,899966.000000,999941.000000,82450.500000,917490.500000,9.800000,8.000000,10.000000
19,100000.000000,10000.000000,90000.000000,99.994000,99.974000,99.996222,99.994000,99.974000,99.996222,999940.000000,99974.000000,899966.000000,999941.000000,82450.500000,917490.500000,9.800000,8.000000,10.000000
