gossips,p2p mean,p2p std,p2p min,p2p q1,p2p q2,p2p q3,p2p max,p2s mean,p2s std,p2s min,p2s q1,p2s q2,p2s q3,p2s max,s2s mean,s2s std,s2s min,s2s q1,s2s q2,s2s q3,s2s max
1,48.952000000000005,1.9914651222989899,45.0,47.5,49.3,50.4,52.5,46.868,1.7987773625437908,43.9,45.5,47.1,47.7,52.2,55.23435840000001,0.43587236150133474,54.31031,54.937037,55.177678,55.584785,56.041742000000006
2,22.372,1.4022363091386076,19.5,21.6,22.3,23.3,24.9,10.008000000000003,1.1261734620681958,7.2,9.4,10.1,10.8,12.3,19.99258452,0.5991784915415533,18.974373999999997,19.55996,19.984885000000002,20.432432000000002,21.295796
3,2.052,0.48314939028558573,1.3,1.7,2.1,2.4,3.1,0.15000000000000002,0.07071067811865477,0.1,0.125,0.15000000000000002,0.17500000000000002,0.2,1.7549069199999996,0.1914947632319049,1.438238,1.586086,1.752853,1.9027029999999998,2.087087
4,0.10000000000000002,0.0,0.1,0.1,0.1,0.1,0.1,,,,,,,,0.03608012000000001,0.005507424801423376,0.025225,0.031731999999999996,0.036537,0.041141000000000004,0.044745
5,,,,,,,,,,,,,,,0.00020000000000000004,0.00010444659357341871,0.0001,0.0001,0.0002,0.00025,0.0004
