gossips,p2p mean,p2p std,p2p min,p2p q1,p2p q2,p2p q3,p2p max,p2s mean,p2s std,p2s min,p2s q1,p2s q2,p2s q3,p2s max,s2s mean,s2s std,s2s min,s2s q1,s2s q2,s2s q3,s2s max
1,49.21200000000001,0.576281181368955,48.26,48.63,49.24,49.59,50.47,43.06000000000001,0.4259597007542678,42.14,42.81,43.07,43.3,43.98,1.29261408,0.04977491657696006,1.1810100000000001,1.265152,1.295253,1.3235350000000001,1.372525
2,22.437600000000007,0.47220475784698906,21.45,22.22,22.39,22.75,23.41,5.4251999999999985,0.20139347887489634,5.16,5.29,5.36,5.52,5.99,0.0001754210526315789,0.00010561950355954029,0.000101,0.000101,0.000101,0.000202,0.000505
3,2.0815999999999995,0.1511533437715929,1.83,2.0,2.04,2.22,2.4,,,,,,,,,,,,,,
4,0.02333333333333334,0.014645571126562064,0.01,0.01,0.02,0.03,0.05,,,,,,,,,,,,,,
5,,,,,,,,,,,,,,,,,,,,,
