round,Simple mean,Simple std,Simple min,Simple q1,Simple q2,Simple q3,Simple max
0,0.0,0.0,0.0,0.0,0.0,0.0,0.0
1,0.0,0.0,0.0,0.0,0.0,0.0,0.0
2,0.0,0.0,0.0,0.0,0.0,0.0,0.0
3,0.0,0.0,0.0,0.0,0.0,0.0,0.0
4,0.0,0.0,0.0,0.0,0.0,0.0,0.0
5,0.0,0.0,0.0,0.0,0.0,0.0,0.0
6,0.0,0.0,0.0,0.0,0.0,0.0,0.0
7,0.0,0.0,0.0,0.0,0.0,0.0,0.0
8,0.0,0.0,0.0,0.0,0.0,0.0,0.0
9,0.0,0.0,0.0,0.0,0.0,0.0,0.0
10,0.0,0.0,0.0,0.0,0.0,0.0,0.0
11,0.0,0.0,0.0,0.0,0.0,0.0,0.0
12,0.000112,0.00011298967504452195,0.0,0.0,0.0001,0.0002,0.0003
13,0.08132000000000002,0.0028334313708528974,0.0738,0.0803,0.0811,0.0829,0.088
14,7.061744,0.11354620234365692,6.7818,7.0917,7.101,7.1138,7.1516
15,65.38178799999999,0.24927942875415834,64.7919,65.4036,65.4612,65.5238,65.6584
16,99.80741599999999,0.00485735524745794,99.797,99.8047,99.8074,99.8101,99.8166
17,99.954448,0.0022375805385886505,99.9499,99.953,99.9548,99.9557,99.9591
18,99.95452399999996,0.0022554157044757752,99.95,99.953,99.9549,99.9557,99.9591
19,99.95452399999996,0.0022554157044757752,99.95,99.953,99.9549,99.9557,99.9591
20,99.95452399999996,0.0022554157044757752,99.95,99.953,99.9549,99.9557,99.9591
21,99.95452399999996,0.0022554157044757752,99.95,99.953,99.9549,99.9557,99.9591
22,99.95452399999996,0.0022554157044757752,99.95,99.953,99.9549,99.9557,99.9591
23,99.95452399999996,0.0022554157044757752,99.95,99.953,99.9549,99.9557,99.9591
24,99.95452399999996,0.0022554157044757752,99.95,99.953,99.9549,99.9557,99.9591
25,99.95452399999996,0.0022554157044757752,99.95,99.953,99.9549,99.9557,99.9591
