gossips,p2p mean,p2p std,p2p min,p2p q1,p2p q2,p2p q3,p2p max,p2s mean,p2s std,p2s min,p2s q1,p2s q2,p2s q3,p2s max,s2s mean,s2s std,s2s min,s2s q1,s2s q2,s2s q3,s2s max
1,10.247600000000002,0.10505078137104318,10.03,10.18,10.25,10.32,10.46,0.5796,0.07591003447063727,0.43,0.52,0.58,0.63,0.75,0.0012985714285714287,0.0004928295368390093,0.00101,0.00101,0.00101,0.001515,0.00202
2,0.10719999999999999,0.02354428451521374,0.07,0.09,0.11,0.13,0.15,,,,,,,,,,,,,,
3,,,,,,,,,,,,,,,,,,,,,
4,,,,,,,,,,,,,,,,,,,,,
5,,,,,,,,,,,,,,,,,,,,,
