gossips,p2p mean,p2p std,p2p min,p2p q1,p2p q2,p2p q3,p2p max,p2s mean,p2s std,p2s min,p2s q1,p2s q2,p2s q3,p2s max,s2s mean,s2s std,s2s min,s2s q1,s2s q2,s2s q3,s2s max
1,0.16519999999999999,0.04083707465853383,0.07,0.13,0.16,0.21,0.23,41.81239999999999,0.5507894334498429,40.65,41.49,41.7,42.24,42.77,54.6593374,0.2583487351673762,54.202222,54.48808100000001,54.682120999999995,54.78818199999999,55.214544999999994
2,,,,,,,,0.07800000000000003,0.0334165627596057,0.04,0.05,0.06,0.1,0.17,19.61405668,0.35750453792477926,18.947677,19.357576,19.595454999999998,19.849596,20.330505
3,,,,,,,,,,,,,,,1.96423024,0.07664940166013474,1.793737,1.922222,1.955455,2.002929,2.1068689999999997
4,,,,,,,,,,,,,,,0.025155519999999997,0.0019517965681221318,0.022525,0.023737,0.024848,0.026061,0.030302999999999997
5,,,,,,,,,,,,,,,0.000101,,0.000101,0.000101,0.000101,0.000101,0.000101
