gossips,p2p mean,p2p std,p2p min,p2p q1,p2p q2,p2p q3,p2p max,p2s mean,p2s std,p2s min,p2s q1,p2s q2,p2s q3,p2s max,s2s mean,s2s std,s2s min,s2s q1,s2s q2,s2s q3,s2s max
1,34.342400000000005,0.45167539966957043,33.36,34.08,34.34,34.61,35.3,69.63,0.5104246598013534,68.54,69.36,69.57,69.89,70.76,52.75708272,0.17670664041274667,52.432929,52.672525,52.741918999999996,52.82939399999999,53.190303
2,0.04880000000000002,0.02147091055358389,0.02,0.03,0.05,0.06,0.11,0.7628,0.09427442212321784,0.52,0.71,0.78,0.83,0.91,21.768105040000002,0.20114449184634317,21.491919,21.635354,21.714747,21.830909,22.264242000000003
3,,,,,,,,,,,,,,,1.1859596799999998,0.022725341225380957,1.12596,1.1795959999999999,1.187778,1.195354,1.226566
4,,,,,,,,,,,,,,,0.015697,0.0014050551294047745,0.013838,0.014343,0.015758,0.016465,0.018484999999999998
5,,,,,,,,,,,,,,,,,,,,,
