gossips,p2p mean,p2p std,p2p min,p2p q1,p2p q2,p2p q3,p2p max,p2s mean,p2s std,p2s min,p2s q1,p2s q2,p2s q3,p2s max,s2s mean,s2s std,s2s min,s2s q1,s2s q2,s2s q3,s2s max
1,49.304759999999995,0.15169577010143173,49.097,49.194,49.247,49.39,49.682,49.30480000000001,0.15167756371109387,49.097,49.194,49.247,49.39,49.682,52.45134664000001,0.06315123312855134,52.316889,52.423667,52.451111,52.495111,52.556222
2,22.196559999999995,0.1582361315671396,21.941,22.07,22.206,22.287,22.481,22.196559999999995,0.1581392002846431,21.941,22.07,22.206,22.287,22.481,22.0593556,0.05478833008269233,21.898778,22.038889,22.061889,22.099,22.163778
3,2.0316,0.0354318594864377,1.971,2.007,2.033,2.058,2.086,2.03156,0.03550244123061579,1.971,2.007,2.033,2.058,2.086,0.7697866799999998,0.00828832759427378,0.754111,0.763333,0.768333,0.775,0.786778
4,0.021120000000000007,0.003778447653027189,0.013,0.019,0.02,0.024,0.028,0.021120000000000007,0.003778447653027189,0.013,0.019,0.02,0.024,0.028,0.001755560000000001,0.0004132007260400204,0.000889,0.001556,0.001889,0.002,0.002444
5,,,,,,,,,,,,,,,,,,,,,
