round,P mean,P std,P min,P q1,P q2,P q3,P max,S mean,S std,S min,S q1,S q2,S q3,S max,P+S mean,P+S std,P+S min,P+S q1,P+S q2,P+S q3,P+S max
0,0.0,0.0,0,0,0,0,0,1.0,0.0,1,1,1,1,1,0.0,0.0,0,0,0,0,0
1,0.0,0.0,0,0,0,0,0,1.0,0.0,1,1,1,1,1,0.0,0.0,0,0,0,0,0
2,0.08,0.27688746209726917,0,0,0,0,1,1.0,0.0,1,1,1,1,1,0.08,0.27688746209726917,0,0,0,0,1
3,1.0,0.0,1,1,1,1,1,1.0,0.0,1,1,1,1,1,1.0,0.0,1,1,1,1,1
4,1.0,0.0,1,1,1,1,1,1.0,0.0,1,1,1,1,1,1.0,0.0,1,1,1,1,1
5,1.0,0.0,1,1,1,1,1,1.0,0.0,1,1,1,1,1,1.0,0.0,1,1,1,1,1
6,1.0,0.0,1,1,1,1,1,1.0,0.0,1,1,1,1,1,1.0,0.0,1,1,1,1,1
7,1.0,0.0,1,1,1,1,1,1.0,0.0,1,1,1,1,1,1.0,0.0,1,1,1,1,1
8,1.0,0.0,1,1,1,1,1,1.0,0.0,1,1,1,1,1,1.0,0.0,1,1,1,1,1
9,1.0,0.0,1,1,1,1,1,1.0,0.0,1,1,1,1,1,1.0,0.0,1,1,1,1,1
10,1.0,0.0,1,1,1,1,1,1.0,0.0,1,1,1,1,1,1.0,0.0,1,1,1,1,1
11,1.0,0.0,1,1,1,1,1,1.0,0.0,1,1,1,1,1,1.0,0.0,1,1,1,1,1
12,1.0,0.0,1,1,1,1,1,1.0,0.0,1,1,1,1,1,1.0,0.0,1,1,1,1,1
13,1.0,0.0,1,1,1,1,1,1.0,0.0,1,1,1,1,1,1.0,0.0,1,1,1,1,1
14,1.0,0.0,1,1,1,1,1,1.0,0.0,1,1,1,1,1,1.0,0.0,1,1,1,1,1
15,1.0,0.0,1,1,1,1,1,1.0,0.0,1,1,1,1,1,1.0,0.0,1,1,1,1,1
16,1.0,0.0,1,1,1,1,1,1.0,0.0,1,1,1,1,1,1.0,0.0,1,1,1,1,1
17,1.0,0.0,1,1,1,1,1,1.0,0.0,1,1,1,1,1,1.0,0.0,1,1,1,1,1
18,1.0,0.0,1,1,1,1,1,1.0,0.0,1,1,1,1,1,1.0,0.0,1,1,1,1,1
19,1.64,0.4898979485566356,1,1,2,2,2,1.0,0.0,1,1,1,1,1,1.0,0.0,1,1,1,1,1
20,2.16,0.9433981132056605,1,1,3,3,3,1.0,0.0,1,1,1,1,1,1.0,0.0,1,1,1,1,1
21,2.44,1.260952021291849,1,1,3,4,4,1.0,0.0,1,1,1,1,1,1.0,0.0,1,1,1,1,1
22,2.8,1.5811388300841895,1,1,3,4,5,1.0,0.0,1,1,1,1,1,1.0,0.0,1,1,1,1,1
23,2.92,1.7776388834631178,1,1,3,4,6,1.0,0.0,1,1,1,1,1,1.0,0.0,1,1,1,1,1
24,3.04,2.009975124224178,1,1,3,4,7,1.0,0.0,1,1,1,1,1,1.0,0.0,1,1,1,1,1
25,3.12,2.1855586623714007,1,1,3,4,8,1.0,0.0,1,1,1,1,1,1.0,0.0,1,1,1,1,1
26,3.16,2.2854612955229263,1,1,3,4,9,1.0,0.0,1,1,1,1,1,1.0,0.0,1,1,1,1,1
27,3.2,2.3979157616563596,1,1,3,4,10,1.0,0.0,1,1,1,1,1,1.0,0.0,1,1,1,1,1
28,3.2,2.3979157616563596,1,1,3,4,10,1.0,0.0,1,1,1,1,1,1.0,0.0,1,1,1,1,1
29,3.2,2.3979157616563596,1,1,3,4,10,1.0,0.0,1,1,1,1,1,1.0,0.0,1,1,1,1,1
30,3.2,2.3979157616563596,1,1,3,4,10,1.0,0.0,1,1,1,1,1,1.0,0.0,1,1,1,1,1
31,3.2,2.3979157616563596,1,1,3,4,10,1.0,0.0,1,1,1,1,1,1.0,0.0,1,1,1,1,1
32,3.2,2.3979157616563596,1,1,3,4,10,1.0,0.0,1,1,1,1,1,1.0,0.0,1,1,1,1,1
33,3.2,2.3979157616563596,1,1,3,4,10,1.0,0.0,1,1,1,1,1,1.0,0.0,1,1,1,1,1
34,3.2,2.3979157616563596,1,1,3,4,10,1.0,0.0,1,1,1,1,1,1.0,0.0,1,1,1,1,1
35,3.2,2.3979157616563596,1,1,3,4,10,1.0,0.0,1,1,1,1,1,1.0,0.0,1,1,1,1,1
36,3.2,2.3979157616563596,1,1,3,4,10,1.0,0.0,1,1,1,1,1,1.0,0.0,1,1,1,1,1
37,3.2,2.3979157616563596,1,1,3,4,10,1.0,0.0,1,1,1,1,1,1.0,0.0,1,1,1,1,1
38,3.2,2.3979157616563596,1,1,3,4,10,1.0,0.0,1,1,1,1,1,1.0,0.0,1,1,1,1,1
39,3.2,2.3979157616563596,1,1,3,4,10,1.0,0.0,1,1,1,1,1,1.0,0.0,1,1,1,1,1
40,3.2,2.3979157616563596,1,1,3,4,10,1.0,0.0,1,1,1,1,1,1.0,0.0,1,1,1,1,1
41,3.2,2.3979157616563596,1,1,3,4,10,1.0,0.0,1,1,1,1,1,1.0,0.0,1,1,1,1,1
42,3.2,2.3979157616563596,1,1,3,4,10,1.0,0.0,1,1,1,1,1,1.0,0.0,1,1,1,1,1
43,3.2,2.3979157616563596,1,1,3,4,10,1.0,0.0,1,1,1,1,1,1.0,0.0,1,1,1,1,1
44,3.2,2.3979157616563596,1,1,3,4,10,1.0,0.0,1,1,1,1,1,1.0,0.0,1,1,1,1,1
45,3.2,2.3979157616563596,1,1,3,4,10,1.0,0.0,1,1,1,1,1,1.0,0.0,1,1,1,1,1
46,3.2,2.3979157616563596,1,1,3,4,10,1.0,0.0,1,1,1,1,1,1.0,0.0,1,1,1,1,1
47,3.2,2.3979157616563596,1,1,3,4,10,1.0,0.0,1,1,1,1,1,1.0,0.0,1,1,1,1,1
48,3.2,2.3979157616563596,1,1,3,4,10,1.0,0.0,1,1,1,1,1,1.0,0.0,1,1,1,1,1
49,3.2,2.3979157616563596,1,1,3,4,10,1.0,0.0,1,1,1,1,1,1.0,0.0,1,1,1,1,1
50,3.2,2.3979157616563596,1,1,3,4,10,1.0,0.0,1,1,1,1,1,1.0,0.0,1,1,1,1,1
