gossips,p2p mean,p2p std,p2p min,p2p q1,p2p q2,p2p q3,p2p max,p2s mean,p2s std,p2s min,p2s q1,p2s q2,p2s q3,p2s max,s2s mean,s2s std,s2s min,s2s q1,s2s q2,s2s q3,s2s max
1,0.14360000000000003,0.011708259193122317,0.116,0.139,0.144,0.151,0.164,1.0876800000000002,0.03649168855141308,0.999,1.065,1.094,1.109,1.16,65.40315551999998,0.26332168722545635,64.931556,65.251778,65.387333,65.524556,66.129
2,,,,,,,,,,,,,,,0.92087556,0.02648836131536515,0.865778,0.909222,0.923,0.936,0.975333
3,,,,,,,,,,,,,,,,,,,,,
