gossips,p2p mean,p2p std,p2p min,p2p q1,p2p q2,p2p q3,p2p max,p2s mean,p2s std,p2s min,p2s q1,p2s q2,p2s q3,p2s max,s2s mean,s2s std,s2s min,s2s q1,s2s q2,s2s q3,s2s max
1,49.28196,0.17166039147106735,48.949,49.193,49.263,49.431,49.569,58.26380000000002,0.15226949793047845,57.985,58.165,58.269,58.357,58.613,55.75041783999999,0.12455662669467497,55.462778,55.673556000000005,55.73344399999999,55.808333,56.026
2,22.216680000000007,0.1407390374653268,21.86,22.103,22.25,22.296,22.464,20.411839999999998,0.1902079300835445,19.894,20.327,20.426,20.542,20.851,21.406893320000005,0.1428639128106186,20.895111,21.372332999999998,21.429333,21.499444,21.630667000000003
3,2.04616,0.033615075982858254,1.992,2.017,2.042,2.066,2.105,0.32911999999999997,0.021766411432908885,0.284,0.318,0.33,0.343,0.367,0.4428800000000001,0.01944111730971243,0.395667,0.43211099999999997,0.445,0.457556,0.46888900000000006
4,0.02456000000000001,0.003905978323885921,0.015,0.023,0.025,0.026,0.031,0.0015555555555555561,0.0010416176459053668,0.001,0.001,0.001,0.00175,0.004,0.0020267200000000005,0.0004961613917533957,0.000667,0.001778,0.002111,0.002333,0.002778
5,0.001,0.0,0.001,0.001,0.001,0.001,0.001,,,,,,,,,,,,,,
