gossips,p2p mean,p2p std,p2p min,p2p q1,p2p q2,p2p q3,p2p max,p2s mean,p2s std,p2s min,p2s q1,p2s q2,p2s q3,p2s max,s2s mean,s2s std,s2s min,s2s q1,s2s q2,s2s q3,s2s max
1,49.517920000000004,0.15252265405506274,49.239,49.415,49.541,49.583,49.849,48.399400000000014,0.1676648442578231,48.099,48.298,48.419,48.51,48.724,56.66321775999999,0.1635457679046572,56.402443999999996,56.592778,56.632667000000005,56.726778,57.22055600000001
2,21.907639999999997,0.14211523493278255,21.731,21.782,21.881,21.988,22.219,14.7808,0.17833348909650548,14.42,14.746,14.797,14.891,15.217,21.03523564,0.16411657474106564,20.726556,20.906444,21.070667,21.137778,21.271667
3,1.81352,0.037485686157074254,1.756,1.787,1.811,1.839,1.893,0.018320000000000006,0.0044132376626085604,0.011,0.015,0.018,0.021,0.029,0.41206212000000003,0.016132665561214614,0.386889,0.399556,0.412444,0.415778,0.444111
4,0.0031250000000000015,0.0013290238326779875,0.001,0.002,0.003,0.004,0.006,,,,,,,,0.00051375,0.0002556382039217687,0.00022200000000000003,0.000333,0.00044400000000000006,0.00058375,0.001222
5,,,,,,,,,,,,,,,,,,,,,
