gossips,p2p mean,p2p std,p2p min,p2p q1,p2p q2,p2p q3,p2p max,p2s mean,p2s std,p2s min,p2s q1,p2s q2,p2s q3,p2s max,s2s mean,s2s std,s2s min,s2s q1,s2s q2,s2s q3,s2s max
1,49.261799999999994,0.1502642117516132,49.043,49.149,49.232,49.328,49.651,49.261799999999994,0.1502642117516132,49.043,49.149,49.232,49.328,49.651,52.10852448,0.056620195699149174,51.979222,52.061221999999994,52.097778000000005,52.157889000000004,52.2
2,22.22632,0.1410979919535822,21.998,22.098,22.235,22.316,22.589,22.22632,0.1410979919535822,21.998,22.098,22.235,22.316,22.589,22.417199999999998,0.061918385941361,22.298667000000002,22.378556,22.423111,22.449333,22.583333
3,2.0484800000000005,0.04181319568429716,1.995,2.011,2.044,2.082,2.14,2.0484800000000005,0.04181319568429716,1.995,2.011,2.044,2.082,2.14,1.0089377600000002,0.009386455571194078,0.991778,1.003778,1.008111,1.010556,1.027111
4,0.022800000000000008,0.003947573094109004,0.016,0.02,0.023,0.025,0.03,0.022800000000000008,0.003947573094109004,0.016,0.02,0.023,0.025,0.03,0.010257760000000003,0.001164710596385786,0.008667,0.009444,0.009889,0.010778,0.012889
5,0.001,0.0,0.001,0.001,0.001,0.001,0.001,0.001,0.0,0.001,0.001,0.001,0.001,0.001,0.00011100000000000001,0.0,0.00011100000000000001,0.00011100000000000001,0.00011100000000000001,0.00011100000000000001,0.00011100000000000001
