gossips,p2p mean,p2p std,p2p min,p2p q1,p2p q2,p2p q3,p2p max,p2s mean,p2s std,p2s min,p2s q1,p2s q2,p2s q3,p2s max,s2s mean,s2s std,s2s min,s2s q1,s2s q2,s2s q3,s2s max
1,41.46240000000001,1.1216664685487694,38.15,40.85,41.77,42.07,43.59,43.4792,1.2039065578357826,41.02,42.78,43.45,44.64,45.71,7.682896960000002,2.829443353951172,1.6836360000000001,6.04303,7.0805050000000005,9.255657000000001,14.613029999999998
2,20.921999999999997,3.2538694913389916,14.7,18.83,20.3,22.94,28.03,19.3508,3.9434660304525684,10.95,17.44,19.66,21.55,26.0,0.13124436,0.08986933554374003,0.010606,0.062020000000000006,0.119697,0.17414100000000002,0.43272700000000003
3,5.1392,1.9377390605204476,2.79,3.75,4.58,6.1,11.01,3.4915999999999996,1.4838847664155057,1.0,2.45,3.47,4.31,7.0,0.0006427272727272727,0.0008939365153669993,0.000101,0.00022725,0.00045450000000000004,0.0006565,0.004444
4,0.6503999999999999,0.4551325814163018,0.2,0.35,0.62,0.71,2.0,0.2568,0.20175727991822254,0.03,0.12,0.2,0.27,0.78,0.000101,,0.000101,0.000101,0.000101,0.000101,0.000101
5,0.04375000000000001,0.04670094496762957,0.01,0.02,0.02,0.05,0.2,0.011,0.00316227766016838,0.01,0.01,0.01,0.01,0.02,,,,,,,
6,0.01,0.0,0.01,0.01,0.01,0.01,0.01,,,,,,,,,,,,,,
7,,,,,,,,,,,,,,,,,,,,,
