gossips,p2p mean,p2p std,p2p min,p2p q1,p2p q2,p2p q3,p2p max,p2s mean,p2s std,p2s min,p2s q1,p2s q2,p2s q3,p2s max,s2s mean,s2s std,s2s min,s2s q1,s2s q2,s2s q3,s2s max
1,0.001,,0.001,0.001,0.001,0.001,0.001,0.16575999999999994,0.015825296205758677,0.126,0.156,0.17,0.175,0.194,69.97695567999999,0.11176126385765484,69.773556,69.92155600000001,69.983222,70.04566700000001,70.2
2,,,,,,,,0.001,,0.001,0.001,0.001,0.001,0.001,4.336764440000001,0.09623815582063418,4.204889,4.267778,4.329222,4.378222,4.619111
3,,,,,,,,,,,,,,,0.00017020000000000002,7.103339254986248e-05,0.00011100000000000001,0.00011100000000000001,0.00011100000000000001,0.00022200000000000003,0.000333
4,,,,,,,,,,,,,,,,,,,,,
5,,,,,,,,,,,,,,,,,,,,,
