round,nodes,nodesP,nodesS,nodesSent,nodesSentP,nodesSentS,nodesRecv,nodesRecvP,nodesRecvS,msgSent,msgSentP,msgSentS,msgRecv,msgRecvP,msgRecvS,msgInfect,msgInfectP,msgInfectS
00,10000.000000,1000.000000,9000.000000,0.000000,0.000000,0.000000,0.000000,0.000000,0.000000,0.000000,0.000000,0.000000,0.000000,0.000000,0.000000,0.000000,0.000000,0.000000
01,10000.000000,1000.000000,9000.000000,0.010000,0.100000,0.000000,0.010000,0.100000,0.000000,10.000000,10.000000,0.000000,1.000000,1.000000,0.000000,0.100000,1.000000,0.000000
02,10000.000000,1000.000000,9000.000000,0.122000,1.220000,0.000000,0.122000,1.220000,0.000000,122.000000,122.000000,0.000000,12.200000,12.200000,0.000000,0.100000,1.000000,0.000000
03,10000.000000,1000.000000,9000.000000,1.102000,11.020000,0.000000,1.102000,11.020000,0.000000,1102.000000,1102.000000,0.000000,116.200000,116.200000,0.000000,0.100000,1.000000,0.000000
04,10000.000000,1000.000000,9000.000000,6.656000,65.440000,0.124444,6.656000,65.440000,0.124444,6656.000000,6544.000000,112.000000,1076.700000,1065.500000,11.200000,1.000000,1.000000,1.000000
05,10000.000000,1000.000000,9000.000000,33.827000,97.990000,26.697778,33.827000,97.990000,26.697778,33827.000000,9799.000000,24028.000000,6649.000000,3852.600000,2796.400000,1.220000,3.200000,1.000000
06,10000.000000,1000.000000,9000.000000,85.186000,100.000000,83.540000,85.186000,100.000000,83.540000,85186.000000,10000.000000,75186.000000,33559.100000,17307.400000,16251.700000,3.490000,16.900000,2.000000
07,10000.000000,1000.000000,9000.000000,99.182000,100.000000,99.091111,99.182000,100.000000,99.091111,99182.000000,10000.000000,89182.000000,85060.700000,43015.500000,42045.200000,7.850000,42.500000,4.000000
08,10000.000000,1000.000000,9000.000000,99.811000,100.000000,99.790000,99.811000,100.000000,99.790000,99811.000000,10000.000000,89811.000000,99169.800000,43015.500000,56154.300000,9.650000,42.500000,6.000000
09,10000.000000,1000.000000,9000.000000,99.827000,100.000000,99.807778,99.827000,100.000000,99.807778,99827.000000,10000.000000,89827.000000,99812.000000,43015.500000,56796.500000,9.650000,42.500000,6.000000
10,10000.000000,1000.000000,9000.000000,99.827000,100.000000,99.807778,99.827000,100.000000,99.807778,99827.000000,10000.000000,89827.000000,99828.000000,43015.500000,56812.500000,9.650000,42.500000,6.000000
11,10000.000000,1000.000000,9000.000000,99.827000,100.000000,99.807778,99.827000,100.000000,99.807778,99827.000000,10000.000000,89827.000000,99828.000000,43015.500000,56812.500000,9.650000,42.500000,6.000000
12,10000.000000,1000.000000,9000.000000,99.827000,100.000000,99.807778,99.827000,100.000000,99.807778,99827.000000,10000.000000,89827.000000,99828.000000,43015.500000,56812.500000,9.650000,42.500000,6.000000
13,10000.000000,1000.000000,9000.000000,99.827000,100.000000,99.807778,99.827000,100.000000,99.807778,99827.000000,10000.000000,89827.000000,99828.000000,43015.500000,56812.500000,9.650000,42.500000,6.000000
14,10000.000000,1000.000000,9000.000000,99.827000,100.000000,99.807778,99.827000,100.000000,99.807778,99827.000000,10000.000000,89827.000000,99828.000000,43015.500000,56812.500000,9.650000,42.500000,6.000000
15,10000.000000,1000.000000,9000.000000,99.827000,100.000000,99.807778,99.827000,100.000000,99.807778,99827.000000,10000.000000,89827.000000,99828.000000,43015.500000,56812.500000,9.650000,42.500000,6.000000
16,10000.000000,1000.000000,9000.000000,99.827000,100.000000,99.807778,99.827000,100.000000,99.807778,99827.000000,10000.000000,89827.000000,99828.000000,43015.500000,56812.500000,9.650000,42.500000,6.000000
17,10000.000000,1000.000000,9000.000000,99.827000,100.000000,99.807778,99.827000,100.000000,99.807778,99827.000000,10000.000000,89827.000000,99828.000000,43015.500000,56812.500000,9.650000,42.500000,6.000000
18,10000.000000,1000.000000,9000.000000,99.827000,100.000000,99.807778,99.827000,100.000000,99.807778,99827.000000,10000.000000,89827.000000,99828.000000,43015.500000,56812.500000,9.650000,42.500000,6.000000
19,10000.000000,1000.000000,9000.000000,99.827000,100.000000,99.807778,99.827000,100.000000,99.807778,99827.000000,10000.000000,89827.000000,99828.000000,43015.500000,56812.500000,9.650000,42.500000,6.000000
