,mean,std,sem,cistd,cisem,min,05th,25th,50th,75th,95th,max
Uniform,,,,,,,,,,,,
P,5.418562251453044,2.2615239465002386,0.0039554362984395965,0.003955430248517107,6.918101577099028e-06,1.0,2.0,4.0,5.0,7.0,9.0,20.0
S,10.813035644674159,3.286855021318912,0.0006906914464549181,0.0006906914312052242,1.4514015999456121e-07,2.0,6.0,8.0,11.0,13.0,17.0,32.0
P+S,10.736273567691013,3.3362647433641386,0.0006960683484533629,0.000696068333303642,1.4522562579514955e-07,1.0,6.0,8.0,10.0,13.0,17.0,32.0
