round,P mean,P std,P min,P q1,P q2,P q3,P max,S mean,S std,S min,S q1,S q2,S q3,S max,P+S mean,P+S std,P+S min,P+S q1,P+S q2,P+S q3,P+S max
0,100.0,0.0,100.0,100.0,100.0,100.0,100.0,100.0,0.0,100.0,100.0,100.0,100.0,100.0,100.0,0.0,100.0,100.0,100.0,100.0,100.0
1,99.99959999999999,0.0020000000000010027,99.99,100.0,100.0,100.0,100.0,99.99990303999998,2.0199999999840927e-05,99.999899,99.999899,99.999899,99.999899,100.0,99.99989999999998,0.0,99.9999,99.9999,99.9999,99.9999,99.9999
2,99.90000000000003,0.004082482904637407,99.89,99.9,99.9,99.9,99.91,99.99980203999999,2.0199999999840927e-05,99.999798,99.999798,99.999798,99.999798,99.999899,99.998804,3.5118845843000165e-05,99.9987,99.9988,99.9988,99.9988,99.9989
3,98.90920000000001,0.03187475490101964,98.85,98.89,98.91,98.94,98.96,99.98963639999997,5.831237718861348e-05,99.98959599999999,99.98959599999999,99.98959599999999,99.98969699999999,99.989798,99.978832,0.00032878564445608805,99.9782,99.9786,99.9788,99.9791,99.9794
4,95.2128,0.15857490343682992,94.88,95.09,95.21,95.3,95.53,99.77475960000001,0.0018563975418359458,99.77181800000001,99.773333,99.77494899999999,99.77555600000001,99.77909100000001,99.72914,0.002761038451983862,99.7233,99.7276,99.7289,99.7304,99.7366
5,95.19959999999998,0.13682348726248278,94.91,95.1,95.2,95.33,95.39,97.62711108000002,0.01964621279432864,97.590101,97.616162,97.623636,97.63161600000001,97.674949,97.60283600000001,0.019144905327529122,97.5679,97.592,97.6006,97.6066,97.6493
6,95.10600000000001,0.18441348468410013,94.65,95.03,95.1,95.22,95.39,96.4415314,0.023271463256172686,96.383535,96.423939,96.446061,96.45596,96.490202,96.42817600000002,0.02302157104398577,96.3706,96.4131,96.4336,96.4421,96.4783
7,95.1432,0.17869247326062634,94.82,95.04,95.15,95.25,95.49,96.44746272000002,0.020724602783725603,96.405455,96.431313,96.447172,96.455253,96.50101,96.43441999999996,0.020256377596535088,96.3915,96.4193,96.4347,96.4445,96.487
8,95.13999999999999,0.16083117442420158,94.85,95.07,95.13,95.24,95.5,96.43724851999997,0.022314810502444972,96.408283,96.41888900000001,96.42818199999999,96.457677,96.47798,96.42427599999999,0.021507930320387628,96.3963,96.4068,96.4172,96.4422,96.4617
9,95.094,0.18553975315279678,94.74,94.99,95.08,95.21,95.6,96.43353536000001,0.023469019371080004,96.381919,96.417677,96.431111,96.451616,96.476667,96.42013999999999,0.023882577331605256,96.368,96.4011,96.4189,96.438,96.4659
10,95.09720000000002,0.19631012879285337,94.65,95.02,95.1,95.24,95.42,96.42594752000001,0.028931634148625495,96.385354,96.40434300000001,96.426061,96.439596,96.53101,96.41266000000002,0.028875335495884995,96.3693,96.3937,96.4098,96.425,96.5191
11,95.17399999999998,0.21439838307848103,94.64,95.04,95.21,95.32,95.64,96.39581420000002,0.03239510795886562,96.361717,96.376768,96.387273,96.399899,96.506566,96.38359599999998,0.03277847972883065,96.3519,96.3633,96.3762,96.3891,96.4931
12,96.20720000000003,0.14046114527986897,96.0,96.12,96.17,96.26,96.49,96.43012931999999,0.0282794497187127,96.378586,96.415051,96.428485,96.43899,96.522929,96.4279,0.027979367398137125,96.3748,96.4133,96.4259,96.4377,96.5183
13,99.87680000000002,0.03300505011862632,99.8,99.86,99.88,99.9,99.93,96.65415347999996,0.027084052163464854,96.62303,96.63596,96.650707,96.664242,96.723333,96.68638000000001,0.026803093726905303,96.6555,96.6689,96.6832,96.696,96.7551
14,99.9604,0.017194960502037747,99.92,99.95,99.96,99.97,99.99,98.78888884,0.016493051902439753,98.762626,98.77596,98.790707,98.798889,98.81979799999999,98.800604,0.016277681038771367,98.7745,98.7879,98.8026,98.8105,98.831
15,99.9604,0.017194960502037747,99.92,99.95,99.96,99.97,99.99,99.96172516,0.002079038834010397,99.95636400000001,99.960707,99.96202,99.962828,99.965758,99.96171199999999,0.0020247057399359627,99.9564,99.9607,99.9619,99.9627,99.9656
16,99.9604,0.017194960502037747,99.92,99.95,99.96,99.97,99.99,99.96331696000001,0.00210665021380621,99.95798,99.962424,99.963535,99.964343,99.967475,99.96328799999998,0.002051893434530412,99.958,99.9625,99.9635,99.9645,99.9672
17,99.9604,0.017194960502037747,99.92,99.95,99.96,99.97,99.99,99.96331292,0.002110343493366894,99.95798,99.962424,99.963535,99.964343,99.967475,99.96328399999999,0.0020556183173610822,99.958,99.9625,99.9635,99.9645,99.9672
18,99.9604,0.017194960502037747,99.92,99.95,99.96,99.97,99.99,99.96331292,0.002110343493366894,99.95798,99.962424,99.963535,99.964343,99.967475,99.96328399999999,0.0020556183173610822,99.958,99.9625,99.9635,99.9645,99.9672
19,99.9604,0.017194960502037747,99.92,99.95,99.96,99.97,99.99,99.96331292,0.002110343493366894,99.95798,99.962424,99.963535,99.964343,99.967475,99.96328399999999,0.0020556183173610822,99.958,99.9625,99.9635,99.9645,99.9672
20,99.9604,0.017194960502037747,99.92,99.95,99.96,99.97,99.99,99.96331292,0.002110343493366894,99.95798,99.962424,99.963535,99.964343,99.967475,99.96328399999999,0.0020556183173610822,99.958,99.9625,99.9635,99.9645,99.9672
21,99.9604,0.017194960502037747,99.92,99.95,99.96,99.97,99.99,99.96331292,0.002110343493366894,99.95798,99.962424,99.963535,99.964343,99.967475,99.96328399999999,0.0020556183173610822,99.958,99.9625,99.9635,99.9645,99.9672
22,99.9604,0.017194960502037747,99.92,99.95,99.96,99.97,99.99,99.96331292,0.002110343493366894,99.95798,99.962424,99.963535,99.964343,99.967475,99.96328399999999,0.0020556183173610822,99.958,99.9625,99.9635,99.9645,99.9672
23,99.9604,0.017194960502037747,99.92,99.95,99.96,99.97,99.99,99.96331292,0.002110343493366894,99.95798,99.962424,99.963535,99.964343,99.967475,99.96328399999999,0.0020556183173610822,99.958,99.9625,99.9635,99.9645,99.9672
24,99.9604,0.017194960502037747,99.92,99.95,99.96,99.97,99.99,99.96331292,0.002110343493366894,99.95798,99.962424,99.963535,99.964343,99.967475,99.96328399999999,0.0020556183173610822,99.958,99.9625,99.9635,99.9645,99.9672
25,99.9604,0.017194960502037747,99.92,99.95,99.96,99.97,99.99,99.96331292,0.002110343493366894,99.95798,99.962424,99.963535,99.964343,99.967475,99.96328399999999,0.0020556183173610822,99.958,99.9625,99.9635,99.9645,99.9672
