gossips,p2p mean,p2p std,p2p min,p2p q1,p2p q2,p2p q3,p2p max,p2s mean,p2s std,p2s min,p2s q1,p2s q2,p2s q3,p2s max,s2s mean,s2s std,s2s min,s2s q1,s2s q2,s2s q3,s2s max
1,1102.04,5.17590571784298,1086.0,1098.0,1103.0,1106.0,1109.0,5.92,2.6602004936971695,1.0,4.0,6.0,8.0,10.0,10.0,,10.0,10.0,10.0,10.0,10.0
2,1.7692307692307692,1.2351684199496948,1.0,1.0,1.0,2.0,5.0,,,,,,,,,,,,,,
3,,,,,,,,,,,,,,,,,,,,,
4,,,,,,,,,,,,,,,,,,,,,
5,,,,,,,,,,,,,,,,,,,,,
