gossips,p2p mean,p2p std,p2p min,p2p q1,p2p q2,p2p q3,p2p max,p2s mean,p2s std,p2s min,p2s q1,p2s q2,p2s q3,p2s max,s2s mean,s2s std,s2s min,s2s q1,s2s q2,s2s q3,s2s max
1,0.14468,0.013387556411334621,0.122,0.133,0.146,0.154,0.177,1.0796,0.040313355934065695,1.008,1.057,1.085,1.102,1.177,65.57870664000001,0.3927110415111085,65.087111,65.338444,65.40355600000001,65.691,66.61
2,,,,,,,,,,,,,,,0.92797332,0.028450900442282424,0.8797780000000001,0.907889,0.926111,0.945667,0.985
3,,,,,,,,,,,,,,,,,,,,,
4,,,,,,,,,,,,,,,,,,,,,
5,,,,,,,,,,,,,,,,,,,,,
