gossips,p2p mean,p2p std,p2p min,p2p q1,p2p q2,p2p q3,p2p max,p2s mean,p2s std,p2s min,p2s q1,p2s q2,p2s q3,p2s max,s2s mean,s2s std,s2s min,s2s q1,s2s q2,s2s q3,s2s max
1,0.2333333333333333,0.23094010767585033,0.1,0.1,0.1,0.3,0.5,0.17500000000000004,0.21213203435596426,0.1,0.1,0.1,0.1,0.7,42.40904095999999,1.6002164918518451,37.225726,42.053954,42.922422,43.445445,43.935435
2,,,,,,,,,,,,,,,15.270422439999997,3.4549780362106275,6.961761999999999,13.023524,16.015015,17.720821,20.477578
3,,,,,,,,,,,,,,,2.0973172800000004,0.9640152869880367,0.509409,1.3031030000000001,2.066867,2.568869,3.997898
4,,,,,,,,,,,,,,,0.07998403999999999,0.0747775481174441,0.014815,0.027527999999999997,0.058959000000000004,0.088188,0.343944
5,,,,,,,,,,,,,,,0.0011439523809523811,0.0022261891985226787,0.0001,0.0002,0.0004,0.001101,0.00971
6,,,,,,,,,,,,,,,,,,,,,
7,,,,,,,,,,,,,,,,,,,,,
