,mean,std,min,q1,q2,q3,max
Simple,,,,,,,
P,3.232785173688337,0.6559697540307361,1.0,3.0,3.0,4.0,5.0
S,6.629238510490306,0.6246950161431213,3.0,6.0,7.0,7.0,10.0
P+S,6.625842064177692,0.6338834680987907,1.0,6.0,7.0,7.0,10.0
