gossips,p2p mean,p2p std,p2p min,p2p q1,p2p q2,p2p q3,p2p max,p2s mean,p2s std,p2s min,p2s q1,p2s q2,p2s q3,p2s max,s2s mean,s2s std,s2s min,s2s q1,s2s q2,s2s q3,s2s max
1,48.94,1.3943337716151987,45.8,48.1,48.9,49.8,51.9,58.136,1.4823629784907626,55.1,56.9,58.0,59.1,60.5,52.21032231999999,0.26921969980261673,51.689089,52.016917,52.156056,52.361762,52.816416000000004
2,22.592,1.2967652061957862,19.8,21.8,22.8,23.5,24.7,20.436,1.2890177138684582,18.1,19.9,20.4,21.2,23.3,21.745145119999997,0.6770968217570713,20.660860999999997,21.226526999999997,21.598599,22.295395000000003,23.109209
3,2.0080000000000005,0.3604626656580863,1.3,1.7,2.0,2.2,2.8,0.29565217391304344,0.1460954260673022,0.1,0.2,0.3,0.35,0.6,1.3846045999999999,0.08016612753370327,1.24985,1.324424,1.386887,1.448348,1.5294290000000001
4,0.1,0.0,0.1,0.1,0.1,0.1,0.1,,,,,,,,0.027123120000000004,0.0036890498361140805,0.01992,0.023824,0.027727999999999996,0.03013,0.033433
5,,,,,,,,,,,,,,,0.00020004999999999996,0.00011253091972758793,0.0001,0.0001,0.0002,0.000225,0.0005009999999999999
6,,,,,,,,,,,,,,,0.0001,,0.0001,0.0001,0.0001,0.0001,0.0001
