round,nodes,nodesP,nodesS,nodesSent,nodesSentP,nodesSentS,nodesRecv,nodesRecvP,nodesRecvS,msgSent,msgSentP,msgSentS,msgRecv,msgRecvP,msgRecvS,msgInfect,msgInfectP,msgInfectS
00,100000.000000,1000.000000,99000.000000,0.000000,0.000000,0.000000,0.000000,0.000000,0.000000,0.000000,0.000000,0.000000,0.000000,0.000000,0.000000,0.000000,0.000000,0.000000
01,100000.000000,1000.000000,99000.000000,0.001000,0.100000,0.000000,0.001000,0.100000,0.000000,17.000000,17.000000,0.000000,1.000000,1.000000,0.000000,0.010000,1.000000,0.000000
02,100000.000000,1000.000000,99000.000000,0.019600,1.960000,0.000000,0.019600,1.960000,0.000000,333.200000,333.200000,0.000000,19.600000,19.600000,0.000000,0.010000,1.000000,0.000000
03,100000.000000,1000.000000,99000.000000,0.286000,28.600000,0.000000,0.286000,28.600000,0.000000,4862.000000,4862.000000,0.000000,333.800000,333.800000,0.000000,0.010000,1.000000,0.000000
04,100000.000000,1000.000000,99000.000000,1.018400,98.960000,0.029091,1.018400,98.960000,0.029091,17312.800000,16823.200000,489.600000,4569.800000,4541.000000,28.800000,1.030000,4.000000,1.000000
05,100000.000000,1000.000000,99000.000000,7.251000,100.000000,6.314141,7.251000,100.000000,6.314141,123267.000000,17000.000000,106267.000000,17487.900000,11027.200000,6460.700000,1.095000,10.500000,1.000000
06,100000.000000,1000.000000,99000.000000,66.721700,100.000000,66.385555,66.721700,100.000000,66.385555,1134268.900000,17000.000000,1117268.900000,118969.400000,11027.200000,107942.200000,1.095000,10.500000,1.000000
07,100000.000000,1000.000000,99000.000000,99.997900,100.000000,99.997879,99.997900,100.000000,99.997879,1699964.300000,17000.000000,1682964.300000,1101303.300000,11027.200000,1090276.100000,10.599000,10.500000,10.600000
08,100000.000000,1000.000000,99000.000000,100.000000,100.000000,100.000000,100.000000,100.000000,100.000000,1700000.000000,17000.000000,1683000.000000,1699962.000000,11027.200000,1688934.800000,16.935000,10.500000,17.000000
09,100000.000000,1000.000000,99000.000000,100.000000,100.000000,100.000000,100.000000,100.000000,100.000000,1700000.000000,17000.000000,1683000.000000,1700001.000000,11027.200000,1688973.800000,16.935000,10.500000,17.000000
10,100000.000000,1000.000000,99000.000000,100.000000,100.000000,100.000000,100.000000,100.000000,100.000000,1700000.000000,17000.000000,1683000.000000,1700001.000000,11027.200000,1688973.800000,16.935000,10.500000,17.000000
11,100000.000000,1000.000000,99000.000000,100.000000,100.000000,100.000000,100.000000,100.000000,100.000000,1700000.000000,17000.000000,1683000.000000,1700001.000000,11027.200000,1688973.800000,16.935000,10.500000,17.000000
12,100000.000000,1000.000000,99000.000000,100.000000,100.000000,100.000000,100.000000,100.000000,100.000000,1700000.000000,17000.000000,1683000.000000,1700001.000000,11027.200000,1688973.800000,16.935000,10.500000,17.000000
13,100000.000000,1000.000000,99000.000000,100.000000,100.000000,100.000000,100.000000,100.000000,100.000000,1700000.000000,17000.000000,1683000.000000,1700001.000000,11027.200000,1688973.800000,16.935000,10.500000,17.000000
14,100000.000000,1000.000000,99000.000000,100.000000,100.000000,100.000000,100.000000,100.000000,100.000000,1700000.000000,17000.000000,1683000.000000,1700001.000000,11027.200000,1688973.800000,16.935000,10.500000,17.000000
15,100000.000000,1000.000000,99000.000000,100.000000,100.000000,100.000000,100.000000,100.000000,100.000000,1700000.000000,17000.000000,1683000.000000,1700001.000000,11027.200000,1688973.800000,16.935000,10.500000,17.000000
16,100000.000000,1000.000000,99000.000000,100.000000,100.000000,100.000000,100.000000,100.000000,100.000000,1700000.000000,17000.000000,1683000.000000,1700001.000000,11027.200000,1688973.800000,16.935000,10.500000,17.000000
17,100000.000000,1000.000000,99000.000000,100.000000,100.000000,100.000000,100.000000,100.000000,100.000000,1700000.000000,17000.000000,1683000.000000,1700001.000000,11027.200000,1688973.800000,16.935000,10.500000,17.000000
18,100000.000000,1000.000000,99000.000000,100.000000,100.000000,100.000000,100.000000,100.000000,100.000000,1700000.000000,17000.000000,1683000.000000,1700001.000000,11027.200000,1688973.800000,16.935000,10.500000,17.000000
19,100000.000000,1000.000000,99000.000000,100.000000,100.000000,100.000000,100.000000,100.000000,100.000000,1700000.000000,17000.000000,1683000.000000,1700001.000000,11027.200000,1688973.800000,16.935000,10.500000,17.000000
