round,P mean,P std,P min,P q1,P q2,P q3,P max,S mean,S std,S min,S q1,S q2,S q3,S max,P+S mean,P+S std,P+S min,P+S q1,P+S q2,P+S q3,P+S max
0,100.0,0.0,100.0,100.0,100.0,100.0,100.0,100.0,0.0,100.0,100.0,100.0,100.0,100.0,100.0,0.0,100.0,100.0,100.0,100.0,100.0
1,100.0,0.0,100.0,100.0,100.0,100.0,100.0,99.99989899999997,0.0,99.999899,99.999899,99.999899,99.999899,99.999899,99.99989999999998,0.0,99.9999,99.9999,99.9999,99.9999,99.9999
2,99.90120000000005,0.0033166247903502165,99.9,99.9,99.9,99.9,99.91,99.99978992,2.796563367268524e-05,99.999697,99.999798,99.999798,99.999798,99.999798,99.998804,4.546060565498261e-05,99.9987,99.9988,99.9988,99.9988,99.9989
3,98.91680000000002,0.030919249667479123,98.84,98.9,98.92,98.94,98.97,99.99970104000002,2.0199999999797508e-05,99.999697,99.999697,99.999697,99.999697,99.999798,99.98887199999997,0.00031026870075093616,99.9881,99.9887,99.9889,99.9891,99.9894
4,95.27320000000002,0.159366454019241,94.98,95.16,95.29,95.39,95.5,99.99960408000007,2.796563367051528e-05,99.999596,99.999596,99.999596,99.999596,99.999697,99.95234,0.0015973937106004757,99.9494,99.9512,99.9525,99.9535,99.9546
5,95.12080000000002,0.13552121605121367,94.86,95.03,95.12,95.23,95.35,99.99950712000002,3.349791038074688e-05,99.999495,99.999495,99.999495,99.999495,99.999596,99.95071999999999,0.0013647344063954009,99.9481,99.9498,99.9507,99.9518,99.953
6,95.13399999999997,0.19198524248840984,94.72,94.99,95.16,95.27,95.43,99.99475536,0.0006753473106518089,99.993535,99.994444,99.994646,99.995253,99.995859,99.946148,0.0019068123487440173,99.9424,99.9452,99.9463,99.9477,99.9488
7,95.15039999999999,0.18660296532120452,94.75,95.06,95.16,95.27,95.52,98.99300199999999,0.040326447670850765,98.895253,98.96343399999999,98.982626,99.027677,99.06959599999999,98.954576,0.03950476005074465,98.8574,98.9281,98.9439,98.988,99.028
8,95.14400000000002,0.14416425816870795,94.83,95.04,95.15,95.19,95.41,96.04700604,0.10600861149748003,95.867879,95.966162,96.04767700000001,96.12,96.225657,96.03797600000001,0.10488104086694279,95.8575,95.9582,96.0391,96.1092,96.2135
9,95.156,0.16075343438529252,94.84,95.04,95.14,95.29,95.43,95.95983843999998,0.15961127656906665,95.623131,95.852525,95.985354,96.038485,96.41161600000001,95.95179999999999,0.15851611642563715,95.6178,95.8444,95.9751,96.0315,96.3994
10,95.10759999999999,0.18216933514361291,94.8,94.98,95.09,95.24,95.44,96.06797168000003,0.15474724519511293,95.743838,95.979091,96.057576,96.148586,96.356162,96.05836800000002,0.1531682699952361,95.735,95.9691,96.05,96.1354,96.3448
11,95.19,0.1726509001810691,94.9,95.08,95.15,95.3,95.52,95.91050904000002,0.13319613707407704,95.61525300000001,95.842626,95.889899,96.002424,96.253737,95.90330399999999,0.13133460917316084,95.6143,95.8332,95.8845,95.9932,96.2416
12,96.15440000000001,0.20281518680809113,95.79,96.03,96.14,96.24,96.72,95.95291724,0.12433342706048603,95.75676800000001,95.84050500000001,95.94828299999999,96.056061,96.170707,95.95493199999999,0.12338541485929409,95.7571,95.8435,95.9492,96.0571,96.1697
13,99.8696,0.04025750447639188,99.79,99.85,99.88,99.9,99.96,96.01862228,0.11717146711284578,95.832121,95.912929,96.037778,96.08818199999999,96.308788,96.05713200000002,0.11601032899415899,95.8718,95.9526,96.0761,96.1262,96.3444
14,99.9584,0.024440403706429113,99.92,99.94,99.96,99.97,100.0,96.00016568,0.12007260638384983,95.72444399999999,95.924646,96.000202,96.097778,96.195859,96.039748,0.11884408946178009,95.7664,95.9651,96.0399,96.1368,96.2335
15,99.95880000000001,0.024207436873818673,99.92,99.94,99.96,99.97,100.0,96.04332124000001,0.1603716897902814,95.77696999999999,95.938485,96.057475,96.143434,96.41696999999999,96.08247600000003,0.15870212474947445,95.8187,95.9787,96.0961,96.1818,96.4522
16,99.95880000000001,0.024207436873818673,99.92,99.94,99.96,99.97,100.0,96.92985448000002,0.15160161726053747,96.545152,96.831919,96.94100999999999,97.034141,97.21737399999999,96.960144,0.15020713498366248,96.579,96.863,96.9713,97.0638,97.2448
17,99.95880000000001,0.024207436873818673,99.92,99.94,99.96,99.97,100.0,99.94313123999999,0.003051956589358107,99.936364,99.942222,99.943333,99.944949,99.94798,99.943288,0.0030868430475130162,99.9363,99.942,99.9437,99.9452,99.948
18,99.95880000000001,0.024207436873818673,99.92,99.94,99.96,99.97,100.0,99.96147464000003,0.002250784027838707,99.956263,99.960606,99.961515,99.962929,99.966061,99.96144799999998,0.0022243201208483757,99.9566,99.9607,99.9616,99.963,99.9662
19,99.95880000000001,0.024207436873818673,99.92,99.94,99.96,99.97,100.0,99.96147868000001,0.002255100509949765,99.956263,99.960606,99.961515,99.962929,99.966061,99.961452,0.0022275023381959007,99.9566,99.9607,99.9616,99.963,99.9662
20,99.95880000000001,0.024207436873818673,99.92,99.94,99.96,99.97,100.0,99.96147868000001,0.002255100509949765,99.956263,99.960606,99.961515,99.962929,99.966061,99.961452,0.0022275023381959007,99.9566,99.9607,99.9616,99.963,99.9662
21,99.95880000000001,0.024207436873818673,99.92,99.94,99.96,99.97,100.0,99.96147868000001,0.002255100509949765,99.956263,99.960606,99.961515,99.962929,99.966061,99.961452,0.0022275023381959007,99.9566,99.9607,99.9616,99.963,99.9662
22,99.95880000000001,0.024207436873818673,99.92,99.94,99.96,99.97,100.0,99.96147868000001,0.002255100509949765,99.956263,99.960606,99.961515,99.962929,99.966061,99.961452,0.0022275023381959007,99.9566,99.9607,99.9616,99.963,99.9662
23,99.95880000000001,0.024207436873818673,99.92,99.94,99.96,99.97,100.0,99.96147868000001,0.002255100509949765,99.956263,99.960606,99.961515,99.962929,99.966061,99.961452,0.0022275023381959007,99.9566,99.9607,99.9616,99.963,99.9662
24,99.95880000000001,0.024207436873818673,99.92,99.94,99.96,99.97,100.0,99.96147868000001,0.002255100509949765,99.956263,99.960606,99.961515,99.962929,99.966061,99.961452,0.0022275023381959007,99.9566,99.9607,99.9616,99.963,99.9662
25,99.95880000000001,0.024207436873818673,99.92,99.94,99.96,99.97,100.0,99.96147868000001,0.002255100509949765,99.956263,99.960606,99.961515,99.962929,99.966061,99.961452,0.0022275023381959007,99.9566,99.9607,99.9616,99.963,99.9662
