gossips,p2p mean,p2p std,p2p min,p2p q1,p2p q2,p2p q3,p2p max,p2s mean,p2s std,p2s min,p2s q1,p2s q2,p2s q3,p2s max,s2s mean,s2s std,s2s min,s2s q1,s2s q2,s2s q3,s2s max
1,49.21520000000001,0.17492974780370116,48.902,49.065,49.206,49.345,49.614,67.12467999999998,0.20554454505045747,66.609,67.018,67.155,67.239,67.45,53.93178664,0.03838446712417149,53.856778000000006,53.903889,53.938221999999996,53.960111,53.996111
2,22.273840000000003,0.12764229967634788,22.006,22.214,22.279,22.384,22.449,14.911040000000003,0.17518953545612662,14.586,14.807,14.934,15.009,15.349,22.76379112,0.06479501804943516,22.663667,22.716222,22.757667,22.816,22.897555999999998
3,2.0405999999999995,0.04779469984562438,1.946,2.019,2.039,2.064,2.155,0.06728,0.009094503834734471,0.051,0.06,0.066,0.073,0.088,0.19629784,0.017736010065870698,0.116,0.194333,0.19955599999999998,0.201889,0.211222
4,0.020200000000000006,0.0034156502553198665,0.013,0.018,0.02,0.022,0.026,,,,,,,,0.0001828235294117647,9.565643946836359e-05,0.00011100000000000001,0.00011100000000000001,0.00011100000000000001,0.00022200000000000003,0.00044400000000000006
5,0.001,,0.001,0.001,0.001,0.001,0.001,,,,,,,,,,,,,,
