round,P mean,P std,P min,P 05th,P 25th,P 50th,P 75th,P 95th,P max,S mean,S std,S min,S 05th,S 25th,S 50th,S 75th,S 95th,S max,P+S mean,P+S std,P+S min,P+S 05th,P+S 25th,P+S 50th,P+S 75th,P+S 95th,P+S max
0,0.0,0.0,0.0,0.0,0.0,0.0,0.0,0.0,0.0,0.0,0.0,0.0,0.0,0.0,0.0,0.0,0.0,0.0,0.0,0.0,0.0,0.0,0.0,0.0,0.0,0.0,0.0
1,0.0,0.0,0.0,0.0,0.0,0.0,0.0,0.0,0.0,0.0,0.0,0.0,0.0,0.0,0.0,0.0,0.0,0.0,0.0,0.0,0.0,0.0,0.0,0.0,0.0,0.0,0.0
2,0.0,0.0,0.0,0.0,0.0,0.0,0.0,0.0,0.0,0.0,0.0,0.0,0.0,0.0,0.0,0.0,0.0,0.0,0.0,0.0,0.0,0.0,0.0,0.0,0.0,0.0,0.0
3,0.5480000000000007,0.15522886329545663,0.29999999999999716,0.31999999999999884,0.4000000000000057,0.5,0.7000000000000028,0.7999999999999972,0.7999999999999972,0.0,0.0,0.0,0.0,0.0,0.0,0.0,0.0,0.0,0.0005479999999994334,0.00015522886329505964,0.0002999999999957481,0.000319999999996412,0.00039999999999906777,0.0005000000000023874,0.0006999999999948159,0.0007999999999981355,0.0007999999999981355
4,4.092000000000001,0.5939158189507993,2.9000000000000057,3.2400000000000038,3.700000000000003,4.0,4.5,4.98,5.299999999999997,0.0,0.0,0.0,0.0,0.0,0.0,0.0,0.0,0.0,0.004091999999998847,0.0005939158189509649,0.002899999999996794,0.0032400000000052387,0.0036999999999949296,0.0040000000000048885,0.004499999999993065,0.00497999999999763,0.0053000000000054115
5,4.3439999999999985,0.43458485937731417,3.5999999999999943,3.9000000000000057,4.0,4.299999999999997,4.599999999999994,5.259999999999996,5.400000000000006,0.0007168400000011843,0.00030709811852260276,0.0,0.00014000000000180537,0.0005009999999998627,0.000701000000006502,0.00100100000000225,0.0010810000000049055,0.0012009999999946785,0.005059999999999149,0.0005713142742843053,0.004099999999993997,0.004099999999993997,0.004699999999999704,0.005099999999998772,0.00539999999999452,0.0060400000000015545,0.0062999999999959755
6,4.464000000000001,0.37189245757342176,3.799999999999997,3.9000000000000057,4.200000000000003,4.5,4.799999999999997,5.120000000000001,5.200000000000003,0.10776379999999847,0.0049026938309454735,0.09709699999999089,0.1008210000000048,0.10400400000000332,0.10750799999999572,0.11121099999999728,0.1135138000000012,0.11871899999999869,0.11212000000000046,0.005055768982062909,0.10120000000000573,0.10492000000000132,0.10840000000000316,0.11209999999999809,0.11530000000000484,0.11813999999999396,0.12330000000000041
7,4.600000000000001,0.6099180272790775,2.799999999999997,3.9000000000000057,4.400000000000006,4.599999999999994,4.900000000000006,5.640000000000002,5.900000000000006,2.8520280000000025,0.07481994204167723,2.7241240000000033,2.7322526000000096,2.7981979999999993,2.8489490000000046,2.8959959999999967,2.991351399999999,3.001300999999998,2.8537759999999985,0.07482717303226177,2.726299999999995,2.7326400000000035,2.8001000000000005,2.8507000000000033,2.8970000000000056,2.992640000000003,3.002899999999997
8,4.244000000000001,0.3578603079415197,3.700000000000003,3.700000000000003,3.9000000000000057,4.299999999999997,4.5,4.779999999999998,5.099999999999994,3.85139544,0.16592375030551276,3.4811810000000065,3.5620619999999974,3.716015999999996,3.872171999999992,3.9770770000000084,4.097157200000001,4.139939999999996,3.8517879999999995,0.16592781640219353,3.4816000000000003,3.5624199999999973,3.7162000000000006,3.872,3.9772999999999996,4.097519999999998,4.140900000000002
9,4.4,0.4326661530556796,3.700000000000003,3.799999999999997,4.0,4.400000000000006,4.700000000000003,4.98,5.400000000000006,3.807263279999999,0.0873984783059831,3.6570569999999947,3.681862000000004,3.7450449999999904,3.7960959999999915,3.850650999999999,3.9583988000000008,4.011310999999992,3.807855999999999,0.08735560007234859,3.657499999999999,3.6824599999999945,3.745999999999995,3.7960999999999956,3.8508000000000067,3.9584799999999998,4.0120000000000005
10,4.272,0.5834517974948757,3.299999999999997,3.619999999999996,3.799999999999997,4.099999999999994,4.700000000000003,5.079999999999995,5.900000000000006,3.758838840000001,0.1020583563472099,3.5061060000000026,3.5890892000000036,3.7094089999999937,3.7680679999999995,3.8184180000000083,3.9168769999999995,3.938738999999998,3.7593519999999994,0.10200185927717091,3.5067999999999984,3.590240000000003,3.7098000000000013,3.7690999999999946,3.818799999999996,3.9181399999999966,3.9388000000000005
11,4.304,0.622562446667,3.0,3.5999999999999943,3.9000000000000057,4.200000000000003,4.700000000000003,5.219999999999997,5.900000000000006,3.8098578800000014,0.10738761397566018,3.5782779999999974,3.6013010000000065,3.775075000000001,3.8256259999999997,3.8625629999999944,3.957337600000002,4.021721999999997,3.8103519999999986,0.10745023823147062,3.5782999999999987,3.6018400000000015,3.775099999999995,3.8259999999999934,3.8623000000000047,3.9579799999999974,4.022499999999994
12,3.6319999999999992,0.5342059527934886,2.5,2.9200000000000044,3.200000000000003,3.5999999999999943,4.0,4.539999999999994,4.799999999999997,3.9586385999999987,0.12482708294308509,3.5949949999999973,3.7735734000000063,3.8981979999999936,3.9522520000000014,4.065465000000003,4.135615599999994,4.1439439999999905,3.958312,0.12475282864929178,3.595399999999998,3.772860000000006,3.8980999999999995,3.951899999999995,4.066199999999995,4.1347799999999975,4.143299999999996
13,0.12799999999999842,0.07756287771866287,0.0,0.0,0.09999999999999432,0.09999999999999432,0.20000000000000284,0.20000000000000284,0.29999999999999716,3.860260279999998,0.11863392605372766,3.6270269999999982,3.6630631999999963,3.757857999999999,3.8981979999999936,3.937136999999993,4.012151799999998,4.057356999999996,3.8565280000000013,0.11851122316472935,3.623599999999996,3.6596600000000024,3.7543000000000006,3.8944000000000045,3.933400000000006,4.0083000000000055,4.0535
14,0.0,0.0,0.0,0.0,0.0,0.0,0.0,0.0,0.0,3.7734974399999994,0.11156751633054526,3.5318319999999943,3.5829027999999936,3.6899900000000088,3.792092000000011,3.8625629999999944,3.926385999999999,3.952652999999998,3.769724,0.1114559761699666,3.5283000000000015,3.5793199999999956,3.686300000000003,3.7883000000000067,3.858699999999999,3.9224600000000036,3.9487000000000023
15,0.0,0.0,0.0,0.0,0.0,0.0,0.0,0.0,0.0,3.594654680000001,0.12658927599152153,3.2788790000000034,3.3993592000000032,3.5297300000000007,3.5913910000000016,3.684784999999991,3.7745746000000024,3.8168170000000003,3.5910600000000006,0.12646266800918046,3.275599999999997,3.3959599999999965,3.526200000000003,3.5878000000000014,3.6811000000000007,3.770799999999997,3.8130000000000024
16,0.0,0.0,0.0,0.0,0.0,0.0,0.0,0.0,0.0,1.0023424,0.07701350920143782,0.9037040000000047,0.9104908000000024,0.9415419999999983,0.9920919999999995,1.0581579999999917,1.1036437999999975,1.2342340000000007,1.0013399999999997,0.07693657127790494,0.9027999999999992,0.9095799999999997,0.9406000000000034,0.991100000000003,1.0571000000000055,1.102539999999999,1.233000000000004
17,0.0,0.0,0.0,0.0,0.0,0.0,0.0,0.0,0.0,0.0015095200000018849,0.00043493448886100484,0.000701000000006502,0.0008409999999969386,0.0013009999999979982,0.0014010000000013179,0.0018019999999978609,0.0022420000000010977,0.002503000000004363,0.001508000000001175,0.00043443756743674074,0.0006999999999948159,0.0008399999999994635,0.001300000000000523,0.0014000000000038426,0.0018000000000029104,0.0022400000000033053,0.0024999999999977263
18,0.0,0.0,0.0,0.0,0.0,0.0,0.0,0.0,0.0,0.0,0.0,0.0,0.0,0.0,0.0,0.0,0.0,0.0,0.0,0.0,0.0,0.0,0.0,0.0,0.0,0.0,0.0
19,0.0,0.0,0.0,0.0,0.0,0.0,0.0,0.0,0.0,0.0,0.0,0.0,0.0,0.0,0.0,0.0,0.0,0.0,0.0,0.0,0.0,0.0,0.0,0.0,0.0,0.0,0.0
20,0.0,0.0,0.0,0.0,0.0,0.0,0.0,0.0,0.0,0.0,0.0,0.0,0.0,0.0,0.0,0.0,0.0,0.0,0.0,0.0,0.0,0.0,0.0,0.0,0.0,0.0,0.0
21,0.0,0.0,0.0,0.0,0.0,0.0,0.0,0.0,0.0,0.0,0.0,0.0,0.0,0.0,0.0,0.0,0.0,0.0,0.0,0.0,0.0,0.0,0.0,0.0,0.0,0.0,0.0
22,0.0,0.0,0.0,0.0,0.0,0.0,0.0,0.0,0.0,0.0,0.0,0.0,0.0,0.0,0.0,0.0,0.0,0.0,0.0,0.0,0.0,0.0,0.0,0.0,0.0,0.0,0.0
23,0.0,0.0,0.0,0.0,0.0,0.0,0.0,0.0,0.0,0.0,0.0,0.0,0.0,0.0,0.0,0.0,0.0,0.0,0.0,0.0,0.0,0.0,0.0,0.0,0.0,0.0,0.0
24,0.0,0.0,0.0,0.0,0.0,0.0,0.0,0.0,0.0,0.0,0.0,0.0,0.0,0.0,0.0,0.0,0.0,0.0,0.0,0.0,0.0,0.0,0.0,0.0,0.0,0.0,0.0
25,0.0,0.0,0.0,0.0,0.0,0.0,0.0,0.0,0.0,0.0,0.0,0.0,0.0,0.0,0.0,0.0,0.0,0.0,0.0,0.0,0.0,0.0,0.0,0.0,0.0,0.0,0.0
