round,nodes,nodesP,nodesS,nodesSent,nodesSentP,nodesSentS,nodesRecv,nodesRecvP,nodesRecvS,msgSent,msgSentP,msgSentS,msgRecv,msgRecvP,msgRecvS,msgInfect,msgInfectP,msgInfectS
00,1000000.000000,500000.000000,500000.000000,0.000000,0.000000,0.000000,0.000000,0.000000,0.000000,0.000000,0.000000,0.000000,0.000000,0.000000,0.000000,0.000000,0.000000,0.000000
01,1000000.000000,500000.000000,500000.000000,0.000110,0.000220,0.000000,0.000110,0.000220,0.000000,11.000000,11.000000,0.000000,1.100000,1.100000,0.000000,0.500000,1.000000,0.000000
02,1000000.000000,500000.000000,500000.000000,0.001160,0.002320,0.000000,0.001160,0.002320,0.000000,116.000000,116.000000,0.000000,11.600000,11.600000,0.000000,0.500000,1.000000,0.000000
03,1000000.000000,500000.000000,500000.000000,0.011850,0.023700,0.000000,0.011850,0.023700,0.000000,1185.000000,1185.000000,0.000000,118.500000,118.500000,0.000000,0.500000,1.000000,0.000000
04,1000000.000000,500000.000000,500000.000000,0.117020,0.234040,0.000000,0.117020,0.234040,0.000000,11714.000000,11714.000000,0.000000,1171.400000,1171.400000,0.000000,0.500000,1.000000,0.000000
05,1000000.000000,500000.000000,500000.000000,1.161750,2.319380,0.004120,1.161750,2.319380,0.004120,117497.000000,117291.000000,206.000000,11750.600000,11730.000000,20.600000,1.000000,1.000000,1.000000
06,1000000.000000,500000.000000,500000.000000,10.542870,20.674280,0.411460,10.542870,20.674280,0.411460,1169383.000000,1148810.000000,20573.000000,117876.400000,115814.800000,2061.600000,1.000000,1.000000,1.000000
07,1000000.000000,500000.000000,500000.000000,55.798990,86.702620,24.895360,55.798990,86.702620,24.895360,8571953.000000,7327185.000000,1244768.000000,1151530.700000,1008361.800000,143168.900000,1.500000,2.000000,1.000000
08,1000000.000000,500000.000000,500000.000000,99.974350,99.981880,99.966820,99.974350,99.981880,99.966820,14988848.000000,9990507.000000,4998341.000000,8327748.800000,4308971.300000,4018777.500000,8.000000,8.000000,8.000000
09,1000000.000000,500000.000000,500000.000000,99.997700,99.995400,100.000000,99.997700,99.995400,100.000000,14997306.000000,9997306.000000,5000000.000000,14988644.000000,4999090.200000,9989553.800000,14.000000,9.000000,19.000000
10,1000000.000000,500000.000000,500000.000000,99.997700,99.995400,100.000000,99.997700,99.995400,100.000000,14997311.000000,9997311.000000,5000000.000000,14997307.000000,4999771.000000,9997536.000000,14.500000,10.000000,19.000000
11,1000000.000000,500000.000000,500000.000000,99.997700,99.995400,100.000000,99.997700,99.995400,100.000000,14997311.000000,9997311.000000,5000000.000000,14997312.000000,4999771.000000,9997541.000000,14.500000,10.000000,19.000000
12,1000000.000000,500000.000000,500000.000000,99.997700,99.995400,100.000000,99.997700,99.995400,100.000000,14997311.000000,9997311.000000,5000000.000000,14997312.000000,4999771.000000,9997541.000000,14.500000,10.000000,19.000000
13,1000000.000000,500000.000000,500000.000000,99.997700,99.995400,100.000000,99.997700,99.995400,100.000000,14997311.000000,9997311.000000,5000000.000000,14997312.000000,4999771.000000,9997541.000000,14.500000,10.000000,19.000000
14,1000000.000000,500000.000000,500000.000000,99.997700,99.995400,100.000000,99.997700,99.995400,100.000000,14997311.000000,9997311.000000,5000000.000000,14997312.000000,4999771.000000,9997541.000000,14.500000,10.000000,19.000000
15,1000000.000000,500000.000000,500000.000000,99.997700,99.995400,100.000000,99.997700,99.995400,100.000000,14997311.000000,9997311.000000,5000000.000000,14997312.000000,4999771.000000,9997541.000000,14.500000,10.000000,19.000000
16,1000000.000000,500000.000000,500000.000000,99.997700,99.995400,100.000000,99.997700,99.995400,100.000000,14997311.000000,9997311.000000,5000000.000000,14997312.000000,4999771.000000,9997541.000000,14.500000,10.000000,19.000000
17,1000000.000000,500000.000000,500000.000000,99.997700,99.995400,100.000000,99.997700,99.995400,100.000000,14997311.000000,9997311.000000,5000000.000000,14997312.000000,4999771.000000,9997541.000000,14.500000,10.000000,19.000000
18,1000000.000000,500000.000000,500000.000000,99.997700,99.995400,100.000000,99.997700,99.995400,100.000000,14997311.000000,9997311.000000,5000000.000000,14997312.000000,4999771.000000,9997541.000000,14.500000,10.000000,19.000000
19,1000000.000000,500000.000000,500000.000000,99.997700,99.995400,100.000000,99.997700,99.995400,100.000000,14997311.000000,9997311.000000,5000000.000000,14997312.000000,4999771.000000,9997541.000000,14.500000,10.000000,19.000000
