round,nodes,nodesP,nodesS,nodesSent,nodesSentP,nodesSentS,nodesRecv,nodesRecvP,nodesRecvS,msgSent,msgSentP,msgSentS,msgRecv,msgRecvP,msgRecvS,msgInfect,msgInfectP,msgInfectS
00,1000000.000000,500000.000000,500000.000000,0.000000,0.000000,0.000000,0.000000,0.000000,0.000000,0.000000,0.000000,0.000000,0.000000,0.000000,0.000000,0.000000,0.000000,0.000000
01,1000000.000000,500000.000000,500000.000000,0.000100,0.000200,0.000000,0.000100,0.000200,0.000000,10.000000,10.000000,0.000000,1.000000,1.000000,0.000000,0.500000,1.000000,0.000000
02,1000000.000000,500000.000000,500000.000000,0.001140,0.002280,0.000000,0.001140,0.002280,0.000000,114.000000,114.000000,0.000000,11.400000,11.400000,0.000000,0.500000,1.000000,0.000000
03,1000000.000000,500000.000000,500000.000000,0.011870,0.023740,0.000000,0.011870,0.023740,0.000000,1187.000000,1187.000000,0.000000,118.700000,118.700000,0.000000,0.500000,1.000000,0.000000
04,1000000.000000,500000.000000,500000.000000,0.117320,0.234640,0.000000,0.117320,0.234640,0.000000,11732.000000,11732.000000,0.000000,1175.100000,1175.100000,0.000000,0.500000,1.000000,0.000000
05,1000000.000000,500000.000000,500000.000000,1.157540,2.315080,0.000000,1.157540,2.315080,0.000000,115754.000000,115754.000000,0.000000,11715.600000,11715.600000,0.000000,0.500000,1.000000,0.000000
06,1000000.000000,500000.000000,500000.000000,10.307270,20.614540,0.000000,10.307270,20.614540,0.000000,1030727.000000,1030727.000000,0.000000,115440.300000,115440.300000,0.000000,0.500000,1.000000,0.000000
07,1000000.000000,500000.000000,500000.000000,44.220820,86.335000,2.106640,44.220820,86.335000,2.106640,4422082.000000,4316750.000000,105332.000000,1006146.300000,995501.900000,10644.400000,1.500000,2.000000,1.000000
08,1000000.000000,500000.000000,500000.000000,98.064160,99.497180,96.631140,98.064160,99.497180,96.631140,9806416.000000,4974859.000000,4831557.000000,4337765.600000,2643426.000000,1694339.600000,4.000000,5.000000,3.000000
09,1000000.000000,500000.000000,500000.000000,99.748530,99.497180,99.999880,99.748530,99.497180,99.999880,9974853.000000,4974859.000000,4999994.000000,9795069.600000,2643426.000000,7151643.600000,9.500000,5.000000,14.000000
10,1000000.000000,500000.000000,500000.000000,99.748540,99.497180,99.999900,99.748540,99.497180,99.999900,9974854.000000,4974859.000000,4999995.000000,9974854.000000,2643426.000000,7331428.000000,9.500000,5.000000,14.000000
11,1000000.000000,500000.000000,500000.000000,99.748540,99.497180,99.999900,99.748540,99.497180,99.999900,9974854.000000,4974859.000000,4999995.000000,9974855.000000,2643426.000000,7331429.000000,9.500000,5.000000,14.000000
12,1000000.000000,500000.000000,500000.000000,99.748540,99.497180,99.999900,99.748540,99.497180,99.999900,9974854.000000,4974859.000000,4999995.000000,9974855.000000,2643426.000000,7331429.000000,9.500000,5.000000,14.000000
13,1000000.000000,500000.000000,500000.000000,99.748540,99.497180,99.999900,99.748540,99.497180,99.999900,9974854.000000,4974859.000000,4999995.000000,9974855.000000,2643426.000000,7331429.000000,9.500000,5.000000,14.000000
14,1000000.000000,500000.000000,500000.000000,99.748540,99.497180,99.999900,99.748540,99.497180,99.999900,9974854.000000,4974859.000000,4999995.000000,9974855.000000,2643426.000000,7331429.000000,9.500000,5.000000,14.000000
15,1000000.000000,500000.000000,500000.000000,99.748540,99.497180,99.999900,99.748540,99.497180,99.999900,9974854.000000,4974859.000000,4999995.000000,9974855.000000,2643426.000000,7331429.000000,9.500000,5.000000,14.000000
16,1000000.000000,500000.000000,500000.000000,99.748540,99.497180,99.999900,99.748540,99.497180,99.999900,9974854.000000,4974859.000000,4999995.000000,9974855.000000,2643426.000000,7331429.000000,9.500000,5.000000,14.000000
17,1000000.000000,500000.000000,500000.000000,99.748540,99.497180,99.999900,99.748540,99.497180,99.999900,9974854.000000,4974859.000000,4999995.000000,9974855.000000,2643426.000000,7331429.000000,9.500000,5.000000,14.000000
18,1000000.000000,500000.000000,500000.000000,99.748540,99.497180,99.999900,99.748540,99.497180,99.999900,9974854.000000,4974859.000000,4999995.000000,9974855.000000,2643426.000000,7331429.000000,9.500000,5.000000,14.000000
19,1000000.000000,500000.000000,500000.000000,99.748540,99.497180,99.999900,99.748540,99.497180,99.999900,9974854.000000,4974859.000000,4999995.000000,9974855.000000,2643426.000000,7331429.000000,9.500000,5.000000,14.000000
