round,Simple mean,Simple std,Simple min,Simple q1,Simple median,Simple q3,Simple max
0,99.99903999999998,8.485281374078115e-05,99.9988,99.999,99.9991,99.9991,99.9991
1,99.989496,0.00022887551201526392,99.9889,99.9893,99.9895,99.9897,99.9899
2,99.89499600000003,0.0016286141347790738,99.892,99.8936,99.8955,99.8963,99.8979
3,98.950312,0.005508707289373803,98.9331,98.9483,98.9506,98.9521,98.965
4,89.95635199999998,0.1237837376071667,89.8569,89.8783,89.8888,90.0754,90.1904
5,35.637696000000005,0.33481563939577286,35.3754,35.4136,35.4659,35.8673,36.4193
6,3.5548599999999997,0.08855833783444675,3.3744,3.4808,3.5953,3.6143,3.639
7,98.670444,0.011825196150593742,98.6453,98.6629,98.6692,98.6782,98.7035
8,99.95808799999999,0.0015352706601773085,99.9551,99.957,99.9581,99.9594,99.9607
9,99.95865999999998,0.0015362291495742263,99.9556,99.9574,99.9588,99.9598,99.9611
10,99.95865999999998,0.0015362291495742263,99.9556,99.9574,99.9588,99.9598,99.9611
11,99.95865999999998,0.0015362291495742263,99.9556,99.9574,99.9588,99.9598,99.9611
12,99.95865999999998,0.0015362291495742263,99.9556,99.9574,99.9588,99.9598,99.9611
13,99.95865999999998,0.0015362291495742263,99.9556,99.9574,99.9588,99.9598,99.9611
14,99.95865999999998,0.0015362291495742263,99.9556,99.9574,99.9588,99.9598,99.9611
15,99.95865999999998,0.0015362291495742263,99.9556,99.9574,99.9588,99.9598,99.9611
16,99.95865999999998,0.0015362291495742263,99.9556,99.9574,99.9588,99.9598,99.9611
17,99.95865999999998,0.0015362291495742263,99.9556,99.9574,99.9588,99.9598,99.9611
18,99.95865999999998,0.0015362291495742263,99.9556,99.9574,99.9588,99.9598,99.9611
19,99.95865999999998,0.0015362291495742263,99.9556,99.9574,99.9588,99.9598,99.9611
20,99.95865999999998,0.0015362291495742263,99.9556,99.9574,99.9588,99.9598,99.9611
21,99.95865999999998,0.0015362291495742263,99.9556,99.9574,99.9588,99.9598,99.9611
22,99.95865999999998,0.0015362291495742263,99.9556,99.9574,99.9588,99.9598,99.9611
23,99.95865999999998,0.0015362291495742263,99.9556,99.9574,99.9588,99.9598,99.9611
