gossips,p2p mean,p2p std,p2p min,p2p q1,p2p q2,p2p q3,p2p max,p2s mean,p2s std,p2s min,p2s q1,p2s q2,p2s q3,p2s max,s2s mean,s2s std,s2s min,s2s q1,s2s q2,s2s q3,s2s max
1,492.6,15.416441439796234,465.0,485.0,491.0,504.0,517.0,576.76,12.018319350058906,553.0,567.0,580.0,586.0,598.0,517608.64,2834.3752968393824,512262,515394,517203.0,519099.0,522725
2,219.36,14.599885844302573,190.0,207.0,218.0,225.0,252.0,204.24,9.075057391921371,191.0,197.0,204.0,212.0,222.0,218535.52,5530.08209040939,207155,215721,218790.0,220873.0,232483
3,19.32,3.145366963222787,10.0,18.0,19.0,21.0,25.0,3.24,1.8321208111548393,1.0,2.0,3.0,4.0,7.0,14979.8,734.5867886097598,13724,14563,14822.0,15425.0,16935
4,1.0,,1.0,1.0,1.0,1.0,1.0,1.0,,1.0,1.0,1.0,1.0,1.0,366.76,34.65818806573707,311,338,365.0,391.0,437
5,,,,,,,,,,,,,,,4.086956521739131,1.9519930019961387,1,3,4.0,5.5,9
