gossips,p2p mean,p2p std,p2p min,p2p 05th,p2p 25th,p2p 50th,p2p 75th,p2p 95th,p2p max,p2s mean,p2s std,p2s min,p2s 05th,p2s 25th,p2s 50th,p2s 75th,p2s 95th,p2s max,s2s mean,s2s std,s2s min,s2s 05th,s2s 25th,s2s 50th,s2s 75th,s2s 95th,s2s max
1,,,,,,,,,,,,,,,,,,,2.8423904400000004,0.24632130113249723,2.397698,2.4262266000000006,2.7258259999999996,2.794494,2.954154,3.3403405999999993,3.4002
2,,,,,,,,,,,,,,,,,,,0.00013333333333333337,7.453559924999297e-05,0.0001,0.0001,0.0001,0.0001,0.0001,0.00025,0.0003
3,,,,,,,,,,,,,,,,,,,,,,,,,,,
4,,,,,,,,,,,,,,,,,,,,,,,,,,,
5,,,,,,,,,,,,,,,,,,,,,,,,,,,
