round,P mean,P std,P min,P q1,P q2,P q3,P max,S mean,S std,S min,S q1,S q2,S q3,S max,P+S mean,P+S std,P+S min,P+S q1,P+S q2,P+S q3,P+S max
0,0.0,0.0,0.0,0.0,0.0,0.0,0.0,0.0,0.0,0.0,0.0,0.0,0.0,0.0,0.0,0.0,0.0,0.0,0.0,0.0,0.0
1,0.0,0.0,0.0,0.0,0.0,0.0,0.0,0.0,0.0,0.0,0.0,0.0,0.0,0.0,0.0,0.0,0.0,0.0,0.0,0.0,0.0
2,0.0,0.0,0.0,0.0,0.0,0.0,0.0,0.0,0.0,0.0,0.0,0.0,0.0,0.0,0.0,0.0,0.0,0.0,0.0,0.0,0.0
3,0.0,0.0,0.0,0.0,0.0,0.0,0.0,0.0,0.0,0.0,0.0,0.0,0.0,0.0,0.0,0.0,0.0,0.0,0.0,0.0,0.0
4,0.0,0.0,0.0,0.0,0.0,0.0,0.0,0.0,0.0,0.0,0.0,0.0,0.0,0.0,0.0,0.0,0.0,0.0,0.0,0.0,0.0
5,0.0,0.0,0.0,0.0,0.0,0.0,0.0,0.0,0.0,0.0,0.0,0.0,0.0,0.0,0.0,0.0,0.0,0.0,0.0,0.0,0.0
6,0.0,0.0,0.0,0.0,0.0,0.0,0.0,0.0,0.0,0.0,0.0,0.0,0.0,0.0,0.0,0.0,0.0,0.0,0.0,0.0,0.0
7,0.0,0.0,0.0,0.0,0.0,0.0,0.0,0.0,0.0,0.0,0.0,0.0,0.0,0.0,0.0,0.0,0.0,0.0,0.0,0.0,0.0
8,0.0,0.0,0.0,0.0,0.0,0.0,0.0,0.0,0.0,0.0,0.0,0.0,0.0,0.0,0.0,0.0,0.0,0.0,0.0,0.0,0.0
9,0.0,0.0,0.0,0.0,0.0,0.0,0.0,0.0,0.0,0.0,0.0,0.0,0.0,0.0,0.0,0.0,0.0,0.0,0.0,0.0,0.0
10,0.0,0.0,0.0,0.0,0.0,0.0,0.0,0.0,0.0,0.0,0.0,0.0,0.0,0.0,0.0,0.0,0.0,0.0,0.0,0.0,0.0
11,0.4880000000000001,0.26820390253188586,0.1,0.3,0.4,0.6,1.1,0.0,0.0,0.0,0.0,0.0,0.0,0.0,0.0004879999999999999,0.0002682039025318859,0.0001,0.0003,0.0004,0.0006,0.0011
12,43.32,1.4118545723031577,40.2,42.4,43.4,44.4,46.5,0.0,0.0,0.0,0.0,0.0,0.0,0.0,0.04332,0.0014118545723031577,0.0402,0.0424,0.0434,0.0444,0.0465
13,99.632,0.17009801096230567,99.2,99.5,99.7,99.8,99.8,6.800000000000003e-05,6.904105059069326e-05,0.0,0.0,0.0001,0.0001,0.0002,0.09970000000000001,0.00019148542155126726,0.0992,0.0995,0.0998,0.0998,0.1
14,99.92400000000002,0.09255628917943022,99.7,99.9,99.9,100.0,100.0,0.047579680000000006,0.0033780898290799396,0.039939999999999996,0.044745,0.048849000000000004,0.04965,0.052953,0.147456,0.0034052753192656856,0.1397,0.1447,0.1487,0.1495,0.1529
15,99.92400000000002,0.09255628917943022,99.7,99.9,99.9,100.0,100.0,12.595587559999997,0.523088756864461,11.729429,12.203503999999999,12.596697,12.818418,14.318318,12.682915999999999,0.5225853468413875,11.8174,12.2913,12.6839,12.9055,14.404
16,99.92400000000002,0.09255628917943022,99.7,99.9,99.9,100.0,100.0,94.41527928,0.35973026362210136,93.867367,94.160761,94.43043,94.585185,95.563363,94.42078799999999,0.3593867569902953,93.8735,94.1666,94.4358,94.5905,95.5678
17,99.92400000000002,0.09255628917943022,99.7,99.9,99.9,100.0,100.0,99.90663879999998,0.0036139280683636903,99.9003,99.904705,99.906607,99.90951,99.912112,99.906656,0.003623658372417331,99.9003,99.9046,99.9067,99.9096,99.9122
18,99.92400000000002,0.09255628917943022,99.7,99.9,99.9,100.0,100.0,99.90964184,0.003557456672025898,99.903504,99.907608,99.90971,99.912913,99.915015,99.909656,0.0035666370715254077,99.9035,99.9075,99.9098,99.9129,99.9151
19,99.92400000000002,0.09255628917943022,99.7,99.9,99.9,100.0,100.0,99.90964584000001,0.0035552471981576423,99.903504,99.907608,99.90971,99.912913,99.915015,99.90965999999999,0.003564173583499242,99.9035,99.9076,99.9098,99.9129,99.9151
20,99.92400000000002,0.09255628917943022,99.7,99.9,99.9,100.0,100.0,99.90964584000001,0.0035552471981576423,99.903504,99.907608,99.90971,99.912913,99.915015,99.90965999999999,0.003564173583499242,99.9035,99.9076,99.9098,99.9129,99.9151
21,99.92400000000002,0.09255628917943022,99.7,99.9,99.9,100.0,100.0,99.90964584000001,0.0035552471981576423,99.903504,99.907608,99.90971,99.912913,99.915015,99.90965999999999,0.003564173583499242,99.9035,99.9076,99.9098,99.9129,99.9151
22,99.92400000000002,0.09255628917943022,99.7,99.9,99.9,100.0,100.0,99.90964584000001,0.0035552471981576423,99.903504,99.907608,99.90971,99.912913,99.915015,99.90965999999999,0.003564173583499242,99.9035,99.9076,99.9098,99.9129,99.9151
23,99.92400000000002,0.09255628917943022,99.7,99.9,99.9,100.0,100.0,99.90964584000001,0.0035552471981576423,99.903504,99.907608,99.90971,99.912913,99.915015,99.90965999999999,0.003564173583499242,99.9035,99.9076,99.9098,99.9129,99.9151
24,99.92400000000002,0.09255628917943022,99.7,99.9,99.9,100.0,100.0,99.90964584000001,0.0035552471981576423,99.903504,99.907608,99.90971,99.912913,99.915015,99.90965999999999,0.003564173583499242,99.9035,99.9076,99.9098,99.9129,99.9151
25,99.92400000000002,0.09255628917943022,99.7,99.9,99.9,100.0,100.0,99.90964584000001,0.0035552471981576423,99.903504,99.907608,99.90971,99.912913,99.915015,99.90965999999999,0.003564173583499242,99.9035,99.9076,99.9098,99.9129,99.9151
