round,nodes,nodesP,nodesS,nodesSent,nodesSentP,nodesSentS,nodesRecv,nodesRecvP,nodesRecvS,msgSent,msgSentP,msgSentS,msgRecv,msgRecvP,msgRecvS,msgInfect,msgInfectP,msgInfectS
00,10000.000000,5000.000000,5000.000000,0.000000,0.000000,0.000000,0.000000,0.000000,0.000000,0.000000,0.000000,0.000000,0.000000,0.000000,0.000000,0.000000,0.000000,0.000000
01,10000.000000,5000.000000,5000.000000,0.012000,0.024000,0.000000,0.012000,0.024000,0.000000,12.000000,12.000000,0.000000,1.200000,1.200000,0.000000,0.500000,1.000000,0.000000
02,10000.000000,5000.000000,5000.000000,0.117000,0.234000,0.000000,0.117000,0.234000,0.000000,117.000000,117.000000,0.000000,11.700000,11.700000,0.000000,0.500000,1.000000,0.000000
03,10000.000000,5000.000000,5000.000000,1.133000,2.266000,0.000000,1.133000,2.266000,0.000000,1133.000000,1133.000000,0.000000,114.500000,114.500000,0.000000,0.500000,1.000000,0.000000
04,10000.000000,5000.000000,5000.000000,10.398000,20.268000,0.528000,10.398000,20.268000,0.528000,10398.000000,10134.000000,264.000000,1152.800000,1126.300000,26.500000,1.000000,1.000000,1.000000
05,10000.000000,5000.000000,5000.000000,63.977000,67.714000,60.240000,63.977000,67.714000,60.240000,63977.000000,33857.000000,30120.000000,10252.000000,5679.500000,4572.500000,1.000000,1.000000,1.000000
06,10000.000000,5000.000000,5000.000000,99.822000,99.872000,99.772000,99.822000,99.872000,99.772000,99822.000000,49936.000000,49886.000000,63127.800000,32115.900000,31011.900000,6.000000,6.000000,6.000000
07,10000.000000,5000.000000,5000.000000,99.990000,99.988000,99.992000,99.990000,99.988000,99.992000,99990.000000,49994.000000,49996.000000,99818.800000,50460.000000,49358.800000,9.500000,10.000000,9.000000
08,10000.000000,5000.000000,5000.000000,99.990000,99.988000,99.992000,99.990000,99.988000,99.992000,99990.000000,49994.000000,49996.000000,99991.000000,50460.000000,49531.000000,9.500000,10.000000,9.000000
09,10000.000000,5000.000000,5000.000000,99.990000,99.988000,99.992000,99.990000,99.988000,99.992000,99990.000000,49994.000000,49996.000000,99991.000000,50460.000000,49531.000000,9.500000,10.000000,9.000000
10,10000.000000,5000.000000,5000.000000,99.990000,99.988000,99.992000,99.990000,99.988000,99.992000,99990.000000,49994.000000,49996.000000,99991.000000,50460.000000,49531.000000,9.500000,10.000000,9.000000
11,10000.000000,5000.000000,5000.000000,99.990000,99.988000,99.992000,99.990000,99.988000,99.992000,99990.000000,49994.000000,49996.000000,99991.000000,50460.000000,49531.000000,9.500000,10.000000,9.000000
12,10000.000000,5000.000000,5000.000000,99.990000,99.988000,99.992000,99.990000,99.988000,99.992000,99990.000000,49994.000000,49996.000000,99991.000000,50460.000000,49531.000000,9.500000,10.000000,9.000000
13,10000.000000,5000.000000,5000.000000,99.990000,99.988000,99.992000,99.990000,99.988000,99.992000,99990.000000,49994.000000,49996.000000,99991.000000,50460.000000,49531.000000,9.500000,10.000000,9.000000
14,10000.000000,5000.000000,5000.000000,99.990000,99.988000,99.992000,99.990000,99.988000,99.992000,99990.000000,49994.000000,49996.000000,99991.000000,50460.000000,49531.000000,9.500000,10.000000,9.000000
15,10000.000000,5000.000000,5000.000000,99.990000,99.988000,99.992000,99.990000,99.988000,99.992000,99990.000000,49994.000000,49996.000000,99991.000000,50460.000000,49531.000000,9.500000,10.000000,9.000000
16,10000.000000,5000.000000,5000.000000,99.990000,99.988000,99.992000,99.990000,99.988000,99.992000,99990.000000,49994.000000,49996.000000,99991.000000,50460.000000,49531.000000,9.500000,10.000000,9.000000
17,10000.000000,5000.000000,5000.000000,99.990000,99.988000,99.992000,99.990000,99.988000,99.992000,99990.000000,49994.000000,49996.000000,99991.000000,50460.000000,49531.000000,9.500000,10.000000,9.000000
18,10000.000000,5000.000000,5000.000000,99.990000,99.988000,99.992000,99.990000,99.988000,99.992000,99990.000000,49994.000000,49996.000000,99991.000000,50460.000000,49531.000000,9.500000,10.000000,9.000000
19,10000.000000,5000.000000,5000.000000,99.990000,99.988000,99.992000,99.990000,99.988000,99.992000,99990.000000,49994.000000,49996.000000,99991.000000,50460.000000,49531.000000,9.500000,10.000000,9.000000
