gossips,p2p mean,p2p std,p2p min,p2p q1,p2p q2,p2p q3,p2p max,p2s mean,p2s std,p2s min,p2s q1,p2s q2,p2s q3,p2s max,s2s mean,s2s std,s2s min,s2s q1,s2s q2,s2s q3,s2s max
1,10.22116,0.0378964378273207,10.1,10.209,10.228,10.243,10.273,0.5692400000000002,0.021315643707537094,0.523,0.555,0.567,0.592,0.599,0.007533360000000002,0.0037478252013667867,0.002222,0.005444,0.006667,0.01,0.017667
2,0.10396000000000001,0.010639862154495548,0.086,0.094,0.104,0.112,0.127,0.001,,0.001,0.001,0.001,0.001,0.001,,,,,,,
3,0.001,0.0,0.001,0.001,0.001,0.001,0.001,,,,,,,,,,,,,,
4,,,,,,,,,,,,,,,,,,,,,
5,,,,,,,,,,,,,,,,,,,,,
