round,P+S mean,P+S std,P+S min,P+S q1,P+S median,P+S q3,P+S max,P mean,P std,P min,P q1,P median,P q3,P max,S mean,S std,S min,S q1,S median,S q3,S max
0,100.0,0.0,100.0,100.0,100.0,100.0,100.0,100.0,0.0,100.0,100.0,100.0,100.0,100.0,100.0,0.0,100.0,100.0,100.0,100.0,100.0
1,100.0,0.0,100.0,100.0,100.0,100.0,100.0,100.0,0.0,100.0,100.0,100.0,100.0,100.0,100.0,0.0,100.0,100.0,100.0,100.0,100.0
2,100.0,0.0,100.0,100.0,100.0,100.0,100.0,100.0,0.0,100.0,100.0,100.0,100.0,100.0,100.0,0.0,100.0,100.0,100.0,100.0,100.0
3,100.0,0.0,100.0,100.0,100.0,100.0,100.0,100.0,0.0,100.0,100.0,100.0,100.0,100.0,100.0,0.0,100.0,100.0,100.0,100.0,100.0
4,100.0,0.0,100.0,100.0,100.0,100.0,100.0,100.0,0.0,100.0,100.0,100.0,100.0,100.0,100.0,0.0,100.0,100.0,100.0,100.0,100.0
5,100.0,0.0,100.0,100.0,100.0,100.0,100.0,100.0,0.0,100.0,100.0,100.0,100.0,100.0,100.0,0.0,100.0,100.0,100.0,100.0,100.0
6,100.0,0.0,100.0,100.0,100.0,100.0,100.0,100.0,0.0,100.0,100.0,100.0,100.0,100.0,100.0,0.0,100.0,100.0,100.0,100.0,100.0
7,100.0,0.0,100.0,100.0,100.0,100.0,100.0,100.0,0.0,100.0,100.0,100.0,100.0,100.0,100.0,0.0,100.0,100.0,100.0,100.0,100.0
8,100.0,0.0,100.0,100.0,100.0,100.0,100.0,100.0,0.0,100.0,100.0,100.0,100.0,100.0,100.0,0.0,100.0,100.0,100.0,100.0,100.0
9,100.0,0.0,100.0,100.0,100.0,100.0,100.0,100.0,0.0,100.0,100.0,100.0,100.0,100.0,100.0,0.0,100.0,100.0,100.0,100.0,100.0
10,100.0,0.0,100.0,100.0,100.0,100.0,100.0,100.0,0.0,100.0,100.0,100.0,100.0,100.0,100.0,0.0,100.0,100.0,100.0,100.0,100.0
11,100.0,0.0,100.0,100.0,100.0,100.0,100.0,100.0,0.0,100.0,100.0,100.0,100.0,100.0,100.0,0.0,100.0,100.0,100.0,100.0,100.0
12,100.0,0.0,100.0,100.0,100.0,100.0,100.0,100.0,0.0,100.0,100.0,100.0,100.0,100.0,100.0,0.0,100.0,100.0,100.0,100.0,100.0
13,99.999992,2.712931993340168e-05,99.9999,100.0,100.0,100.0,100.0,99.99992,0.000271293199326306,99.999,100.0,100.0,100.0,100.0,100.0,0.0,100.0,100.0,100.0,100.0,100.0
14,99.99993599999999,6.858571280020579e-05,99.9998,99.9999,99.9999,100.0,100.0,99.99936,0.0006858571279791834,99.998,99.999,99.999,100.0,100.0,100.0,0.0,100.0,100.0,100.0,100.0,100.0
15,99.99971600000002,0.00011892854997704729,99.9994,99.9997,99.9997,99.9998,99.9999,99.99724000000003,0.0011757550765363373,99.994,99.997,99.997,99.998,99.999,99.99999111999999,4.350293783060003e-05,99.999778,100.0,100.0,100.0,100.0
16,99.999092,0.00021710826792172968,99.9986,99.999,99.9991,99.9993,99.9994,99.99564000000001,0.0015460918472059557,99.991,99.995,99.995,99.997,99.999,99.99947548000002,0.00017667124723685576,99.999222,99.999333,99.999444,99.999667,99.999889
17,99.998148,0.00033480740732608053,99.9974,99.9979,99.9982,99.9984,99.999,99.9956,0.0014696938456695762,99.991,99.995,99.995,99.997,99.998,99.99843112,0.0003642456665489685,99.997667,99.998222,99.99844399999999,99.99855600000001,99.999444
18,99.99813199999998,0.00033908111124024084,99.9974,99.9979,99.9982,99.9984,99.999,99.9956,0.0014696938456695762,99.991,99.995,99.995,99.997,99.998,99.99841336000001,0.00037254915165672224,99.997667,99.998222,99.99844399999999,99.99855600000001,99.999444
19,99.99813199999998,0.00033908111124024084,99.9974,99.9979,99.9982,99.9984,99.999,99.9956,0.0014696938456695762,99.991,99.995,99.995,99.997,99.998,99.99841336000001,0.00037254915165672224,99.997667,99.998222,99.99844399999999,99.99855600000001,99.999444
20,99.99813199999998,0.00033908111124024084,99.9974,99.9979,99.9982,99.9984,99.999,99.9956,0.0014696938456695762,99.991,99.995,99.995,99.997,99.998,99.99841336000001,0.00037254915165672224,99.997667,99.998222,99.99844399999999,99.99855600000001,99.999444
21,99.99813199999998,0.00033908111124024084,99.9974,99.9979,99.9982,99.9984,99.999,99.9956,0.0014696938456695762,99.991,99.995,99.995,99.997,99.998,99.99841336000001,0.00037254915165672224,99.997667,99.998222,99.99844399999999,99.99855600000001,99.999444
22,99.99812799999998,0.0003458554611395317,99.9974,99.9979,99.9982,99.9984,99.999,99.99556000000001,0.0014987995196154146,99.991,99.995,99.995,99.997,99.998,99.99841336000001,0.00037254915165672224,99.997667,99.998222,99.99844399999999,99.99855600000001,99.999444
23,99.99812799999998,0.0003458554611395317,99.9974,99.9979,99.9982,99.9984,99.999,99.99556000000001,0.0014987995196154146,99.991,99.995,99.995,99.997,99.998,99.99841336000001,0.00037254915165672224,99.997667,99.998222,99.99844399999999,99.99855600000001,99.999444
24,99.99807999999999,0.00033585711247582613,99.9974,99.9978,99.9981,99.9983,99.9989,99.99508,0.0014675149062274575,99.991,99.994,99.995,99.996,99.998,99.99841336000001,0.00037254915165672224,99.997667,99.998222,99.99844399999999,99.99855600000001,99.999444
25,99.997812,0.00038191098439144516,99.9972,99.9975,99.9978,99.9981,99.9986,99.99259999999998,0.0024979991993597725,99.985,99.991,99.993,99.994,99.997,99.99839112,0.00038632559532095727,99.997667,99.998222,99.99844399999999,99.99855600000001,99.999444
26,99.99713599999995,0.00048487524168585466,99.9963,99.9968,99.997,99.9975,99.9982,99.991,0.0024657656011878378,99.984,99.99,99.991,99.992,99.997,99.99781779999999,0.0004649664934163189,99.997111,99.997556,99.997778,99.998,99.999
27,99.99622400000004,0.0005873874360252678,99.9954,99.9957,99.9962,99.9967,99.9976,99.991,0.0024657656011878378,99.984,99.99,99.991,99.992,99.997,99.99680443999999,0.0005889973229131544,99.995778,99.99633299999999,99.996667,99.997222,99.998333
28,99.99620000000003,0.0005741080037761431,99.9954,99.9956,99.9962,99.9967,99.9974,99.991,0.0024657656011878378,99.984,99.99,99.991,99.992,99.997,99.99677779999998,0.0005639403514536017,99.995778,99.99633299999999,99.996667,99.997222,99.998111
29,99.99620000000003,0.0005741080037761431,99.9954,99.9956,99.9962,99.9967,99.9974,99.991,0.0024657656011878378,99.984,99.99,99.991,99.992,99.997,99.99677779999998,0.0005639403514536017,99.995778,99.99633299999999,99.996667,99.997222,99.998111
30,99.99620000000003,0.0005741080037761431,99.9954,99.9956,99.9962,99.9967,99.9974,99.991,0.0024657656011878378,99.984,99.99,99.991,99.992,99.997,99.99677779999998,0.0005639403514536017,99.995778,99.99633299999999,99.996667,99.997222,99.998111
31,99.99620000000003,0.0005741080037761431,99.9954,99.9956,99.9962,99.9967,99.9974,99.991,0.0024657656011878378,99.984,99.99,99.991,99.992,99.997,99.99677779999998,0.0005639403514536017,99.995778,99.99633299999999,99.996667,99.997222,99.998111
32,99.99619600000001,0.0005737455882181503,99.9954,99.9956,99.9962,99.9967,99.9974,99.99096,0.0024573156085453945,99.984,99.99,99.991,99.992,99.997,99.99677779999998,0.0005639403514536017,99.995778,99.99633299999999,99.996667,99.997222,99.998111
33,99.99619200000002,0.0005733550383486242,99.9954,99.9956,99.9962,99.9967,99.9974,99.99092,0.0024317894645717163,99.984,99.99,99.991,99.992,99.997,99.99677779999998,0.0005639403514536017,99.995778,99.99633299999999,99.996667,99.997222,99.998111
34,99.99613200000002,0.0005870059624900046,99.9953,99.9956,99.9961,99.9967,99.9974,99.99032,0.002664132128854557,99.983,99.989,99.99,99.992,99.997,99.99677779999998,0.0005639403514536017,99.995778,99.99633299999999,99.996667,99.997222,99.998111
35,99.99587599999997,0.0005846571644984761,99.995,99.9954,99.9958,99.9961,99.9972,99.98780000000001,0.0031874754901019074,99.981,99.986,99.988,99.989,99.997,99.99677335999999,0.000553771641020615,99.995778,99.99633299999999,99.996667,99.997222,99.998
36,99.995248,0.0006099967213029794,99.9942,99.9948,99.9953,99.9956,99.9964,99.98639999999999,0.003224903099319695,99.98,99.984,99.987,99.988,99.996,99.99623108000003,0.000609225076304734,99.995111,99.995778,99.996222,99.99655600000001,99.99744399999999
37,99.99438400000001,0.000680399882423,99.9932,99.9939,99.9943,99.9947,99.9955,99.98636000000002,0.0031097266760936695,99.98,99.984,99.987,99.988,99.995,99.99527551999999,0.0006806423507253783,99.994111,99.994778,99.995222,99.995667,99.99655600000001
38,99.994372,0.0006936973403449968,99.9931,99.9939,99.9943,99.9947,99.9955,99.98636000000002,0.0031097266760936695,99.98,99.984,99.987,99.988,99.995,99.99526215999998,0.0006934409667738377,99.994111,99.994778,99.995222,99.995667,99.99655600000001
39,99.994372,0.0006936973403449968,99.9931,99.9939,99.9943,99.9947,99.9955,99.98636000000002,0.0031097266760936695,99.98,99.984,99.987,99.988,99.995,99.99526215999998,0.0006934409667738377,99.994111,99.994778,99.995222,99.995667,99.99655600000001
40,99.994372,0.0006936973403449968,99.9931,99.9939,99.9943,99.9947,99.9955,99.98636000000002,0.0031097266760936695,99.98,99.984,99.987,99.988,99.995,99.99526215999998,0.0006934409667738377,99.994111,99.994778,99.995222,99.995667,99.99655600000001
41,99.994372,0.0006936973403449968,99.9931,99.9939,99.9943,99.9947,99.9955,99.98636000000002,0.0031097266760936695,99.98,99.984,99.987,99.988,99.995,99.99526215999998,0.0006934409667738377,99.994111,99.994778,99.995222,99.995667,99.99655600000001
42,99.994372,0.0006936973403449968,99.9931,99.9939,99.9943,99.9947,99.9955,99.98636000000002,0.0031097266760936695,99.98,99.984,99.987,99.988,99.995,99.99526215999998,0.0006934409667738377,99.994111,99.994778,99.995222,99.995667,99.99655600000001
43,99.99436,0.0006939740629172631,99.9931,99.9939,99.9942,99.9947,99.9955,99.98624,0.0031404458282235704,99.98,99.984,99.986,99.988,99.995,99.99526215999998,0.0006934409667738377,99.994111,99.994778,99.995222,99.995667,99.99655600000001
44,99.994332,0.0007075139574597209,99.9931,99.9939,99.9942,99.9947,99.9955,99.98596000000002,0.003267782122481648,99.978,99.984,99.986,99.988,99.994,99.99526215999998,0.0006934409667738377,99.994111,99.994778,99.995222,99.995667,99.99655600000001
45,99.994064,0.0006857871389874508,99.9929,99.9937,99.994,99.9944,99.9953,99.98339999999999,0.0031368774282719606,99.978,99.981,99.983,99.985,99.991,99.99524883999999,0.0007022086687021581,99.994111,99.994778,99.995222,99.995667,99.99655600000001
46,99.99345600000001,0.0007376069413981892,99.9919,99.993,99.9935,99.9937,99.9951,99.98191999999997,0.003772744359216608,99.973,99.979,99.982,99.984,99.991,99.99473772000002,0.0007495100543668559,99.993222,99.994222,99.994778,99.995111,99.99633299999999
47,99.992564,0.0008245629145184973,99.9907,99.9921,99.9924,99.9929,99.9945,99.98191999999997,0.003772744359216608,99.973,99.979,99.982,99.984,99.991,99.99374668,0.0008712936001144621,99.991889,99.99333299999999,99.99355600000001,99.994444,99.995667
48,99.99255199999999,0.0008217639563758816,99.9907,99.992,99.9924,99.9929,99.9945,99.98191999999997,0.003772744359216608,99.973,99.979,99.982,99.984,99.991,99.99373336,0.0008732612383474278,99.991889,99.99333299999999,99.99355600000001,99.994444,99.995667
49,99.99255199999999,0.0008217639563758816,99.9907,99.992,99.9924,99.9929,99.9945,99.98191999999997,0.003772744359216608,99.973,99.979,99.982,99.984,99.991,99.99373336,0.0008732612383474278,99.991889,99.99333299999999,99.99355600000001,99.994444,99.995667
50,99.99255199999999,0.0008217639563758816,99.9907,99.992,99.9924,99.9929,99.9945,99.98191999999997,0.003772744359216608,99.973,99.979,99.982,99.984,99.991,99.99373336,0.0008732612383474278,99.991889,99.99333299999999,99.99355600000001,99.994444,99.995667
51,99.99255199999999,0.0008217639563758816,99.9907,99.992,99.9924,99.9929,99.9945,99.98191999999997,0.003772744359216608,99.973,99.979,99.982,99.984,99.991,99.99373336,0.0008732612383474278,99.991889,99.99333299999999,99.99355600000001,99.994444,99.995667
52,99.99255199999999,0.0008217639563758816,99.9907,99.992,99.9924,99.9929,99.9945,99.98191999999997,0.003772744359216608,99.973,99.979,99.982,99.984,99.991,99.99373336,0.0008732612383474278,99.991889,99.99333299999999,99.99355600000001,99.994444,99.995667
53,99.99254799999999,0.0008188382013550555,99.9907,99.992,99.9924,99.9929,99.9945,99.98187999999996,0.003808621797973938,99.973,99.979,99.982,99.984,99.991,99.99373336,0.0008732612383474278,99.991889,99.99333299999999,99.99355600000001,99.994444,99.995667
54,99.99250399999997,0.0008378448543716755,99.9907,99.992,99.9924,99.9929,99.9945,99.98144,0.0038892672831795983,99.972,99.979,99.982,99.984,99.991,99.99373336,0.0008732612383474278,99.991889,99.99333299999999,99.99355600000001,99.994444,99.995667
55,99.99223599999999,0.0008744735559187384,99.9905,99.9918,99.9921,99.9927,99.9944,99.97887999999998,0.004545943246455818,99.97,99.976,99.98,99.981,99.99,99.99372,0.000872778505693336,99.991889,99.99333299999999,99.99355600000001,99.994333,99.995667
56,99.991644,0.0008504492930197635,99.9899,99.9912,99.9915,99.992,99.9938,99.9776,0.004525483399594184,99.968,99.975,99.978,99.98,99.987,99.99320444000001,0.0008925004013447817,99.991333,99.992667,99.993,99.993889,99.995
57,99.99073199999997,0.0009054148220558995,99.9892,99.9903,99.9906,99.991,99.993,99.9776,0.004525483399594184,99.968,99.975,99.978,99.98,99.987,99.99219111999999,0.0008947604068141121,99.991,99.991556,99.991889,99.992778,99.994111
58,99.99069600000001,0.0008941946096909191,99.9892,99.9903,99.9906,99.9909,99.9929,99.9776,0.004525483399594184,99.968,99.975,99.978,99.98,99.987,99.99215115999999,0.0008933090699201186,99.991,99.991556,99.991889,99.99255600000001,99.994
59,99.99069600000001,0.0008941946096909191,99.9892,99.9903,99.9906,99.9909,99.9929,99.9776,0.004525483399594184,99.968,99.975,99.978,99.98,99.987,99.99215115999999,0.0008933090699201186,99.991,99.991556,99.991889,99.99255600000001,99.994
60,99.99069600000001,0.0008941946096909191,99.9892,99.9903,99.9906,99.9909,99.9929,99.9776,0.004525483399594184,99.968,99.975,99.978,99.98,99.987,99.99215115999999,0.0008933090699201186,99.991,99.991556,99.991889,99.99255600000001,99.994
61,99.99069600000001,0.0008941946096909191,99.9892,99.9903,99.9906,99.9909,99.9929,99.9776,0.004525483399594184,99.968,99.975,99.978,99.98,99.987,99.99215115999999,0.0008933090699201186,99.991,99.991556,99.991889,99.99255600000001,99.994
62,99.99069600000001,0.0008941946096909191,99.9892,99.9903,99.9906,99.9909,99.9929,99.9776,0.004525483399594184,99.968,99.975,99.978,99.98,99.987,99.99215115999999,0.0008933090699201186,99.991,99.991556,99.991889,99.99255600000001,99.994
63,99.99068000000001,0.0008926365441762657,99.9892,99.9903,99.9906,99.9909,99.9929,99.97744,0.004499599982220377,99.968,99.975,99.978,99.979,99.987,99.99215115999999,0.0008933090699201186,99.991,99.991556,99.991889,99.99255600000001,99.994
64,99.99062399999998,0.0009021219429761643,99.9892,99.9901,99.9905,99.9909,99.9929,99.97688000000002,0.004554733801223313,99.968,99.973,99.977,99.979,99.986,99.99215115999999,0.0008933090699201186,99.991,99.991556,99.991889,99.99255600000001,99.994
65,99.99040000000001,0.0009156418513830416,99.9891,99.99,99.9904,99.9907,99.9928,99.97467999999999,0.004469630857241281,99.967,99.972,99.975,99.977,99.984,99.99214672000002,0.000895426089412849,99.991,99.991556,99.991889,99.99255600000001,99.994
66,99.98976400000001,0.0009842276159498552,99.9885,99.9893,99.9895,99.9901,99.9924,99.97272,0.00485402925413549,99.965,99.969,99.972,99.976,99.984,99.99165780000001,0.0009443171077565683,99.99055600000001,99.990889,99.991222,99.992222,99.99355600000001
67,99.988944,0.001030370807040302,99.9875,99.9882,99.9888,99.9893,99.9917,99.97272,0.00485402925413549,99.965,99.969,99.972,99.976,99.984,99.99074667999999,0.0009905493716102923,99.989222,99.989889,99.99055600000001,99.991,99.992778
68,99.98892000000002,0.0010400000000003419,99.9875,99.9882,99.9888,99.9893,99.9917,99.97272,0.00485402925413549,99.965,99.969,99.972,99.976,99.984,99.99072004,0.000998287793372803,99.989222,99.989889,99.99055600000001,99.991,99.992778
69,99.98892000000002,0.0010400000000003419,99.9875,99.9882,99.9888,99.9893,99.9917,99.97272,0.00485402925413549,99.965,99.969,99.972,99.976,99.984,99.99072004,0.000998287793372803,99.989222,99.989889,99.99055600000001,99.991,99.992778
70,99.98892000000002,0.0010400000000003419,99.9875,99.9882,99.9888,99.9893,99.9917,99.97272,0.00485402925413549,99.965,99.969,99.972,99.976,99.984,99.99072004,0.000998287793372803,99.989222,99.989889,99.99055600000001,99.991,99.992778
71,99.98892000000002,0.0010400000000003419,99.9875,99.9882,99.9888,99.9893,99.9917,99.97272,0.00485402925413549,99.965,99.969,99.972,99.976,99.984,99.99072004,0.000998287793372803,99.989222,99.989889,99.99055600000001,99.991,99.992778
72,99.98892000000002,0.0010400000000003419,99.9875,99.9882,99.9888,99.9893,99.9917,99.97272,0.00485402925413549,99.965,99.969,99.972,99.976,99.984,99.99072004,0.000998287793372803,99.989222,99.989889,99.99055600000001,99.991,99.992778
73,99.988916,0.0010391073091845172,99.9875,99.9882,99.9888,99.9893,99.9917,99.97268,0.004764199827884143,99.965,99.969,99.972,99.976,99.983,99.99072004,0.000998287793372803,99.989222,99.989889,99.99055600000001,99.991,99.992778
74,99.988904,0.0010421055608716321,99.9875,99.9882,99.9888,99.9892,99.9917,99.97256000000002,0.004800666620378144,99.965,99.969,99.972,99.976,99.983,99.99072004,0.000998287793372803,99.989222,99.989889,99.99055600000001,99.991,99.992778
75,99.98860799999999,0.001009522659479065,99.9871,99.988,99.9885,99.9889,99.9912,99.96992,0.004987343982522153,99.961,99.966,99.97,99.974,99.979,99.99068448000001,0.0009776029099784406,99.989222,99.989778,99.990444,99.991,99.992667
76,99.98801999999999,0.0010594338110510467,99.9861,99.9874,99.9879,99.9883,99.9909,99.96836000000002,0.005066596490742783,99.959,99.965,99.968,99.973,99.978,99.99020444,0.0009740387704811618,99.988778,99.98955600000001,99.99,99.990667,99.992333
77,99.98711999999999,0.001230284519938438,99.985,99.9865,99.987,99.9874,99.9903,99.96832,0.005009750492789493,99.959,99.965,99.968,99.973,99.978,99.98920892,0.0011041904154626473,99.987222,99.988556,99.989,99.98955600000001,99.991667
78,99.98710799999998,0.0012341539612223038,99.985,99.9865,99.987,99.9874,99.9903,99.96832,0.005009750492789493,99.959,99.965,99.968,99.973,99.978,99.98919556000001,0.0011024118678608997,99.987222,99.988444,99.989,99.98955600000001,99.991667
79,99.98710799999998,0.0012341539612223038,99.985,99.9865,99.987,99.9874,99.9903,99.96832,0.005009750492789493,99.959,99.965,99.968,99.973,99.978,99.98919556000001,0.0011024118678608997,99.987222,99.988444,99.989,99.98955600000001,99.991667
80,99.98710799999998,0.0012341539612223038,99.985,99.9865,99.987,99.9874,99.9903,99.96832,0.005009750492789493,99.959,99.965,99.968,99.973,99.978,99.98919556000001,0.0011024118678608997,99.987222,99.988444,99.989,99.98955600000001,99.991667
81,99.98710799999998,0.0012341539612223038,99.985,99.9865,99.987,99.9874,99.9903,99.96832,0.005009750492789493,99.959,99.965,99.968,99.973,99.978,99.98919556000001,0.0011024118678608997,99.987222,99.988444,99.989,99.98955600000001,99.991667
82,99.98710799999998,0.0012341539612223038,99.985,99.9865,99.987,99.9874,99.9903,99.96832,0.005009750492789493,99.959,99.965,99.968,99.973,99.978,99.98919556000001,0.0011024118678608997,99.987222,99.988444,99.989,99.98955600000001,99.991667
83,99.98710799999998,0.0012341539612223038,99.985,99.9865,99.987,99.9874,99.9903,99.96832,0.005009750492789493,99.959,99.965,99.968,99.973,99.978,99.98919556000001,0.0011024118678608997,99.987222,99.988444,99.989,99.98955600000001,99.991667
84,99.98706000000001,0.0012354756169195543,99.985,99.9865,99.987,99.9874,99.9903,99.96784,0.004953221174145294,99.959,99.965,99.967,99.972,99.978,99.98919556000001,0.0011024118678608997,99.987222,99.988444,99.989,99.98955600000001,99.991667
85,99.98679200000001,0.0012890058184517749,99.9846,99.9861,99.9867,99.9873,99.9899,99.96535999999996,0.005175944358280487,99.957,99.961,99.965,99.971,99.974,99.98917332,0.0011187845090104506,99.987222,99.988444,99.988889,99.98955600000001,99.991667
86,99.98611199999999,0.0013644984426506815,99.9834,99.9852,99.9861,99.9867,99.9895,99.96395999999997,0.005355221750777772,99.956,99.959,99.964,99.969,99.973,99.98857339999999,0.0011621740661363592,99.98644399999999,99.987889,99.988222,99.989111,99.991333
87,99.98519200000001,0.0013555574499076572,99.9824,99.9843,99.9852,99.9855,99.9884,99.96391999999996,0.005305996607612998,99.956,99.959,99.964,99.969,99.973,99.9875556,0.0012114963970224434,99.985333,99.986889,99.987444,99.987778,99.990111
88,99.98517600000001,0.0013600823504481472,99.9824,99.9843,99.9852,99.9855,99.9884,99.96391999999996,0.005305996607612998,99.956,99.959,99.964,99.969,99.973,99.98753784,0.0012117744569014298,99.985333,99.986889,99.987444,99.987778,99.990111
89,99.98517600000001,0.0013600823504481472,99.9824,99.9843,99.9852,99.9855,99.9884,99.96391999999996,0.005305996607612998,99.956,99.959,99.964,99.969,99.973,99.98753784,0.0012117744569014298,99.985333,99.986889,99.987444,99.987778,99.990111
90,99.98517600000001,0.0013600823504481472,99.9824,99.9843,99.9852,99.9855,99.9884,99.96391999999996,0.005305996607612998,99.956,99.959,99.964,99.969,99.973,99.98753784,0.0012117744569014298,99.985333,99.986889,99.987444,99.987778,99.990111
91,99.98517600000001,0.0013600823504481472,99.9824,99.9843,99.9852,99.9855,99.9884,99.96391999999996,0.005305996607612998,99.956,99.959,99.964,99.969,99.973,99.98753784,0.0012117744569014298,99.985333,99.986889,99.987444,99.987778,99.990111
92,99.98517200000002,0.001359564636198122,99.9824,99.9843,99.9852,99.9855,99.9884,99.96387999999997,0.005309011207371953,99.956,99.959,99.964,99.969,99.973,99.98753784,0.0012117744569014298,99.985333,99.986889,99.987444,99.987778,99.990111
93,99.98516800000002,0.0013622686959630054,99.9824,99.9842,99.9852,99.9855,99.9884,99.96383999999996,0.005341760009584645,99.956,99.959,99.964,99.969,99.973,99.98753784,0.0012117744569014298,99.985333,99.986889,99.987444,99.987778,99.990111
94,99.98511600000002,0.001362550549521404,99.9823,99.9842,99.9852,99.9854,99.9883,99.96331999999998,0.005289385597589569,99.955,99.959,99.963,99.969,99.972,99.98753784,0.0012117744569014298,99.985333,99.986889,99.987444,99.987778,99.990111
95,99.98481199999998,0.0014128892384042936,99.982,99.9838,99.9848,99.9852,99.9882,99.96044000000002,0.006312400494266093,99.949,99.955,99.961,99.968,99.971,99.98752008000001,0.001222734768295678,99.985333,99.986778,99.98733299999999,99.987778,99.990111
96,99.984172,0.0014860740223841267,99.9814,99.9833,99.9842,99.9849,99.9881,99.95852,0.006771233270240021,99.947,99.953,99.957,99.965,99.971,99.98702216000001,0.0013094505009346366,99.984889,99.986222,99.986889,99.987444,99.99
97,99.983372,0.0015363645400741158,99.9804,99.9824,99.9833,99.984,99.9874,99.95852,0.006771233270240021,99.947,99.953,99.957,99.965,99.971,99.98613323999999,0.0014012943810645876,99.984,99.985222,99.985889,99.986889,99.989222
98,99.98335599999999,0.0015281570599896962,99.9804,99.9824,99.9833,99.984,99.9874,99.95852,0.006771233270240021,99.947,99.953,99.957,99.965,99.971,99.98611543999999,0.0013989301363550434,99.984,99.985111,99.985889,99.986889,99.989222
99,99.98335599999999,0.0015281570599896962,99.9804,99.9824,99.9833,99.984,99.9874,99.95852,0.006771233270240021,99.947,99.953,99.957,99.965,99.971,99.98611543999999,0.0013989301363550434,99.984,99.985111,99.985889,99.986889,99.989222
100,99.98335599999999,0.0015281570599896962,99.9804,99.9824,99.9833,99.984,99.9874,99.95852,0.006771233270240021,99.947,99.953,99.957,99.965,99.971,99.98611543999999,0.0013989301363550434,99.984,99.985111,99.985889,99.986889,99.989222
101,99.98335599999999,0.0015281570599896962,99.9804,99.9824,99.9833,99.984,99.9874,99.95852,0.006771233270240021,99.947,99.953,99.957,99.965,99.971,99.98611543999999,0.0013989301363550434,99.984,99.985111,99.985889,99.986889,99.989222
102,99.98335599999999,0.0015281570599896962,99.9804,99.9824,99.9833,99.984,99.9874,99.95852,0.006771233270240021,99.947,99.953,99.957,99.965,99.971,99.98611543999999,0.0013989301363550434,99.984,99.985111,99.985889,99.986889,99.989222
103,99.98335599999999,0.0015281570599896962,99.9804,99.9824,99.9833,99.984,99.9874,99.95852,0.006771233270240021,99.947,99.953,99.957,99.965,99.971,99.98611543999999,0.0013989301363550434,99.984,99.985111,99.985889,99.986889,99.989222
104,99.98335599999999,0.0015281570599896962,99.9804,99.9824,99.9833,99.984,99.9874,99.95852,0.006771233270240021,99.947,99.953,99.957,99.965,99.971,99.98611543999999,0.0013989301363550434,99.984,99.985111,99.985889,99.986889,99.989222
105,99.98335599999999,0.0015281570599896962,99.9804,99.9824,99.9833,99.984,99.9874,99.95852,0.006771233270240021,99.947,99.953,99.957,99.965,99.971,99.98611543999999,0.0013989301363550434,99.984,99.985111,99.985889,99.986889,99.989222
106,99.98335599999999,0.0015281570599896962,99.9804,99.9824,99.9833,99.984,99.9874,99.95852,0.006771233270240021,99.947,99.953,99.957,99.965,99.971,99.98611543999999,0.0013989301363550434,99.984,99.985111,99.985889,99.986889,99.989222
107,99.98335599999999,0.0015281570599896962,99.9804,99.9824,99.9833,99.984,99.9874,99.95852,0.006771233270240021,99.947,99.953,99.957,99.965,99.971,99.98611543999999,0.0013989301363550434,99.984,99.985111,99.985889,99.986889,99.989222
108,99.98335599999999,0.0015281570599896962,99.9804,99.9824,99.9833,99.984,99.9874,99.95852,0.006771233270240021,99.947,99.953,99.957,99.965,99.971,99.98611543999999,0.0013989301363550434,99.984,99.985111,99.985889,99.986889,99.989222
109,99.98335599999999,0.0015281570599896962,99.9804,99.9824,99.9833,99.984,99.9874,99.95852,0.006771233270240021,99.947,99.953,99.957,99.965,99.971,99.98611543999999,0.0013989301363550434,99.984,99.985111,99.985889,99.986889,99.989222
110,99.98335599999999,0.0015281570599896962,99.9804,99.9824,99.9833,99.984,99.9874,99.95852,0.006771233270240021,99.947,99.953,99.957,99.965,99.971,99.98611543999999,0.0013989301363550434,99.984,99.985111,99.985889,99.986889,99.989222
111,99.98335599999999,0.0015281570599896962,99.9804,99.9824,99.9833,99.984,99.9874,99.95852,0.006771233270240021,99.947,99.953,99.957,99.965,99.971,99.98611543999999,0.0013989301363550434,99.984,99.985111,99.985889,99.986889,99.989222
112,99.98335599999999,0.0015281570599896962,99.9804,99.9824,99.9833,99.984,99.9874,99.95852,0.006771233270240021,99.947,99.953,99.957,99.965,99.971,99.98611543999999,0.0013989301363550434,99.984,99.985111,99.985889,99.986889,99.989222
113,99.98335599999999,0.0015281570599896962,99.9804,99.9824,99.9833,99.984,99.9874,99.95852,0.006771233270240021,99.947,99.953,99.957,99.965,99.971,99.98611543999999,0.0013989301363550434,99.984,99.985111,99.985889,99.986889,99.989222
114,99.98335599999999,0.0015281570599896962,99.9804,99.9824,99.9833,99.984,99.9874,99.95852,0.006771233270240021,99.947,99.953,99.957,99.965,99.971,99.98611543999999,0.0013989301363550434,99.984,99.985111,99.985889,99.986889,99.989222
115,99.98335599999999,0.0015281570599896962,99.9804,99.9824,99.9833,99.984,99.9874,99.95852,0.006771233270240021,99.947,99.953,99.957,99.965,99.971,99.98611543999999,0.0013989301363550434,99.984,99.985111,99.985889,99.986889,99.989222
116,99.98335599999999,0.0015281570599896962,99.9804,99.9824,99.9833,99.984,99.9874,99.95852,0.006771233270240021,99.947,99.953,99.957,99.965,99.971,99.98611543999999,0.0013989301363550434,99.984,99.985111,99.985889,99.986889,99.989222
117,99.98335599999999,0.0015281570599896962,99.9804,99.9824,99.9833,99.984,99.9874,99.95852,0.006771233270240021,99.947,99.953,99.957,99.965,99.971,99.98611543999999,0.0013989301363550434,99.984,99.985111,99.985889,99.986889,99.989222
118,99.98335599999999,0.0015281570599896962,99.9804,99.9824,99.9833,99.984,99.9874,99.95852,0.006771233270240021,99.947,99.953,99.957,99.965,99.971,99.98611543999999,0.0013989301363550434,99.984,99.985111,99.985889,99.986889,99.989222
119,99.98335599999999,0.0015281570599896962,99.9804,99.9824,99.9833,99.984,99.9874,99.95852,0.006771233270240021,99.947,99.953,99.957,99.965,99.971,99.98611543999999,0.0013989301363550434,99.984,99.985111,99.985889,99.986889,99.989222
120,99.98335599999999,0.0015281570599896962,99.9804,99.9824,99.9833,99.984,99.9874,99.95852,0.006771233270240021,99.947,99.953,99.957,99.965,99.971,99.98611543999999,0.0013989301363550434,99.984,99.985111,99.985889,99.986889,99.989222
121,99.98335599999999,0.0015281570599896962,99.9804,99.9824,99.9833,99.984,99.9874,99.95852,0.006771233270240021,99.947,99.953,99.957,99.965,99.971,99.98611543999999,0.0013989301363550434,99.984,99.985111,99.985889,99.986889,99.989222
122,99.98335599999999,0.0015281570599896962,99.9804,99.9824,99.9833,99.984,99.9874,99.95852,0.006771233270240021,99.947,99.953,99.957,99.965,99.971,99.98611543999999,0.0013989301363550434,99.984,99.985111,99.985889,99.986889,99.989222
123,99.98335599999999,0.0015281570599896962,99.9804,99.9824,99.9833,99.984,99.9874,99.95852,0.006771233270240021,99.947,99.953,99.957,99.965,99.971,99.98611543999999,0.0013989301363550434,99.984,99.985111,99.985889,99.986889,99.989222
