gossips,p2p mean,p2p std,p2p min,p2p q1,p2p q2,p2p q3,p2p max,p2s mean,p2s std,p2s min,p2s q1,p2s q2,p2s q3,p2s max,s2s mean,s2s std,s2s min,s2s q1,s2s q2,s2s q3,s2s max
1,51.640719999999995,0.14666899240580195,51.351,51.538,51.62,51.711,51.907,58.62132,0.27513553023918874,58.233,58.44,58.622,58.689,59.387,55.8212,0.278859915464287,55.535667000000004,55.644110999999995,55.756778000000004,55.80433299999999,56.459778
2,18.7664,0.16797246798210605,18.465,18.662,18.76,18.895,19.109,20.122999999999998,0.17766799561729446,19.657,20.068,20.143,20.207,20.432,21.440906760000004,0.1846290727341985,20.946444,21.368778,21.446111,21.529111,21.828111
3,0.02860000000000001,0.003989569734528607,0.021,0.026,0.028,0.03,0.038,0.2034,0.014793016370346293,0.176,0.192,0.202,0.214,0.236,0.44047996,0.014909265836720456,0.408333,0.43,0.446333,0.452,0.459111
4,,,,,,,,,,,,,,,0.001920040000000001,0.0005087480941815245,0.001,0.001778,0.001889,0.002222,0.002889
5,,,,,,,,,,,,,,,,,,,,,
