gossips,p2p mean,p2p std,p2p min,p2p q1,p2p q2,p2p q3,p2p max,p2s mean,p2s std,p2s min,p2s q1,p2s q2,p2s q3,p2s max,s2s mean,s2s std,s2s min,s2s q1,s2s q2,s2s q3,s2s max
1,49.264799999999994,0.5407180411267962,48.42,48.88,49.1,49.59,50.56,58.406000000000006,0.5774296493946227,57.43,58.04,58.39,58.66,60.03,52.83296163999999,0.21160775465171128,52.47596,52.701313,52.819494999999996,52.905455,53.300303
2,22.248,0.4034848200366405,21.46,22.0,22.32,22.51,22.98,20.292,0.39338276525541893,19.48,20.13,20.35,20.54,21.17,21.73319192,0.22985622374249515,21.333434,21.546364,21.791313,21.861212,22.256869000000002
3,2.0480000000000005,0.12780193008453877,1.78,1.94,2.06,2.13,2.25,0.33719999999999994,0.06723838189605695,0.22,0.29,0.32,0.39,0.48,1.19578584,0.03487779255328529,1.133232,1.1736360000000001,1.190707,1.207071,1.261616
4,0.02476190476190477,0.010304876330673559,0.01,0.02,0.02,0.03,0.05,0.013333333333333334,0.005773502691896258,0.01,0.01,0.01,0.015,0.02,0.016347640000000004,0.0018917737461616986,0.012828,0.015556,0.016162,0.016869,0.019798
5,,,,,,,,,,,,,,,0.000101,0.0,0.000101,0.000101,0.000101,0.000101,0.000101
