round,nodes,nodesP,nodesS,nodesSent,nodesSentP,nodesSentS,nodesRecv,nodesRecvP,nodesRecvS,msgSent,msgSentP,msgSentS,msgRecv,msgRecvP,msgRecvS,msgInfect,msgInfectP,msgInfectS
00,100000.000000,100000.000000,0.000000,0.000000,0.000000,0.000000,0.000000,0.000000,0.000000,0.000000,0.000000,0.000000,0.000000,0.000000,0.000000,0.000000,0.000000,0.000000
01,100000.000000,100000.000000,0.000000,0.001200,0.001200,0.000000,0.001200,0.001200,0.000000,20.400000,20.400000,0.000000,1.200000,1.200000,0.000000,1.000000,1.000000,0.000000
02,100000.000000,100000.000000,0.000000,0.020100,0.020100,0.000000,0.020100,0.020100,0.000000,341.700000,341.700000,0.000000,20.100000,20.100000,0.000000,1.000000,1.000000,0.000000
03,100000.000000,100000.000000,0.000000,0.336200,0.336200,0.000000,0.336200,0.336200,0.000000,5715.400000,5715.400000,0.000000,336.800000,336.800000,0.000000,1.000000,1.000000,0.000000
04,100000.000000,100000.000000,0.000000,5.586500,5.586500,0.000000,5.586500,5.586500,0.000000,94970.500000,94970.500000,0.000000,5744.800000,5744.800000,0.000000,1.000000,1.000000,0.000000
05,100000.000000,100000.000000,0.000000,60.180300,60.180300,0.000000,60.180300,60.180300,0.000000,1023065.100000,1023065.100000,0.000000,92132.500000,92132.500000,0.000000,1.000000,1.000000,0.000000
06,100000.000000,100000.000000,0.000000,99.993800,99.993800,0.000000,99.993800,99.993800,0.000000,1699894.600000,1699894.600000,0.000000,988172.800000,988172.800000,0.000000,9.000000,9.000000,0.000000
07,100000.000000,100000.000000,0.000000,100.000000,100.000000,0.000000,100.000000,100.000000,0.000000,1700000.000000,1700000.000000,0.000000,1699887.300000,1699887.300000,0.000000,16.000000,16.000000,0.000000
08,100000.000000,100000.000000,0.000000,100.000000,100.000000,0.000000,100.000000,100.000000,0.000000,1700000.000000,1700000.000000,0.000000,1700001.000000,1700001.000000,0.000000,17.000000,17.000000,0.000000
09,100000.000000,100000.000000,0.000000,100.000000,100.000000,0.000000,100.000000,100.000000,0.000000,1700000.000000,1700000.000000,0.000000,1700001.000000,1700001.000000,0.000000,17.000000,17.000000,0.000000
10,100000.000000,100000.000000,0.000000,100.000000,100.000000,0.000000,100.000000,100.000000,0.000000,1700000.000000,1700000.000000,0.000000,1700001.000000,1700001.000000,0.000000,17.000000,17.000000,0.000000
11,100000.000000,100000.000000,0.000000,100.000000,100.000000,0.000000,100.000000,100.000000,0.000000,1700000.000000,1700000.000000,0.000000,1700001.000000,1700001.000000,0.000000,17.000000,17.000000,0.000000
12,100000.000000,100000.000000,0.000000,100.000000,100.000000,0.000000,100.000000,100.000000,0.000000,1700000.000000,1700000.000000,0.000000,1700001.000000,1700001.000000,0.000000,17.000000,17.000000,0.000000
13,100000.000000,100000.000000,0.000000,100.000000,100.000000,0.000000,100.000000,100.000000,0.000000,1700000.000000,1700000.000000,0.000000,1700001.000000,1700001.000000,0.000000,17.000000,17.000000,0.000000
14,100000.000000,100000.000000,0.000000,100.000000,100.000000,0.000000,100.000000,100.000000,0.000000,1700000.000000,1700000.000000,0.000000,1700001.000000,1700001.000000,0.000000,17.000000,17.000000,0.000000
15,100000.000000,100000.000000,0.000000,100.000000,100.000000,0.000000,100.000000,100.000000,0.000000,1700000.000000,1700000.000000,0.000000,1700001.000000,1700001.000000,0.000000,17.000000,17.000000,0.000000
16,100000.000000,100000.000000,0.000000,100.000000,100.000000,0.000000,100.000000,100.000000,0.000000,1700000.000000,1700000.000000,0.000000,1700001.000000,1700001.000000,0.000000,17.000000,17.000000,0.000000
17,100000.000000,100000.000000,0.000000,100.000000,100.000000,0.000000,100.000000,100.000000,0.000000,1700000.000000,1700000.000000,0.000000,1700001.000000,1700001.000000,0.000000,17.000000,17.000000,0.000000
18,100000.000000,100000.000000,0.000000,100.000000,100.000000,0.000000,100.000000,100.000000,0.000000,1700000.000000,1700000.000000,0.000000,1700001.000000,1700001.000000,0.000000,17.000000,17.000000,0.000000
19,100000.000000,100000.000000,0.000000,100.000000,100.000000,0.000000,100.000000,100.000000,0.000000,1700000.000000,1700000.000000,0.000000,1700001.000000,1700001.000000,0.000000,17.000000,17.000000,0.000000
