gossips,p2p mean,p2p std,p2p min,p2p q1,p2p q2,p2p q3,p2p max,p2s mean,p2s std,p2s min,p2s q1,p2s q2,p2s q3,p2s max,s2s mean,s2s std,s2s min,s2s q1,s2s q2,s2s q3,s2s max
1,5.98,5.513166059534211,1.7,2.5,4.5,7.2,29.3,18.916,7.327782747871282,9.3,14.1,18.4,23.5,37.2,41.19601204000001,0.9318986865450871,38.131130999999996,40.870470000000005,41.275275,41.81021,42.380581
2,0.14285714285714285,0.053452248382484885,0.1,0.1,0.1,0.2,0.2,0.924,0.7025429998702334,0.1,0.5,0.7,1.3,2.6,21.44413208,3.8265167210814686,11.722923,20.364164000000002,21.679679999999998,23.919119,26.269069000000002
3,0.1,0.0,0.1,0.1,0.1,0.1,0.1,0.1,,0.1,0.1,0.1,0.1,0.1,5.545953999999998,1.8054284855798315,1.610811,4.7336339999999995,5.4466470000000005,7.084885000000001,8.613013
4,,,,,,,,,,,,,,,0.7446766800000002,0.34997462985916566,0.125926,0.511712,0.725125,1.053754,1.481882
5,,,,,,,,,,,,,,,0.05189588,0.03274793631452217,0.006506999999999999,0.025526,0.050551,0.067968,0.13043
6,,,,,,,,,,,,,,,0.0017617599999999994,0.0014352318418987225,0.0001,0.0005009999999999999,0.0015019999999999999,0.002402,0.005104999999999999
7,,,,,,,,,,,,,,,0.0001375,7.440238091428449e-05,0.0001,0.0001,0.0001,0.000125,0.0003
