,mean,std,sem,cistd,cisem,min,05th,25th,50th,75th,95th,max
Uniform,,,,,,,,,,,,
P,7.341463350000003,1.872795108672086,0.18822299044479318,0.1872795108672086,0.018822299044479317,3.0487799999999936,4.8628051000000045,6.097560999999999,7.0121950000000055,8.536585000000002,10.990853900000003,12.804878000000002
S,5.460404340000001,1.5958254362104347,0.16038649099440144,0.15958254362104346,0.016038649099440146,1.6288509999999974,3.2989757500000003,4.220005500000006,5.246313999999998,6.432639000000005,8.716120800000006,10.121832999999995
P+S,5.460404340000001,1.5958254362104347,0.16038649099440144,0.15958254362104346,0.016038649099440146,1.6288509999999974,3.2989757500000003,4.220005500000006,5.246313999999998,6.432639000000005,8.716120800000006,10.121832999999995
