gossips,p2p mean,p2p std,p2p min,p2p q1,p2p q2,p2p q3,p2p max,p2s mean,p2s std,p2s min,p2s q1,p2s q2,p2s q3,p2s max,s2s mean,s2s std,s2s min,s2s q1,s2s q2,s2s q3,s2s max
1,49.24224,0.13759611186367066,49.049,49.124,49.248,49.33,49.587,58.34684,0.2348500727414562,58.06,58.175,58.297,58.488,58.767,55.83906232,0.2869052826433192,55.530778000000005,55.65744399999999,55.719889,55.87133299999999,56.53844399999999
2,22.282159999999998,0.12946289043583123,21.86,22.244,22.299,22.384,22.431,20.31056,0.14049320268254972,20.101,20.227,20.281,20.362,20.613,21.37802224,0.1614498289397981,21.055332999999997,21.311332999999998,21.386778,21.502222,21.672778
3,2.0296399999999997,0.03137127135878728,1.967,2.006,2.026,2.055,2.089,0.32908000000000004,0.01924603855342705,0.288,0.318,0.329,0.341,0.37,0.44052884000000014,0.020410547972964047,0.403778,0.427333,0.447,0.45588900000000004,0.46644399999999997
4,0.02428000000000001,0.004306197084822447,0.015,0.021,0.024,0.028,0.033,0.0016923076923076928,0.0007510676161988108,0.001,0.001,0.002,0.002,0.003,0.0020489600000000007,0.0004057660943614353,0.000889,0.001778,0.002111,0.002333,0.002778
5,0.001,,0.001,0.001,0.001,0.001,0.001,,,,,,,,,,,,,,
