round,P+S mean,P+S std,P+S min,P+S q1,P+S median,P+S q3,P+S max,P mean,P std,P min,P q1,P median,P q3,P max,S mean,S std,S min,S q1,S median,S q3,S max
0,0.00010399999999999998,1.9595917942265427e-05,0.0001,0.0001,0.0001,0.0001,0.0002,0.004,0.01959591794226543,0.0,0.0,0.0,0.0,0.1,9.999999999999999e-05,1.3552527156068805e-20,0.0001,0.0001,0.0001,0.0001,0.0001
1,0.001172,9.173875952943768e-05,0.0011,0.0011,0.0012,0.0012,0.0015,1.072,0.09173875952943772,1.0,1.0,1.1,1.1,1.4,9.999999999999999e-05,1.3552527156068805e-20,0.0001,0.0001,0.0001,0.0001,0.0001
2,0.011219999999999999,0.00045254833995939044,0.0103,0.011,0.0111,0.0115,0.0124,11.083999999999998,0.45666618004840254,10.2,10.8,11.0,11.3,12.2,0.00013599999999999992,6.24819974072532e-05,0.0001,0.0001,0.0001,0.0002,0.0003
3,0.07427999999999998,0.0017674840876228555,0.0708,0.073,0.0742,0.0755,0.0783,66.86399999999999,1.358198807244359,64.5,66.2,66.8,68.0,69.2,0.007423479999999998,0.0025669264753007633,0.003203,0.005606,0.006706999999999999,0.009009,0.013313
4,0.452416,0.015707493243671954,0.4255,0.4406,0.4482,0.4609,0.4868,99.86000000000001,0.11313708498984852,99.5,99.8,99.9,99.9,100.0,0.35290892000000007,0.015759302207699426,0.325826,0.34124099999999996,0.348649,0.36146100000000003,0.387387
5,4.630172,0.1526810571616531,4.3789,4.5151,4.5979,4.7383,4.9871,99.98800000000001,0.032496153618541995,99.9,100.0,100.0,100.0,100.0,4.53471872,0.15282672817397355,4.283183,4.4195199999999994,4.502402,4.642943,4.891992
6,36.797412,0.887514656248561,35.2472,36.1361,36.6915,37.0991,38.9027,99.98800000000001,0.032496153618541995,99.9,100.0,100.0,100.0,100.0,36.73415811999999,0.8883962115423185,35.182382000000004,36.072171999999995,36.628128000000004,37.036235999999995,38.841542
7,97.22485200000001,0.23993910414102962,96.7814,97.0223,97.1858,97.3632,97.7435,99.98800000000001,0.032496153618541995,99.9,100.0,100.0,100.0,100.0,97.22208608,0.24017187617702795,96.778178,97.019319,97.182983,97.360561,97.741241
8,99.99385999999998,0.0007277362159472292,99.9927,99.9933,99.9939,99.9943,99.9955,99.98800000000001,0.032496153618541995,99.9,100.0,100.0,100.0,100.0,99.99386584000001,0.000723187095012613,99.992693,99.99329300000001,99.993894,99.994294,99.99549499999999
9,99.995388,0.0006320253159479091,99.9936,99.9952,99.9955,99.9957,99.9965,99.98800000000001,0.032496153618541995,99.9,100.0,100.0,100.0,100.0,99.99539535999996,0.0006266996652315936,99.99369399999999,99.995195,99.99549499999999,99.995696,99.996496
10,99.995388,0.0006320253159479091,99.9936,99.9952,99.9955,99.9957,99.9965,99.98800000000001,0.032496153618541995,99.9,100.0,100.0,100.0,100.0,99.99539535999996,0.0006266996652315936,99.99369399999999,99.995195,99.99549499999999,99.995696,99.996496
11,99.995388,0.0006320253159479091,99.9936,99.9952,99.9955,99.9957,99.9965,99.98800000000001,0.032496153618541995,99.9,100.0,100.0,100.0,100.0,99.99539535999996,0.0006266996652315936,99.99369399999999,99.995195,99.99549499999999,99.995696,99.996496
12,99.995388,0.0006320253159479091,99.9936,99.9952,99.9955,99.9957,99.9965,99.98800000000001,0.032496153618541995,99.9,100.0,100.0,100.0,100.0,99.99539535999996,0.0006266996652315936,99.99369399999999,99.995195,99.99549499999999,99.995696,99.996496
13,99.995388,0.0006320253159479091,99.9936,99.9952,99.9955,99.9957,99.9965,99.98800000000001,0.032496153618541995,99.9,100.0,100.0,100.0,100.0,99.99539535999996,0.0006266996652315936,99.99369399999999,99.995195,99.99549499999999,99.995696,99.996496
14,99.995388,0.0006320253159479091,99.9936,99.9952,99.9955,99.9957,99.9965,99.98800000000001,0.032496153618541995,99.9,100.0,100.0,100.0,100.0,99.99539535999996,0.0006266996652315936,99.99369399999999,99.995195,99.99549499999999,99.995696,99.996496
15,99.995388,0.0006320253159479091,99.9936,99.9952,99.9955,99.9957,99.9965,99.98800000000001,0.032496153618541995,99.9,100.0,100.0,100.0,100.0,99.99539535999996,0.0006266996652315936,99.99369399999999,99.995195,99.99549499999999,99.995696,99.996496
16,99.995388,0.0006320253159479091,99.9936,99.9952,99.9955,99.9957,99.9965,99.98800000000001,0.032496153618541995,99.9,100.0,100.0,100.0,100.0,99.99539535999996,0.0006266996652315936,99.99369399999999,99.995195,99.99549499999999,99.995696,99.996496
17,99.995388,0.0006320253159479091,99.9936,99.9952,99.9955,99.9957,99.9965,99.98800000000001,0.032496153618541995,99.9,100.0,100.0,100.0,100.0,99.99539535999996,0.0006266996652315936,99.99369399999999,99.995195,99.99549499999999,99.995696,99.996496
18,99.995388,0.0006320253159479091,99.9936,99.9952,99.9955,99.9957,99.9965,99.98800000000001,0.032496153618541995,99.9,100.0,100.0,100.0,100.0,99.99539535999996,0.0006266996652315936,99.99369399999999,99.995195,99.99549499999999,99.995696,99.996496
19,99.995388,0.0006320253159479091,99.9936,99.9952,99.9955,99.9957,99.9965,99.98800000000001,0.032496153618541995,99.9,100.0,100.0,100.0,100.0,99.99539535999996,0.0006266996652315936,99.99369399999999,99.995195,99.99549499999999,99.995696,99.996496
20,99.995388,0.0006320253159479091,99.9936,99.9952,99.9955,99.9957,99.9965,99.98800000000001,0.032496153618541995,99.9,100.0,100.0,100.0,100.0,99.99539535999996,0.0006266996652315936,99.99369399999999,99.995195,99.99549499999999,99.995696,99.996496
21,99.995388,0.0006320253159479091,99.9936,99.9952,99.9955,99.9957,99.9965,99.98800000000001,0.032496153618541995,99.9,100.0,100.0,100.0,100.0,99.99539535999996,0.0006266996652315936,99.99369399999999,99.995195,99.99549499999999,99.995696,99.996496
22,99.995388,0.0006320253159479091,99.9936,99.9952,99.9955,99.9957,99.9965,99.98800000000001,0.032496153618541995,99.9,100.0,100.0,100.0,100.0,99.99539535999996,0.0006266996652315936,99.99369399999999,99.995195,99.99549499999999,99.995696,99.996496
23,99.995388,0.0006320253159479091,99.9936,99.9952,99.9955,99.9957,99.9965,99.98800000000001,0.032496153618541995,99.9,100.0,100.0,100.0,100.0,99.99539535999996,0.0006266996652315936,99.99369399999999,99.995195,99.99549499999999,99.995696,99.996496
24,99.995388,0.0006320253159479091,99.9936,99.9952,99.9955,99.9957,99.9965,99.98800000000001,0.032496153618541995,99.9,100.0,100.0,100.0,100.0,99.99539535999996,0.0006266996652315936,99.99369399999999,99.995195,99.99549499999999,99.995696,99.996496
