round,P+S mean,P+S std,P+S min,P+S q1,P+S median,P+S q3,P+S max,P mean,P std,P min,P q1,P median,P q3,P max,S mean,S std,S min,S q1,S median,S q3,S max
0,0.0,0.0,0.0,0.0,0.0,0.0,0.0,0.0,0.0,0.0,0.0,0.0,0.0,0.0,0.0,0.0,0.0,0.0,0.0,0.0,0.0
1,0.0,0.0,0.0,0.0,0.0,0.0,0.0,0.0,0.0,0.0,0.0,0.0,0.0,0.0,0.0,0.0,0.0,0.0,0.0,0.0,0.0
2,0.0,0.0,0.0,0.0,0.0,0.0,0.0,0.0,0.0,0.0,0.0,0.0,0.0,0.0,0.0,0.0,0.0,0.0,0.0,0.0,0.0
3,0.0,0.0,0.0,0.0,0.0,0.0,0.0,0.0,0.0,0.0,0.0,0.0,0.0,0.0,0.0,0.0,0.0,0.0,0.0,0.0,0.0
4,0.0,0.0,0.0,0.0,0.0,0.0,0.0,0.0,0.0,0.0,0.0,0.0,0.0,0.0,0.0,0.0,0.0,0.0,0.0,0.0,0.0
5,0.0,0.0,0.0,0.0,0.0,0.0,0.0,0.0,0.0,0.0,0.0,0.0,0.0,0.0,0.0,0.0,0.0,0.0,0.0,0.0,0.0
6,0.0,0.0,0.0,0.0,0.0,0.0,0.0,0.0,0.0,0.0,0.0,0.0,0.0,0.0,0.0,0.0,0.0,0.0,0.0,0.0,0.0
7,0.0,0.0,0.0,0.0,0.0,0.0,0.0,0.0,0.0,0.0,0.0,0.0,0.0,0.0,0.0,0.0,0.0,0.0,0.0,0.0,0.0
8,0.0,0.0,0.0,0.0,0.0,0.0,0.0,0.0,0.0,0.0,0.0,0.0,0.0,0.0,0.0,0.0,0.0,0.0,0.0,0.0,0.0
9,0.0,0.0,0.0,0.0,0.0,0.0,0.0,0.0,0.0,0.0,0.0,0.0,0.0,0.0,0.0,0.0,0.0,0.0,0.0,0.0,0.0
10,0.0,0.0,0.0,0.0,0.0,0.0,0.0,0.0,0.0,0.0,0.0,0.0,0.0,0.0,0.0,0.0,0.0,0.0,0.0,0.0,0.0
11,0.0,0.0,0.0,0.0,0.0,0.0,0.0,0.0,0.0,0.0,0.0,0.0,0.0,0.0,0.0,0.0,0.0,0.0,0.0,0.0,0.0
12,0.0,0.0,0.0,0.0,0.0,0.0,0.0,0.0,0.0,0.0,0.0,0.0,0.0,0.0,0.0,0.0,0.0,0.0,0.0,0.0,0.0
13,0.0,0.0,0.0,0.0,0.0,0.0,0.0,0.0,0.0,0.0,0.0,0.0,0.0,0.0,0.0,0.0,0.0,0.0,0.0,0.0,0.0
14,0.0,0.0,0.0,0.0,0.0,0.0,0.0,0.0,0.0,0.0,0.0,0.0,0.0,0.0,0.0,0.0,0.0,0.0,0.0,0.0,0.0
15,0.0,0.0,0.0,0.0,0.0,0.0,0.0,0.0,0.0,0.0,0.0,0.0,0.0,0.0,0.0,0.0,0.0,0.0,0.0,0.0,0.0
16,0.0,0.0,0.0,0.0,0.0,0.0,0.0,0.0,0.0,0.0,0.0,0.0,0.0,0.0,0.0,0.0,0.0,0.0,0.0,0.0,0.0
17,0.0,0.0,0.0,0.0,0.0,0.0,0.0,0.0,0.0,0.0,0.0,0.0,0.0,0.0,0.0,0.0,0.0,0.0,0.0,0.0,0.0
18,0.0,0.0,0.0,0.0,0.0,0.0,0.0,0.0,0.0,0.0,0.0,0.0,0.0,0.0,0.0,0.0,0.0,0.0,0.0,0.0,0.0
19,0.0,0.0,0.0,0.0,0.0,0.0,0.0,0.0,0.0,0.0,0.0,0.0,0.0,0.0,0.0,0.0,0.0,0.0,0.0,0.0,0.0
20,0.0,0.0,0.0,0.0,0.0,0.0,0.0,0.0,0.0,0.0,0.0,0.0,0.0,0.0,0.0,0.0,0.0,0.0,0.0,0.0,0.0
21,0.0,0.0,0.0,0.0,0.0,0.0,0.0,0.0,0.0,0.0,0.0,0.0,0.0,0.0,0.0,0.0,0.0,0.0,0.0,0.0,0.0
22,0.0,0.0,0.0,0.0,0.0,0.0,0.0,0.0,0.0,0.0,0.0,0.0,0.0,0.0,0.0,0.0,0.0,0.0,0.0,0.0,0.0
23,0.0,0.0,0.0,0.0,0.0,0.0,0.0,0.0,0.0,0.0,0.0,0.0,0.0,0.0,0.0,0.0,0.0,0.0,0.0,0.0,0.0
24,0.0,0.0,0.0,0.0,0.0,0.0,0.0,0.0,0.0,0.0,0.0,0.0,0.0,0.0,0.0,0.0,0.0,0.0,0.0,0.0,0.0
25,0.0,0.0,0.0,0.0,0.0,0.0,0.0,0.0,0.0,0.0,0.0,0.0,0.0,0.0,0.0,0.0,0.0,0.0,0.0,0.0,0.0
26,0.0,0.0,0.0,0.0,0.0,0.0,0.0,0.0,0.0,0.0,0.0,0.0,0.0,0.0,0.0,0.0,0.0,0.0,0.0,0.0,0.0
27,0.0,0.0,0.0,0.0,0.0,0.0,0.0,0.0,0.0,0.0,0.0,0.0,0.0,0.0,0.0,0.0,0.0,0.0,0.0,0.0,0.0
28,0.0006679999999999999,0.00015676734353812336,0.0004,0.0006,0.0007,0.0007,0.0011,0.06680000000000003,0.015676734353812338,0.04,0.06,0.07,0.07,0.11,0.0,0.0,0.0,0.0,0.0,0.0,0.0
29,0.011468,0.0002824464551025559,0.011,0.0113,0.0115,0.0116,0.0122,1.1459999999999997,0.027568097504180416,1.1,1.13,1.14,1.16,1.22,8.08e-06,2.740061313182608e-05,0.0,0.0,0.0,0.0,0.000101
30,0.10930399999999998,0.001431497118404365,0.1066,0.1084,0.1091,0.1102,0.1122,10.896400000000002,0.15011675456124138,10.57,10.81,10.89,11.0,11.22,0.0003434000000000001,0.0003624760405875125,0.0,0.000101,0.000202,0.000505,0.001515
31,0.7332120000000001,0.0072804021866927264,0.719,0.7278,0.7323,0.7367,0.753,65.90519999999998,0.6007536599971748,64.42,65.51,66.1,66.31,66.81,0.07490904,0.01087912569089998,0.056061,0.067273,0.07333300000000001,0.082424,0.105455
32,4.578536000000001,0.08146892845741863,4.4192,4.5291,4.5693,4.6254,4.8149,99.8208,0.04462465686142586,99.72,99.79,99.83,99.85,99.9,3.61649296,0.08241972453410887,3.455455,3.5662629999999997,3.6069699999999996,3.663939,3.8551519999999995
33,37.280092,0.4749215749321138,36.3474,37.0246,37.2454,37.526,38.6414,99.9536,0.02037253052519484,99.91,99.94,99.95,99.97,99.99,36.647026239999995,0.47973467190656716,35.704949,36.389091,36.611717,36.895657,38.02202
34,97.48835199999999,0.09748306979163222,97.2845,97.4265,97.4696,97.5541,97.7493,99.9536,0.02037253052519484,99.91,99.94,99.95,99.97,99.99,97.46345048,0.09845775155349445,97.257576,97.401111,97.44444399999999,97.530303,97.72697
35,99.958076,0.002338765486318762,99.9543,99.9565,99.9575,99.9595,99.9626,99.9536,0.02037253052519484,99.91,99.94,99.95,99.97,99.99,99.95812136,0.002376639676179383,99.95404,99.95636400000001,99.957374,99.95939399999999,99.962626
36,99.959372,0.0022263009679727957,99.9557,99.9575,99.959,99.9606,99.9634,99.9536,0.02037253052519484,99.91,99.94,99.95,99.97,99.99,99.95943035999998,0.0022679625901661153,99.955455,99.957576,99.959091,99.960404,99.963939
37,99.959372,0.0022263009679727957,99.9557,99.9575,99.959,99.9606,99.9634,99.9536,0.02037253052519484,99.91,99.94,99.95,99.97,99.99,99.95943035999998,0.0022679625901661153,99.955455,99.957576,99.959091,99.960404,99.963939
38,99.959372,0.0022263009679727957,99.9557,99.9575,99.959,99.9606,99.9634,99.9536,0.02037253052519484,99.91,99.94,99.95,99.97,99.99,99.95943035999998,0.0022679625901661153,99.955455,99.957576,99.959091,99.960404,99.963939
39,99.959372,0.0022263009679727957,99.9557,99.9575,99.959,99.9606,99.9634,99.9536,0.02037253052519484,99.91,99.94,99.95,99.97,99.99,99.95943035999998,0.0022679625901661153,99.955455,99.957576,99.959091,99.960404,99.963939
40,99.959372,0.0022263009679727957,99.9557,99.9575,99.959,99.9606,99.9634,99.9536,0.02037253052519484,99.91,99.94,99.95,99.97,99.99,99.95943035999998,0.0022679625901661153,99.955455,99.957576,99.959091,99.960404,99.963939
41,99.959372,0.0022263009679727957,99.9557,99.9575,99.959,99.9606,99.9634,99.9536,0.02037253052519484,99.91,99.94,99.95,99.97,99.99,99.95943035999998,0.0022679625901661153,99.955455,99.957576,99.959091,99.960404,99.963939
42,99.959372,0.0022263009679727957,99.9557,99.9575,99.959,99.9606,99.9634,99.9536,0.02037253052519484,99.91,99.94,99.95,99.97,99.99,99.95943035999998,0.0022679625901661153,99.955455,99.957576,99.959091,99.960404,99.963939
43,99.959372,0.0022263009679727957,99.9557,99.9575,99.959,99.9606,99.9634,99.9536,0.02037253052519484,99.91,99.94,99.95,99.97,99.99,99.95943035999998,0.0022679625901661153,99.955455,99.957576,99.959091,99.960404,99.963939
44,99.959372,0.0022263009679727957,99.9557,99.9575,99.959,99.9606,99.9634,99.9536,0.02037253052519484,99.91,99.94,99.95,99.97,99.99,99.95943035999998,0.0022679625901661153,99.955455,99.957576,99.959091,99.960404,99.963939
45,99.959372,0.0022263009679727957,99.9557,99.9575,99.959,99.9606,99.9634,99.9536,0.02037253052519484,99.91,99.94,99.95,99.97,99.99,99.95943035999998,0.0022679625901661153,99.955455,99.957576,99.959091,99.960404,99.963939
46,99.959372,0.0022263009679727957,99.9557,99.9575,99.959,99.9606,99.9634,99.9536,0.02037253052519484,99.91,99.94,99.95,99.97,99.99,99.95943035999998,0.0022679625901661153,99.955455,99.957576,99.959091,99.960404,99.963939
47,99.959372,0.0022263009679727957,99.9557,99.9575,99.959,99.9606,99.9634,99.9536,0.02037253052519484,99.91,99.94,99.95,99.97,99.99,99.95943035999998,0.0022679625901661153,99.955455,99.957576,99.959091,99.960404,99.963939
48,99.959372,0.0022263009679727957,99.9557,99.9575,99.959,99.9606,99.9634,99.9536,0.02037253052519484,99.91,99.94,99.95,99.97,99.99,99.95943035999998,0.0022679625901661153,99.955455,99.957576,99.959091,99.960404,99.963939
