gossips,p2p mean,p2p std,p2p min,p2p q1,p2p q2,p2p q3,p2p max,p2s mean,p2s std,p2s min,p2s q1,p2s q2,p2s q3,p2s max,s2s mean,s2s std,s2s min,s2s q1,s2s q2,s2s q3,s2s max
1,48.98400000000001,1.392144628501889,46.6,48.1,48.9,49.9,51.0,77.22000000000001,1.3266499161421605,75.5,76.3,76.9,77.8,80.3,54.71227228,0.35296749894968305,53.978378,54.547647999999995,54.676376,54.998298,55.261662
2,22.58,1.2079597123524715,20.6,22.0,22.8,23.4,24.5,10.8,0.8067424206853966,9.2,10.2,11.0,11.3,12.0,19.57324112,0.6041117387448778,18.542442,19.056957,19.683984,20.044444,20.676376
3,1.9040000000000001,0.3599537007264499,1.3,1.7,1.9,2.2,2.6,0.24545454545454548,0.17106744068953994,0.1,0.1,0.2,0.3,0.7,2.0351671600000003,0.1394749050276549,1.825225,1.9195200000000001,2.0441439999999997,2.128028,2.295395
4,0.10000000000000002,0.0,0.1,0.1,0.1,0.1,0.1,,,,,,,,0.030742639999999998,0.0036104866578713,0.021721999999999998,0.028428,0.030430000000000002,0.032332,0.036837
5,,,,,,,,,,,,,,,0.00020561111111111106,0.00012603320705689334,0.0001,0.0001,0.00015000000000000001,0.0003,0.0005009999999999999
