round,Simple mean,Simple std,Simple min,Simple q1,Simple median,Simple q3,Simple max
0,0.0,0.0,0.0,0.0,0.0,0.0,0.0
1,0.0,0.0,0.0,0.0,0.0,0.0,0.0
2,0.0,0.0,0.0,0.0,0.0,0.0,0.0
3,0.0,0.0,0.0,0.0,0.0,0.0,0.0
4,0.0,0.0,0.0,0.0,0.0,0.0,0.0
5,0.0,0.0,0.0,0.0,0.0,0.0,0.0
6,1.8315919999999999,0.06391781548207043,1.6995,1.7745,1.862,1.8768,1.8861
7,98.52413999999997,0.013361137676111271,98.4955,98.5161,98.5225,98.5336,98.5593
8,99.953452,0.0015577214128328868,99.9505,99.9525,99.9531,99.9546,99.9565
9,99.95407600000003,0.0015593024081290874,99.9513,99.9531,99.954,99.9553,99.9575
10,99.95407600000003,0.0015593024081290874,99.9513,99.9531,99.954,99.9553,99.9575
11,99.95407600000003,0.0015593024081290874,99.9513,99.9531,99.954,99.9553,99.9575
12,99.95407600000003,0.0015593024081290874,99.9513,99.9531,99.954,99.9553,99.9575
13,99.95407600000003,0.0015593024081290874,99.9513,99.9531,99.954,99.9553,99.9575
14,99.95407600000003,0.0015593024081290874,99.9513,99.9531,99.954,99.9553,99.9575
15,99.95407600000003,0.0015593024081290874,99.9513,99.9531,99.954,99.9553,99.9575
16,99.95407600000003,0.0015593024081290874,99.9513,99.9531,99.954,99.9553,99.9575
17,99.95407600000003,0.0015593024081290874,99.9513,99.9531,99.954,99.9553,99.9575
18,99.95407600000003,0.0015593024081290874,99.9513,99.9531,99.954,99.9553,99.9575
19,99.95407600000003,0.0015593024081290874,99.9513,99.9531,99.954,99.9553,99.9575
20,99.95407600000003,0.0015593024081290874,99.9513,99.9531,99.954,99.9553,99.9575
21,99.95407600000003,0.0015593024081290874,99.9513,99.9531,99.954,99.9553,99.9575
22,99.95407600000003,0.0015593024081290874,99.9513,99.9531,99.954,99.9553,99.9575
23,99.95407600000003,0.0015593024081290874,99.9513,99.9531,99.954,99.9553,99.9575
