round,P mean,P std,P min,P q1,P q2,P q3,P max,S mean,S std,S min,S q1,S q2,S q3,S max,P+S mean,P+S std,P+S min,P+S q1,P+S q2,P+S q3,P+S max
0,100.0,0.0,100.0,100.0,100.0,100.0,100.0,99.99999595999999,2.0199999999840927e-05,99.999899,100.0,100.0,100.0,100.0,99.999996,1.999999999995951e-05,99.9999,100.0,100.0,100.0,100.0
1,100.0,0.0,100.0,100.0,100.0,100.0,100.0,99.99989899999997,0.0,99.999899,99.999899,99.999899,99.999899,99.999899,99.99989999999998,0.0,99.9999,99.9999,99.9999,99.9999,99.9999
2,99.90040000000005,0.0035118845842834544,99.89,99.9,99.9,99.9,99.91,99.99980203999999,2.0200000000320758e-05,99.999798,99.999798,99.999798,99.999798,99.999899,99.998808,2.76887462096291e-05,99.9988,99.9988,99.9988,99.9988,99.9989
3,98.91440000000003,0.025344295873693103,98.86,98.9,98.91,98.93,98.96,99.99970104000002,2.0200000000320758e-05,99.999697,99.999697,99.999697,99.999697,99.999798,99.988848,0.0002535087112250245,99.9883,99.9887,99.9888,99.989,99.9893
4,95.25439999999999,0.1899140156316403,94.74,95.17,95.26,95.33,95.63,99.99960004000006,2.0200000000320758e-05,99.999596,99.999596,99.999596,99.999596,99.999697,99.952148,0.001900464855411146,99.947,99.9513,99.9522,99.9529,99.9559
5,95.14280000000002,0.16174877639928892,94.81,95.02,95.14,95.26,95.39,99.99844056,0.0005025363237357773,99.99727299999999,99.998384,99.998586,99.998788,99.99899,99.949884,0.0016064142263606295,99.9465,99.9491,99.95,99.9513,99.9527
6,95.1056,0.2314101697563536,94.76,94.92,95.13,95.28,95.48,99.78669087999998,0.014976954703588414,99.75899,99.775253,99.79020200000001,99.794747,99.825354,99.73988000000001,0.015251475338470911,99.711,99.7266,99.7399,99.7473,99.7788
7,95.09639999999999,0.18121994003604044,94.83,94.95,95.06,95.23,95.52,96.67866672000002,0.06855389140457098,96.535354,96.632929,96.686263,96.728687,96.792525,96.66284399999996,0.06730908234901485,96.5217,96.6191,96.6733,96.7122,96.7735
8,95.13199999999999,0.1472243186433531,94.84,95.07,95.12,95.19,95.42,96.61315556,0.07651624533123605,96.50676800000001,96.547576,96.614141,96.659798,96.75101,96.598344,0.07585290084542959,96.4955,96.533,96.5984,96.6451,96.7351
9,95.12800000000001,0.17255433926737618,94.71,95.05,95.12,95.24,95.53,96.61512328,0.06119204041480335,96.50404,96.55555600000001,96.629192,96.666263,96.696061,96.60025200000001,0.06030533503209552,96.4891,96.5416,96.6159,96.6503,96.6803
10,95.146,0.19687136240025482,94.74,95.02,95.12,95.33,95.42,96.61093328000001,0.05599769314558124,96.501414,96.592929,96.609697,96.626263,96.761717,96.596284,0.05537250129802644,96.4892,96.5805,96.5948,96.6121,96.7443
11,95.162,0.15986973864159718,94.81,95.09,95.17,95.27,95.39,96.39952315999999,0.06656784694810518,96.28899,96.371818,96.385152,96.449899,96.552323,96.387148,0.06572115412863506,96.2795,96.3593,96.3736,96.4367,96.5395
12,96.23520000000002,0.19585538882893597,95.86,96.08,96.21,96.36,96.71,96.58079588000001,0.05972558589032991,96.44868699999999,96.53666700000001,96.574242,96.630505,96.684444,96.57733999999996,0.059449586485805186,96.4472,96.5332,96.5693,96.6249,96.6821
13,99.87080000000002,0.04864154602806126,99.73,99.85,99.87,99.91,99.94,96.60270716,0.057467766963078475,96.509394,96.57353499999999,96.60596,96.62798000000001,96.744747,96.63538799999998,0.05695340434659849,96.5435,96.6065,96.6391,96.66,96.7762
14,99.9544,0.025013329779673407,99.88,99.95,99.96,99.97,99.99,96.6017454,0.06701812594241623,96.44929300000001,96.568283,96.591515,96.637374,96.73808100000001,96.635272,0.06627298670398428,96.4846,96.6021,96.6248,96.6705,96.7704
15,99.95479999999999,0.025514701644346157,99.88,99.95,99.96,99.97,99.99,96.82869084000002,0.06259458692296511,96.722424,96.78828299999999,96.825455,96.88161600000001,96.940404,96.85995199999999,0.0619495165437158,96.7547,96.8192,96.8564,96.9124,96.9707
16,99.95479999999999,0.025514701644346157,99.88,99.95,99.96,99.97,99.99,99.90549492000002,0.0032050646238919803,99.897879,99.90383800000001,99.905354,99.907475,99.910909,99.905988,0.0031212070314770917,99.8986,99.9044,99.9057,99.908,99.9115
17,99.95479999999999,0.025514701644346157,99.88,99.95,99.96,99.97,99.99,99.96256548,0.0018772906035028078,99.95939399999999,99.961313,99.962626,99.963737,99.967475,99.962488,0.001777713887742554,99.9593,99.9612,99.9625,99.9638,99.9666
18,99.95479999999999,0.025514701644346157,99.88,99.95,99.96,99.97,99.99,99.96259779999998,0.0018922946387953832,99.95939399999999,99.961212,99.962626,99.963737,99.967677,99.96251999999998,0.0017874562931760175,99.9593,99.9614,99.9625,99.9637,99.9668
19,99.95479999999999,0.025514701644346157,99.88,99.95,99.96,99.97,99.99,99.96259779999998,0.0018922946387953832,99.95939399999999,99.961212,99.962626,99.963737,99.967677,99.96251999999998,0.0017874562931760175,99.9593,99.9614,99.9625,99.9637,99.9668
20,99.95479999999999,0.025514701644346157,99.88,99.95,99.96,99.97,99.99,99.96259779999998,0.0018922946387953832,99.95939399999999,99.961212,99.962626,99.963737,99.967677,99.96251999999998,0.0017874562931760175,99.9593,99.9614,99.9625,99.9637,99.9668
21,99.95479999999999,0.025514701644346157,99.88,99.95,99.96,99.97,99.99,99.96259779999998,0.0018922946387953832,99.95939399999999,99.961212,99.962626,99.963737,99.967677,99.96251999999998,0.0017874562931760175,99.9593,99.9614,99.9625,99.9637,99.9668
22,99.95479999999999,0.025514701644346157,99.88,99.95,99.96,99.97,99.99,99.96259779999998,0.0018922946387953832,99.95939399999999,99.961212,99.962626,99.963737,99.967677,99.96251999999998,0.0017874562931760175,99.9593,99.9614,99.9625,99.9637,99.9668
23,99.95479999999999,0.025514701644346157,99.88,99.95,99.96,99.97,99.99,99.96259779999998,0.0018922946387953832,99.95939399999999,99.961212,99.962626,99.963737,99.967677,99.96251999999998,0.0017874562931760175,99.9593,99.9614,99.9625,99.9637,99.9668
24,99.95479999999999,0.025514701644346157,99.88,99.95,99.96,99.97,99.99,99.96259779999998,0.0018922946387953832,99.95939399999999,99.961212,99.962626,99.963737,99.967677,99.96251999999998,0.0017874562931760175,99.9593,99.9614,99.9625,99.9637,99.9668
25,99.95479999999999,0.025514701644346157,99.88,99.95,99.96,99.97,99.99,99.96259779999998,0.0018922946387953832,99.95939399999999,99.961212,99.962626,99.963737,99.967677,99.96251999999998,0.0017874562931760175,99.9593,99.9614,99.9625,99.9637,99.9668
