,mean,std,min,q1,q2,q3,max
Simple,,,,,,,
P,3.234356687133743,0.6566571903437483,1.0,3.0,3.0,4.0,5.0
S,6.6282681075810785,0.624811635896874,3.0,6.0,7.0,7.0,10.0
P+S,6.624874107181737,0.6339856528224584,1.0,6.0,7.0,7.0,10.0
