gossips,p2p mean,p2p std,p2p min,p2p 05th,p2p 25th,p2p 50th,p2p 75th,p2p 95th,p2p max,p2s mean,p2s std,p2s min,p2s 05th,p2s 25th,p2s 50th,p2s 75th,p2s 95th,p2s max,s2s mean,s2s std,s2s min,s2s 05th,s2s 25th,s2s 50th,s2s 75th,s2s 95th,s2s max
1,49.004,1.5855547924937818,45.2,46.8,48.1,49.1,50.2,51.3,52.1,57.97200000000001,1.155342373498003,56.3,56.46,57.2,57.7,58.5,60.3,60.7,52.06785188,0.23250338570667223,51.760661,51.80594620000001,51.840740999999994,52.001201,52.229428999999996,52.4114114,52.717117
2,22.240000000000006,1.344321390144485,20.0,20.18,21.2,22.4,23.4,24.1,25.1,20.36800000000001,1.1512497557002999,18.1,18.32,19.7,20.3,21.1,22.259999999999998,22.6,21.803819920000002,0.49799493875965584,20.619119,20.9161564,21.498599,21.794194,22.140741000000002,22.3895496,22.882583
3,1.8079999999999996,0.35431059820445676,1.0,1.3,1.6,1.8,2.0,2.3799999999999994,2.4,0.3416666666666666,0.13819269959814165,0.1,0.1,0.27499999999999997,0.35,0.42500000000000004,0.5,0.6,1.4511110800000002,0.06522220787732964,1.306406,1.3555351999999998,1.4129129999999999,1.455956,1.479279,1.5606402,1.603704
4,,,,,,,,,,,,,,,,,,,0.031019,0.0027227323188297454,0.026826999999999997,0.026847,0.029229,0.030831,0.033132999999999996,0.034855,0.037137
5,,,,,,,,,,,,,,,,,,,0.00023649999999999992,0.0001613992086271012,0.0001,0.0001,0.0001,0.0002,0.0002,0.000601,0.000601
