gossips,p2p mean,p2p std,p2p min,p2p q1,p2p q2,p2p q3,p2p max,p2s mean,p2s std,p2s min,p2s q1,p2s q2,p2s q3,p2s max,s2s mean,s2s std,s2s min,s2s q1,s2s q2,s2s q3,s2s max
1,49416.4,188.31600215241033,49004.0,49278.0,49423.0,49567.0,49691.0,58492.24,203.3048368009652,58098.0,58342.0,58488.0,58594.0,58844.0,508368.8,1076.3462500515366,506781.0,507623.0,508193.0,508915.0,511346.0
2,22185.72,118.65690034717765,21945.0,22150.0,22198.0,22266.0,22387.0,20262.32,156.54331668902404,19959.0,20182.0,20250.0,20356.0,20594.0,189903.76,1392.8712634937474,185568.0,189027.0,190403.0,190954.0,191816.0
3,2036.84,43.67749229675773,1899.0,2027.0,2035.0,2069.0,2094.0,313.04,14.881420183123211,273.0,305.0,315.0,325.0,334.0,3902.36,121.17441974278229,3541.0,3841.0,3883.0,3960.0,4106.0
4,23.2,4.7169905660283025,15.0,19.0,24.0,27.0,31.0,1.7142857142857142,1.0555973258234952,1.0,1.0,1.0,2.0,5.0,17.28,4.439594576084622,7.0,14.0,18.0,20.0,24.0
5,,,,,,,,,,,,,,,,,,,,,
