gossips,p2p mean,p2p std,p2p min,p2p q1,p2p q2,p2p q3,p2p max,p2s mean,p2s std,p2s min,p2s q1,p2s q2,p2s q3,p2s max,s2s mean,s2s std,s2s min,s2s q1,s2s q2,s2s q3,s2s max
1,0.17777777777777784,0.08084520834544431,0.1,0.1,0.2,0.2,0.3,1.04,0.3427827300200522,0.2,0.9,1.0,1.3,1.6,53.119571519999994,0.31081008474269184,52.65515500000001,52.94364399999999,53.107406999999995,53.275876000000004,53.97047
2,,,,,,,,,,,,,,,20.74260656,0.5501967676044092,19.525726000000002,20.383884,20.825826,21.241942,21.513313
3,,,,,,,,,,,,,,,0.85017012,0.031181047727104994,0.782382,0.8432430000000001,0.86026,0.868168,0.904805
4,,,,,,,,,,,,,,,0.0035716399999999988,0.0008287751946899311,0.001702,0.0031030000000000003,0.003604,0.004104,0.005305
5,,,,,,,,,,,,,,,0.0001,,0.0001,0.0001,0.0001,0.0001,0.0001
