gossips,p2p mean,p2p std,p2p min,p2p q1,p2p q2,p2p q3,p2p max,p2s mean,p2s std,p2s min,p2s q1,p2s q2,p2s q3,p2s max,s2s mean,s2s std,s2s min,s2s q1,s2s q2,s2s q3,s2s max
1,49.3996,0.5175139289590837,48.27,49.26,49.43,49.67,50.23,58.34160000000001,0.5053850017560864,57.43,58.0,58.3,58.56,59.32,52.71635155999999,0.21829804436272432,52.212928999999995,52.62696999999999,52.737373999999996,52.863636,53.128282999999996
2,22.156399999999998,0.44866357106411076,21.06,21.96,22.06,22.34,23.1,20.332000000000008,0.3526802139805024,19.54,20.12,20.36,20.64,20.88,21.869058640000002,0.2781420024697933,21.426161999999998,21.662929000000002,21.837677,22.086161999999998,22.475657
3,2.0724,0.1353477003868186,1.79,1.98,2.08,2.17,2.34,0.32799999999999996,0.07444237144709098,0.2,0.29,0.32,0.37,0.47,1.2080767600000002,0.03043645473260641,1.1585860000000001,1.1862629999999998,1.205455,1.232424,1.280505
4,0.027058823529411774,0.01447614670861731,0.01,0.02,0.02,0.03,0.06,0.01,0.0,0.01,0.01,0.01,0.01,0.01,0.01641232,0.0013634507911912338,0.014140999999999999,0.015455000000000002,0.016364,0.017071,0.020303
5,,,,,,,,,,,,,,,0.0001515,7.14177848998413e-05,0.000101,0.00012625,0.0001515,0.00017675,0.000202
