gossips,p2p mean,p2p std,p2p min,p2p q1,p2p q2,p2p q3,p2p max,p2s mean,p2s std,p2s min,p2s q1,p2s q2,p2s q3,p2s max,s2s mean,s2s std,s2s min,s2s q1,s2s q2,s2s q3,s2s max
1,53.743080000000006,0.12922490729989713,53.46,53.651,53.743,53.869,53.963,0.011560000000000006,0.002785079292707241,0.006,0.01,0.011,0.013,0.017,0.000124875,3.9244426355853386e-05,0.00011100000000000001,0.00011100000000000001,0.00011100000000000001,0.00011100000000000001,0.00022200000000000003
2,5.903799999999999,0.048675798230058125,5.797,5.874,5.907,5.931,6.003,,,,,,,,,,,,,,
3,0.06396,0.009400709193105239,0.047,0.057,0.064,0.07,0.079,,,,,,,,,,,,,,
4,0.001,0.0,0.001,0.001,0.001,0.001,0.001,,,,,,,,,,,,,,
5,,,,,,,,,,,,,,,,,,,,,
