gossips,p2p mean,p2p std,p2p min,p2p q1,p2p q2,p2p q3,p2p max,p2s mean,p2s std,p2s min,p2s q1,p2s q2,p2s q3,p2s max,s2s mean,s2s std,s2s min,s2s q1,s2s q2,s2s q3,s2s max
1,,,,,,,,0.22142857142857145,0.11883130530663677,0.1,0.1,0.25,0.3,0.4,52.95382184000001,0.454893731478635,52.096196,52.64494499999999,52.876577000000005,53.25976,53.726627
2,,,,,,,,,,,,,,,21.047711720000002,0.6696881612028789,19.557558,20.814114,21.236837,21.405506,22.491592
3,,,,,,,,,,,,,,,1.31552364,0.11397709834943451,1.155956,1.2357360000000002,1.294094,1.363864,1.657558
4,,,,,,,,,,,,,,,0.02158164,0.0034416308740673122,0.016717,0.01962,0.021522,0.022322,0.032132
5,,,,,,,,,,,,,,,,,,,,,
