gossips,p2p mean,p2p std,p2p min,p2p q1,p2p q2,p2p q3,p2p max,p2s mean,p2s std,p2s min,p2s q1,p2s q2,p2s q3,p2s max,s2s mean,s2s std,s2s min,s2s q1,s2s q2,s2s q3,s2s max
1,1.0936000000000001,0.01036018017861333,1.06,1.09,1.1,1.1,1.11,0.012499999999999999,0.004522670168666454,0.01,0.01,0.01,0.0125,0.02,,,,,,,
2,0.01,0.0,0.01,0.01,0.01,0.01,0.01,,,,,,,,,,,,,,
3,,,,,,,,,,,,,,,,,,,,,
4,,,,,,,,,,,,,,,,,,,,,
5,,,,,,,,,,,,,,,,,,,,,
