,mean,std,min,q1,q2,q3,max
Simple,,,,,,,
P,5.236248194017792,0.6663230610616343,1.0,5.0,5.0,6.0,8.0
S,6.688915492079736,0.5064280774994157,3.0,6.0,7.0,7.0,9.0
P+S,6.543652622955289,0.6820102053349952,1.0,6.0,7.0,7.0,9.0
