round,P mean,P std,P min,P q1,P q2,P q3,P max,S mean,S std,S min,S q1,S q2,S q3,S max,P+S mean,P+S std,P+S min,P+S q1,P+S q2,P+S q3,P+S max
0,100.0,0.0,100.0,100.0,100.0,100.0,100.0,100.0,0.0,100.0,100.0,100.0,100.0,100.0,100.0,0.0,100.0,100.0,100.0,100.0,100.0
1,99.99959999999999,0.0020000000000011415,99.99,100.0,100.0,100.0,100.0,99.99990303999998,2.0200000000869523e-05,99.999899,99.999899,99.999899,99.999899,100.0,99.99989999999998,0.0,99.9999,99.9999,99.9999,99.9999,99.9999
2,99.90000000000003,0.002886751345950597,99.89,99.9,99.9,99.9,99.91,99.99980203999999,2.0200000000869523e-05,99.999798,99.999798,99.999798,99.999798,99.999899,99.998804,1.9999999996489162e-05,99.9988,99.9988,99.9988,99.9988,99.9989
3,98.91360000000003,0.02984403904746976,98.86,98.89,98.91,98.94,98.97,99.99970104,2.0200000000869523e-05,99.999697,99.999697,99.999697,99.999697,99.999798,99.98884,0.00030000000000430024,99.9883,99.9886,99.9888,99.9891,99.9894
4,95.22079999999998,0.1877702496847349,94.72,95.14,95.25,95.36,95.5,99.99890516,0.0007471497328711976,99.99727299999999,99.998485,99.999394,99.999495,99.999697,99.95112400000002,0.0019513414189511098,99.9468,99.9499,99.9516,99.9527,99.954
5,95.1548,0.16098964770029864,94.89,95.03,95.16,95.23,95.6,99.92748292,0.01075804582208134,99.90596,99.920404,99.925859,99.93575799999999,99.94828299999999,99.87975599999999,0.011040534407356249,99.8569,99.8728,99.8784,99.8874,99.9011
6,95.09400000000001,0.17075811352124082,94.79,95.0,95.1,95.15,95.44,97.84478779999998,0.051901354666815454,97.75404,97.81798,97.83919200000001,97.86303000000001,97.972121,97.81728,0.050923709278354753,97.7306,97.7909,97.8111,97.8352,97.9426
7,95.06439999999999,0.17604639539999617,94.76,94.94,95.04,95.17,95.43,96.97148687999999,0.06461098583852534,96.830202,96.92434300000001,96.977374,97.015455,97.123232,96.95241600000001,0.06375955928329952,96.8136,96.9027,96.958,96.9949,97.1037
8,95.09200000000001,0.1744276354251218,94.76,94.99,95.04,95.22,95.42,96.97209684000003,0.05545030215402905,96.892525,96.942727,96.959192,96.984444,97.13101,96.95329599999997,0.055102559529179376,96.8748,96.9234,96.9404,96.9655,97.1106
9,95.09320000000001,0.14904473601349913,94.82,95.0,95.1,95.21,95.41,96.97908288,0.060505993000225716,96.888687,96.94202,96.962828,97.02,97.140303,96.960224,0.05955899232413956,96.8725,96.9231,96.9423,97.0006,97.119
10,95.08159999999998,0.1554209338109425,94.76,95.01,95.06,95.19,95.35,96.95962011999998,0.05890811014999182,96.86838399999999,96.922525,96.94899000000001,97.00292900000001,97.068788,96.94084000000001,0.058820539213217414,96.8477,96.9038,96.9327,96.9836,97.0484
11,95.186,0.15824558972264297,94.86,95.11,95.19,95.26,95.58,96.88814139999998,0.04911105318561434,96.791919,96.855152,96.88555600000001,96.921818,96.99,96.87112,0.04884727900985453,96.7774,96.8375,96.8678,96.9037,96.9721
12,96.234,0.17900186218770556,95.84,96.12,96.26,96.35,96.51,96.94448888000002,0.08456219386114583,96.799495,96.907172,96.925758,96.983535,97.21899,96.93738399999998,0.08379415592191577,96.7948,96.9019,96.9195,96.9772,97.2079
13,99.86679999999998,0.035674453978536295,99.81,99.84,99.87,99.89,99.93,96.95568892,0.04931743347346914,96.86818199999999,96.925455,96.961212,96.98040400000001,97.074646,96.98479999999999,0.04870543261964192,96.8988,96.9554,96.9897,97.009,97.1027
14,99.9632,0.023930454794395952,99.92,99.95,99.96,99.98,100.0,97.02382220000001,0.06839105060971074,96.86313100000001,96.978687,97.041111,97.072626,97.13303,97.05321599999999,0.06758195444544932,96.8944,97.0085,97.0702,97.1014,97.1614
15,99.96359999999999,0.02360790827950007,99.92,99.95,99.96,99.98,100.0,99.09701419999999,0.029172216008274538,99.04808100000001,99.07686899999999,99.096869,99.119899,99.15787900000001,99.10567999999999,0.028875580802243263,99.0572,99.0861,99.1057,99.1282,99.1663
16,99.96359999999999,0.02360790827950007,99.92,99.95,99.96,99.98,100.0,99.96186248,0.002324214618604574,99.957071,99.960505,99.961919,99.963535,99.967576,99.96188000000002,0.0023234313704806873,99.9573,99.9607,99.9618,99.9634,99.9676
17,99.96359999999999,0.02360790827950007,99.92,99.95,99.96,99.98,100.0,99.96285639999996,0.0023265854450967697,99.958384,99.961313,99.963131,99.964646,99.968384,99.96286400000001,0.002333252379549678,99.9586,99.9614,99.9631,99.9644,99.9684
18,99.96359999999999,0.02360790827950007,99.92,99.95,99.96,99.98,100.0,99.96285639999996,0.0023265854450967697,99.958384,99.961313,99.963131,99.964646,99.968384,99.96286400000001,0.002333252379549678,99.9586,99.9614,99.9631,99.9644,99.9684
19,99.96359999999999,0.02360790827950007,99.92,99.95,99.96,99.98,100.0,99.96285639999996,0.0023265854450967697,99.958384,99.961313,99.963131,99.964646,99.968384,99.96286400000001,0.002333252379549678,99.9586,99.9614,99.9631,99.9644,99.9684
20,99.96359999999999,0.02360790827950007,99.92,99.95,99.96,99.98,100.0,99.96285639999996,0.0023265854450967697,99.958384,99.961313,99.963131,99.964646,99.968384,99.96286400000001,0.002333252379549678,99.9586,99.9614,99.9631,99.9644,99.9684
21,99.96359999999999,0.02360790827950007,99.92,99.95,99.96,99.98,100.0,99.96285639999996,0.0023265854450967697,99.958384,99.961313,99.963131,99.964646,99.968384,99.96286400000001,0.002333252379549678,99.9586,99.9614,99.9631,99.9644,99.9684
22,99.96359999999999,0.02360790827950007,99.92,99.95,99.96,99.98,100.0,99.96285639999996,0.0023265854450967697,99.958384,99.961313,99.963131,99.964646,99.968384,99.96286400000001,0.002333252379549678,99.9586,99.9614,99.9631,99.9644,99.9684
23,99.96359999999999,0.02360790827950007,99.92,99.95,99.96,99.98,100.0,99.96285639999996,0.0023265854450967697,99.958384,99.961313,99.963131,99.964646,99.968384,99.96286400000001,0.002333252379549678,99.9586,99.9614,99.9631,99.9644,99.9684
24,99.96359999999999,0.02360790827950007,99.92,99.95,99.96,99.98,100.0,99.96285639999996,0.0023265854450967697,99.958384,99.961313,99.963131,99.964646,99.968384,99.96286400000001,0.002333252379549678,99.9586,99.9614,99.9631,99.9644,99.9684
25,99.96359999999999,0.02360790827950007,99.92,99.95,99.96,99.98,100.0,99.96285639999996,0.0023265854450967697,99.958384,99.961313,99.963131,99.964646,99.968384,99.96286400000001,0.002333252379549678,99.9586,99.9614,99.9631,99.9644,99.9684
