gossips,p2p mean,p2p std,p2p min,p2p 05th,p2p 25th,p2p 50th,p2p 75th,p2p 95th,p2p max,p2s mean,p2s std,p2s min,p2s 05th,p2s 25th,p2s 50th,p2s 75th,p2s 95th,p2s max,s2s mean,s2s std,s2s min,s2s 05th,s2s 25th,s2s 50th,s2s 75th,s2s 95th,s2s max
1,49.47944000000001,0.17255006925527425,49.155,49.1858,49.357,49.512,49.592,49.702000000000005,49.876,58.33188000000001,0.18151568967998313,58.003,58.056400000000004,58.199,58.299,58.491,58.5732,58.795,55.81475115999999,0.16948481432899704,55.54533299999999,55.6384664,55.704221999999994,55.764444,55.877444,56.1825336,56.317333
2,21.916999999999998,0.1728745209682442,21.472,21.6768,21.83,21.907,21.994,22.182,22.371,20.293079999999996,0.18515246042113495,19.823,20.0334,20.204,20.274,20.417,20.5392,20.68,21.393942120000002,0.2250749083736024,20.663,21.1544444,21.312222,21.379333,21.486333,21.680711,21.945
3,1.8122399999999999,0.041021243277111936,1.735,1.7446000000000002,1.775,1.82,1.83,1.877,1.888,0.32092,0.018935511611783824,0.273,0.2942,0.308,0.321,0.336,0.345,0.354,0.44522219999999996,0.016961467066265227,0.411,0.41468920000000004,0.43655600000000006,0.44577799999999995,0.456333,0.4706666,0.471667
4,0.0028571428571428576,0.0014238015607358147,0.001,0.001,0.002,0.003,0.004,0.005,0.006,0.0016111111111111111,0.0009509579315902049,0.001,0.001,0.001,0.001,0.002,0.004,0.004,0.0021511200000000007,0.0005962270923062789,0.000889,0.0011776,0.001889,0.002,0.002444,0.0031553999999999987,0.003667
5,,,,,,,,,,,,,,,,,,,,,,,,,,,
