gossips,p2p mean,p2p std,p2p min,p2p q1,p2p q2,p2p q3,p2p max,p2s mean,p2s std,p2s min,p2s q1,p2s q2,p2s q3,p2s max,s2s mean,s2s std,s2s min,s2s q1,s2s q2,s2s q3,s2s max
1,51.584799999999994,0.4364069202017766,50.7,51.37,51.58,51.83,52.38,58.476399999999984,0.548497037366657,57.54,58.04,58.5,58.85,59.6,33.91968080000001,0.3741508965327345,33.350101,33.65,33.763333,34.230808,34.785959999999996
2,18.688799999999993,0.42375621922673057,17.67,18.4,18.7,18.93,19.76,20.054,0.46698501046607493,19.28,19.66,20.05,20.52,20.96,1.2708605600000005,0.025214235223843924,1.219899,1.2501010000000001,1.269495,1.284242,1.320606
3,0.031904761904761915,0.016618979396776333,0.01,0.02,0.03,0.04,0.08,0.20679999999999998,0.051211977765623015,0.1,0.19,0.2,0.24,0.31,0.0017776,0.000478197047948507,0.000909,0.0014140000000000001,0.0017170000000000002,0.00202,0.003232
