round,Simple mean,Simple std,Simple min,Simple q1,Simple q2,Simple q3,Simple max
0,1.0,0.0,1,1,1,1,1
1,1.0,0.0,1,1,1,1,1
2,1.0,0.0,1,1,1,1,1
3,1.0,0.0,1,1,1,1,1
4,1.0,0.0,1,1,1,1,1
5,1.0,0.0,1,1,1,1,1
6,1.0,0.0,1,1,1,1,1
7,1.0,0.0,1,1,1,1,1
8,1.0,0.0,1,1,1,1,1
9,1.0,0.0,1,1,1,1,1
10,1.0,0.0,1,1,1,1,1
11,1.0,0.0,1,1,1,1,1
12,1.0,0.0,1,1,1,1,1
13,1.0,0.0,1,1,1,1,1
14,1.0,0.0,1,1,1,1,1
15,1.0,0.0,1,1,1,1,1
