gossips,p2p mean,p2p std,p2p min,p2p 05th,p2p 25th,p2p 50th,p2p 75th,p2p 95th,p2p max,p2s mean,p2s std,p2s min,p2s 05th,p2s 25th,p2s 50th,p2s 75th,p2s 95th,p2s max,s2s mean,s2s std,s2s min,s2s 05th,s2s 25th,s2s 50th,s2s 75th,s2s 95th,s2s max
1,1.10296,0.003026284851100443,1.093,1.1,1.101,1.104,1.105,1.1068,1.108,0.005080000000000002,0.0018956792977716463,0.002,0.0022,0.004,0.005,0.006,0.008599999999999993,0.01,0.001111,0.0,0.001111,0.001111,0.001111,0.001111,0.001111,0.001111,0.001111
2,0.0016000000000000005,0.0006110100926607787,0.001,0.001,0.001,0.002,0.002,0.002299999999999999,0.003,,,,,,,,,,,,,,,,,,
3,,,,,,,,,,,,,,,,,,,,,,,,,,,
4,,,,,,,,,,,,,,,,,,,,,,,,,,,
5,,,,,,,,,,,,,,,,,,,,,,,,,,,
