gossips,p2p mean,p2p std,p2p min,p2p q1,p2p q2,p2p q3,p2p max,p2s mean,p2s std,p2s min,p2s q1,p2s q2,p2s q3,p2s max,s2s mean,s2s std,s2s min,s2s q1,s2s q2,s2s q3,s2s max
1,,,,,,,,,,,,,,,8.42324448,0.34177473943436326,7.831919,8.14697,8.48202,8.700909,8.932525
2,,,,,,,,,,,,,,,0.0006261999999999999,0.00024393817522752224,0.000202,0.000404,0.000606,0.0007070000000000001,0.001111
3,,,,,,,,,,,,,,,,,,,,,
4,,,,,,,,,,,,,,,,,,,,,
5,,,,,,,,,,,,,,,,,,,,,
