round,P mean,P std,P min,P 05th,P 25th,P 50th,P 75th,P 95th,P max,S mean,S std,S min,S 05th,S 25th,S 50th,S 75th,S 95th,S max,P+S mean,P+S std,P+S min,P+S 05th,P+S 25th,P+S 50th,P+S 75th,P+S 95th,P+S max
0,0.0,0.0,0.0,0.0,0.0,0.0,0.0,0.0,0.0,0.0,0.0,0.0,0.0,0.0,0.0,0.0,0.0,0.0,0.0,0.0,0.0,0.0,0.0,0.0,0.0,0.0,0.0
1,0.0,0.0,0.0,0.0,0.0,0.0,0.0,0.0,0.0,0.0,0.0,0.0,0.0,0.0,0.0,0.0,0.0,0.0,0.0,0.0,0.0,0.0,0.0,0.0,0.0,0.0,0.0
2,0.0,0.0,0.0,0.0,0.0,0.0,0.0,0.0,0.0,0.0,0.0,0.0,0.0,0.0,0.0,0.0,0.0,0.0,0.0,0.0,0.0,0.0,0.0,0.0,0.0,0.0,0.0
3,0.0,0.0,0.0,0.0,0.0,0.0,0.0,0.0,0.0,0.0,0.0,0.0,0.0,0.0,0.0,0.0,0.0,0.0,0.0,0.0,0.0,0.0,0.0,0.0,0.0,0.0,0.0
4,0.0,0.0,0.0,0.0,0.0,0.0,0.0,0.0,0.0,0.0,0.0,0.0,0.0,0.0,0.0,0.0,0.0,0.0,0.0,0.0,0.0,0.0,0.0,0.0,0.0,0.0,0.0
5,0.0,0.0,0.0,0.0,0.0,0.0,0.0,0.0,0.0,0.0,0.0,0.0,0.0,0.0,0.0,0.0,0.0,0.0,0.0,0.0,0.0,0.0,0.0,0.0,0.0,0.0,0.0
6,0.0,0.0,0.0,0.0,0.0,0.0,0.0,0.0,0.0,0.0,0.0,0.0,0.0,0.0,0.0,0.0,0.0,0.0,0.0,0.0,0.0,0.0,0.0,0.0,0.0,0.0,0.0
7,0.0,0.0,0.0,0.0,0.0,0.0,0.0,0.0,0.0,0.0,0.0,0.0,0.0,0.0,0.0,0.0,0.0,0.0,0.0,0.0,0.0,0.0,0.0,0.0,0.0,0.0,0.0
8,0.0,0.0,0.0,0.0,0.0,0.0,0.0,0.0,0.0,0.0,0.0,0.0,0.0,0.0,0.0,0.0,0.0,0.0,0.0,0.0,0.0,0.0,0.0,0.0,0.0,0.0,0.0
9,0.0,0.0,0.0,0.0,0.0,0.0,0.0,0.0,0.0,0.0,0.0,0.0,0.0,0.0,0.0,0.0,0.0,0.0,0.0,0.0,0.0,0.0,0.0,0.0,0.0,0.0,0.0
10,0.0,0.0,0.0,0.0,0.0,0.0,0.0,0.0,0.0,0.0,0.0,0.0,0.0,0.0,0.0,0.0,0.0,0.0,0.0,0.0,0.0,0.0,0.0,0.0,0.0,0.0,0.0
11,0.00016,0.00046303347611160913,0.0,0.0,0.0,0.0,0.0,0.001,0.002,0.0,0.0,0.0,0.0,0.0,0.0,0.0,0.0,0.0,1.6e-05,4.6303347611160905e-05,0.0,0.0,0.0,0.0,0.0,0.0001,0.0002
12,0.08163999999999999,0.010015507975135361,0.063,0.06520000000000001,0.075,0.083,0.089,0.097,0.101,0.0,0.0,0.0,0.0,0.0,0.0,0.0,0.0,0.0,0.008164,0.001001550797513536,0.0063,0.00652,0.0075,0.0083,0.0089,0.0097,0.0101
13,7.048959999999999,0.12328843579184545,6.733,6.7822,7.012,7.062,7.139,7.1944,7.201,2.22e-05,4.4399999999999995e-05,0.0,0.0,0.0,0.0,0.0,0.00011100000000000001,0.00011100000000000001,0.7049159999999999,0.012322716583610935,0.6733,0.6782999999999999,0.7013,0.7062,0.7139,0.7194400000000001,0.7202
14,65.27624,0.3741535813005139,64.544,64.6274,64.973,65.407,65.555,65.7014,65.855,0.28687556000000003,0.030845673273352296,0.229667,0.2314666,0.273444,0.289111,0.304222,0.330222,0.34777800000000003,6.785811999999998,0.049871429255636986,6.664,6.67348,6.7904,6.8042,6.814,6.82152,6.8222
15,99.80284,0.013944690745942337,99.771,99.7822,99.792,99.805,99.812,99.82079999999999,99.832,32.32330672,0.44119197771822855,31.425556,31.482422199999995,32.089,32.364111,32.511222,33.0645782,33.118111,39.07126000000001,0.3965390845805749,38.2626,38.3151,38.8619,39.1071,39.2392,39.73716,39.7834
16,99.95231999999999,0.004772588396248953,99.942,99.9452,99.95,99.952,99.954,99.959,99.963,98.64396448,0.04067801563116883,98.592111,98.5945332,98.61166700000001,98.63855600000001,98.663444,98.72737780000001,98.749111,98.77480000000001,0.03643321561432645,98.7281,98.73042,98.7453,98.7701,98.7922,98.84916,98.8695
17,99.95235999999998,0.004723388614121031,99.942,99.9452,99.95,99.952,99.954,99.959,99.963,99.98445328,0.0013738704602713164,99.982444,99.982778,99.983111,99.984222,99.985444,99.98660020000001,99.987778,99.981244,0.0011866187256236631,99.9794,99.97964000000002,99.9801,99.9811,99.9821,99.98318,99.9832
18,99.95235999999998,0.004723388614121031,99.942,99.9452,99.95,99.952,99.954,99.959,99.963,99.98467116,0.0013390937138226403,99.982667,99.98293340000001,99.983333,99.984667,99.985667,99.9867112,99.987889,99.98144,0.0011627553482993023,99.9796,99.9799,99.9803,99.9813,99.9823,99.98328,99.9833
19,99.95235999999998,0.004723388614121031,99.942,99.9452,99.95,99.952,99.954,99.959,99.963,99.98467116,0.0013390937138226403,99.982667,99.98293340000001,99.983333,99.984667,99.985667,99.9867112,99.987889,99.98144,0.0011627553482993023,99.9796,99.9799,99.9803,99.9813,99.9823,99.98328,99.9833
20,99.95235999999998,0.004723388614121031,99.942,99.9452,99.95,99.952,99.954,99.959,99.963,99.98467116,0.0013390937138226403,99.982667,99.98293340000001,99.983333,99.984667,99.985667,99.9867112,99.987889,99.98144,0.0011627553482993023,99.9796,99.9799,99.9803,99.9813,99.9823,99.98328,99.9833
21,99.95235999999998,0.004723388614121031,99.942,99.9452,99.95,99.952,99.954,99.959,99.963,99.98467116,0.0013390937138226403,99.982667,99.98293340000001,99.983333,99.984667,99.985667,99.9867112,99.987889,99.98144,0.0011627553482993023,99.9796,99.9799,99.9803,99.9813,99.9823,99.98328,99.9833
22,99.95235999999998,0.004723388614121031,99.942,99.9452,99.95,99.952,99.954,99.959,99.963,99.98467116,0.0013390937138226403,99.982667,99.98293340000001,99.983333,99.984667,99.985667,99.9867112,99.987889,99.98144,0.0011627553482993023,99.9796,99.9799,99.9803,99.9813,99.9823,99.98328,99.9833
23,99.95235999999998,0.004723388614121031,99.942,99.9452,99.95,99.952,99.954,99.959,99.963,99.98467116,0.0013390937138226403,99.982667,99.98293340000001,99.983333,99.984667,99.985667,99.9867112,99.987889,99.98144,0.0011627553482993023,99.9796,99.9799,99.9803,99.9813,99.9823,99.98328,99.9833
24,99.95235999999998,0.004723388614121031,99.942,99.9452,99.95,99.952,99.954,99.959,99.963,99.98467116,0.0013390937138226403,99.982667,99.98293340000001,99.983333,99.984667,99.985667,99.9867112,99.987889,99.98144,0.0011627553482993023,99.9796,99.9799,99.9803,99.9813,99.9823,99.98328,99.9833
25,99.95235999999998,0.004723388614121031,99.942,99.9452,99.95,99.952,99.954,99.959,99.963,99.98467116,0.0013390937138226403,99.982667,99.98293340000001,99.983333,99.984667,99.985667,99.9867112,99.987889,99.98144,0.0011627553482993023,99.9796,99.9799,99.9803,99.9813,99.9823,99.98328,99.9833
