gossips,p2p mean,p2p std,p2p min,p2p q1,p2p q2,p2p q3,p2p max,p2s mean,p2s std,p2s min,p2s q1,p2s q2,p2s q3,p2s max,s2s mean,s2s std,s2s min,s2s q1,s2s q2,s2s q3,s2s max
1,49.51176,0.14061391585946775,49.29,49.39,49.462,49.634,49.772,43.13456,0.1938672397974104,42.846,42.988,43.155,43.217,43.534,59.800497760000006,0.16632865869623986,59.518333,59.704,59.796222,59.900110999999995,60.250778000000004
2,21.918360000000003,0.13501446836049333,21.693,21.825,21.908,21.991,22.248,5.56504,0.07806166365978436,5.426,5.505,5.563,5.615,5.694,18.06022668,0.20540281000506436,17.637667,17.950889,18.030110999999998,18.156778,18.496111
3,1.8332,0.03745441673999654,1.758,1.802,1.835,1.856,1.915,0.009760000000000001,0.0034554305086342,0.005,0.007,0.009,0.011,0.019,1.34812888,0.037877535368738044,1.262333,1.321333,1.3477780000000001,1.377556,1.409889
4,0.0023913043478260877,0.0013052039351200886,0.001,0.001,0.002,0.003,0.005,,,,,,,,0.0009333200000000004,0.0002663216601530312,0.00044400000000000006,0.000778,0.001,0.001111,0.001444
5,,,,,,,,,,,,,,,,,,,,,
