round,Uniform mean,Uniform std,Uniform sem,Uniform cistd,Uniform cisem,Uniform min,Uniform 05th,Uniform 25th,Uniform 50th,Uniform 75th,Uniform 95th,Uniform max
0,0.0,0.0,0.0,0.0,0.0,0.0,0.0,0.0,0.0,0.0,0.0,0.0
1,0.0,0.0,0.0,0.0,0.0,0.0,0.0,0.0,0.0,0.0,0.0,0.0
2,0.0,0.0,0.0,0.0,0.0,0.0,0.0,0.0,0.0,0.0,0.0,0.0
3,0.0,0.0,0.0,0.0,0.0,0.0,0.0,0.0,0.0,0.0,0.0,0.0
4,0.0,0.0,0.0,0.0,0.0,0.0,0.0,0.0,0.0,0.0,0.0,0.0
5,0.0,0.0,0.0,0.0,0.0,0.0,0.0,0.0,0.0,0.0,0.0,0.0
6,0.0,0.0,0.0,0.0,0.0,0.0,0.0,0.0,0.0,0.0,0.0,0.0
7,0.0,0.0,0.0,0.0,0.0,0.0,0.0,0.0,0.0,0.0,0.0,0.0
8,0.0,0.0,0.0,0.0,0.0,0.0,0.0,0.0,0.0,0.0,0.0,0.0
9,0.0,0.0,0.0,0.0,0.0,0.0,0.0,0.0,0.0,0.0,0.0,0.0
10,0.0,0.0,0.0,0.0,0.0,0.0,0.0,0.0,0.0,0.0,0.0,0.0
11,0.0,0.0,0.0,0.0,0.0,0.0,0.0,0.0,0.0,0.0,0.0,0.0
12,8.000000000000002e-05,8.660254037844386e-05,1.7320508075688774e-05,1.7320508075688774e-05,3.4641016151377547e-06,0.0,0.0,0.0,0.0001,0.0001,0.0002,0.0003
13,0.08220799999999999,0.00311299962522752,0.000622599925045504,0.000622599925045504,0.0001245199850091008,0.0771,0.07736,0.0799,0.0819,0.0841,0.08764,0.0884
14,7.061227999999999,0.09444215390032844,0.018888430780065687,0.018888430780065687,0.0037776861560131375,6.8032,6.8128400000000005,7.0795,7.0933,7.1052,7.12266,7.126
15,65.38501600000001,0.23365523868868693,0.04673104773773738,0.04673104773773738,0.009346209547547477,64.8077,64.87782,65.4217,65.4789,65.5105,65.55812,65.5767
16,99.80870799999998,0.004468400161140175,0.000893680032228035,0.000893680032228035,0.000178736006445607,99.7996,99.80172,99.8062,99.8088,99.8113,99.81462,99.8191
17,99.954512,0.0018403622831745727,0.00036807245663491456,0.00036807245663491456,7.361449132698291e-05,99.9517,99.95212000000001,99.9529,99.9544,99.9561,99.95726,99.9575
18,99.95455199999998,0.0018282778782241634,0.0003656555756448327,0.0003656555756448327,7.313111512896654e-05,99.9517,99.9522,99.9529,99.9544,99.9561,99.95726,99.9575
19,99.95455199999998,0.0018282778782241634,0.0003656555756448327,0.0003656555756448327,7.313111512896654e-05,99.9517,99.9522,99.9529,99.9544,99.9561,99.95726,99.9575
20,99.95455199999998,0.0018282778782241634,0.0003656555756448327,0.0003656555756448327,7.313111512896654e-05,99.9517,99.9522,99.9529,99.9544,99.9561,99.95726,99.9575
21,99.95455199999998,0.0018282778782241634,0.0003656555756448327,0.0003656555756448327,7.313111512896654e-05,99.9517,99.9522,99.9529,99.9544,99.9561,99.95726,99.9575
22,99.95455199999998,0.0018282778782241634,0.0003656555756448327,0.0003656555756448327,7.313111512896654e-05,99.9517,99.9522,99.9529,99.9544,99.9561,99.95726,99.9575
23,99.95455199999998,0.0018282778782241634,0.0003656555756448327,0.0003656555756448327,7.313111512896654e-05,99.9517,99.9522,99.9529,99.9544,99.9561,99.95726,99.9575
24,99.95455199999998,0.0018282778782241634,0.0003656555756448327,0.0003656555756448327,7.313111512896654e-05,99.9517,99.9522,99.9529,99.9544,99.9561,99.95726,99.9575
25,99.95455199999998,0.0018282778782241634,0.0003656555756448327,0.0003656555756448327,7.313111512896654e-05,99.9517,99.9522,99.9529,99.9544,99.9561,99.95726,99.9575
