round,P mean,P std,P min,P q1,P q2,P q3,P max,S mean,S std,S min,S q1,S q2,S q3,S max,P+S mean,P+S std,P+S min,P+S q1,P+S q2,P+S q3,P+S max
0,0.0,0.0,0,0,0,0,0,1.0,0.0,1,1,1,1,1,0.0,0.0,0,0,0,0,0
1,1.0,0.0,1,1,1,1,1,1.0,0.0,1,1,1,1,1,1.0,0.0,1,1,1,1,1
2,1.0,0.0,1,1,1,1,1,1.0,0.0,1,1,1,1,1,1.0,0.0,1,1,1,1,1
3,1.0,0.0,1,1,1,1,1,1.0,0.0,1,1,1,1,1,1.0,0.0,1,1,1,1,1
4,1.0,0.0,1,1,1,1,1,1.0,0.0,1,1,1,1,1,1.0,0.0,1,1,1,1,1
5,1.0,0.0,1,1,1,1,1,1.0,0.0,1,1,1,1,1,1.0,0.0,1,1,1,1,1
6,1.0,0.0,1,1,1,1,1,1.0,0.0,1,1,1,1,1,1.0,0.0,1,1,1,1,1
7,1.64,0.4898979485566356,1,1,2,2,2,1.0,0.0,1,1,1,1,1,1.0,0.0,1,1,1,1,1
8,2.12,0.8812869377601524,1,1,2,3,3,1.0,0.0,1,1,1,1,1,1.0,0.0,1,1,1,1,1
9,2.52,1.3266499161421599,1,1,2,4,4,1.0,0.0,1,1,1,1,1,1.0,0.0,1,1,1,1,1
10,2.76,1.6401219466856725,1,1,2,4,5,1.0,0.0,1,1,1,1,1,1.0,0.0,1,1,1,1,1
11,2.96,1.9467922333931784,1,1,2,4,6,1.0,0.0,1,1,1,1,1,1.0,0.0,1,1,1,1,1
12,3.12,2.2233608194203054,1,1,2,4,7,1.0,0.0,1,1,1,1,1,1.0,0.0,1,1,1,1,1
13,3.24,2.454248017893329,1,1,2,4,8,1.0,0.0,1,1,1,1,1,1.0,0.0,1,1,1,1,1
14,3.28,2.541653005427767,1,1,2,4,9,1.0,0.0,1,1,1,1,1,1.0,0.0,1,1,1,1,1
15,3.28,2.541653005427767,1,1,2,4,9,1.0,0.0,1,1,1,1,1,1.0,0.0,1,1,1,1,1
16,3.28,2.541653005427767,1,1,2,4,9,1.0,0.0,1,1,1,1,1,1.0,0.0,1,1,1,1,1
17,3.28,2.541653005427767,1,1,2,4,9,1.0,0.0,1,1,1,1,1,1.0,0.0,1,1,1,1,1
18,3.28,2.541653005427767,1,1,2,4,9,1.0,0.0,1,1,1,1,1,1.0,0.0,1,1,1,1,1
19,3.28,2.541653005427767,1,1,2,4,9,1.0,0.0,1,1,1,1,1,1.0,0.0,1,1,1,1,1
20,3.28,2.541653005427767,1,1,2,4,9,1.0,0.0,1,1,1,1,1,1.0,0.0,1,1,1,1,1
21,3.28,2.541653005427767,1,1,2,4,9,1.0,0.0,1,1,1,1,1,1.0,0.0,1,1,1,1,1
22,3.28,2.541653005427767,1,1,2,4,9,1.0,0.0,1,1,1,1,1,1.0,0.0,1,1,1,1,1
23,3.28,2.541653005427767,1,1,2,4,9,1.0,0.0,1,1,1,1,1,1.0,0.0,1,1,1,1,1
24,3.28,2.541653005427767,1,1,2,4,9,1.0,0.0,1,1,1,1,1,1.0,0.0,1,1,1,1,1
25,3.28,2.541653005427767,1,1,2,4,9,1.0,0.0,1,1,1,1,1,1.0,0.0,1,1,1,1,1
26,3.28,2.541653005427767,1,1,2,4,9,1.0,0.0,1,1,1,1,1,1.0,0.0,1,1,1,1,1
27,3.28,2.541653005427767,1,1,2,4,9,1.0,0.0,1,1,1,1,1,1.0,0.0,1,1,1,1,1
28,3.28,2.541653005427767,1,1,2,4,9,1.0,0.0,1,1,1,1,1,1.0,0.0,1,1,1,1,1
29,3.28,2.541653005427767,1,1,2,4,9,1.0,0.0,1,1,1,1,1,1.0,0.0,1,1,1,1,1
30,3.28,2.541653005427767,1,1,2,4,9,1.0,0.0,1,1,1,1,1,1.0,0.0,1,1,1,1,1
31,3.28,2.541653005427767,1,1,2,4,9,1.0,0.0,1,1,1,1,1,1.0,0.0,1,1,1,1,1
32,3.28,2.541653005427767,1,1,2,4,9,1.0,0.0,1,1,1,1,1,1.0,0.0,1,1,1,1,1
33,3.28,2.541653005427767,1,1,2,4,9,1.0,0.0,1,1,1,1,1,1.0,0.0,1,1,1,1,1
34,3.28,2.541653005427767,1,1,2,4,9,1.0,0.0,1,1,1,1,1,1.0,0.0,1,1,1,1,1
35,3.28,2.541653005427767,1,1,2,4,9,1.0,0.0,1,1,1,1,1,1.0,0.0,1,1,1,1,1
36,3.28,2.541653005427767,1,1,2,4,9,1.0,0.0,1,1,1,1,1,1.0,0.0,1,1,1,1,1
37,3.28,2.541653005427767,1,1,2,4,9,1.0,0.0,1,1,1,1,1,1.0,0.0,1,1,1,1,1
38,3.28,2.541653005427767,1,1,2,4,9,1.0,0.0,1,1,1,1,1,1.0,0.0,1,1,1,1,1
39,3.28,2.541653005427767,1,1,2,4,9,1.0,0.0,1,1,1,1,1,1.0,0.0,1,1,1,1,1
40,3.28,2.541653005427767,1,1,2,4,9,1.0,0.0,1,1,1,1,1,1.0,0.0,1,1,1,1,1
