gossips,p2p mean,p2p std,p2p min,p2p q1,p2p q2,p2p q3,p2p max,p2s mean,p2s std,p2s min,p2s q1,p2s q2,p2s q3,p2s max,s2s mean,s2s std,s2s min,s2s q1,s2s q2,s2s q3,s2s max
1,49.476400000000005,0.5019286137822127,48.44,49.2,49.41,49.69,50.9,58.4256,0.5476623047097529,57.13,58.13,58.57,58.69,59.66,52.83150304,0.19047032090864338,52.546868999999994,52.681212,52.84899,52.896364,53.352019999999996
2,22.1576,0.38361525864682017,21.54,21.89,22.11,22.48,22.84,20.230000000000004,0.4687572221665848,19.35,20.05,20.18,20.58,21.6,21.75394752,0.28564079435894646,21.071514999999998,21.591919,21.779394,21.932828,22.356667
3,2.0172,0.11970519342674041,1.75,1.96,2.01,2.07,2.33,0.3144,0.060627276589557175,0.21,0.27,0.31,0.36,0.43,1.2007272399999998,0.04064699505629739,1.123737,1.165051,1.2057579999999999,1.236869,1.278889
4,0.023,0.012182817926554554,0.01,0.01,0.02,0.03,0.05,0.01,0.0,0.01,0.01,0.01,0.01,0.01,0.0169456,0.0018590421368722845,0.012626,0.016162,0.017273,0.018586000000000002,0.019191999999999997
5,,,,,,,,,,,,,,,0.00012119999999999999,4.516857314549575e-05,0.000101,0.000101,0.000101,0.000101,0.000202
