gossips,p2p mean,p2p std,p2p min,p2p 05th,p2p 25th,p2p 50th,p2p 75th,p2p 95th,p2p max,p2s mean,p2s std,p2s min,p2s 05th,p2s 25th,p2s 50th,p2s 75th,p2s 95th,p2s max,s2s mean,s2s std,s2s min,s2s 05th,s2s 25th,s2s 50th,s2s 75th,s2s 95th,s2s max
1,10.3,0.2884441020371193,9.7,9.74,10.2,10.3,10.5,10.780000000000001,10.8,0.552,0.2418594633252956,0.2,0.2,0.3,0.5,0.8,0.9,1.0,,,,,,,,,
2,0.12142857142857146,0.0410325903324145,0.1,0.1,0.1,0.1,0.1,0.2,0.2,,,,,,,,,,,,,,,,,,
3,,,,,,,,,,,,,,,,,,,,,,,,,,,
4,,,,,,,,,,,,,,,,,,,,,,,,,,,
5,,,,,,,,,,,,,,,,,,,,,,,,,,,
