gossips,p2p mean,p2p std,p2p min,p2p q1,p2p q2,p2p q3,p2p max,p2s mean,p2s std,p2s min,p2s q1,p2s q2,p2s q3,p2s max,s2s mean,s2s std,s2s min,s2s q1,s2s q2,s2s q3,s2s max
1,49.22836000000001,0.1949824522019012,48.799,49.107,49.283,49.361,49.665,50.20180000000001,0.17124738440824971,49.894,50.094,50.16,50.337,50.526,52.92584004000001,0.05800421220730424,52.80866700000001,52.884889,52.91355600000001,52.984443999999996,53.028667000000006
2,22.26472,0.15516054051637415,21.982,22.16,22.268,22.42,22.519,18.345079999999996,0.18111274573222813,17.963,18.251,18.328,18.452,18.844,23.177573360000007,0.14804260676515843,22.882222,23.084222,23.132222,23.305111,23.506444000000002
3,2.045,0.03930012722625728,1.976,2.016,2.035,2.077,2.119,0.01920000000000001,0.004898979485566357,0.011,0.015,0.019,0.022,0.03,0.050480080000000004,0.0032878338096686095,0.045889,0.047777999999999994,0.049888999999999996,0.052444000000000005,0.059333000000000004
4,0.023800000000000012,0.00483045891539648,0.011,0.021,0.025,0.026,0.035,,,,,,,,,,,,,,
5,,,,,,,,,,,,,,,,,,,,,
