round,nodes,nodesP,nodesS,nodesSent,nodesSentP,nodesSentS,nodesRecv,nodesRecvP,nodesRecvS,msgSent,msgSentP,msgSentS,msgRecv,msgRecvP,msgRecvS,msgInfect,msgInfectP,msgInfectS
00,10000.000000,100.000000,9900.000000,0.000000,0.000000,0.000000,0.000000,0.000000,0.000000,0.000000,0.000000,0.000000,0.000000,0.000000,0.000000,0.000000,0.000000,0.000000
01,10000.000000,100.000000,9900.000000,0.010000,1.000000,0.000000,0.010000,1.000000,0.000000,10.000000,10.000000,0.000000,1.000000,1.000000,0.000000,0.010000,1.000000,0.000000
02,10000.000000,100.000000,9900.000000,0.113000,11.300000,0.000000,0.113000,11.300000,0.000000,113.000000,113.000000,0.000000,11.500000,11.500000,0.000000,0.010000,1.000000,0.000000
03,10000.000000,100.000000,9900.000000,0.693000,69.300000,0.000000,0.693000,69.300000,0.000000,693.000000,693.000000,0.000000,112.200000,112.200000,0.000000,0.010000,1.000000,0.000000
04,10000.000000,100.000000,9900.000000,1.010000,100.000000,0.010101,1.010000,100.000000,0.010101,1010.000000,1000.000000,10.000000,691.800000,690.800000,1.000000,0.756000,6.300000,0.700000
05,10000.000000,100.000000,9900.000000,2.619000,100.000000,1.635354,2.619000,100.000000,1.635354,2619.000000,1000.000000,1619.000000,1008.500000,845.500000,163.000000,1.070000,8.000000,1.000000
06,10000.000000,100.000000,9900.000000,17.242000,100.000000,16.406061,17.242000,100.000000,16.406061,17242.000000,1000.000000,16242.000000,2617.400000,845.500000,1771.900000,1.070000,8.000000,1.000000
07,10000.000000,100.000000,9900.000000,80.251000,100.000000,80.051515,80.251000,100.000000,80.051515,80251.000000,1000.000000,79251.000000,16960.500000,845.500000,16115.000000,1.763000,8.000000,1.700000
08,10000.000000,100.000000,9900.000000,99.956000,100.000000,99.955556,99.956000,100.000000,99.955556,99956.000000,1000.000000,98956.000000,79681.800000,845.500000,78836.300000,7.604000,8.000000,7.600000
09,10000.000000,100.000000,9900.000000,99.996000,100.000000,99.995960,99.996000,100.000000,99.995960,99996.000000,1000.000000,98996.000000,99956.300000,845.500000,99110.800000,9.881000,8.000000,9.900000
10,10000.000000,100.000000,9900.000000,99.996000,100.000000,99.995960,99.996000,100.000000,99.995960,99996.000000,1000.000000,98996.000000,99997.000000,845.500000,99151.500000,9.980000,8.000000,10.000000
11,10000.000000,100.000000,9900.000000,99.996000,100.000000,99.995960,99.996000,100.000000,99.995960,99996.000000,1000.000000,98996.000000,99997.000000,845.500000,99151.500000,9.980000,8.000000,10.000000
12,10000.000000,100.000000,9900.000000,99.996000,100.000000,99.995960,99.996000,100.000000,99.995960,99996.000000,1000.000000,98996.000000,99997.000000,845.500000,99151.500000,9.980000,8.000000,10.000000
13,10000.000000,100.000000,9900.000000,99.996000,100.000000,99.995960,99.996000,100.000000,99.995960,99996.000000,1000.000000,98996.000000,99997.000000,845.500000,99151.500000,9.980000,8.000000,10.000000
14,10000.000000,100.000000,9900.000000,99.996000,100.000000,99.995960,99.996000,100.000000,99.995960,99996.000000,1000.000000,98996.000000,99997.000000,845.500000,99151.500000,9.980000,8.000000,10.000000
15,10000.000000,100.000000,9900.000000,99.996000,100.000000,99.995960,99.996000,100.000000,99.995960,99996.000000,1000.000000,98996.000000,99997.000000,845.500000,99151.500000,9.980000,8.000000,10.000000
16,10000.000000,100.000000,9900.000000,99.996000,100.000000,99.995960,99.996000,100.000000,99.995960,99996.000000,1000.000000,98996.000000,99997.000000,845.500000,99151.500000,9.980000,8.000000,10.000000
17,10000.000000,100.000000,9900.000000,99.996000,100.000000,99.995960,99.996000,100.000000,99.995960,99996.000000,1000.000000,98996.000000,99997.000000,845.500000,99151.500000,9.980000,8.000000,10.000000
18,10000.000000,100.000000,9900.000000,99.996000,100.000000,99.995960,99.996000,100.000000,99.995960,99996.000000,1000.000000,98996.000000,99997.000000,845.500000,99151.500000,9.980000,8.000000,10.000000
19,10000.000000,100.000000,9900.000000,99.996000,100.000000,99.995960,99.996000,100.000000,99.995960,99996.000000,1000.000000,98996.000000,99997.000000,845.500000,99151.500000,9.980000,8.000000,10.000000
