gossips,p2p mean,p2p std,p2p min,p2p q1,p2p q2,p2p q3,p2p max,p2s mean,p2s std,p2s min,p2s q1,p2s q2,p2s q3,p2s max,s2s mean,s2s std,s2s min,s2s q1,s2s q2,s2s q3,s2s max
1,488.12,16.346049471763312,462.0,475.0,492.0,501.0,517.0,574.44,15.077798247754897,544.0,565.0,575.0,584.0,600.0,518506.52,2560.9309687429336,513120,516494.0,518396.0,520337.0,522614
2,221.92,10.574812843103505,196.0,218.0,221.0,229.0,237.0,209.48,12.12133106002252,182.0,203.0,209.0,217.0,237.0,217269.32,4164.659387032749,209111,214217.0,218121.0,219629.0,226193
3,18.56,3.9166312055132284,14.0,15.0,18.0,21.0,28.0,3.2916666666666665,1.6010639578422372,1.0,2.0,3.0,4.0,7.0,14507.04,482.2746865981391,13592,14253.0,14448.0,14896.0,15588
4,,,,,,,,,,,,,,,319.76,24.16140172534146,279,304.0,316.0,336.0,368
5,,,,,,,,,,,,,,,2.52,1.3880441875771343,1,2.0,2.0,3.0,7
