round,nodes,nodesP,nodesS,recvOne,recvOneP,recvOneS,recvAll,recvAllP,recvAllS,msgSent,msgSentP,msgSentS,msgRecv,msgRecvP,msgRecvS,consist,consistP,consistS,Unnamed: 19
0,1000000.0,10000.0,990000.0,5.2000000000000004e-05,0.005199999999999999,0.0,0.0,0.0,0.0,105.2,5.6,99.6,0.52,0.52,0.0,99.999056,99.99560000000001,99.99909099999999,
1,1000000.0,10000.0,990000.0,0.010631999999999999,1.0632000000000001,0.0,0.0,0.0,0.0,1166.8,1067.2,99.6,106.68,106.68,0.0,99.98953599999996,99.04360000000001,99.99909099999999,
2,1000000.0,10000.0,990000.0,0.109724,10.9692,3.232e-05,0.0,0.0,0.0,11721.2,11618.4,102.8,1162.12,1161.8,0.32,99.89987599999999,90.08080000000001,99.99905868,
3,1000000.0,10000.0,990000.0,0.6959360000000001,68.62559999999999,0.00977772,0.0,0.0,0.0,117043.2,115975.6,1067.6,11717.8,11621.0,96.8,99.34800000000001,35.7768,99.99013332,
4,1000000.0,10000.0,990000.0,1.8556640000000002,99.9964,0.8643434800000002,0.018515999999999998,1.8516,0.0,1046120.4,959837.6,86282.8,117408.8,108787.0,8621.8,98.26178799999998,3.630000000000001,99.21766459999998,
5,1000000.0,10000.0,990000.0,29.615563999999996,100.0,28.904610239999997,0.985708,98.57080000000002,0.0,5644809.2,1987598.4,3657210.8,1024577.88,651948.0,372629.88,73.686632,98.70679999999997,73.43390300000002,
6,1000000.0,10000.0,990000.0,98.51635599999997,100.0,98.50136976000002,1.019516,99.94920000000002,0.020226239999999996,38755616.0,1999449.6,36756166.4,5593096.92,998629.4,4594467.52,4.013404000000001,99.95280000000001,3.0443191600000006,
7,1000000.0,10000.0,990000.0,100.0,100.0,100.0,78.53369199999999,99.94960000000003,78.31736976,98567430.4,1999456.4,96567974.0,37704266.2,1000048.8,36704217.4,80.46027600000001,99.95280000000001,80.2633818,
8,1000000.0,10000.0,990000.0,100.0,100.0,100.0,99.94747200000002,99.94960000000003,99.94745068,100994250.4,1999456.4,98994794.0,98476418.36,1000049.2,97476369.16,99.952788,99.95280000000001,99.95278772,
9,1000000.0,10000.0,990000.0,100.0,100.0,100.0,99.95863200000002,99.94960000000003,99.95872331999999,100995368.0,1999456.4,98995911.6,100994247.52,1000049.2,99994198.32,99.96281200000001,99.95280000000001,99.96291292,
10,1000000.0,10000.0,990000.0,100.0,100.0,100.0,99.95864,99.94960000000003,99.95873139999998,100995368.8,1999456.4,98995912.4,100995368.0,1000049.2,99995318.8,99.96281599999999,99.95280000000001,99.962917,
11,1000000.0,10000.0,990000.0,100.0,100.0,100.0,99.95864,99.94960000000003,99.95873139999998,100995368.8,1999456.4,98995912.4,100995368.8,1000049.2,99995319.6,99.96281599999999,99.95280000000001,99.962917,
12,1000000.0,10000.0,990000.0,100.0,100.0,100.0,99.95864,99.94960000000003,99.95873139999998,100995368.8,1999456.4,98995912.4,100995368.8,1000049.2,99995319.6,99.96281599999999,99.95280000000001,99.962917,
13,1000000.0,10000.0,990000.0,100.0,100.0,100.0,99.95864,99.94960000000003,99.95873139999998,100995368.8,1999456.4,98995912.4,100995368.8,1000049.2,99995319.6,99.96281599999999,99.95280000000001,99.962917,
14,1000000.0,10000.0,990000.0,100.0,100.0,100.0,99.95864,99.94960000000003,99.95873139999998,100995368.8,1999456.4,98995912.4,100995368.8,1000049.2,99995319.6,99.96281599999999,99.95280000000001,99.962917,
15,1000000.0,10000.0,990000.0,100.0,100.0,100.0,99.95864,99.94960000000003,99.95873139999998,100995368.8,1999456.4,98995912.4,100995368.8,1000049.2,99995319.6,99.96281599999999,99.95280000000001,99.962917,
16,1000000.0,10000.0,990000.0,100.0,100.0,100.0,99.95864,99.94960000000003,99.95873139999998,100995368.8,1999456.4,98995912.4,100995368.8,1000049.2,99995319.6,99.96281599999999,99.95280000000001,99.962917,
17,1000000.0,10000.0,990000.0,100.0,100.0,100.0,99.95864,99.94960000000003,99.95873139999998,100995368.8,1999456.4,98995912.4,100995368.8,1000049.2,99995319.6,99.96281599999999,99.95280000000001,99.962917,
18,1000000.0,10000.0,990000.0,100.0,100.0,100.0,99.95864,99.94960000000003,99.95873139999998,100995368.8,1999456.4,98995912.4,100995368.8,1000049.2,99995319.6,99.96281599999999,99.95280000000001,99.962917,
19,1000000.0,10000.0,990000.0,100.0,100.0,100.0,99.95864,99.94960000000003,99.95873139999998,100995368.8,1999456.4,98995912.4,100995368.8,1000049.2,99995319.6,99.96281599999999,99.95280000000001,99.962917,
20,1000000.0,10000.0,990000.0,100.0,100.0,100.0,99.95864,99.94960000000003,99.95873139999998,100995368.8,1999456.4,98995912.4,100995368.8,1000049.2,99995319.6,99.96281599999999,99.95280000000001,99.962917,
21,1000000.0,10000.0,990000.0,100.0,100.0,100.0,99.95864,99.94960000000003,99.95873139999998,100995368.8,1999456.4,98995912.4,100995368.8,1000049.2,99995319.6,99.96281599999999,99.95280000000001,99.962917,
22,1000000.0,10000.0,990000.0,100.0,100.0,100.0,99.95864,99.94960000000003,99.95873139999998,100995368.8,1999456.4,98995912.4,100995368.8,1000049.2,99995319.6,99.96281599999999,99.95280000000001,99.962917,
23,1000000.0,10000.0,990000.0,100.0,100.0,100.0,99.95864,99.94960000000003,99.95873139999998,100995368.8,1999456.4,98995912.4,100995368.8,1000049.2,99995319.6,99.96281599999999,99.95280000000001,99.962917,
