,mean,std,min,q1,q2,q3,max
Simple,,,,,,,
P,5.2360455994025985,0.6663074825987213,1.0,5.0,5.0,6.0,8.0
S,7.494432908195613,0.5060283979618407,6.0,7.0,7.0,8.0,10.0
P+S,7.268599411458709,0.856663954489063,1.0,7.0,7.0,8.0,10.0
