round,P mean,P std,P min,P q1,P q2,P q3,P max,S mean,S std,S min,S q1,S q2,S q3,S max,P+S mean,P+S std,P+S min,P+S q1,P+S q2,P+S q3,P+S max
0,0.0,0.0,0,0,0,0,0,1.0,0.0,1,1,1,1,1,0.0,0.0,0,0,0,0,0
1,1.0,0.0,1,1,1,1,1,1.0,0.0,1,1,1,1,1,1.0,0.0,1,1,1,1,1
2,1.0,0.0,1,1,1,1,1,1.0,0.0,1,1,1,1,1,1.0,0.0,1,1,1,1,1
3,1.0,0.0,1,1,1,1,1,1.0,0.0,1,1,1,1,1,1.0,0.0,1,1,1,1,1
4,1.0,0.0,1,1,1,1,1,1.0,0.0,1,1,1,1,1,1.0,0.0,1,1,1,1,1
5,1.28,0.45825756949558394,1,1,1,2,2,1.0,0.0,1,1,1,1,1,1.0,0.0,1,1,1,1,1
6,2.04,0.6757711644237765,1,2,2,2,3,1.0,0.0,1,1,1,1,1,1.0,0.0,1,1,1,1,1
7,2.76,0.9695359714832658,1,3,3,3,4,1.0,0.0,1,1,1,1,1,1.0,0.0,1,1,1,1,1
8,3.56,1.416568624058385,1,3,4,4,5,1.0,0.0,1,1,1,1,1,1.0,0.0,1,1,1,1,1
9,4.2,1.8027756377319948,1,3,5,5,6,1.0,0.0,1,1,1,1,1,1.0,0.0,1,1,1,1,1
10,4.92,2.2715633383201093,1,3,6,6,7,1.0,0.0,1,1,1,1,1,1.0,0.0,1,1,1,1,1
11,5.52,2.678930134711741,1,3,7,7,8,1.0,0.0,1,1,1,1,1,1.0,0.0,1,1,1,1,1
12,6.2,3.162277660168379,1,3,8,8,9,1.0,0.0,1,1,1,1,1,1.0,0.0,1,1,1,1,1
13,6.8,3.5939764421413036,1,3,9,9,10,1.0,0.0,1,1,1,1,1,1.0,0.0,1,1,1,1,1
14,7.2,3.872983346207417,1,3,10,10,10,1.0,0.0,1,1,1,1,1,1.0,0.0,1,1,1,1,1
15,7.2,3.872983346207417,1,3,10,10,10,1.0,0.0,1,1,1,1,1,1.0,0.0,1,1,1,1,1
16,7.2,3.872983346207417,1,3,10,10,10,1.0,0.0,1,1,1,1,1,1.0,0.0,1,1,1,1,1
17,7.2,3.872983346207417,1,3,10,10,10,1.0,0.0,1,1,1,1,1,1.0,0.0,1,1,1,1,1
18,7.2,3.872983346207417,1,3,10,10,10,1.0,0.0,1,1,1,1,1,1.0,0.0,1,1,1,1,1
19,7.2,3.872983346207417,1,3,10,10,10,1.0,0.0,1,1,1,1,1,1.0,0.0,1,1,1,1,1
20,7.2,3.872983346207417,1,3,10,10,10,1.0,0.0,1,1,1,1,1,1.0,0.0,1,1,1,1,1
21,7.2,3.872983346207417,1,3,10,10,10,1.0,0.0,1,1,1,1,1,1.0,0.0,1,1,1,1,1
22,7.2,3.872983346207417,1,3,10,10,10,1.0,0.0,1,1,1,1,1,1.0,0.0,1,1,1,1,1
23,7.2,3.872983346207417,1,3,10,10,10,1.0,0.0,1,1,1,1,1,1.0,0.0,1,1,1,1,1
24,7.2,3.872983346207417,1,3,10,10,10,1.0,0.0,1,1,1,1,1,1.0,0.0,1,1,1,1,1
25,7.2,3.872983346207417,1,3,10,10,10,1.0,0.0,1,1,1,1,1,1.0,0.0,1,1,1,1,1
