round,P mean,P std,P min,P q1,P q2,P q3,P max,S mean,S std,S min,S q1,S q2,S q3,S max,P+S mean,P+S std,P+S min,P+S q1,P+S q2,P+S q3,P+S max
0,100.0,0.0,100.0,100.0,100.0,100.0,100.0,100.0,0.0,100.0,100.0,100.0,100.0,100.0,100.0,0.0,100.0,100.0,100.0,100.0,100.0
1,100.0,0.0,100.0,100.0,100.0,100.0,100.0,99.99989999999998,0.0,99.9999,99.9999,99.9999,99.9999,99.9999,99.99989999999998,0.0,99.9999,99.9999,99.9999,99.9999,99.9999
2,99.12799999999997,0.09363047936792217,99.0,99.1,99.1,99.2,99.3,99.99980000000004,0.0,99.9998,99.9998,99.9998,99.9998,99.9998,99.99892800000002,9.363047936608258e-05,99.9988,99.9989,99.9989,99.999,99.9991
3,95.66,0.4734624237113933,94.9,95.3,95.6,95.9,96.5,99.999696,2.000000000024795e-05,99.9996,99.9997,99.9997,99.9997,99.9997,99.99535600000003,0.00047441191665821184,99.9946,99.995,99.9953,99.9956,99.9962
4,95.428,0.5841803374529697,94.2,95.1,95.4,95.7,96.8,99.99372172,0.0017293118216956706,99.98989,99.992693,99.99369399999999,99.995195,99.996597,99.98915600000001,0.0019096422003427708,99.9852,99.9881,99.9896,99.9906,99.9922
5,95.26800000000001,0.4732159478856707,94.3,95.1,95.4,95.6,96.0,99.68032436,0.014811988483094299,99.64814799999999,99.67017,99.678679,99.691692,99.71121099999999,99.67591199999998,0.014926774601368023,99.6428,99.6659,99.6747,99.6866,99.7075
6,95.39200000000001,0.4102032016777363,94.7,95.1,95.3,95.7,96.4,96.93989588000001,0.10715786954704032,96.673473,96.890591,96.94234200000001,97.01921899999999,97.114014,96.938348,0.10700605559188539,96.6726,96.8895,96.9409,97.018,97.1126
7,95.308,0.5692978130996141,94.0,95.0,95.2,95.8,96.4,95.98041244000004,0.12631055899682186,95.693493,95.888288,95.991892,96.07007,96.193794,95.97973999999996,0.12630750175662497,95.693,95.8864,95.9905,96.0692,96.1926
8,95.31200000000001,0.3734077306823379,94.4,95.1,95.3,95.6,95.8,96.00404012000003,0.11482091928242048,95.79049,95.94995,96.010611,96.087688,96.222923,96.003348,0.11475658339865767,95.7895,95.9497,96.0095,96.0867,96.2223
9,95.25200000000001,0.35014282800023,94.5,95.0,95.3,95.5,95.9,95.97939540000003,0.10053265151680742,95.728729,95.92022,95.990691,96.022823,96.187588,95.97866799999998,0.10032362516708952,95.7284,95.9199,95.9896,96.0221,96.1861
10,95.22399999999999,0.46393246634971735,94.0,95.0,95.3,95.6,95.9,95.92795195999999,0.12196783856836667,95.616416,95.89019,95.96006,96.01911899999999,96.147447,95.92724799999996,0.1217879171620338,95.6161,95.8902,95.9599,96.0176,96.1463
11,95.228,0.46950328362358984,94.3,94.8,95.3,95.6,95.8,95.858006,0.1424691932243585,95.612212,95.73954,95.880981,95.94874899999999,96.112813,95.857376,0.14240517102034492,95.6122,95.7396,95.8807,95.9479,96.112
12,95.288,0.6227091348829442,94.0,95.0,95.3,95.7,96.2,95.9055376,0.15054278377618766,95.555756,95.817918,95.916517,96.02862900000001,96.11391400000001,95.90492000000002,0.15035384653099404,95.5553,95.8179,95.9156,96.0278,96.114
13,95.27600000000001,0.511761663276958,94.3,95.0,95.3,95.6,96.1,95.96238240000001,0.1592942935661838,95.479479,95.87978000000001,95.996697,96.02252299999999,96.277277,95.96169600000002,0.1592571073243936,95.4791,95.8798,95.9956,96.0215,96.2762
14,95.11599999999999,0.49386232899462446,94.0,94.9,95.2,95.5,96.0,95.96654256,0.155993409317,95.655355,95.865566,95.934635,96.046146,96.30540500000001,95.96569200000002,0.15579400373570346,95.6549,95.8651,95.9331,96.0457,96.3046
15,95.22399999999999,0.5464125425598004,93.9,95.0,95.3,95.5,96.0,95.92504908000001,0.11032133971680022,95.674675,95.833534,95.925225,96.025626,96.108008,95.92434800000001,0.1102800379337392,95.6729,95.8331,95.9238,96.0256,96.1075
16,95.33999999999997,0.3559026084010411,94.8,95.1,95.3,95.6,96.1,95.92788392,0.14112529759665066,95.621822,95.862763,95.911411,95.984585,96.288689,95.92729600000001,0.14095787928786907,95.6214,95.8621,95.9108,95.984,96.2879
17,95.336,0.5707305260219873,94.6,94.8,95.2,95.6,96.5,95.9511512,0.10460923833008348,95.703704,95.893293,95.951251,96.011211,96.182783,95.950536,0.10434749989019178,95.7038,95.8921,95.95,96.0103,96.1819
18,95.536,0.5187163643713828,94.5,95.2,95.6,95.8,96.7,95.97100304,0.1364540456244891,95.714815,95.859059,95.9999,96.043143,96.282382,95.97056799999999,0.13636454426768477,95.7151,95.8587,95.999,96.0419,96.2818
19,95.33200000000001,0.4670117771534276,94.6,94.9,95.3,95.7,96.2,95.91005000000001,0.1446978130875991,95.586887,95.863664,95.936236,96.02022,96.08048000000001,95.909472,0.1445179761598311,95.586,95.8637,95.9351,96.0199,96.0796
20,95.38,0.48045117684665284,94.3,95.0,95.4,95.7,96.3,95.89622828000002,0.1602952711042209,95.572272,95.764865,95.889189,96.021722,96.21021,95.89571199999999,0.16005525951995475,95.573,95.7652,95.8883,96.0213,96.2092
21,96.244,0.5888406688853383,94.9,95.7,96.3,96.7,97.0,95.82418816,0.14008723367502862,95.612913,95.713413,95.838138,95.91001,96.125726,95.82460800000001,0.13998149853938824,95.6133,95.7145,95.8392,95.9104,96.1263
22,99.81599999999999,0.10279429296739861,99.6,99.8,99.8,99.9,100.0,95.90454851999999,0.10292722398946001,95.65695699999999,95.845145,95.8999,95.98298299999999,96.090991,95.90846000000002,0.10281659642295228,95.6611,95.8491,95.9036,95.9868,96.0948
23,99.90800000000003,0.07023769168568543,99.8,99.9,99.9,100.0,100.0,95.95131532,0.12261038248986106,95.744745,95.880881,95.935435,96.050551,96.218819,95.95527199999998,0.12248769842994855,95.7489,95.885,95.9393,96.0543,96.2225
24,99.90800000000003,0.07023769168568543,99.8,99.9,99.9,100.0,100.0,96.1732652,0.13079342467641047,95.96906899999999,96.10970999999999,96.155455,96.222122,96.434735,96.17699999999999,0.130664554617285,95.973,96.1135,96.1592,96.2258,96.4382
25,99.90800000000003,0.07023769168568543,99.8,99.9,99.9,100.0,100.0,98.91429024000003,0.08801301205564231,98.72892900000001,98.85915899999999,98.922823,98.99099100000001,99.07117099999999,98.91528400000001,0.0879328184847212,98.7301,98.8602,98.9238,98.992,99.0719
26,99.90800000000003,0.07023769168568543,99.8,99.9,99.9,100.0,100.0,99.91345351999999,0.003702065190764508,99.907207,99.911512,99.912513,99.915315,99.924024,99.91344799999999,0.003716306410041042,99.9072,99.9116,99.9125,99.9153,99.9241
27,99.90800000000003,0.07023769168568543,99.8,99.9,99.9,100.0,100.0,99.91477468000002,0.0036081843624374698,99.90880899999999,99.91261300000001,99.914114,99.91681700000001,99.925425,99.91476799999998,0.003624766659156798,99.9088,99.9125,99.9141,99.9168,99.9255
28,99.90800000000003,0.07023769168568543,99.8,99.9,99.9,100.0,100.0,99.91477468000002,0.0036081843624374698,99.90880899999999,99.91261300000001,99.914114,99.91681700000001,99.925425,99.91476799999998,0.003624766659156798,99.9088,99.9125,99.9141,99.9168,99.9255
29,99.90800000000003,0.07023769168568543,99.8,99.9,99.9,100.0,100.0,99.91477468000002,0.0036081843624374698,99.90880899999999,99.91261300000001,99.914114,99.91681700000001,99.925425,99.91476799999998,0.003624766659156798,99.9088,99.9125,99.9141,99.9168,99.9255
30,99.90800000000003,0.07023769168568543,99.8,99.9,99.9,100.0,100.0,99.91477468000002,0.0036081843624374698,99.90880899999999,99.91261300000001,99.914114,99.91681700000001,99.925425,99.91476799999998,0.003624766659156798,99.9088,99.9125,99.9141,99.9168,99.9255
31,99.90800000000003,0.07023769168568543,99.8,99.9,99.9,100.0,100.0,99.91477468000002,0.0036081843624374698,99.90880899999999,99.91261300000001,99.914114,99.91681700000001,99.925425,99.91476799999998,0.003624766659156798,99.9088,99.9125,99.9141,99.9168,99.9255
32,99.90800000000003,0.07023769168568543,99.8,99.9,99.9,100.0,100.0,99.91477468000002,0.0036081843624374698,99.90880899999999,99.91261300000001,99.914114,99.91681700000001,99.925425,99.91476799999998,0.003624766659156798,99.9088,99.9125,99.9141,99.9168,99.9255
33,99.90800000000003,0.07023769168568543,99.8,99.9,99.9,100.0,100.0,99.91477468000002,0.0036081843624374698,99.90880899999999,99.91261300000001,99.914114,99.91681700000001,99.925425,99.91476799999998,0.003624766659156798,99.9088,99.9125,99.9141,99.9168,99.9255
34,99.90800000000003,0.07023769168568543,99.8,99.9,99.9,100.0,100.0,99.91477468000002,0.0036081843624374698,99.90880899999999,99.91261300000001,99.914114,99.91681700000001,99.925425,99.91476799999998,0.003624766659156798,99.9088,99.9125,99.9141,99.9168,99.9255
35,99.90800000000003,0.07023769168568543,99.8,99.9,99.9,100.0,100.0,99.91477468000002,0.0036081843624374698,99.90880899999999,99.91261300000001,99.914114,99.91681700000001,99.925425,99.91476799999998,0.003624766659156798,99.9088,99.9125,99.9141,99.9168,99.9255
36,99.90800000000003,0.07023769168568543,99.8,99.9,99.9,100.0,100.0,99.91477468000002,0.0036081843624374698,99.90880899999999,99.91261300000001,99.914114,99.91681700000001,99.925425,99.91476799999998,0.003624766659156798,99.9088,99.9125,99.9141,99.9168,99.9255
37,99.90800000000003,0.07023769168568543,99.8,99.9,99.9,100.0,100.0,99.91477468000002,0.0036081843624374698,99.90880899999999,99.91261300000001,99.914114,99.91681700000001,99.925425,99.91476799999998,0.003624766659156798,99.9088,99.9125,99.9141,99.9168,99.9255
38,99.90800000000003,0.07023769168568543,99.8,99.9,99.9,100.0,100.0,99.91477468000002,0.0036081843624374698,99.90880899999999,99.91261300000001,99.914114,99.91681700000001,99.925425,99.91476799999998,0.003624766659156798,99.9088,99.9125,99.9141,99.9168,99.9255
39,99.90800000000003,0.07023769168568543,99.8,99.9,99.9,100.0,100.0,99.91477468000002,0.0036081843624374698,99.90880899999999,99.91261300000001,99.914114,99.91681700000001,99.925425,99.91476799999998,0.003624766659156798,99.9088,99.9125,99.9141,99.9168,99.9255
40,99.90800000000003,0.07023769168568543,99.8,99.9,99.9,100.0,100.0,99.91477468000002,0.0036081843624374698,99.90880899999999,99.91261300000001,99.914114,99.91681700000001,99.925425,99.91476799999998,0.003624766659156798,99.9088,99.9125,99.9141,99.9168,99.9255
