gossips,p2p mean,p2p std,p2p min,p2p q1,p2p q2,p2p q3,p2p max,p2s mean,p2s std,p2s min,p2s q1,p2s q2,p2s q3,p2s max,s2s mean,s2s std,s2s min,s2s q1,s2s q2,s2s q3,s2s max
1,49.26320000000001,0.526875380585073,48.32,48.96,49.23,49.48,50.25,47.06440000000001,0.6456913607392735,46.12,46.53,47.08,47.27,48.84,56.23038387999999,0.2098246095759347,55.855959999999996,56.096566,56.200807999999995,56.37212099999999,56.647677
2,22.248800000000003,0.37674394487503016,21.38,22.05,22.32,22.44,22.91,9.843199999999998,0.4154587825524936,9.37,9.54,9.7,10.11,10.96,19.473418279999997,0.3258553981284646,18.648182000000002,19.240707,19.587979999999998,19.660505,20.093636
3,2.0304,0.157175061635108,1.75,1.89,2.04,2.12,2.31,0.018,0.011516578439248717,0.01,0.01,0.01,0.03,0.05,1.5929576000000003,0.06425110522395704,1.493838,1.5604040000000001,1.589495,1.6168690000000001,1.74101
4,0.029523809523809525,0.014309504001254018,0.01,0.02,0.03,0.04,0.06,,,,,,,,0.026626359999999995,0.0023050969950669468,0.023232,0.025051,0.026162,0.02798,0.031212
5,0.01,,0.01,0.01,0.01,0.01,0.01,,,,,,,,0.000101,,0.000101,0.000101,0.000101,0.000101,0.000101
