round,nodes,nodesP,nodesS,nodesSent,nodesSentP,nodesSentS,nodesRecv,nodesRecvP,nodesRecvS,msgSent,msgSentP,msgSentS,msgRecv,msgRecvP,msgRecvS,msgInfect,msgInfectP,msgInfectS
00,1000.000000,1000.000000,0.000000,0.000000,0.000000,0.000000,0.000000,0.000000,0.000000,0.000000,0.000000,0.000000,0.000000,0.000000,0.000000,0.000000,0.000000,0.000000
01,1000.000000,1000.000000,0.000000,0.100000,0.100000,0.000000,0.100000,0.100000,0.000000,10.000000,10.000000,0.000000,1.000000,1.000000,0.000000,1.000000,1.000000,0.000000
02,1000.000000,1000.000000,0.000000,1.200000,1.200000,0.000000,1.200000,1.200000,0.000000,120.000000,120.000000,0.000000,12.000000,12.000000,0.000000,1.000000,1.000000,0.000000
03,1000.000000,1000.000000,0.000000,10.790000,10.790000,0.000000,10.790000,10.790000,0.000000,1079.000000,1079.000000,0.000000,114.300000,114.300000,0.000000,1.000000,1.000000,0.000000
04,1000.000000,1000.000000,0.000000,66.490000,66.490000,0.000000,66.490000,66.490000,0.000000,6649.000000,6649.000000,0.000000,1084.600000,1084.600000,0.000000,1.000000,1.000000,0.000000
05,1000.000000,1000.000000,0.000000,99.840000,99.840000,0.000000,99.840000,99.840000,0.000000,9984.000000,9984.000000,0.000000,6553.800000,6553.800000,0.000000,6.000000,6.000000,0.000000
06,1000.000000,1000.000000,0.000000,99.990000,99.990000,0.000000,99.990000,99.990000,0.000000,9999.000000,9999.000000,0.000000,9985.100000,9985.100000,0.000000,9.200000,9.200000,0.000000
07,1000.000000,1000.000000,0.000000,99.990000,99.990000,0.000000,99.990000,99.990000,0.000000,9999.000000,9999.000000,0.000000,10000.000000,10000.000000,0.000000,10.000000,10.000000,0.000000
08,1000.000000,1000.000000,0.000000,99.990000,99.990000,0.000000,99.990000,99.990000,0.000000,9999.000000,9999.000000,0.000000,10000.000000,10000.000000,0.000000,10.000000,10.000000,0.000000
09,1000.000000,1000.000000,0.000000,99.990000,99.990000,0.000000,99.990000,99.990000,0.000000,9999.000000,9999.000000,0.000000,10000.000000,10000.000000,0.000000,10.000000,10.000000,0.000000
10,1000.000000,1000.000000,0.000000,99.990000,99.990000,0.000000,99.990000,99.990000,0.000000,9999.000000,9999.000000,0.000000,10000.000000,10000.000000,0.000000,10.000000,10.000000,0.000000
11,1000.000000,1000.000000,0.000000,99.990000,99.990000,0.000000,99.990000,99.990000,0.000000,9999.000000,9999.000000,0.000000,10000.000000,10000.000000,0.000000,10.000000,10.000000,0.000000
12,1000.000000,1000.000000,0.000000,99.990000,99.990000,0.000000,99.990000,99.990000,0.000000,9999.000000,9999.000000,0.000000,10000.000000,10000.000000,0.000000,10.000000,10.000000,0.000000
13,1000.000000,1000.000000,0.000000,99.990000,99.990000,0.000000,99.990000,99.990000,0.000000,9999.000000,9999.000000,0.000000,10000.000000,10000.000000,0.000000,10.000000,10.000000,0.000000
14,1000.000000,1000.000000,0.000000,99.990000,99.990000,0.000000,99.990000,99.990000,0.000000,9999.000000,9999.000000,0.000000,10000.000000,10000.000000,0.000000,10.000000,10.000000,0.000000
15,1000.000000,1000.000000,0.000000,99.990000,99.990000,0.000000,99.990000,99.990000,0.000000,9999.000000,9999.000000,0.000000,10000.000000,10000.000000,0.000000,10.000000,10.000000,0.000000
16,1000.000000,1000.000000,0.000000,99.990000,99.990000,0.000000,99.990000,99.990000,0.000000,9999.000000,9999.000000,0.000000,10000.000000,10000.000000,0.000000,10.000000,10.000000,0.000000
17,1000.000000,1000.000000,0.000000,99.990000,99.990000,0.000000,99.990000,99.990000,0.000000,9999.000000,9999.000000,0.000000,10000.000000,10000.000000,0.000000,10.000000,10.000000,0.000000
18,1000.000000,1000.000000,0.000000,99.990000,99.990000,0.000000,99.990000,99.990000,0.000000,9999.000000,9999.000000,0.000000,10000.000000,10000.000000,0.000000,10.000000,10.000000,0.000000
19,1000.000000,1000.000000,0.000000,99.990000,99.990000,0.000000,99.990000,99.990000,0.000000,9999.000000,9999.000000,0.000000,10000.000000,10000.000000,0.000000,10.000000,10.000000,0.000000
