,mean,std,min,q1,q2,q3,max
Simple,,,,,,,
P,4.235626956087633,0.6649176126671694,1.0,4.0,4.0,5.0,6.0
S,5.690986193796287,0.6024058211329402,2.0,5.0,6.0,6.0,8.0
P+S,5.676432642170971,0.6202046739857745,1.0,5.0,6.0,6.0,8.0
