round,P mean,P std,P min,P q1,P q2,P q3,P max,S mean,S std,S min,S q1,S q2,S q3,S max,P+S mean,P+S std,P+S min,P+S q1,P+S q2,P+S q3,P+S max
0,0.0,0.0,0.0,0.0,0.0,0.0,0.0,0.0,0.0,0.0,0.0,0.0,0.0,0.0,0.0,0.0,0.0,0.0,0.0,0.0,0.0
1,0.0,0.0,0.0,0.0,0.0,0.0,0.0,0.0,0.0,0.0,0.0,0.0,0.0,0.0,0.0,0.0,0.0,0.0,0.0,0.0,0.0
2,0.0,0.0,0.0,0.0,0.0,0.0,0.0,0.0,0.0,0.0,0.0,0.0,0.0,0.0,0.0,0.0,0.0,0.0,0.0,0.0,0.0
3,0.0,0.0,0.0,0.0,0.0,0.0,0.0,0.0,0.0,0.0,0.0,0.0,0.0,0.0,0.0,0.0,0.0,0.0,0.0,0.0,0.0
4,0.0,0.0,0.0,0.0,0.0,0.0,0.0,0.0,0.0,0.0,0.0,0.0,0.0,0.0,0.0,0.0,0.0,0.0,0.0,0.0,0.0
5,0.0,0.0,0.0,0.0,0.0,0.0,0.0,0.0,0.0,0.0,0.0,0.0,0.0,0.0,0.0,0.0,0.0,0.0,0.0,0.0,0.0
6,0.0,0.0,0.0,0.0,0.0,0.0,0.0,0.0,0.0,0.0,0.0,0.0,0.0,0.0,0.0,0.0,0.0,0.0,0.0,0.0,0.0
7,0.0,0.0,0.0,0.0,0.0,0.0,0.0,0.0,0.0,0.0,0.0,0.0,0.0,0.0,0.0,0.0,0.0,0.0,0.0,0.0,0.0
8,0.0,0.0,0.0,0.0,0.0,0.0,0.0,0.0,0.0,0.0,0.0,0.0,0.0,0.0,0.0,0.0,0.0,0.0,0.0,0.0,0.0
9,0.0,0.0,0.0,0.0,0.0,0.0,0.0,0.0,0.0,0.0,0.0,0.0,0.0,0.0,0.0,0.0,0.0,0.0,0.0,0.0,0.0
10,0.0,0.0,0.0,0.0,0.0,0.0,0.0,0.0,0.0,0.0,0.0,0.0,0.0,0.0,0.0,0.0,0.0,0.0,0.0,0.0,0.0
11,0.08240000000000004,0.03165964834506747,0.04,0.06,0.08,0.11,0.14,0.0,0.0,0.0,0.0,0.0,0.0,0.0,0.000824,0.00031659648345067466,0.0004,0.0006,0.0008,0.0011,0.0014
12,7.0855999999999995,0.20494064181285926,6.81,6.86,7.11,7.22,7.45,0.0,0.0,0.0,0.0,0.0,0.0,0.0,0.07085599999999999,0.002049406418128594,0.0681,0.0686,0.0711,0.0722,0.0745
13,65.5068,0.613702696751447,64.15,65.22,65.61,65.95,66.61,2.8280000000000004e-05,6.198690721972396e-05,0.0,0.0,0.0,0.0,0.000202,0.6550959999999999,0.006153351390367154,0.6415,0.6522,0.6563,0.6596,0.6661
14,99.80319999999998,0.0477598157450372,99.72,99.76,99.8,99.85,99.88,0.21174944,0.008226538817955785,0.192828,0.207677,0.21111100000000002,0.21363600000000002,0.229596,1.207664,0.008216998641028693,1.1885,1.2038,1.2073,1.2092,1.2257
15,99.9584,0.019723082923317016,99.91,99.94,99.96,99.97,99.99,14.960202039999997,0.2568477284349749,14.263131,14.806161999999999,14.994545,15.117172,15.466465,15.810183999999998,0.2543135706825989,15.1202,15.6578,15.8442,15.9653,16.3117
16,99.9584,0.019723082923317016,99.91,99.94,99.96,99.97,99.99,84.02370111999998,0.3826496584063894,83.366061,83.727071,84.05888900000001,84.27,84.74707099999999,84.18304799999999,0.37888390165502245,83.5321,83.8893,84.2176,84.4268,84.8995
17,99.9584,0.019723082923317016,99.91,99.94,99.96,99.97,99.99,99.94291707999999,0.0023943181687769554,99.937273,99.941515,99.943333,99.94474699999999,99.946768,99.94307199999999,0.0024352481050854136,99.9373,99.9415,99.9435,99.945,99.9471
18,99.9584,0.019723082923317016,99.91,99.94,99.96,99.97,99.99,99.95966468,0.001855653405136585,99.955152,99.958586,99.96,99.960808,99.962525,99.959652,0.001831920667863184,99.955,99.9587,99.9599,99.9608,99.9624
19,99.9584,0.019723082923317016,99.91,99.94,99.96,99.97,99.99,99.95966468,0.001855653405136585,99.955152,99.958586,99.96,99.960808,99.962525,99.959652,0.001831920667863184,99.955,99.9587,99.9599,99.9608,99.9624
20,99.9584,0.019723082923317016,99.91,99.94,99.96,99.97,99.99,99.95966468,0.001855653405136585,99.955152,99.958586,99.96,99.960808,99.962525,99.959652,0.001831920667863184,99.955,99.9587,99.9599,99.9608,99.9624
21,99.9584,0.019723082923317016,99.91,99.94,99.96,99.97,99.99,99.95966468,0.001855653405136585,99.955152,99.958586,99.96,99.960808,99.962525,99.959652,0.001831920667863184,99.955,99.9587,99.9599,99.9608,99.9624
22,99.9584,0.019723082923317016,99.91,99.94,99.96,99.97,99.99,99.95966468,0.001855653405136585,99.955152,99.958586,99.96,99.960808,99.962525,99.959652,0.001831920667863184,99.955,99.9587,99.9599,99.9608,99.9624
23,99.9584,0.019723082923317016,99.91,99.94,99.96,99.97,99.99,99.95966468,0.001855653405136585,99.955152,99.958586,99.96,99.960808,99.962525,99.959652,0.001831920667863184,99.955,99.9587,99.9599,99.9608,99.9624
24,99.9584,0.019723082923317016,99.91,99.94,99.96,99.97,99.99,99.95966468,0.001855653405136585,99.955152,99.958586,99.96,99.960808,99.962525,99.959652,0.001831920667863184,99.955,99.9587,99.9599,99.9608,99.9624
25,99.9584,0.019723082923317016,99.91,99.94,99.96,99.97,99.99,99.95966468,0.001855653405136585,99.955152,99.958586,99.96,99.960808,99.962525,99.959652,0.001831920667863184,99.955,99.9587,99.9599,99.9608,99.9624
