gossips,p2p mean,p2p std,p2p min,p2p q1,p2p q2,p2p q3,p2p max,p2s mean,p2s std,p2s min,p2s q1,p2s q2,p2s q3,p2s max,s2s mean,s2s std,s2s min,s2s q1,s2s q2,s2s q3,s2s max
1,34.291999999999994,0.6516005934108211,33.21,33.9,34.15,34.58,36.43,79.41119999999997,0.5853298215536253,78.06,79.06,79.43,79.84,80.5,51.054008079999996,0.14675338172705513,50.770909,50.944342999999996,51.05202,51.159696999999994,51.306263
2,0.05320000000000002,0.022861904265976327,0.01,0.04,0.05,0.07,0.1,8.5408,0.287400997446657,7.85,8.42,8.57,8.73,9.03,21.84282844,0.24394993079849375,21.275051,21.718182000000002,21.796060999999998,21.987778,22.30798
3,,,,,,,,0.01,0.0,0.01,0.01,0.01,0.01,0.01,1.7247636799999997,0.04372187029938974,1.601515,1.705556,1.73596,1.755859,1.787273
4,,,,,,,,,,,,,,,0.008149679999999998,0.0007913743698991855,0.006667,0.007576,0.00798,0.008687,0.009595999999999999
5,,,,,,,,,,,,,,,0.000101,0.0,0.000101,0.000101,0.000101,0.000101,0.000101
