gossips,p2p mean,p2p std,p2p min,p2p q1,p2p q2,p2p q3,p2p max,p2s mean,p2s std,p2s min,p2s q1,p2s q2,p2s q3,p2s max,s2s mean,s2s std,s2s min,s2s q1,s2s q2,s2s q3,s2s max
1,48.88799999999999,1.5616017418023094,46.2,47.9,48.8,50.1,52.2,57.70399999999999,1.6246743263394878,54.6,56.7,57.2,58.9,61.0,4.248584560000001,0.10027130141233498,4.043243,4.1848849999999995,4.239139,4.3099099999999995,4.455155
2,22.524,1.2059850745345053,19.9,22.0,22.3,23.2,25.1,20.768,1.1491736161259534,18.3,20.1,20.7,21.3,23.6,0.033969919999999994,0.0019179744940952693,0.031431,0.033233,0.033734,0.034434,0.041341
3,1.8440000000000003,0.47353282181210343,1.1,1.5,1.8,2.3,2.6,0.4499999999999999,0.18650096164806274,0.1,0.3,0.5,0.6,0.8,0.00013000000000000004,4.8304589153964794e-05,0.0001,0.0001,0.0001,0.00017500000000000003,0.0002
4,0.1,0.0,0.1,0.1,0.1,0.1,0.1,,,,,,,,,,,,,,
5,,,,,,,,,,,,,,,,,,,,,
