gossips,p2p mean,p2p std,p2p min,p2p q1,p2p q2,p2p q3,p2p max,p2s mean,p2s std,p2s min,p2s q1,p2s q2,p2s q3,p2s max,s2s mean,s2s std,s2s min,s2s q1,s2s q2,s2s q3,s2s max
1,517.76,16.37650756419084,491.0,505.0,520.0,531.0,546.0,583.28,12.535017617325726,565.0,577.0,582.0,591.0,613.0,520777.68,2632.6027792535174,515177,518708.0,520446.0,522330.0,526231
2,189.28,9.70188985026457,166.0,182.0,191.0,193.0,215.0,200.96,11.215614116043758,172.0,194.0,201.0,209.0,224.0,217289.88,4324.614696902679,207599,214432.0,216524.0,218381.0,225665
3,1.25,0.5,1.0,1.0,1.0,1.25,2.0,2.125,1.1539158284426272,1.0,1.0,2.0,3.0,5.0,14016.0,659.5502255325214,12985,13538.0,13831.0,14382.0,15297
4,,,,,,,,,,,,,,,291.2,37.066381893390506,222,276.0,288.0,311.0,377
5,,,,,,,,,,,,,,,1.9523809523809523,0.9206622874969125,1,1.0,2.0,3.0,4
