round,nodes,nodesP,nodesS,nodesSent,nodesSentP,nodesSentS,nodesRecv,nodesRecvP,nodesRecvS,msgSent,msgSentP,msgSentS,msgRecv,msgRecvP,msgRecvS,msgInfect,msgInfectP,msgInfectS
00,1000.000000,1000.000000,0.000000,0.000000,0.000000,0.000000,0.000000,0.000000,0.000000,0.000000,0.000000,0.000000,0.000000,0.000000,0.000000,0.000000,0.000000,0.000000
01,1000.000000,1000.000000,0.000000,0.110000,0.110000,0.000000,0.110000,0.110000,0.000000,11.000000,11.000000,0.000000,1.100000,1.100000,0.000000,1.000000,1.000000,0.000000
02,1000.000000,1000.000000,0.000000,1.190000,1.190000,0.000000,1.190000,1.190000,0.000000,119.000000,119.000000,0.000000,11.900000,11.900000,0.000000,1.000000,1.000000,0.000000
03,1000.000000,1000.000000,0.000000,11.000000,11.000000,0.000000,11.000000,11.000000,0.000000,1100.000000,1100.000000,0.000000,115.000000,115.000000,0.000000,1.000000,1.000000,0.000000
04,1000.000000,1000.000000,0.000000,66.950000,66.950000,0.000000,66.950000,66.950000,0.000000,6695.000000,6695.000000,0.000000,1097.600000,1097.600000,0.000000,1.000000,1.000000,0.000000
05,1000.000000,1000.000000,0.000000,99.870000,99.870000,0.000000,99.870000,99.870000,0.000000,9987.000000,9987.000000,0.000000,6602.800000,6602.800000,0.000000,6.000000,6.000000,0.000000
06,1000.000000,1000.000000,0.000000,100.000000,100.000000,0.000000,100.000000,100.000000,0.000000,10000.000000,10000.000000,0.000000,9988.000000,9988.000000,0.000000,9.300000,9.300000,0.000000
07,1000.000000,1000.000000,0.000000,100.000000,100.000000,0.000000,100.000000,100.000000,0.000000,10000.000000,10000.000000,0.000000,10001.000000,10001.000000,0.000000,10.000000,10.000000,0.000000
08,1000.000000,1000.000000,0.000000,100.000000,100.000000,0.000000,100.000000,100.000000,0.000000,10000.000000,10000.000000,0.000000,10001.000000,10001.000000,0.000000,10.000000,10.000000,0.000000
09,1000.000000,1000.000000,0.000000,100.000000,100.000000,0.000000,100.000000,100.000000,0.000000,10000.000000,10000.000000,0.000000,10001.000000,10001.000000,0.000000,10.000000,10.000000,0.000000
10,1000.000000,1000.000000,0.000000,100.000000,100.000000,0.000000,100.000000,100.000000,0.000000,10000.000000,10000.000000,0.000000,10001.000000,10001.000000,0.000000,10.000000,10.000000,0.000000
11,1000.000000,1000.000000,0.000000,100.000000,100.000000,0.000000,100.000000,100.000000,0.000000,10000.000000,10000.000000,0.000000,10001.000000,10001.000000,0.000000,10.000000,10.000000,0.000000
12,1000.000000,1000.000000,0.000000,100.000000,100.000000,0.000000,100.000000,100.000000,0.000000,10000.000000,10000.000000,0.000000,10001.000000,10001.000000,0.000000,10.000000,10.000000,0.000000
13,1000.000000,1000.000000,0.000000,100.000000,100.000000,0.000000,100.000000,100.000000,0.000000,10000.000000,10000.000000,0.000000,10001.000000,10001.000000,0.000000,10.000000,10.000000,0.000000
14,1000.000000,1000.000000,0.000000,100.000000,100.000000,0.000000,100.000000,100.000000,0.000000,10000.000000,10000.000000,0.000000,10001.000000,10001.000000,0.000000,10.000000,10.000000,0.000000
15,1000.000000,1000.000000,0.000000,100.000000,100.000000,0.000000,100.000000,100.000000,0.000000,10000.000000,10000.000000,0.000000,10001.000000,10001.000000,0.000000,10.000000,10.000000,0.000000
16,1000.000000,1000.000000,0.000000,100.000000,100.000000,0.000000,100.000000,100.000000,0.000000,10000.000000,10000.000000,0.000000,10001.000000,10001.000000,0.000000,10.000000,10.000000,0.000000
17,1000.000000,1000.000000,0.000000,100.000000,100.000000,0.000000,100.000000,100.000000,0.000000,10000.000000,10000.000000,0.000000,10001.000000,10001.000000,0.000000,10.000000,10.000000,0.000000
18,1000.000000,1000.000000,0.000000,100.000000,100.000000,0.000000,100.000000,100.000000,0.000000,10000.000000,10000.000000,0.000000,10001.000000,10001.000000,0.000000,10.000000,10.000000,0.000000
19,1000.000000,1000.000000,0.000000,100.000000,100.000000,0.000000,100.000000,100.000000,0.000000,10000.000000,10000.000000,0.000000,10001.000000,10001.000000,0.000000,10.000000,10.000000,0.000000
