gossips,p2p mean,p2p std,p2p min,p2p q1,p2p q2,p2p q3,p2p max,p2s mean,p2s std,p2s min,p2s q1,p2s q2,p2s q3,p2s max,s2s mean,s2s std,s2s min,s2s q1,s2s q2,s2s q3,s2s max
1,4895.48,54.93034983807524,4800,4851.0,4888.0,4938.0,4998,5817.92,62.222664680966524,5707.0,5778.0,5824.0,5848.0,5928.0,512562.12,1854.2654277817574,508491,511386.0,512750.0,513851.0,516726
2,2223.36,39.11295608022143,2161,2181.0,2229.0,2253.0,2297,2028.6,44.903600449555626,1911.0,2005.0,2026.0,2066.0,2101.0,216839.96,2079.737653327132,212396,215581.0,216754.0,217913.0,221226
3,205.28,11.749184368854424,185,196.0,205.0,213.0,232,34.76,5.680962359788467,26.0,31.0,34.0,39.0,48.0,13753.24,287.6986675904725,13255,13521.0,13828.0,13975.0,14171
4,2.6363636363636362,1.4653279998642443,1,2.0,2.0,3.0,7,1.5,0.7071067811865476,1.0,1.25,1.5,1.75,2.0,241.08,18.856740616200526,203,233.0,241.0,251.0,280
5,1.0,,1,1.0,1.0,1.0,1,,,,,,,,1.25,0.4629100498862757,1,1.0,1.0,1.25,2
