gossips,p2p mean,p2p std,p2p min,p2p q1,p2p q2,p2p q3,p2p max,p2s mean,p2s std,p2s min,p2s q1,p2s q2,p2s q3,p2s max,s2s mean,s2s std,s2s min,s2s q1,s2s q2,s2s q3,s2s max
1,51.70251999999999,0.1739298517602239,51.324,51.612,51.666,51.83,52.046,67.12472000000001,0.2074621491581885,66.775,66.969,67.08,67.284,67.551,53.91779116,0.07945449798977232,53.727667000000004,53.876667000000005,53.902333,53.979667000000006,54.044111
2,18.719760000000004,0.15629706757752482,18.472,18.607,18.713,18.812,19.035,14.835680000000002,0.19084804601217897,14.491,14.731,14.845,14.97,15.188,22.753022239999996,0.12936342599381243,22.529,22.659889,22.742778,22.836667000000002,23.049444
3,0.027840000000000018,0.004963869458396342,0.017,0.025,0.027,0.031,0.043,0.06744,0.006265514078403037,0.048,0.066,0.068,0.071,0.076,0.19723555999999998,0.023277234081966584,0.116222,0.19755599999999998,0.203444,0.20744400000000002,0.217
4,,,,,,,,,,,,,,,0.00018694736842105264,9.102775747857876e-05,0.00011100000000000001,0.00011100000000000001,0.00022200000000000003,0.00022200000000000003,0.00044400000000000006
5,,,,,,,,,,,,,,,,,,,,,
