gossips,p2p mean,p2p std,p2p min,p2p q1,p2p q2,p2p q3,p2p max,p2s mean,p2s std,p2s min,p2s q1,p2s q2,p2s q3,p2s max,s2s mean,s2s std,s2s min,s2s q1,s2s q2,s2s q3,s2s max
1,51.80599999999998,0.5639296646450398,50.44,51.44,51.88,52.18,52.92,66.8312,0.7810373443909924,65.15,66.4,66.73,67.32,68.83,48.965499120000004,0.04713033400698571,48.887071,48.934746999999994,48.956666999999996,48.997475,49.061919
2,18.843200000000003,0.34904297729649214,18.0,18.67,18.9,19.13,19.38,14.993200000000002,0.6221918246543158,13.61,14.61,14.93,15.35,16.39,23.23927672,0.22605835850662526,22.712424,23.133939,23.237676999999998,23.334747,23.709595999999998
3,0.02952380952380953,0.019098740920854045,0.01,0.02,0.03,0.04,0.08,0.07040000000000002,0.029080348461919547,0.02,0.05,0.07,0.09,0.13,1.5072969600000006,0.03968980317566885,1.401616,1.4870709999999998,1.520505,1.534343,1.552626
4,,,,,,,,,,,,,,,0.00524852,0.0009304237887471854,0.003737,0.004646,0.005051,0.00596,0.007273000000000001
5,,,,,,,,,,,,,,,0.000101,0.0,0.000101,0.000101,0.000101,0.000101,0.000101
