gossips,p2p mean,p2p std,p2p min,p2p q1,p2p q2,p2p q3,p2p max,p2s mean,p2s std,p2s min,p2s q1,p2s q2,p2s q3,p2s max,s2s mean,s2s std,s2s min,s2s q1,s2s q2,s2s q3,s2s max
1,,,,,,,,,,,,,,,60.30845655999999,0.5995565839701257,59.36936899999999,59.939840000000004,60.203904,60.864164,61.428529000000005
2,,,,,,,,,,,,,,,1.70413616,0.17395739725999962,1.474374,1.546146,1.676977,1.835435,2.093994
3,,,,,,,,,,,,,,,0.00012000000000000002,4.4721359549995795e-05,0.0001,0.0001,0.0001,0.0001,0.0002
4,,,,,,,,,,,,,,,,,,,,,
5,,,,,,,,,,,,,,,,,,,,,
