round,P mean,P std,P min,P q1,P q2,P q3,P max,S mean,S std,S min,S q1,S q2,S q3,S max,P+S mean,P+S std,P+S min,P+S q1,P+S q2,P+S q3,P+S max
0,100.0,0.0,100.0,100.0,100.0,100.0,100.0,99.999996,2.0000000001064458e-05,99.9999,100.0,100.0,100.0,100.0,99.999996,2.0000000001064458e-05,99.9999,100.0,100.0,100.0,100.0
1,100.0,0.0,100.0,100.0,100.0,100.0,100.0,99.99989999999998,0.0,99.9999,99.9999,99.9999,99.9999,99.9999,99.99989999999998,0.0,99.9999,99.9999,99.9999,99.9999,99.9999
2,99.78,0.14433756729740296,99.4,99.7,99.8,99.9,100.0,99.99980000000004,0.0,99.9998,99.9998,99.9998,99.9998,99.9998,99.99958000000002,0.00014433756729961313,99.9992,99.9995,99.9996,99.9997,99.9998
3,99.012,0.5278257288158684,97.8,98.6,99.1,99.5,99.6,99.99969999999999,0.0,99.9997,99.9997,99.9997,99.9997,99.9997,99.99871199999998,0.0005278257288148186,99.9975,99.9983,99.9988,99.9992,99.9993
4,96.81199999999998,1.306496587570496,93.6,95.7,96.8,97.9,98.7,99.99960000000004,0.0,99.9996,99.9996,99.9996,99.9996,99.9996,99.996412,0.0013064965875672757,99.9932,99.9953,99.9964,99.9975,99.9983
5,91.24799999999999,2.98846671946223,85.3,88.5,91.2,93.8,96.0,99.99941500000003,0.00016248076809334295,99.998899,99.999399,99.999499,99.999499,99.999499,99.99066399999998,0.0030678276787784987,99.9844,99.988,99.9906,99.9933,99.9952
6,80.69199999999998,5.368031917441128,69.3,76.6,80.4,86.3,88.8,99.9985464,0.0008646209188645154,99.99549499999999,99.998398,99.998599,99.999099,99.999399,99.97924,0.0058738828725098755,99.9668,99.9752,99.979,99.9849,99.9876
7,71.86399999999999,5.799129244981523,63.5,67.2,70.8,76.4,84.0,99.99049047999999,0.006726419584493621,99.970871,99.987087,99.99199200000001,99.99549499999999,99.998899,99.962364,0.00893694951684744,99.9433,99.9586,99.963,99.9702,99.9748
8,67.96800000000002,7.159534435515576,52.9,62.8,69.7,72.6,79.7,99.93847451999999,0.03852131310945151,99.84664699999999,99.91011,99.944745,99.97027,99.990691,99.90650399999998,0.03393996513453425,99.8265,99.8853,99.9155,99.9336,99.945
9,64.39600000000002,7.002409109251854,50.4,57.9,66.2,69.1,76.8,99.70174180000002,0.1500692398314277,99.367067,99.574074,99.73003,99.824224,99.92182199999999,99.66643599999998,0.14611858163834077,99.3445,99.5455,99.6849,99.7845,99.8723
10,62.376,9.141265412038607,44.6,56.9,61.1,67.2,82.0,98.87198391999999,0.46833222689666615,97.847447,98.42012,98.987387,99.294895,99.57988,98.83548799999998,0.4657504297009996,97.8161,98.4037,98.9439,99.2535,99.5249
11,64.12400000000001,6.575033586732973,51.8,60.3,62.4,68.7,79.3,96.38721524,1.3142532736035064,93.565866,95.192693,96.662663,97.62212199999999,98.38068100000001,96.354952,1.3112465275200245,93.5326,95.1592,96.6301,97.5763,98.343
12,67.06,6.5781836398811535,49.6,62.8,67.1,70.8,80.4,90.24259860000001,3.1502350950124454,83.77387399999999,88.537638,90.614114,93.030631,94.7998,90.219416,3.14500713296488,83.7705,88.5258,90.5918,93.0013,94.7773
13,68.77600000000001,8.080340339366902,49.5,64.4,70.4,75.4,82.5,79.87232836,5.426266835286583,68.338238,76.4002,79.335335,85.798298,86.87267299999999,79.861232,5.42140238689216,68.3462,76.3807,79.3227,85.7803,86.8485
14,70.848,9.25986500981521,50.7,63.6,71.1,79.4,85.4,71.62096496,5.752635794902834,64.028328,67.268969,69.907007,76.138238,84.53363399999999,71.62019200000002,5.751296206865025,64.0244,67.2594,69.9167,76.1475,84.5295
15,81.296,8.169938800260377,63.4,77.6,82.0,87.0,94.1,67.88519716,6.944789554704727,51.897197,64.561862,69.327127,71.43383399999999,80.603504,67.89860800000001,6.936708508959182,51.9394,64.5615,69.3439,71.4258,80.5949
16,93.66799999999999,4.147762448999861,84.0,92.0,94.7,96.3,98.6,64.67282088,7.109499299068743,49.862763,60.698899,65.859459,68.90150200000001,77.64494499999999,64.701816,7.101439902153647,49.9068,60.7355,65.8898,68.9289,77.6563
17,98.78,0.8674675786448741,96.2,98.4,99.0,99.4,99.9,63.00394792,8.453198830403384,47.509409000000005,58.668969,62.114214000000004,67.671171,81.817818,63.039723999999985,8.444833037587735,47.5608,58.7095,62.152,67.7018,81.8344
18,99.78400000000002,0.17483325389257964,99.4,99.7,99.8,99.9,100.0,64.65345736,5.7330877009831696,55.65045,60.910309999999996,63.286286,67.819119,78.071471,64.68858799999998,5.7274065586965275,55.6948,60.9491,63.3227,67.8509,78.0933
19,99.90800000000002,0.09966610925150864,99.6,99.9,99.9,100.0,100.0,66.80956552000002,6.397147670521323,50.633333,62.424725,67.231031,71.558058,78.564464,66.842664,6.390745998569599,50.6826,62.4622,67.2638,71.5865,78.5859
20,99.94,0.08164965809276901,99.7,99.9,100.0,100.0,100.0,68.07643248,7.793471497344273,48.521021000000005,64.49599599999999,68.954655,71.804805,81.715315,68.10829600000001,7.785657603808006,48.5725,64.5314,68.9857,71.833,81.7335
21,99.94800000000001,0.07702813338860602,99.7,99.9,100.0,100.0,100.0,71.84398396,9.039932559178402,48.271371,65.846246,72.183984,79.11671700000001,85.55815799999999,71.872088,9.030869300087708,48.3231,65.8804,72.2117,79.1374,85.5726
22,99.956,0.07118052168020499,99.7,99.9,100.0,100.0,100.0,82.95058660000001,8.150492984269503,64.25405400000001,78.189489,84.376076,88.53994,95.47998,82.96759200000001,8.142333716904101,64.2898,78.2112,84.3917,88.5511,95.4845
23,99.956,0.07118052168020499,99.7,99.9,100.0,100.0,100.0,94.5747588,3.30912720158671,86.653453,92.736637,95.330931,97.071271,98.743243,94.58014000000001,3.3058153602149907,86.6668,92.7439,95.3355,97.0742,98.7445
24,99.956,0.07118052168020499,99.7,99.9,100.0,100.0,100.0,98.94635840000001,0.6656041896012024,97.427027,98.455956,99.092392,99.484785,99.674875,98.94736799999998,0.6649376128129107,97.4296,98.4574,99.0933,99.4853,99.6752
25,99.956,0.07118052168020499,99.7,99.9,100.0,100.0,100.0,99.79658464,0.10137572776840346,99.57247199999999,99.733133,99.81761800000001,99.875976,99.910811,99.79674399999998,0.10127373417294344,99.5728,99.7333,99.8175,99.8761,99.9109
26,99.956,0.07118052168020499,99.7,99.9,100.0,100.0,100.0,99.93267667999997,0.015640863410521236,99.898999,99.922723,99.935736,99.94364399999999,99.95435400000001,99.93270000000001,0.015624579994360377,99.8991,99.9228,99.9358,99.9437,99.9544
27,99.956,0.07118052168020499,99.7,99.9,100.0,100.0,100.0,99.95529128,0.003636593065858113,99.947648,99.953453,99.955656,99.956456,99.962663,99.95529200000001,0.003634547197842208,99.9477,99.9535,99.9557,99.9564,99.9627
28,99.956,0.07118052168020499,99.7,99.9,100.0,100.0,100.0,99.95884684,0.0021647923241399076,99.954755,99.958058,99.958458,99.95956,99.964164,99.95884399999997,0.0021673870597221307,99.9548,99.958,99.9585,99.9595,99.9642
29,99.956,0.07118052168020499,99.7,99.9,100.0,100.0,100.0,99.95959563999999,0.002022213512468167,99.95655699999999,99.95835799999999,99.95935899999999,99.96025999999999,99.96456500000001,99.95959199999999,0.0020277080657743174,99.9566,99.9583,99.9594,99.9602,99.9646
30,99.956,0.07118052168020499,99.7,99.9,100.0,100.0,100.0,99.95969576000003,0.0019997201320887214,99.95665699999999,99.95835799999999,99.959459,99.96046,99.964665,99.95969199999998,0.002004353594883368,99.9567,99.9584,99.9595,99.9605,99.9647
31,99.956,0.07118052168020499,99.7,99.9,100.0,100.0,100.0,99.95971580000001,0.0020014459772906986,99.95665699999999,99.95835799999999,99.959459,99.960561,99.964665,99.95971200000002,0.002006099033782215,99.9567,99.9584,99.9595,99.9605,99.9647
32,99.956,0.07118052168020499,99.7,99.9,100.0,100.0,100.0,99.95971580000001,0.0020014459772906986,99.95665699999999,99.95835799999999,99.959459,99.960561,99.964665,99.95971200000002,0.002006099033782215,99.9567,99.9584,99.9595,99.9605,99.9647
33,99.956,0.07118052168020499,99.7,99.9,100.0,100.0,100.0,99.95971580000001,0.0020014459772906986,99.95665699999999,99.95835799999999,99.959459,99.960561,99.964665,99.95971200000002,0.002006099033782215,99.9567,99.9584,99.9595,99.9605,99.9647
34,99.956,0.07118052168020499,99.7,99.9,100.0,100.0,100.0,99.95971580000001,0.0020014459772906986,99.95665699999999,99.95835799999999,99.959459,99.960561,99.964665,99.95971200000002,0.002006099033782215,99.9567,99.9584,99.9595,99.9605,99.9647
35,99.956,0.07118052168020499,99.7,99.9,100.0,100.0,100.0,99.95971580000001,0.0020014459772906986,99.95665699999999,99.95835799999999,99.959459,99.960561,99.964665,99.95971200000002,0.002006099033782215,99.9567,99.9584,99.9595,99.9605,99.9647
36,99.956,0.07118052168020499,99.7,99.9,100.0,100.0,100.0,99.95971580000001,0.0020014459772906986,99.95665699999999,99.95835799999999,99.959459,99.960561,99.964665,99.95971200000002,0.002006099033782215,99.9567,99.9584,99.9595,99.9605,99.9647
37,99.956,0.07118052168020499,99.7,99.9,100.0,100.0,100.0,99.95971580000001,0.0020014459772906986,99.95665699999999,99.95835799999999,99.959459,99.960561,99.964665,99.95971200000002,0.002006099033782215,99.9567,99.9584,99.9595,99.9605,99.9647
38,99.956,0.07118052168020499,99.7,99.9,100.0,100.0,100.0,99.95971580000001,0.0020014459772906986,99.95665699999999,99.95835799999999,99.959459,99.960561,99.964665,99.95971200000002,0.002006099033782215,99.9567,99.9584,99.9595,99.9605,99.9647
39,99.956,0.07118052168020499,99.7,99.9,100.0,100.0,100.0,99.95971580000001,0.0020014459772906986,99.95665699999999,99.95835799999999,99.959459,99.960561,99.964665,99.95971200000002,0.002006099033782215,99.9567,99.9584,99.9595,99.9605,99.9647
40,99.956,0.07118052168020499,99.7,99.9,100.0,100.0,100.0,99.95971580000001,0.0020014459772906986,99.95665699999999,99.95835799999999,99.959459,99.960561,99.964665,99.95971200000002,0.002006099033782215,99.9567,99.9584,99.9595,99.9605,99.9647
41,99.956,0.07118052168020499,99.7,99.9,100.0,100.0,100.0,99.95971580000001,0.0020014459772906986,99.95665699999999,99.95835799999999,99.959459,99.960561,99.964665,99.95971200000002,0.002006099033782215,99.9567,99.9584,99.9595,99.9605,99.9647
42,99.956,0.07118052168020499,99.7,99.9,100.0,100.0,100.0,99.95971580000001,0.0020014459772906986,99.95665699999999,99.95835799999999,99.959459,99.960561,99.964665,99.95971200000002,0.002006099033782215,99.9567,99.9584,99.9595,99.9605,99.9647
43,99.956,0.07118052168020499,99.7,99.9,100.0,100.0,100.0,99.95971580000001,0.0020014459772906986,99.95665699999999,99.95835799999999,99.959459,99.960561,99.964665,99.95971200000002,0.002006099033782215,99.9567,99.9584,99.9595,99.9605,99.9647
44,99.956,0.07118052168020499,99.7,99.9,100.0,100.0,100.0,99.95971580000001,0.0020014459772906986,99.95665699999999,99.95835799999999,99.959459,99.960561,99.964665,99.95971200000002,0.002006099033782215,99.9567,99.9584,99.9595,99.9605,99.9647
45,99.956,0.07118052168020499,99.7,99.9,100.0,100.0,100.0,99.95971580000001,0.0020014459772906986,99.95665699999999,99.95835799999999,99.959459,99.960561,99.964665,99.95971200000002,0.002006099033782215,99.9567,99.9584,99.9595,99.9605,99.9647
46,99.956,0.07118052168020499,99.7,99.9,100.0,100.0,100.0,99.95971580000001,0.0020014459772906986,99.95665699999999,99.95835799999999,99.959459,99.960561,99.964665,99.95971200000002,0.002006099033782215,99.9567,99.9584,99.9595,99.9605,99.9647
47,99.956,0.07118052168020499,99.7,99.9,100.0,100.0,100.0,99.95971580000001,0.0020014459772906986,99.95665699999999,99.95835799999999,99.959459,99.960561,99.964665,99.95971200000002,0.002006099033782215,99.9567,99.9584,99.9595,99.9605,99.9647
48,99.956,0.07118052168020499,99.7,99.9,100.0,100.0,100.0,99.95971580000001,0.0020014459772906986,99.95665699999999,99.95835799999999,99.959459,99.960561,99.964665,99.95971200000002,0.002006099033782215,99.9567,99.9584,99.9595,99.9605,99.9647
49,99.956,0.07118052168020499,99.7,99.9,100.0,100.0,100.0,99.95971580000001,0.0020014459772906986,99.95665699999999,99.95835799999999,99.959459,99.960561,99.964665,99.95971200000002,0.002006099033782215,99.9567,99.9584,99.9595,99.9605,99.9647
50,99.956,0.07118052168020499,99.7,99.9,100.0,100.0,100.0,99.95971580000001,0.0020014459772906986,99.95665699999999,99.95835799999999,99.959459,99.960561,99.964665,99.95971200000002,0.002006099033782215,99.9567,99.9584,99.9595,99.9605,99.9647
