gossips,p2p mean,p2p std,p2p min,p2p q1,p2p q2,p2p q3,p2p max,p2s mean,p2s std,p2s min,p2s q1,p2s q2,p2s q3,p2s max,s2s mean,s2s std,s2s min,s2s q1,s2s q2,s2s q3,s2s max
1,49.288399999999996,0.548214374127493,48.31,48.82,49.33,49.63,50.3,50.178000000000004,0.4710891635348874,49.37,49.88,50.16,50.56,50.98,50.16429907999999,0.10393211287418865,50.017677,50.088384000000005,50.168384,50.229394,50.46
2,22.373599999999996,0.3780418848046691,21.77,22.07,22.33,22.68,23.02,18.250800000000005,0.515718915689545,17.32,17.96,18.29,18.41,19.52,23.07900204,0.22938100947922158,22.729495,22.930404,22.997475,23.228384,23.776061
3,2.0644,0.164191960826345,1.77,1.94,2.05,2.18,2.46,0.022173913043478266,0.01085295173051194,0.01,0.01,0.02,0.03,0.04,1.2286788,0.03186646760703167,1.166768,1.214848,1.223434,1.248687,1.314343
4,0.02238095238095238,0.012611408289624875,0.01,0.01,0.02,0.03,0.05,,,,,,,,0.010719119999999997,0.0012429293798657001,0.008485,0.009696999999999999,0.010505,0.011515000000000001,0.012727
5,,,,,,,,,,,,,,,,,,,,,
