round,P+S mean,P+S std,P+S min,P+S q1,P+S median,P+S q3,P+S max,P mean,P std,P min,P q1,P median,P q3,P max,S mean,S std,S min,S q1,S median,S q3,S max
0,100.0,0.0,100.0,100.0,100.0,100.0,100.0,100.0,0.0,100.0,100.0,100.0,100.0,100.0,100.0,0.0,100.0,100.0,100.0,100.0,100.0
1,99.99989199999999,2.7129319933401665e-05,99.9998,99.9999,99.9999,99.9999,99.9999,99.99880000000002,0.0032496153618560477,99.99,100.0,100.0,100.0,100.0,99.99990303999998,1.979187712184384e-05,99.999899,99.999899,99.999899,99.999899,100.0
2,99.99871599999999,9.24337600680709e-05,99.9985,99.9986,99.9987,99.9988,99.9988,99.89120000000003,0.009927738916795338,99.87,99.88,99.89,99.9,99.9,99.99980203999999,1.9791877121843846e-05,99.999798,99.999798,99.999798,99.999798,99.999899
3,99.98846399999998,0.0004568413291303778,99.9874,99.9882,99.9885,99.9887,99.9895,98.8768,0.045757622315850933,98.77,98.85,98.87,98.9,98.98,99.99969296,3.4753394079125734e-05,99.999596,99.999697,99.999697,99.999697,99.999798
4,99.95012399999997,0.0016514914471474863,99.9464,99.9493,99.95,99.951,99.9533,95.1664,0.1513903563639384,94.8,95.06,95.2,95.25,95.46,99.99844459999998,0.0009573180453772499,99.99596,99.998081,99.998586,99.99919200000001,99.999495
5,99.86529600000001,0.01297756464056458,99.8364,99.8584,99.866,99.8749,99.8831,95.09440000000001,0.18297715704426062,94.61,94.97,95.12,95.21,95.42,99.91348679999999,0.012280560710326426,99.883636,99.907172,99.913535,99.923333,99.92959599999999
6,97.73233199999999,0.056742045927160846,97.6016,97.6999,97.7425,97.7833,97.8067,95.0632,0.13510647652870045,94.77,94.96,95.07,95.17,95.34,97.75929303999997,0.057719196928220036,97.628283,97.72535400000001,97.770303,97.813737,97.83545500000001
7,96.88398799999999,0.053615015210294235,96.7995,96.8307,96.8902,96.9138,96.988,95.13600000000001,0.19287301521986064,94.79,94.97,95.15,95.28,95.43,96.90164444,0.054212451239234155,96.817374,96.84666700000001,96.90777800000001,96.929192,97.003737
8,96.91520399999999,0.07200658569880884,96.7881,96.8597,96.9334,96.9511,97.052,95.0536,0.157933656957595,94.81,94.92,95.05,95.2,95.38,96.93400808,0.07213958388231437,96.806061,96.875455,96.950909,96.97100999999999,97.07
9,96.8925,0.07676429378298288,96.7494,96.8324,96.9027,96.9315,97.0983,95.0288,0.16055703036616054,94.78,94.89,95.02,95.14,95.33,96.91132524000001,0.07677761984447196,96.767677,96.851919,96.921515,96.95212099999999,97.11697
10,96.86980000000001,0.05880881566567941,96.7241,96.8317,96.8796,96.911,96.9893,95.0584,0.12418309063636666,94.72,94.98,95.05,95.15,95.33,96.88809704,0.059798657369194645,96.738182,96.848586,96.896869,96.929192,97.009495
11,96.82084799999998,0.059878671461547545,96.6781,96.7906,96.8146,96.8776,96.9087,95.13760000000002,0.15801974560161705,94.89,95.01,95.15,95.24,95.46,96.83785048,0.06009545350065685,96.694141,96.808384,96.830505,96.89596,96.926263
12,96.899696,0.06170833642223724,96.7854,96.8659,96.895,96.9378,97.029,96.13519999999998,0.15995299309484562,95.77,96.02,96.11,96.27,96.44,96.90741816000003,0.062025991992183165,96.791717,96.87191899999999,96.90303,96.946566,97.038485
13,96.93358,0.07811123350709585,96.7953,96.8662,96.9269,97.0056,97.0785,99.87639999999999,0.03474248120097517,99.81,99.85,99.87,99.9,99.95,96.90385456,0.07896446209078054,96.76393900000001,96.835657,96.897172,96.976869,97.050606
14,97.00952400000001,0.06318073934356938,96.9155,96.9718,97.0056,97.0461,97.1938,99.96560000000001,0.019612241075409716,99.93,99.95,99.97,99.98,100.0,96.97966464,0.06378308812710806,96.88464599999999,96.941414,96.97545500000001,97.016768,97.165758
15,99.098884,0.03822115309615901,99.0417,99.0696,99.098,99.1201,99.1832,99.96600000000002,0.019183326093250377,99.93,99.95,99.97,99.98,100.0,99.09012524000002,0.03856372962282436,99.032424,99.060707,99.08919200000001,99.111717,99.175253
16,99.96198400000003,0.0020228059719106985,99.9584,99.9605,99.962,99.9634,99.9658,99.96600000000002,0.019183326093250377,99.93,99.95,99.97,99.98,100.0,99.96194328,0.002033419514415928,99.958182,99.960404,99.96181800000001,99.96333299999999,99.965758
17,99.96294400000001,0.001916471758205728,99.9598,99.9614,99.9629,99.9642,99.9664,99.96600000000002,0.019183326093250377,99.93,99.95,99.97,99.98,100.0,99.96291304,0.0019250494119369527,99.95959599999999,99.961313,99.962727,99.964444,99.966364
18,99.96294,0.0019166637681137912,99.9598,99.9614,99.9629,99.9642,99.9664,99.96600000000002,0.019183326093250377,99.93,99.95,99.97,99.98,100.0,99.962909,0.0019255415238313652,99.95959599999999,99.961313,99.962727,99.964444,99.966364
19,99.96294,0.0019166637681137912,99.9598,99.9614,99.9629,99.9642,99.9664,99.96600000000002,0.019183326093250377,99.93,99.95,99.97,99.98,100.0,99.962909,0.0019255415238313652,99.95959599999999,99.961313,99.962727,99.964444,99.966364
20,99.96294,0.0019166637681137912,99.9598,99.9614,99.9629,99.9642,99.9664,99.96600000000002,0.019183326093250377,99.93,99.95,99.97,99.98,100.0,99.962909,0.0019255415238313652,99.95959599999999,99.961313,99.962727,99.964444,99.966364
21,99.96294,0.0019166637681137912,99.9598,99.9614,99.9629,99.9642,99.9664,99.96600000000002,0.019183326093250377,99.93,99.95,99.97,99.98,100.0,99.962909,0.0019255415238313652,99.95959599999999,99.961313,99.962727,99.964444,99.966364
22,99.96294,0.0019166637681137912,99.9598,99.9614,99.9629,99.9642,99.9664,99.96600000000002,0.019183326093250377,99.93,99.95,99.97,99.98,100.0,99.962909,0.0019255415238313652,99.95959599999999,99.961313,99.962727,99.964444,99.966364
23,99.96294,0.0019166637681137912,99.9598,99.9614,99.9629,99.9642,99.9664,99.96600000000002,0.019183326093250377,99.93,99.95,99.97,99.98,100.0,99.962909,0.0019255415238313652,99.95959599999999,99.961313,99.962727,99.964444,99.966364
