gossips,p2p mean,p2p std,p2p min,p2p q1,p2p q2,p2p q3,p2p max,p2s mean,p2s std,p2s min,p2s q1,p2s q2,p2s q3,p2s max,s2s mean,s2s std,s2s min,s2s q1,s2s q2,s2s q3,s2s max
1,49.624,1.3639037111663457,47.0,48.6,50.0,50.4,52.3,56.73200000000001,1.6290897253783583,54.3,55.8,56.2,58.2,60.1,7.234418440000001,0.21522283794071823,6.801000999999999,7.1187190000000005,7.2469470000000005,7.405606,7.586186
2,22.059999999999995,0.9954061147759402,20.1,21.7,22.2,22.6,23.6,18.148,1.7750868523352126,14.0,17.2,18.3,19.8,20.5,0.05915507999999999,0.002861411480371183,0.05505499999999999,0.057057000000000004,0.058959000000000004,0.060661,0.066366
3,2.112,0.4833218389437829,1.1,1.7,2.2,2.5,2.8,0.1,0.0,0.1,0.1,0.1,0.1,0.1,0.0002,0.0,0.0002,0.0002,0.0002,0.0002,0.0002
4,0.1142857142857143,0.03779644730092272,0.1,0.1,0.1,0.1,0.2,,,,,,,,,,,,,,
5,,,,,,,,,,,,,,,,,,,,,
6,,,,,,,,,,,,,,,,,,,,,
