round,P+S mean,P+S std,P+S min,P+S q1,P+S median,P+S q3,P+S max,P mean,P std,P min,P q1,P median,P q3,P max,S mean,S std,S min,S q1,S median,S q3,S max
0,0.0,0.0,0.0,0.0,0.0,0.0,0.0,0.0,0.0,0.0,0.0,0.0,0.0,0.0,0.0,0.0,0.0,0.0,0.0,0.0,0.0
1,0.0,0.0,0.0,0.0,0.0,0.0,0.0,0.0,0.0,0.0,0.0,0.0,0.0,0.0,0.0,0.0,0.0,0.0,0.0,0.0,0.0
2,0.0,0.0,0.0,0.0,0.0,0.0,0.0,0.0,0.0,0.0,0.0,0.0,0.0,0.0,0.0,0.0,0.0,0.0,0.0,0.0,0.0
3,0.0,0.0,0.0,0.0,0.0,0.0,0.0,0.0,0.0,0.0,0.0,0.0,0.0,0.0,0.0,0.0,0.0,0.0,0.0,0.0,0.0
4,0.0,0.0,0.0,0.0,0.0,0.0,0.0,0.0,0.0,0.0,0.0,0.0,0.0,0.0,0.0,0.0,0.0,0.0,0.0,0.0,0.0
5,0.0,0.0,0.0,0.0,0.0,0.0,0.0,0.0,0.0,0.0,0.0,0.0,0.0,0.0,0.0,0.0,0.0,0.0,0.0,0.0,0.0
6,0.0,0.0,0.0,0.0,0.0,0.0,0.0,0.0,0.0,0.0,0.0,0.0,0.0,0.0,0.0,0.0,0.0,0.0,0.0,0.0,0.0
7,0.0,0.0,0.0,0.0,0.0,0.0,0.0,0.0,0.0,0.0,0.0,0.0,0.0,0.0,0.0,0.0,0.0,0.0,0.0,0.0,0.0
8,0.0,0.0,0.0,0.0,0.0,0.0,0.0,0.0,0.0,0.0,0.0,0.0,0.0,0.0,0.0,0.0,0.0,0.0,0.0,0.0,0.0
9,0.0,0.0,0.0,0.0,0.0,0.0,0.0,0.0,0.0,0.0,0.0,0.0,0.0,0.0,0.0,0.0,0.0,0.0,0.0,0.0,0.0
10,0.0,0.0,0.0,0.0,0.0,0.0,0.0,0.0,0.0,0.0,0.0,0.0,0.0,0.0,0.0,0.0,0.0,0.0,0.0,0.0,0.0
11,0.0,0.0,0.0,0.0,0.0,0.0,0.0,0.0,0.0,0.0,0.0,0.0,0.0,0.0,0.0,0.0,0.0,0.0,0.0,0.0,0.0
12,0.0,0.0,0.0,0.0,0.0,0.0,0.0,0.0,0.0,0.0,0.0,0.0,0.0,0.0,0.0,0.0,0.0,0.0,0.0,0.0,0.0
13,0.0,0.0,0.0,0.0,0.0,0.0,0.0,0.0,0.0,0.0,0.0,0.0,0.0,0.0,0.0,0.0,0.0,0.0,0.0,0.0,0.0
14,0.0,0.0,0.0,0.0,0.0,0.0,0.0,0.0,0.0,0.0,0.0,0.0,0.0,0.0,0.0,0.0,0.0,0.0,0.0,0.0,0.0
15,0.0,0.0,0.0,0.0,0.0,0.0,0.0,0.0,0.0,0.0,0.0,0.0,0.0,0.0,0.0,0.0,0.0,0.0,0.0,0.0,0.0
16,0.0,0.0,0.0,0.0,0.0,0.0,0.0,0.0,0.0,0.0,0.0,0.0,0.0,0.0,0.0,0.0,0.0,0.0,0.0,0.0,0.0
17,0.0,0.0,0.0,0.0,0.0,0.0,0.0,0.0,0.0,0.0,0.0,0.0,0.0,0.0,0.0,0.0,0.0,0.0,0.0,0.0,0.0
18,0.0,0.0,0.0,0.0,0.0,0.0,0.0,0.0,0.0,0.0,0.0,0.0,0.0,0.0,0.0,0.0,0.0,0.0,0.0,0.0,0.0
19,0.0,0.0,0.0,0.0,0.0,0.0,0.0,0.0,0.0,0.0,0.0,0.0,0.0,0.0,0.0,0.0,0.0,0.0,0.0,0.0,0.0
20,0.0,0.0,0.0,0.0,0.0,0.0,0.0,0.0,0.0,0.0,0.0,0.0,0.0,0.0,0.0,0.0,0.0,0.0,0.0,0.0,0.0
21,0.0,0.0,0.0,0.0,0.0,0.0,0.0,0.0,0.0,0.0,0.0,0.0,0.0,0.0,0.0,0.0,0.0,0.0,0.0,0.0,0.0
22,0.0,0.0,0.0,0.0,0.0,0.0,0.0,0.0,0.0,0.0,0.0,0.0,0.0,0.0,0.0,0.0,0.0,0.0,0.0,0.0,0.0
23,0.0,0.0,0.0,0.0,0.0,0.0,0.0,0.0,0.0,0.0,0.0,0.0,0.0,0.0,0.0,0.0,0.0,0.0,0.0,0.0,0.0
24,0.0,0.0,0.0,0.0,0.0,0.0,0.0,0.0,0.0,0.0,0.0,0.0,0.0,0.0,0.0,0.0,0.0,0.0,0.0,0.0,0.0
25,0.0,0.0,0.0,0.0,0.0,0.0,0.0,0.0,0.0,0.0,0.0,0.0,0.0,0.0,0.0,0.0,0.0,0.0,0.0,0.0,0.0
26,0.0,0.0,0.0,0.0,0.0,0.0,0.0,0.0,0.0,0.0,0.0,0.0,0.0,0.0,0.0,0.0,0.0,0.0,0.0,0.0,0.0
27,4e-06,1.9595917942265424e-05,0.0,0.0,0.0,0.0,0.0001,0.004,0.01959591794226543,0.0,0.0,0.0,0.0,0.1,0.0,0.0,0.0,0.0,0.0,0.0,0.0
28,0.0010760000000000004,9.0686272390037e-05,0.001,0.001,0.001,0.0011,0.0013,1.072,0.08726969691708575,1.0,1.0,1.0,1.1,1.3,4e-06,1.9595917942265424e-05,0.0,0.0,0.0,0.0,0.0001
29,0.010939999999999998,0.00037841775856848996,0.01,0.0107,0.011,0.0112,0.0115,10.924,0.3765952734700744,10.0,10.7,11.0,11.2,11.5,1.6e-05,3.6660605559646716e-05,0.0,0.0,0.0,0.0,0.0001
30,0.06942,0.0013853519408439153,0.0667,0.0687,0.0693,0.0704,0.0723,66.68,1.5112908389850046,63.2,65.6,66.4,67.9,69.2,0.0027428400000000003,0.0007556068120391715,0.001301,0.002202,0.0026030000000000003,0.003203,0.0045049999999999995
31,0.4430999999999999,0.01591311408870056,0.4105,0.4351,0.4415,0.4543,0.4751,99.77600000000002,0.15564061166675094,99.4,99.7,99.8,99.9,100.0,0.34366772000000007,0.015911587846648114,0.311411,0.335836,0.341942,0.35485500000000003,0.375776
32,4.5407280000000005,0.16846280899949398,4.1959,4.4304,4.5369,4.6571,4.8991,99.944,0.07525955088890718,99.8,99.9,100.0,100.0,100.0,4.4452292,0.16860152798334896,4.1002,4.334835,4.441441,4.561762,4.803904
33,36.267896,1.0400130881791827,34.0684,35.4552,36.3396,36.8411,38.458,99.944,0.07525955088890718,99.8,99.9,100.0,100.0,100.0,36.20415612,1.0410219544561128,34.002603,35.390691,36.275876000000004,36.777878,38.396396
34,97.09355199999999,0.28997945736896574,96.4117,96.8596,97.1226,97.2973,97.6345,99.944,0.07525955088890718,99.8,99.9,100.0,100.0,100.0,97.09069872000002,0.2902352628405488,96.40830799999999,96.856657,97.11972,97.294595,97.632132
35,99.95326000000001,0.0017127755252813951,99.9493,99.9521,99.9534,99.9545,99.9564,99.944,0.07525955088890718,99.8,99.9,100.0,100.0,100.0,99.95326932000003,0.0017369654393807688,99.949249,99.952152,99.953353,99.954555,99.95655699999999
36,99.95483200000002,0.0016081591961002032,99.9517,99.9538,99.9545,99.9561,99.9576,99.944,0.07525955088890718,99.8,99.9,100.0,100.0,100.0,99.95484292,0.0016343661748809027,99.951652,99.953754,99.954555,99.956056,99.95755799999999
37,99.95483200000002,0.0016081591961002032,99.9517,99.9538,99.9545,99.9561,99.9576,99.944,0.07525955088890718,99.8,99.9,100.0,100.0,100.0,99.95484292,0.0016343661748809027,99.951652,99.953754,99.954555,99.956056,99.95755799999999
38,99.95483200000002,0.0016081591961002032,99.9517,99.9538,99.9545,99.9561,99.9576,99.944,0.07525955088890718,99.8,99.9,100.0,100.0,100.0,99.95484292,0.0016343661748809027,99.951652,99.953754,99.954555,99.956056,99.95755799999999
39,99.95483200000002,0.0016081591961002032,99.9517,99.9538,99.9545,99.9561,99.9576,99.944,0.07525955088890718,99.8,99.9,100.0,100.0,100.0,99.95484292,0.0016343661748809027,99.951652,99.953754,99.954555,99.956056,99.95755799999999
40,99.95483200000002,0.0016081591961002032,99.9517,99.9538,99.9545,99.9561,99.9576,99.944,0.07525955088890718,99.8,99.9,100.0,100.0,100.0,99.95484292,0.0016343661748809027,99.951652,99.953754,99.954555,99.956056,99.95755799999999
41,99.95483200000002,0.0016081591961002032,99.9517,99.9538,99.9545,99.9561,99.9576,99.944,0.07525955088890718,99.8,99.9,100.0,100.0,100.0,99.95484292,0.0016343661748809027,99.951652,99.953754,99.954555,99.956056,99.95755799999999
42,99.95483200000002,0.0016081591961002032,99.9517,99.9538,99.9545,99.9561,99.9576,99.944,0.07525955088890718,99.8,99.9,100.0,100.0,100.0,99.95484292,0.0016343661748809027,99.951652,99.953754,99.954555,99.956056,99.95755799999999
43,99.95483200000002,0.0016081591961002032,99.9517,99.9538,99.9545,99.9561,99.9576,99.944,0.07525955088890718,99.8,99.9,100.0,100.0,100.0,99.95484292,0.0016343661748809027,99.951652,99.953754,99.954555,99.956056,99.95755799999999
44,99.95483200000002,0.0016081591961002032,99.9517,99.9538,99.9545,99.9561,99.9576,99.944,0.07525955088890718,99.8,99.9,100.0,100.0,100.0,99.95484292,0.0016343661748809027,99.951652,99.953754,99.954555,99.956056,99.95755799999999
45,99.95483200000002,0.0016081591961002032,99.9517,99.9538,99.9545,99.9561,99.9576,99.944,0.07525955088890718,99.8,99.9,100.0,100.0,100.0,99.95484292,0.0016343661748809027,99.951652,99.953754,99.954555,99.956056,99.95755799999999
46,99.95483200000002,0.0016081591961002032,99.9517,99.9538,99.9545,99.9561,99.9576,99.944,0.07525955088890718,99.8,99.9,100.0,100.0,100.0,99.95484292,0.0016343661748809027,99.951652,99.953754,99.954555,99.956056,99.95755799999999
47,99.95483200000002,0.0016081591961002032,99.9517,99.9538,99.9545,99.9561,99.9576,99.944,0.07525955088890718,99.8,99.9,100.0,100.0,100.0,99.95484292,0.0016343661748809027,99.951652,99.953754,99.954555,99.956056,99.95755799999999
48,99.95483200000002,0.0016081591961002032,99.9517,99.9538,99.9545,99.9561,99.9576,99.944,0.07525955088890718,99.8,99.9,100.0,100.0,100.0,99.95484292,0.0016343661748809027,99.951652,99.953754,99.954555,99.956056,99.95755799999999
