gossips,p2p mean,p2p std,p2p min,p2p q1,p2p q2,p2p q3,p2p max,p2s mean,p2s std,p2s min,p2s q1,p2s q2,p2s q3,p2s max,s2s mean,s2s std,s2s min,s2s q1,s2s q2,s2s q3,s2s max
1,49.29999999999999,1.1339459128782705,47.4,48.5,49.3,49.9,51.5,57.84800000000001,0.8794505860668547,55.9,57.3,57.5,58.2,59.5,52.24762367999999,0.32314328358868094,51.494294000000004,52.133133,52.246646999999996,52.42922900000001,52.802703
2,22.296,1.2126005112979295,20.1,21.5,22.2,23.2,25.0,20.62,1.162612001773019,17.6,20.0,20.4,21.3,22.7,21.762983039999998,0.646214817097513,20.494995,21.278779,21.758157999999998,22.224124,23.040541
3,2.0800000000000005,0.45643546458763845,1.4,1.7,1.9,2.3,3.1,0.28400000000000003,0.15726834816113933,0.1,0.2,0.3,0.4,0.7,1.37332128,0.07649453608238953,1.27037,1.315616,1.356657,1.444144,1.522923
4,0.11666666666666665,0.04082482904638631,0.1,0.1,0.1,0.1,0.2,,,,,,,,0.026466520000000004,0.0036241980850941348,0.02002,0.024124,0.025925999999999998,0.029229,0.033132999999999996
5,,,,,,,,,,,,,,,0.00019999999999999996,9.428090415820633e-05,0.0001,0.0001,0.0002,0.0003,0.0004
6,,,,,,,,,,,,,,,,,,,,,
