gossips,p2p mean,p2p std,p2p min,p2p q1,p2p q2,p2p q3,p2p max,p2s mean,p2s std,p2s min,p2s q1,p2s q2,p2s q3,p2s max,s2s mean,s2s std,s2s min,s2s q1,s2s q2,s2s q3,s2s max
1,49.359040000000014,0.16210220027295527,49.009,49.224,49.391,49.504,49.613,12.242319999999998,0.18752193649455182,11.806,12.127,12.252,12.384,12.61,0.021822240000000003,0.0027267902877436932,0.017222,0.019888999999999997,0.021889,0.023556,0.029
2,22.015559999999997,0.14040360869056515,21.778,21.906,21.992,22.112,22.342,,,,,,,,,,,,,,
3,1.9958800000000003,0.0405065015357617,1.92,1.971,2.005,2.024,2.074,,,,,,,,,,,,,,
4,0.02068000000000001,0.005850356114517018,0.012,0.016,0.021,0.024,0.032,,,,,,,,,,,,,,
5,0.001,0.0,0.001,0.001,0.001,0.001,0.001,,,,,,,,,,,,,,
