gossips,p2p mean,p2p std,p2p min,p2p q1,p2p q2,p2p q3,p2p max,p2s mean,p2s std,p2s min,p2s q1,p2s q2,p2s q3,p2s max,s2s mean,s2s std,s2s min,s2s q1,s2s q2,s2s q3,s2s max
1,49.227479999999986,0.1819322492944382,48.796,49.123,49.22,49.326,49.62,58.40392,0.2745326210125117,58.023,58.155,58.367,58.525,58.965,55.837955519999994,0.32179819971594953,55.483778,55.591,55.75666700000001,55.835443999999995,56.488778
2,22.28372,0.1613762477359459,22.038,22.167,22.257,22.369,22.627,20.2952,0.13904855267135996,20.074,20.204,20.29,20.369,20.562,21.414728959999998,0.17980824229728776,21.131,21.348778,21.382,21.461555999999998,21.882667
3,2.02328,0.043121456376147636,1.939,1.991,2.023,2.054,2.103,0.32583999999999996,0.016473918780909418,0.28,0.316,0.327,0.337,0.355,0.44619996,0.018179708657548203,0.407,0.43533299999999997,0.453,0.458,0.47811099999999995
4,0.02104000000000001,0.0037246923810340814,0.015,0.018,0.021,0.023,0.031,0.0017058823529411769,0.0006859943405700353,0.001,0.001,0.002,0.002,0.003,0.0021689200000000013,0.000481266810961792,0.001333,0.001889,0.002111,0.0025559999999999997,0.003222
5,,,,,,,,,,,,,,,0.00011100000000000001,,0.00011100000000000001,0.00011100000000000001,0.00011100000000000001,0.00011100000000000001,0.00011100000000000001
