gossips,p2p mean,p2p std,p2p min,p2p q1,p2p q2,p2p q3,p2p max,p2s mean,p2s std,p2s min,p2s q1,p2s q2,p2s q3,p2s max,s2s mean,s2s std,s2s min,s2s q1,s2s q2,s2s q3,s2s max
1,53.437200000000004,0.5237168446148489,52.49,52.99,53.42,53.82,54.42,0.07640000000000002,0.02430363484474425,0.04,0.06,0.08,0.09,0.13,0.000101,0.0,0.000101,0.000101,0.000101,0.000101,0.000101
2,5.7863999999999995,0.14430523206037954,5.47,5.68,5.8,5.88,6.06,,,,,,,,,,,,,,
3,0.06640000000000003,0.023072349974229616,0.03,0.05,0.06,0.08,0.13,,,,,,,,,,,,,,
4,0.01,,0.01,0.01,0.01,0.01,0.01,,,,,,,,,,,,,,
5,,,,,,,,,,,,,,,,,,,,,
