,mean,std,min,05th,25th,50th,75th,95th,max
Uniform,,,,,,,,,
P,4.235811273537205,0.6647635039375813,1.0,3.0,4.0,4.0,5.0,5.0,7.0
S,6.634066841761234,0.594906424087504,3.0,6.0,6.0,7.0,7.0,7.0,10.0
P+S,6.610084494352362,0.6416652239531276,1.0,6.0,6.0,7.0,7.0,7.0,10.0
