gossips,p2p mean,p2p std,p2p min,p2p q1,p2p q2,p2p q3,p2p max,p2s mean,p2s std,p2s min,p2s q1,p2s q2,p2s q3,p2s max,s2s mean,s2s std,s2s min,s2s q1,s2s q2,s2s q3,s2s max
1,49.135600000000004,0.3830587422315271,48.48,48.9,49.07,49.26,50.2,55.3144,0.5912069575594213,54.0,55.09,55.33,55.42,56.48,48.01791100000001,0.05946779075544427,47.90303,47.964545,48.020909,48.053535,48.136162
2,22.2008,0.3761085836120553,21.55,21.82,22.23,22.45,22.89,18.934,0.5245871392501601,18.13,18.61,18.94,19.25,20.07,23.621866640000004,0.24899079316561099,22.850908999999998,23.518182,23.638182,23.792626000000002,24.098283
3,2.0496000000000003,0.12785017272834115,1.83,1.95,2.05,2.11,2.33,0.030454545454545453,0.01812056782650528,0.01,0.0125,0.03,0.04750000000000001,0.06,1.5632404800000002,0.03316523560663086,1.471818,1.545556,1.565152,1.577879,1.621919
4,0.022000000000000006,0.009999999999999998,0.01,0.01,0.02,0.03,0.04,,,,,,,,0.008824359999999998,0.0009891126865361028,0.006667,0.008182,0.008889,0.009293000000000001,0.010909
5,,,,,,,,,,,,,,,,,,,,,
