gossips,p2p mean,p2p std,p2p min,p2p q1,p2p q2,p2p q3,p2p max,p2s mean,p2s std,p2s min,p2s q1,p2s q2,p2s q3,p2s max,s2s mean,s2s std,s2s min,s2s q1,s2s q2,s2s q3,s2s max
1,49.456,1.362314207516018,47.0,48.1,49.4,50.5,52.3,78.376,1.800296271913784,74.3,77.4,78.6,79.3,81.9,50.14388388,0.2701686876257941,49.605405,49.983984,50.124124,50.291892,50.770671
2,21.828000000000003,1.1241737706718948,19.8,21.2,21.8,22.6,23.9,10.232,1.1400730970717041,7.6,9.5,10.1,11.2,12.2,22.054310279999996,0.525830613033206,21.184283999999998,21.607508,22.115816,22.442442,22.89009
3,2.084,0.4579665198825493,1.2,1.8,2.2,2.4,2.7,0.21052631578947367,0.09941348467724345,0.1,0.1,0.2,0.3,0.4,2.0732893200000007,0.08824789868920388,1.837838,2.0402400000000003,2.076076,2.123524,2.25005
4,0.09999999999999999,0.0,0.1,0.1,0.1,0.1,0.1,,,,,,,,0.01900704,0.002037432278629158,0.014113999999999998,0.018118000000000002,0.019019,0.020419999999999997,0.023223
5,,,,,,,,,,,,,,,0.00011428571428571431,3.779644730092272e-05,0.0001,0.0001,0.0001,0.0001,0.0002
