gossips,p2p mean,p2p std,p2p min,p2p q1,p2p q2,p2p q3,p2p max,p2s mean,p2s std,p2s min,p2s q1,p2s q2,p2s q3,p2s max,s2s mean,s2s std,s2s min,s2s q1,s2s q2,s2s q3,s2s max
1,49.46799999999999,1.2068277977132178,46.8,48.6,49.6,50.3,52.1,68.03600000000002,1.9159157949485468,63.1,67.0,68.6,69.7,70.6,48.092476479999995,0.12684511658453188,47.78989,48.02983,48.065765999999996,48.167466999999995,48.306807
2,21.888,0.7546080660404663,20.5,21.3,21.7,22.6,23.4,14.299999999999997,1.7284386017443605,11.4,13.0,14.1,15.9,18.3,22.944468559999997,0.470065342676161,22.033634,22.632032000000002,22.955054999999998,23.212713,23.844645
3,1.8079999999999998,0.3200520790954705,1.2,1.6,1.7,2.1,2.4,0.14,0.0699205898780101,0.1,0.1,0.1,0.17500000000000002,0.3,1.9165125199999997,0.07706702610180738,1.753554,1.868769,1.904505,1.966967,2.062062
4,0.1,,0.1,0.1,0.1,0.1,0.1,,,,,,,,0.02232236,0.0016363050062055472,0.01952,0.021421,0.022222,0.023323,0.026425999999999998
5,,,,,,,,,,,,,,,0.00014000000000000001,5.163977794943222e-05,0.0001,0.0001,0.0001,0.0002,0.0002
