round,nodes,nodesP,nodesS,nodesSent,nodesSentP,nodesSentS,nodesRecv,nodesRecvP,nodesRecvS,msgSent,msgSentP,msgSentS,msgRecv,msgRecvP,msgRecvS,msgInfect,msgInfectP,msgInfectS
00,100000.000000,50000.000000,50000.000000,0.000000,0.000000,0.000000,0.000000,0.000000,0.000000,0.000000,0.000000,0.000000,0.000000,0.000000,0.000000,0.000000,0.000000,0.000000
01,100000.000000,50000.000000,50000.000000,0.001100,0.002200,0.000000,0.001100,0.002200,0.000000,18.700000,18.700000,0.000000,1.100000,1.100000,0.000000,0.500000,1.000000,0.000000
02,100000.000000,50000.000000,50000.000000,0.019600,0.039200,0.000000,0.019600,0.039200,0.000000,333.200000,333.200000,0.000000,19.600000,19.600000,0.000000,0.500000,1.000000,0.000000
03,100000.000000,50000.000000,50000.000000,0.335600,0.671200,0.000000,0.335600,0.671200,0.000000,5705.200000,5705.200000,0.000000,336.400000,336.400000,0.000000,0.500000,1.000000,0.000000
04,100000.000000,50000.000000,50000.000000,5.348100,10.696200,0.000000,5.348100,10.696200,0.000000,90917.700000,90917.700000,0.000000,5665.200000,5665.200000,0.000000,0.500000,1.000000,0.000000
05,100000.000000,50000.000000,50000.000000,41.354000,82.708000,0.000000,41.354000,82.708000,0.000000,703018.000000,703018.000000,0.000000,87691.600000,87691.600000,0.000000,1.000000,2.000000,0.000000
06,100000.000000,50000.000000,50000.000000,50.496000,99.999800,0.992200,50.496000,99.999800,0.992200,858432.000000,849998.300000,8433.700000,692783.600000,692285.700000,497.900000,7.000000,13.000000,1.000000
07,100000.000000,50000.000000,50000.000000,89.773000,100.000000,79.546000,89.773000,100.000000,79.546000,1526141.000000,850000.000000,676141.000000,854655.700000,775518.500000,79137.200000,8.150000,15.000000,1.300000
08,100000.000000,50000.000000,50000.000000,100.000000,100.000000,100.000000,100.000000,100.000000,100.000000,1700000.000000,850000.000000,850000.000000,1510000.000000,775518.500000,734481.500000,14.500000,15.000000,14.000000
09,100000.000000,50000.000000,50000.000000,100.000000,100.000000,100.000000,100.000000,100.000000,100.000000,1700000.000000,850000.000000,850000.000000,1700001.000000,775518.500000,924482.500000,16.500000,15.000000,18.000000
10,100000.000000,50000.000000,50000.000000,100.000000,100.000000,100.000000,100.000000,100.000000,100.000000,1700000.000000,850000.000000,850000.000000,1700001.000000,775518.500000,924482.500000,16.500000,15.000000,18.000000
11,100000.000000,50000.000000,50000.000000,100.000000,100.000000,100.000000,100.000000,100.000000,100.000000,1700000.000000,850000.000000,850000.000000,1700001.000000,775518.500000,924482.500000,16.500000,15.000000,18.000000
12,100000.000000,50000.000000,50000.000000,100.000000,100.000000,100.000000,100.000000,100.000000,100.000000,1700000.000000,850000.000000,850000.000000,1700001.000000,775518.500000,924482.500000,16.500000,15.000000,18.000000
13,100000.000000,50000.000000,50000.000000,100.000000,100.000000,100.000000,100.000000,100.000000,100.000000,1700000.000000,850000.000000,850000.000000,1700001.000000,775518.500000,924482.500000,16.500000,15.000000,18.000000
14,100000.000000,50000.000000,50000.000000,100.000000,100.000000,100.000000,100.000000,100.000000,100.000000,1700000.000000,850000.000000,850000.000000,1700001.000000,775518.500000,924482.500000,16.500000,15.000000,18.000000
15,100000.000000,50000.000000,50000.000000,100.000000,100.000000,100.000000,100.000000,100.000000,100.000000,1700000.000000,850000.000000,850000.000000,1700001.000000,775518.500000,924482.500000,16.500000,15.000000,18.000000
16,100000.000000,50000.000000,50000.000000,100.000000,100.000000,100.000000,100.000000,100.000000,100.000000,1700000.000000,850000.000000,850000.000000,1700001.000000,775518.500000,924482.500000,16.500000,15.000000,18.000000
17,100000.000000,50000.000000,50000.000000,100.000000,100.000000,100.000000,100.000000,100.000000,100.000000,1700000.000000,850000.000000,850000.000000,1700001.000000,775518.500000,924482.500000,16.500000,15.000000,18.000000
18,100000.000000,50000.000000,50000.000000,100.000000,100.000000,100.000000,100.000000,100.000000,100.000000,1700000.000000,850000.000000,850000.000000,1700001.000000,775518.500000,924482.500000,16.500000,15.000000,18.000000
19,100000.000000,50000.000000,50000.000000,100.000000,100.000000,100.000000,100.000000,100.000000,100.000000,1700000.000000,850000.000000,850000.000000,1700001.000000,775518.500000,924482.500000,16.500000,15.000000,18.000000
