"Date(UTC)","UnixTimeStamp","Value"
"7/30/2015","1438214400","644"
"7/31/2015","1438300800","582"
"8/1/2015","1438387200","575"
"8/2/2015","1438473600","581"
"8/3/2015","1438560000","587"
"8/4/2015","1438646400","587"
"8/5/2015","1438732800","579"
"8/6/2015","1438819200","584"
"8/7/2015","1438905600","633"
"8/8/2015","1438992000","668"
"8/9/2015","1439078400","618"
"8/10/2015","1439164800","631"
"8/11/2015","1439251200","692"
"8/12/2015","1439337600","653"
"8/13/2015","1439424000","666"
"8/14/2015","1439510400","660"
"8/15/2015","1439596800","638"
"8/16/2015","1439683200","641"
"8/17/2015","1439769600","635"
"8/18/2015","1439856000","648"
"8/19/2015","1439942400","653"
"8/20/2015","1440028800","650"
"8/21/2015","1440115200","668"
"8/22/2015","1440201600","648"
"8/23/2015","1440288000","681"
"8/24/2015","1440374400","673"
"8/25/2015","1440460800","680"
"8/26/2015","1440547200","669"
"8/27/2015","1440633600","708"
"8/28/2015","1440720000","691"
"8/29/2015","1440806400","682"
"8/30/2015","1440892800","689"
"8/31/2015","1440979200","731"
"9/1/2015","1441065600","741"
"9/2/2015","1441152000","766"
"9/3/2015","1441238400","755"
"9/4/2015","1441324800","762"
"9/5/2015","1441411200","753"
"9/6/2015","1441497600","733"
"9/7/2015","1441584000","753"
"9/8/2015","1441670400","759"
"9/9/2015","1441756800","765"
"9/10/2015","1441843200","730"
"9/11/2015","1441929600","736"
"9/12/2015","1442016000","761"
"9/13/2015","1442102400","764"
"9/14/2015","1442188800","771"
"9/15/2015","1442275200","755"
"9/16/2015","1442361600","739"
"9/17/2015","1442448000","753"
"9/18/2015","1442534400","785"
"9/19/2015","1442620800","735"
"9/20/2015","1442707200","766"
"9/21/2015","1442793600","779"
"9/22/2015","1442880000","807"
"9/23/2015","1442966400","784"
"9/24/2015","1443052800","782"
"9/25/2015","1443139200","767"
"9/26/2015","1443225600","765"
"9/27/2015","1443312000","725"
"9/28/2015","1443398400","755"
"9/29/2015","1443484800","762"
"9/30/2015","1443571200","742"
"10/1/2015","1443657600","741"
"10/2/2015","1443744000","773"
"10/3/2015","1443830400","769"
"10/4/2015","1443916800","776"
"10/5/2015","1444003200","771"
"10/6/2015","1444089600","781"
"10/7/2015","1444176000","808"
"10/8/2015","1444262400","789"
"10/9/2015","1444348800","779"
"10/10/2015","1444435200","778"
"10/11/2015","1444521600","748"
"10/12/2015","1444608000","787"
"10/13/2015","1444694400","818"
"10/14/2015","1444780800","791"
"10/15/2015","1444867200","824"
"10/16/2015","1444953600","827"
"10/17/2015","1445040000","788"
"10/18/2015","1445126400","812"
"10/19/2015","1445212800","802"
"10/20/2015","1445299200","770"
"10/21/2015","1445385600","774"
"10/22/2015","1445472000","782"
"10/23/2015","1445558400","818"
"10/24/2015","1445644800","771"
"10/25/2015","1445731200","751"
"10/26/2015","1445817600","765"
"10/27/2015","1445904000","815"
"10/28/2015","1445990400","808"
"10/29/2015","1446076800","814"
"10/30/2015","1446163200","781"
"10/31/2015","1446249600","812"
"11/1/2015","1446336000","783"
"11/2/2015","1446422400","779"
"11/3/2015","1446508800","844"
"11/4/2015","1446595200","762"
"11/5/2015","1446681600","813"
"11/6/2015","1446768000","812"
"11/7/2015","1446854400","1005"
"11/8/2015","1446940800","1015"
"11/9/2015","1447027200","786"
"11/10/2015","1447113600","834"
"11/11/2015","1447200000","1044"
"11/12/2015","1447286400","874"
"11/13/2015","1447372800","808"
"11/14/2015","1447459200","938"
"11/15/2015","1447545600","797"
"11/16/2015","1447632000","782"
"11/17/2015","1447718400","762"
"11/18/2015","1447804800","774"
"11/19/2015","1447891200","882"
"11/20/2015","1447977600","814"
"11/21/2015","1448064000","832"
"11/22/2015","1448150400","816"
"11/23/2015","1448236800","863"
"11/24/2015","1448323200","828"
"11/25/2015","1448409600","807"
"11/26/2015","1448496000","784"
"11/27/2015","1448582400","790"
"11/28/2015","1448668800","774"
"11/29/2015","1448755200","776"
"11/30/2015","1448841600","864"
"12/1/2015","1448928000","847"
"12/2/2015","1449014400","819"
"12/3/2015","1449100800","778"
"12/4/2015","1449187200","804"
"12/5/2015","1449273600","835"
"12/6/2015","1449360000","877"
"12/7/2015","1449446400","775"
"12/8/2015","1449532800","771"
"12/9/2015","1449619200","779"
"12/10/2015","1449705600","820"
"12/11/2015","1449792000","884"
"12/12/2015","1449878400","916"
"12/13/2015","1449964800","845"
"12/14/2015","1450051200","1752"
"12/15/2015","1450137600","1834"
"12/16/2015","1450224000","1216"
"12/17/2015","1450310400","1053"
"12/18/2015","1450396800","1057"
"12/19/2015","1450483200","1009"
"12/20/2015","1450569600","1103"
"12/21/2015","1450656000","1172"
"12/22/2015","1450742400","2045"
"12/23/2015","1450828800","1544"
"12/24/2015","1450915200","1292"
"12/25/2015","1451001600","1042"
"12/26/2015","1451088000","1074"
"12/27/2015","1451174400","1575"
"12/28/2015","1451260800","1239"
"12/29/2015","1451347200","1200"
"12/30/2015","1451433600","1564"
"12/31/2015","1451520000","1057"
"1/1/2016","1451606400","885"
"1/2/2016","1451692800","954"
"1/3/2016","1451779200","955"
"1/4/2016","1451865600","981"
"1/5/2016","1451952000","1396"
"1/6/2016","1452038400","1553"
"1/7/2016","1452124800","1550"
"1/8/2016","1452211200","1080"
"1/9/2016","1452297600","1209"
"1/10/2016","1452384000","1044"
"1/11/2016","1452470400","1058"
"1/12/2016","1452556800","1094"
"1/13/2016","1452643200","1423"
"1/14/2016","1452729600","1062"
"1/15/2016","1452816000","1006"
"1/16/2016","1452902400","967"
"1/17/2016","1452988800","887"
"1/18/2016","1453075200","1057"
"1/19/2016","1453161600","1107"
"1/20/2016","1453248000","959"
"1/21/2016","1453334400","944"
"1/22/2016","1453420800","1027"
"1/23/2016","1453507200","906"
"1/24/2016","1453593600","993"
"1/25/2016","1453680000","1335"
"1/26/2016","1453766400","1228"
"1/27/2016","1453852800","1566"
"1/28/2016","1453939200","1424"
"1/29/2016","1454025600","1308"
"1/30/2016","1454112000","1179"
"1/31/2016","1454198400","1135"
"2/1/2016","1454284800","1081"
"2/2/2016","1454371200","1077"
"2/3/2016","1454457600","1060"
"2/4/2016","1454544000","1087"
"2/5/2016","1454630400","1117"
"2/6/2016","1454716800","1678"
"2/7/2016","1454803200","1026"
"2/8/2016","1454889600","1034"
"2/9/2016","1454976000","1032"
"2/10/2016","1455062400","1106"
"2/11/2016","1455148800","1280"
"2/12/2016","1455235200","1171"
"2/13/2016","1455321600","1222"
"2/14/2016","1455408000","1140"
"2/15/2016","1455494400","1127"
"2/16/2016","1455580800","1128"
"2/17/2016","1455667200","1265"
"2/18/2016","1455753600","1109"
"2/19/2016","1455840000","1157"
"2/20/2016","1455926400","1046"
"2/21/2016","1456012800","1051"
"2/22/2016","1456099200","1090"
"2/23/2016","1456185600","1117"
"2/24/2016","1456272000","1109"
"2/25/2016","1456358400","1114"
"2/26/2016","1456444800","1289"
"2/27/2016","1456531200","1102"
"2/28/2016","1456617600","1091"
"2/29/2016","1456704000","1175"
"3/1/2016","1456790400","1157"
"3/2/2016","1456876800","1199"
"3/3/2016","1456963200","1248"
"3/4/2016","1457049600","1249"
"3/5/2016","1457136000","1314"
"3/6/2016","1457222400","1366"
"3/7/2016","1457308800","1218"
"3/8/2016","1457395200","1242"
"3/9/2016","1457481600","1279"
"3/10/2016","1457568000","1222"
"3/11/2016","1457654400","1211"
"3/12/2016","1457740800","1385"
"3/13/2016","1457827200","1392"
"3/14/2016","1457913600","1501"
"3/15/2016","1458000000","1318"
"3/16/2016","1458086400","1316"
"3/17/2016","1458172800","1421"
"3/18/2016","1458259200","1403"
"3/19/2016","1458345600","1494"
"3/20/2016","1458432000","1446"
"3/21/2016","1458518400","1498"
"3/22/2016","1458604800","1514"
"3/23/2016","1458691200","1529"
"3/24/2016","1458777600","1862"
"3/25/2016","1458864000","1621"
"3/26/2016","1458950400","1538"
"3/27/2016","1459036800","1261"
"3/28/2016","1459123200","1568"
"3/29/2016","1459209600","1389"
"3/30/2016","1459296000","1572"
"3/31/2016","1459382400","1405"
"4/1/2016","1459468800","1493"
"4/2/2016","1459555200","1235"
"4/3/2016","1459641600","1245"
"4/4/2016","1459728000","1502"
"4/5/2016","1459814400","1528"
"4/6/2016","1459900800","1337"
"4/7/2016","1459987200","1404"
"4/8/2016","1460073600","1541"
"4/9/2016","1460160000","1318"
"4/10/2016","1460246400","1281"
"4/11/2016","1460332800","1262"
"4/12/2016","1460419200","1451"
"4/13/2016","1460505600","1477"
"4/14/2016","1460592000","1406"
"4/15/2016","1460678400","1412"
"4/16/2016","1460764800","1215"
"4/17/2016","1460851200","1917"
"4/18/2016","1460937600","1351"
"4/19/2016","1461024000","1317"
"4/20/2016","1461110400","1359"
"4/21/2016","1461196800","1504"
"4/22/2016","1461283200","1291"
"4/23/2016","1461369600","1270"
"4/24/2016","1461456000","1433"
"4/25/2016","1461542400","1399"
"4/26/2016","1461628800","1344"
"4/27/2016","1461715200","1314"
"4/28/2016","1461801600","1408"
"4/29/2016","1461888000","1423"
"4/30/2016","1461974400","1588"
"5/1/2016","1462060800","1681"
"5/2/2016","1462147200","1480"
"5/3/2016","1462233600","1446"
"5/4/2016","1462320000","1498"
"5/5/2016","1462406400","1486"
"5/6/2016","1462492800","1625"
"5/7/2016","1462579200","1375"
"5/8/2016","1462665600","1530"
"5/9/2016","1462752000","1460"
"5/10/2016","1462838400","1481"
"5/11/2016","1462924800","1559"
"5/12/2016","1463011200","1679"
"5/13/2016","1463097600","1674"
"5/14/2016","1463184000","1683"
"5/15/2016","1463270400","1540"
"5/16/2016","1463356800","1491"
"5/17/2016","1463443200","1515"
"5/18/2016","1463529600","1689"
"5/19/2016","1463616000","1576"
"5/20/2016","1463702400","1677"
"5/21/2016","1463788800","1673"
"5/22/2016","1463875200","1494"
"5/23/2016","1463961600","1568"
"5/24/2016","1464048000","1528"
"5/25/2016","1464134400","1670"
"5/26/2016","1464220800","1733"
"5/27/2016","1464307200","1727"
"5/28/2016","1464393600","2436"
"5/29/2016","1464480000","1675"
"5/30/2016","1464566400","1543"
"5/31/2016","1464652800","1594"
"6/1/2016","1464739200","1562"
"6/2/2016","1464825600","1453"
"6/3/2016","1464912000","1429"
"6/4/2016","1464998400","1409"
"6/5/2016","1465084800","1396"
"6/6/2016","1465171200","1426"
"6/7/2016","1465257600","1693"
"6/8/2016","1465344000","1437"
"6/9/2016","1465430400","1477"
"6/10/2016","1465516800","1437"
"6/11/2016","1465603200","1382"
"6/12/2016","1465689600","1463"
"6/13/2016","1465776000","1599"
"6/14/2016","1465862400","1713"
"6/15/2016","1465948800","1523"
"6/16/2016","1466035200","1604"
"6/17/2016","1466121600","2138"
"6/18/2016","1466208000","2044"
"6/19/2016","1466294400","1624"
"6/20/2016","1466380800","1709"
"6/21/2016","1466467200","1629"
"6/22/2016","1466553600","1614"
"6/23/2016","1466640000","1513"
"6/24/2016","1466726400","1638"
"6/25/2016","1466812800","1415"
"6/26/2016","1466899200","1453"
"6/27/2016","1466985600","1410"
"6/28/2016","1467072000","1482"
"6/29/2016","1467158400","1792"
"6/30/2016","1467244800","2367"
"7/1/2016","1467331200","1380"
"7/2/2016","1467417600","1382"
"7/3/2016","1467504000","1404"
"7/4/2016","1467590400","1415"
"7/5/2016","1467676800","1470"
"7/6/2016","1467763200","1409"
"7/7/2016","1467849600","1414"
"7/8/2016","1467936000","1581"
"7/9/2016","1468022400","1417"
"7/10/2016","1468108800","1407"
"7/11/2016","1468195200","1421"
"7/12/2016","1468281600","1567"
"7/13/2016","1468368000","1357"
"7/14/2016","1468454400","1536"
"7/15/2016","1468540800","1457"
"7/16/2016","1468627200","1349"
"7/17/2016","1468713600","1264"
"7/18/2016","1468800000","1397"
"7/19/2016","1468886400","1502"
"7/20/2016","1468972800","1718"
"7/21/2016","1469059200","1522"
"7/22/2016","1469145600","1641"
"7/23/2016","1469232000","1496"
"7/24/2016","1469318400","1797"
"7/25/2016","1469404800","1737"
"7/26/2016","1469491200","1946"
"7/27/2016","1469577600","1706"
"7/28/2016","1469664000","1610"
"7/29/2016","1469750400","1598"
"7/30/2016","1469836800","1460"
"7/31/2016","1469923200","1585"
"8/1/2016","1470009600","1561"
"8/2/2016","1470096000","1687"
"8/3/2016","1470182400","1665"
"8/4/2016","1470268800","1617"
"8/5/2016","1470355200","1527"
"8/6/2016","1470441600","1465"
"8/7/2016","1470528000","1473"
"8/8/2016","1470614400","1504"
"8/9/2016","1470700800","1592"
"8/10/2016","1470787200","1607"
"8/11/2016","1470873600","1621"
"8/12/2016","1470960000","1559"
"8/13/2016","1471046400","1431"
"8/14/2016","1471132800","1406"
"8/15/2016","1471219200","1467"
"8/16/2016","1471305600","1621"
"8/17/2016","1471392000","1532"
"8/18/2016","1471478400","1663"
"8/19/2016","1471564800","1491"
"8/20/2016","1471651200","1453"
"8/21/2016","1471737600","1480"
"8/22/2016","1471824000","1526"
"8/23/2016","1471910400","2023"
"8/24/2016","1471996800","1590"
"8/25/2016","1472083200","1663"
"8/26/2016","1472169600","1610"
"8/27/2016","1472256000","1586"
"8/28/2016","1472342400","1451"
"8/29/2016","1472428800","1572"
"8/30/2016","1472515200","1616"
"8/31/2016","1472601600","1538"
"9/1/2016","1472688000","1583"
"9/2/2016","1472774400","1850"
"9/3/2016","1472860800","1513"
"9/4/2016","1472947200","1719"
"9/5/2016","1473033600","1512"
"9/6/2016","1473120000","1722"
"9/7/2016","1473206400","1692"
"9/8/2016","1473292800","1900"
"9/9/2016","1473379200","1853"
"9/10/2016","1473465600","1508"
"9/11/2016","1473552000","1460"
"9/12/2016","1473638400","1585"
"9/13/2016","1473724800","1497"
"9/14/2016","1473811200","1758"
"9/15/2016","1473897600","1743"
"9/16/2016","1473984000","2020"
"9/17/2016","1474070400","1588"
"9/18/2016","1474156800","1433"
"9/19/2016","1474243200","1341"
"9/20/2016","1474329600","1689"
"9/21/2016","1474416000","1598"
"9/22/2016","1474502400","1876"
"9/23/2016","1474588800","1280"
"9/24/2016","1474675200","1526"
"9/25/2016","1474761600","1387"
"9/26/2016","1474848000","1545"
"9/27/2016","1474934400","1661"
"9/28/2016","1475020800","1561"
"9/29/2016","1475107200","1442"
"9/30/2016","1475193600","1437"
"10/1/2016","1475280000","1810"
"10/2/2016","1475366400","1687"
"10/3/2016","1475452800","1719"
"10/4/2016","1475539200","2192"
"10/5/2016","1475625600","1802"
"10/6/2016","1475712000","1938"
"10/7/2016","1475798400","4119"
"10/8/2016","1475884800","5429"
"10/9/2016","1475971200","5683"
"10/10/2016","1476057600","12725"
"10/11/2016","1476144000","2762"
"10/12/2016","1476230400","1248"
"10/13/2016","1476316800","1306"
"10/14/2016","1476403200","1400"
"10/15/2016","1476489600","1236"
"10/16/2016","1476576000","1297"
"10/17/2016","1476662400","1377"
"10/18/2016","1476748800","1747"
"10/19/2016","1476835200","1638"
"10/20/2016","1476921600","1466"
"10/21/2016","1477008000","1724"
"10/22/2016","1477094400","1357"
"10/23/2016","1477180800","1292"
"10/24/2016","1477267200","1791"
"10/25/2016","1477353600","1675"
"10/26/2016","1477440000","1550"
"10/27/2016","1477526400","1518"
"10/28/2016","1477612800","1472"
"10/29/2016","1477699200","1461"
"10/30/2016","1477785600","1422"
"10/31/2016","1477872000","1536"
"11/1/2016","1477958400","1689"
"11/2/2016","1478044800","1497"
"11/3/2016","1478131200","1471"
"11/4/2016","1478217600","1262"
"11/5/2016","1478304000","1358"
"11/6/2016","1478390400","1289"
"11/7/2016","1478476800","1399"
"11/8/2016","1478563200","1476"
"11/9/2016","1478649600","1484"
"11/10/2016","1478736000","1492"
"11/11/2016","1478822400","1462"
"11/12/2016","1478908800","1426"
"11/13/2016","1478995200","1468"
"11/14/2016","1479081600","1576"
"11/15/2016","1479168000","1577"
"11/16/2016","1479254400","1481"
"11/17/2016","1479340800","1476"
"11/18/2016","1479427200","1514"
"11/19/2016","1479513600","1375"
"11/20/2016","1479600000","1473"
"11/21/2016","1479686400","1537"
"11/22/2016","1479772800","1708"
"11/23/2016","1479859200","1950"
"11/24/2016","1479945600","1424"
"11/25/2016","1480032000","1767"
"11/26/2016","1480118400","1501"
"11/27/2016","1480204800","1703"
"11/28/2016","1480291200","1731"
"11/29/2016","1480377600","1692"
"11/30/2016","1480464000","2209"
"12/1/2016","1480550400","1407"
"12/2/2016","1480636800","1462"
"12/3/2016","1480723200","1404"
"12/4/2016","1480809600","1403"
"12/5/2016","1480896000","1491"
"12/6/2016","1480982400","1615"
"12/7/2016","1481068800","1523"
"12/8/2016","1481155200","1416"
"12/9/2016","1481241600","1502"
"12/10/2016","1481328000","1428"
"12/11/2016","1481414400","1681"
"12/12/2016","1481500800","1477"
"12/13/2016","1481587200","1538"
"12/14/2016","1481673600","1835"
"12/15/2016","1481760000","1582"
"12/16/2016","1481846400","1506"
"12/17/2016","1481932800","1418"
"12/18/2016","1482019200","1345"
"12/19/2016","1482105600","1616"
"12/20/2016","1482192000","1536"
"12/21/2016","1482278400","1769"
"12/22/2016","1482364800","1762"
"12/23/2016","1482451200","1522"
"12/24/2016","1482537600","1361"
"12/25/2016","1482624000","1317"
"12/26/2016","1482710400","1294"
"12/27/2016","1482796800","1558"
"12/28/2016","1482883200","1531"
"12/29/2016","1482969600","1678"
"12/30/2016","1483056000","1623"
"12/31/2016","1483142400","1544"
"1/1/2017","1483228800","1390"
"1/2/2017","1483315200","1458"
"1/3/2017","1483401600","1627"
"1/4/2017","1483488000","1717"
"1/5/2017","1483574400","1676"
"1/6/2017","1483660800","1593"
"1/7/2017","1483747200","1570"
"1/8/2017","1483833600","1557"
"1/9/2017","1483920000","1595"
"1/10/2017","1484006400","1686"
"1/11/2017","1484092800","1591"
"1/12/2017","1484179200","1697"
"1/13/2017","1484265600","1729"
"1/14/2017","1484352000","1499"
"1/15/2017","1484438400","1498"
"1/16/2017","1484524800","1575"
"1/17/2017","1484611200","1642"
"1/18/2017","1484697600","1583"
"1/19/2017","1484784000","1552"
"1/20/2017","1484870400","1609"
"1/21/2017","1484956800","1504"
"1/22/2017","1485043200","1616"
"1/23/2017","1485129600","1612"
"1/24/2017","1485216000","1754"
"1/25/2017","1485302400","1644"
"1/26/2017","1485388800","1673"
"1/27/2017","1485475200","1658"
"1/28/2017","1485561600","1628"
"1/29/2017","1485648000","1523"
"1/30/2017","1485734400","1579"
"1/31/2017","1485820800","1539"
"2/1/2017","1485907200","1607"
"2/2/2017","1485993600","1578"
"2/3/2017","1486080000","1568"
"2/4/2017","1486166400","1560"
"2/5/2017","1486252800","1614"
"2/6/2017","1486339200","1606"
"2/7/2017","1486425600","1827"
"2/8/2017","1486512000","1764"
"2/9/2017","1486598400","1630"
"2/10/2017","1486684800","1735"
"2/11/2017","1486771200","1594"
"2/12/2017","1486857600","1571"
"2/13/2017","1486944000","1823"
"2/14/2017","1487030400","1914"
"2/15/2017","1487116800","1818"
"2/16/2017","1487203200","1661"
"2/17/2017","1487289600","1661"
"2/18/2017","1487376000","1773"
"2/19/2017","1487462400","1635"
"2/20/2017","1487548800","1696"
"2/21/2017","1487635200","1989"
"2/22/2017","1487721600","1790"
"2/23/2017","1487808000","1667"
"2/24/2017","1487894400","1778"
"2/25/2017","1487980800","1761"
"2/26/2017","1488067200","1713"
"2/27/2017","1488153600","1819"
"2/28/2017","1488240000","1935"
"3/1/2017","1488326400","2235"
"3/2/2017","1488412800","2209"
"3/3/2017","1488499200","2084"
"3/4/2017","1488585600","1860"
"3/5/2017","1488672000","1821"
"3/6/2017","1488758400","1808"
"3/7/2017","1488844800","1963"
"3/8/2017","1488931200","1800"
"3/9/2017","1489017600","2403"
"3/10/2017","1489104000","2190"
"3/11/2017","1489190400","2014"
"3/12/2017","1489276800","2043"
"3/13/2017","1489363200","2452"
"3/14/2017","1489449600","2433"
"3/15/2017","1489536000","2456"
"3/16/2017","1489622400","3071"
"3/17/2017","1489708800","2880"
"3/18/2017","1489795200","2513"
"3/19/2017","1489881600","2396"
"3/20/2017","1489968000","2316"
"3/21/2017","1490054400","2507"
"3/22/2017","1490140800","2368"
"3/23/2017","1490227200","2513"
"3/24/2017","1490313600","2557"
"3/25/2017","1490400000","2428"
"3/26/2017","1490486400","2375"
"3/27/2017","1490572800","2896"
"3/28/2017","1490659200","2543"
"3/29/2017","1490745600","2744"
"3/30/2017","1490832000","2853"
"3/31/2017","1490918400","2949"
"4/1/2017","1491004800","2403"
"4/2/2017","1491091200","2669"
"4/3/2017","1491177600","2788"
"4/4/2017","1491264000","2518"
"4/5/2017","1491350400","2558"
"4/6/2017","1491436800","2799"
"4/7/2017","1491523200","2776"
"4/8/2017","1491609600","2249"
"4/9/2017","1491696000","2358"
"4/10/2017","1491782400","2460"
"4/11/2017","1491868800","2377"
"4/12/2017","1491955200","2697"
"4/13/2017","1492041600","2589"
"4/14/2017","1492128000","2451"
"4/15/2017","1492214400","2348"
"4/16/2017","1492300800","2220"
"4/17/2017","1492387200","2309"
"4/18/2017","1492473600","2603"
"4/19/2017","1492560000","2664"
"4/20/2017","1492646400","2581"
"4/21/2017","1492732800","2691"
"4/22/2017","1492819200","2429"
"4/23/2017","1492905600","2393"
"4/24/2017","1492992000","2553"
"4/25/2017","1493078400","2803"
"4/26/2017","1493164800","2724"
"4/27/2017","1493251200","3095"
"4/28/2017","1493337600","3178"
"4/29/2017","1493424000","2793"
"4/30/2017","1493510400","3064"
"5/1/2017","1493596800","3544"
"5/2/2017","1493683200","3461"
"5/3/2017","1493769600","3028"
"5/4/2017","1493856000","3351"
"5/5/2017","1493942400","3171"
"5/6/2017","1494028800","2934"
"5/7/2017","1494115200","3322"
"5/8/2017","1494201600","3409"
"5/9/2017","1494288000","3376"
"5/10/2017","1494374400","3227"
"5/11/2017","1494460800","3352"
"5/12/2017","1494547200","3154"
"5/13/2017","1494633600","3065"
"5/14/2017","1494720000","3140"
"5/15/2017","1494806400","3831"
"5/16/2017","1494892800","3644"
"5/17/2017","1494979200","4305"
"5/18/2017","1495065600","4245"
"5/19/2017","1495152000","4801"
"5/20/2017","1495238400","4179"
"5/21/2017","1495324800","4586"
"5/22/2017","1495411200","5328"
"5/23/2017","1495497600","6627"
"5/24/2017","1495584000","6666"
"5/25/2017","1495670400","5952"
"5/26/2017","1495756800","5559"
"5/27/2017","1495843200","5127"
"5/28/2017","1495929600","5379"
"5/29/2017","1496016000","4922"
"5/30/2017","1496102400","7069"
"5/31/2017","1496188800","6843"
"6/1/2017","1496275200","6541"
"6/2/2017","1496361600","7542"
"6/3/2017","1496448000","6636"
"6/4/2017","1496534400","6458"
"6/5/2017","1496620800","6439"
"6/6/2017","1496707200","7374"
"6/7/2017","1496793600","7388"
"6/8/2017","1496880000","6932"
"6/9/2017","1496966400","7482"
"6/10/2017","1497052800","6592"
"6/11/2017","1497139200","8658"
"6/12/2017","1497225600","9451"
"6/13/2017","1497312000","8807"
"6/14/2017","1497398400","7942"
"6/15/2017","1497484800","8192"
"6/16/2017","1497571200","8034"
"6/17/2017","1497657600","7958"
"6/18/2017","1497744000","7931"
"6/19/2017","1497830400","8956"
"6/20/2017","1497916800","9258"
"6/21/2017","1498003200","6195"
"6/22/2017","1498089600","8691"
"6/23/2017","1498176000","9123"
"6/24/2017","1498262400","8935"
"6/25/2017","1498348800","8979"
"6/26/2017","1498435200","9544"
"6/27/2017","1498521600","7911"
"6/28/2017","1498608000","10005"
"6/29/2017","1498694400","9460"
"6/30/2017","1498780800","8800"
"7/1/2017","1498867200","8106"
"7/2/2017","1498953600","8503"
"7/3/2017","1499040000","10143"
"7/4/2017","1499126400","10132"
"7/5/2017","1499212800","10094"
"7/6/2017","1499299200","8830"
"7/7/2017","1499385600","9709"
"7/8/2017","1499472000","8884"
"7/9/2017","1499558400","6980"
"7/10/2017","1499644800","10586"
"7/11/2017","1499731200","10484"
"7/12/2017","1499817600","10735"
"7/13/2017","1499904000","10676"
"7/14/2017","1499990400","10040"
"7/15/2017","1500076800","8747"
"7/16/2017","1500163200","9225"
"7/17/2017","1500249600","9814"
"7/18/2017","1500336000","11286"
"7/19/2017","1500422400","10282"
"7/20/2017","1500508800","9370"
"7/21/2017","1500595200","8661"
"7/22/2017","1500681600","7992"
"7/23/2017","1500768000","9282"
"7/24/2017","1500854400","10560"
"7/25/2017","1500940800","9766"
"7/26/2017","1501027200","8403"
"7/27/2017","1501113600","8346"
"7/28/2017","1501200000","9258"
"7/29/2017","1501286400","7452"
"7/30/2017","1501372800","7621"
"7/31/2017","1501459200","9291"
"8/1/2017","1501545600","9503"
"8/2/2017","1501632000","9426"
"8/3/2017","1501718400","9597"
"8/4/2017","1501804800","10507"
"8/5/2017","1501891200","10427"
"8/6/2017","1501977600","10463"
"8/7/2017","1502064000","11867"
"8/8/2017","1502150400","13278"
"8/9/2017","1502236800","11373"
"8/10/2017","1502323200","13581"
"8/11/2017","1502409600","14429"
"8/12/2017","1502496000","13642"
"8/13/2017","1502582400","12993"
"8/14/2017","1502668800","15655"
"8/15/2017","1502755200","16403"
"8/16/2017","1502841600","17360"
"8/17/2017","1502928000","17330"
"8/18/2017","1503014400","17335"
"8/19/2017","1503100800","16348"
"8/20/2017","1503187200","12825"
"8/21/2017","1503273600","15179"
"8/22/2017","1503360000","14259"
"8/23/2017","1503446400","14352"
"8/24/2017","1503532800","13796"
"8/25/2017","1503619200","15772"
"8/26/2017","1503705600","14625"
"8/27/2017","1503792000","14945"
"8/28/2017","1503878400","17757"
"8/29/2017","1503964800","18455"
"8/30/2017","1504051200","18827"
"8/31/2017","1504137600","17436"
"9/1/2017","1504224000","18436"
"9/2/2017","1504310400","15334"
"9/3/2017","1504396800","13871"
"9/4/2017","1504483200","19760"
"9/5/2017","1504569600","19704"
"9/6/2017","1504656000","22603"
"9/7/2017","1504742400","21135"
"9/8/2017","1504828800","20975"
"9/9/2017","1504915200","17147"
"9/10/2017","1505001600","14680"
"9/11/2017","1505088000","16764"
"9/12/2017","1505174400","18037"
"9/13/2017","1505260800","16933"
"9/14/2017","1505347200","17288"
"9/15/2017","1505433600","19312"
"9/16/2017","1505520000","16698"
"9/17/2017","1505606400","14350"
"9/18/2017","1505692800","17536"
"9/19/2017","1505779200","16596"
"9/20/2017","1505865600","16028"
"9/21/2017","1505952000","16104"
"9/22/2017","1506038400","16972"
"9/23/2017","1506124800","15951"
"9/24/2017","1506211200","17983"
"9/25/2017","1506297600","19577"
"9/26/2017","1506384000","18527"
"9/27/2017","1506470400","18893"
"9/28/2017","1506556800","20553"
"9/29/2017","1506643200","21540"
"9/30/2017","1506729600","21998"
"10/1/2017","1506816000","21781"
"10/2/2017","1506902400","21143"
"10/3/2017","1506988800","20918"
"10/4/2017","1507075200","20395"
"10/5/2017","1507161600","20313"
"10/6/2017","1507248000","21656"
"10/7/2017","1507334400","19657"
"10/8/2017","1507420800","19150"
"10/9/2017","1507507200","19671"
"10/10/2017","1507593600","21438"
"10/11/2017","1507680000","20045"
"10/12/2017","1507766400","21137"
"10/13/2017","1507852800","21845"
"10/14/2017","1507939200","19951"
"10/15/2017","1508025600","19011"
"10/16/2017","1508112000","16294"
"10/17/2017","1508198400","14412"
"10/18/2017","1508284800","13060"
"10/19/2017","1508371200","12978"
"10/20/2017","1508457600","15254"
"10/21/2017","1508544000","11983"
"10/22/2017","1508630400","10947"
"10/23/2017","1508716800","12828"
"10/24/2017","1508803200","13946"
"10/25/2017","1508889600","14347"
"10/26/2017","1508976000","14417"
"10/27/2017","1509062400","14924"
"10/28/2017","1509148800","14317"
"10/29/2017","1509235200","14872"
"10/30/2017","1509321600","16448"
"10/31/2017","1509408000","15604"
"11/1/2017","1509494400","15758"
"11/2/2017","1509580800","15696"
"11/3/2017","1509667200","15831"
"11/4/2017","1509753600","12156"
"11/5/2017","1509840000","11640"
"11/6/2017","1509926400","13796"
"11/7/2017","1510012800","14267"
"11/8/2017","1510099200","14220"
"11/9/2017","1510185600","13929"
"11/10/2017","1510272000","13413"
"11/11/2017","1510358400","12665"
"11/12/2017","1510444800","13233"
"11/13/2017","1510531200","14443"
"11/14/2017","1510617600","16232"
"11/15/2017","1510704000","16453"
"11/16/2017","1510790400","15278"
"11/17/2017","1510876800","15301"
"11/18/2017","1510963200","14628"
"11/19/2017","1511049600","14551"
"11/20/2017","1511136000","16654"
"11/21/2017","1511222400","16182"
"11/22/2017","1511308800","15978"
"11/23/2017","1511395200","16029"
"11/24/2017","1511481600","15104"
"11/25/2017","1511568000","16192"
"11/26/2017","1511654400","16099"
"11/27/2017","1511740800","22187"
"11/28/2017","1511827200","18980"
"11/29/2017","1511913600","18539"
"11/30/2017","1512000000","18059"
"12/1/2017","1512086400","18184"
"12/2/2017","1512172800","17954"
"12/3/2017","1512259200","19326"
"12/4/2017","1512345600","19741"
"12/5/2017","1512432000","19800"
"12/6/2017","1512518400","21174"
"12/7/2017","1512604800","17899"
"12/8/2017","1512691200","21220"
"12/9/2017","1512777600","19891"
"12/10/2017","1512864000","20864"
"12/11/2017","1512950400","23554"
"12/12/2017","1513036800","25607"
"12/13/2017","1513123200","26216"
"12/14/2017","1513209600","26049"
"12/15/2017","1513296000","26180"
"12/16/2017","1513382400","26389"
"12/17/2017","1513468800","25965"
"12/18/2017","1513555200","27932"
"12/19/2017","1513641600","31463"
"12/20/2017","1513728000","27465"
"12/21/2017","1513814400","30221"
"12/22/2017","1513900800","29198"
"12/23/2017","1513987200","26198"
"12/24/2017","1514073600","20519"
"12/25/2017","1514160000","21721"
"12/26/2017","1514246400","22433"
"12/27/2017","1514332800","24734"
"12/28/2017","1514419200","25965"
"12/29/2017","1514505600","29542"
"12/30/2017","1514592000","29346"
"12/31/2017","1514678400","25038"
"1/1/2018","1514764800","24025"
"1/2/2018","1514851200","30157"
"1/3/2018","1514937600","32473"
"1/4/2018","1515024000","33681"
"1/5/2018","1515110400","33416"
"1/6/2018","1515196800","32655"
"1/7/2018","1515283200","31266"
"1/8/2018","1515369600","32502"
"1/9/2018","1515456000","33037"
"1/10/2018","1515542400","30646"
"1/11/2018","1515628800","31298"
"1/12/2018","1515715200","30655"
"1/13/2018","1515801600","31264"
"1/14/2018","1515888000","29323"
"1/15/2018","1515974400","31846"
"1/16/2018","1516060800","32767"
"1/17/2018","1516147200","32427"
"1/18/2018","1516233600","31705"
"1/19/2018","1516320000","28846"
"1/20/2018","1516406400","27414"
"1/21/2018","1516492800","26798"
"1/22/2018","1516579200","25864"
"1/23/2018","1516665600","25079"
"1/24/2018","1516752000","24566"
"1/25/2018","1516838400","23671"
"1/26/2018","1516924800","26059"
"1/27/2018","1517011200","22450"
"1/28/2018","1517097600","24197"
"1/29/2018","1517184000","25248"
"1/30/2018","1517270400","25224"
"1/31/2018","1517356800","24902"
"2/1/2018","1517443200","26328"
"2/2/2018","1517529600","26186"
"2/3/2018","1517616000","22592"
"2/4/2018","1517702400","22742"
"2/5/2018","1517788800","24175"
"2/6/2018","1517875200","24934"
"2/7/2018","1517961600","22972"
"2/8/2018","1518048000","20093"
"2/9/2018","1518134400","22095"
"2/10/2018","1518220800","22121"
"2/11/2018","1518307200","20982"
"2/12/2018","1518393600","22178"
"2/13/2018","1518480000","20432"
"2/14/2018","1518566400","21848"
"2/15/2018","1518652800","21805"
"2/16/2018","1518739200","20711"
"2/17/2018","1518825600","21891"
"2/18/2018","1518912000","20735"
"2/19/2018","1518998400","21811"
"2/20/2018","1519084800","24413"
"2/21/2018","1519171200","23307"
"2/22/2018","1519257600","21747"
"2/23/2018","1519344000","20793"
"2/24/2018","1519430400","21265"
"2/25/2018","1519516800","20566"
"2/26/2018","1519603200","21652"
"2/27/2018","1519689600","20964"
"2/28/2018","1519776000","21593"
"3/1/2018","1519862400","20663"
"3/2/2018","1519948800","22550"
"3/3/2018","1520035200","21173"
"3/4/2018","1520121600","20794"
"3/5/2018","1520208000","22566"
"3/6/2018","1520294400","21623"
"3/7/2018","1520380800","22824"
"3/8/2018","1520467200","21478"
"3/9/2018","1520553600","20374"
"3/10/2018","1520640000","18862"
"3/11/2018","1520726400","18612"
"3/12/2018","1520812800","21668"
"3/13/2018","1520899200","20946"
"3/14/2018","1520985600","20106"
"3/15/2018","1521072000","20056"
"3/16/2018","1521158400","19502"
"3/17/2018","1521244800","17376"
"3/18/2018","1521331200","20197"
"3/19/2018","1521417600","20642"
"3/20/2018","1521504000","20067"
"3/21/2018","1521590400","20630"
"3/22/2018","1521676800","17883"
"3/23/2018","1521763200","18847"
"3/24/2018","1521849600","16599"
"3/25/2018","1521936000","14982"
"3/26/2018","1522022400","17841"
"3/27/2018","1522108800","17230"
"3/28/2018","1522195200","17283"
"3/29/2018","1522281600","17508"
"3/30/2018","1522368000","18457"
"3/31/2018","1522454400","17025"
"4/1/2018","1522540800","15893"
"4/2/2018","1522627200","16871"
"4/3/2018","1522713600","19076"
"4/4/2018","1522800000","18676"
"4/5/2018","1522886400","19496"
"4/6/2018","1522972800","17769"
"4/7/2018","1523059200","15831"
"4/8/2018","1523145600","17233"
"4/9/2018","1523232000","18630"
"4/10/2018","1523318400","17582"
"4/11/2018","1523404800","18496"
"4/12/2018","1523491200","21244"
"4/13/2018","1523577600","21136"
"4/14/2018","1523664000","18148"
"4/15/2018","1523750400","18672"
"4/16/2018","1523836800","20768"
"4/17/2018","1523923200","22300"
"4/18/2018","1524009600","22474"
"4/19/2018","1524096000","25206"
"4/20/2018","1524182400","26386"
"4/21/2018","1524268800","21672"
"4/22/2018","1524355200","23074"
"4/23/2018","1524441600","24241"
"4/24/2018","1524528000","25599"
"4/25/2018","1524614400","25145"
"4/26/2018","1524700800","24705"
"4/27/2018","1524787200","24120"
"4/28/2018","1524873600","24555"
"4/29/2018","1524960000","24654"
"4/30/2018","1525046400","25891"
"5/1/2018","1525132800","24618"
"5/2/2018","1525219200","25626"
"5/3/2018","1525305600","26338"
"5/4/2018","1525392000","27766"
"5/5/2018","1525478400","24103"
"5/6/2018","1525564800","22388"
"5/7/2018","1525651200","23088"
"5/8/2018","1525737600","23859"
"5/9/2018","1525824000","24510"
"5/10/2018","1525910400","26750"
"5/11/2018","1525996800","25118"
"5/12/2018","1526083200","23752"
"5/13/2018","1526169600","23520"
"5/14/2018","1526256000","25932"
"5/15/2018","1526342400","24792"
"5/16/2018","1526428800","24743"
"5/17/2018","1526515200","24608"
"5/18/2018","1526601600","24643"
"5/19/2018","1526688000","24459"
"5/20/2018","1526774400","23759"
"5/21/2018","1526860800","25580"
"5/22/2018","1526947200","25326"
"5/23/2018","1527033600","25965"
"5/24/2018","1527120000","25467"
"5/25/2018","1527206400","24930"
"5/26/2018","1527292800","23053"
"5/27/2018","1527379200","23497"
"5/28/2018","1527465600","25414"
"5/29/2018","1527552000","25332"
"5/30/2018","1527638400","25508"
"5/31/2018","1527724800","27436"
"6/1/2018","1527811200","25130"
"6/2/2018","1527897600","24617"
"6/3/2018","1527984000","25077"
"6/4/2018","1528070400","26427"
"6/5/2018","1528156800","25848"
"6/6/2018","1528243200","24376"
"6/7/2018","1528329600","24384"
"6/8/2018","1528416000","24513"
"6/9/2018","1528502400","24163"
"6/10/2018","1528588800","24560"
"6/11/2018","1528675200","24470"
"6/12/2018","1528761600","23682"
"6/13/2018","1528848000","25448"
"6/14/2018","1528934400","24149"
"6/15/2018","1529020800","22615"
"6/16/2018","1529107200","26353"
"6/17/2018","1529193600","19968"
"6/18/2018","1529280000","22074"
"6/19/2018","1529366400","25000"
"6/20/2018","1529452800","25587"
"6/21/2018","1529539200","23526"
"6/22/2018","1529625600","24500"
"6/23/2018","1529712000","20591"
"6/24/2018","1529798400","20968"
"6/25/2018","1529884800","25228"
"6/26/2018","1529971200","23860"
"6/27/2018","1530057600","24580"
"6/28/2018","1530144000","23926"
"6/29/2018","1530230400","23219"
"6/30/2018","1530316800","22085"
"7/1/2018","1530403200","22500"
"7/2/2018","1530489600","19625"
"7/3/2018","1530576000","22047"
"7/4/2018","1530662400","18915"
"7/5/2018","1530748800","21492"
"7/6/2018","1530835200","19221"
"7/7/2018","1530921600","19710"
"7/8/2018","1531008000","22366"
"7/9/2018","1531094400","22362"
"7/10/2018","1531180800","23429"
"7/11/2018","1531267200","22106"
"7/12/2018","1531353600","21238"
"7/13/2018","1531440000","20793"
"7/14/2018","1531526400","19583"
"7/15/2018","1531612800","18676"
"7/16/2018","1531699200","23433"
"7/17/2018","1531785600","23583"
"7/18/2018","1531872000","23590"
"7/19/2018","1531958400","23728"
"7/20/2018","1532044800","21230"
"7/21/2018","1532131200","19169"
"7/22/2018","1532217600","20793"
"7/23/2018","1532304000","23066"
"7/24/2018","1532390400","24225"
"7/25/2018","1532476800","24159"
"7/26/2018","1532563200","23504"
"7/27/2018","1532649600","22766"
"7/28/2018","1532736000","19586"
"7/29/2018","1532822400","21871"
"7/30/2018","1532908800","23849"
"7/31/2018","1532995200","23919"
"8/1/2018","1533081600","24727"
"8/2/2018","1533168000","24602"
"8/3/2018","1533254400","22395"
"8/4/2018","1533340800","21272"
"8/5/2018","1533427200","22206"
"8/6/2018","1533513600","23317"
"8/7/2018","1533600000","19803"
"8/8/2018","1533686400","16263"
"8/9/2018","1533772800","15543"
"8/10/2018","1533859200","18596"
"8/11/2018","1533945600","20285"
"8/12/2018","1534032000","19754"
"8/13/2018","1534118400","21954"
"8/14/2018","1534204800","21862"
"8/15/2018","1534291200","19765"
"8/16/2018","1534377600","22328"
"8/17/2018","1534464000","20514"
"8/18/2018","1534550400","22512"
"8/19/2018","1534636800","22015"
"8/20/2018","1534723200","25134"
"8/21/2018","1534809600","25249"
"8/22/2018","1534896000","22830"
"8/23/2018","1534982400","24307"
"8/24/2018","1535068800","22859"
"8/25/2018","1535155200","24937"
"8/26/2018","1535241600","24193"
"8/27/2018","1535328000","24863"
"8/28/2018","1535414400","25984"
"8/29/2018","1535500800","24552"
"8/30/2018","1535587200","23668"
"8/31/2018","1535673600","22118"
"9/1/2018","1535760000","23748"
"9/2/2018","1535846400","23061"
"9/3/2018","1535932800","25005"
"9/4/2018","1536019200","23087"
"9/5/2018","1536105600","25414"
"9/6/2018","1536192000","23479"
"9/7/2018","1536278400","25113"
"9/8/2018","1536364800","25208"
"9/9/2018","1536451200","22118"
"9/10/2018","1536537600","23522"
"9/11/2018","1536624000","22317"
"9/12/2018","1536710400","24133"
"9/13/2018","1536796800","24041"
"9/14/2018","1536883200","26309"
"9/15/2018","1536969600","25808"
"9/16/2018","1537056000","27185"
"9/17/2018","1537142400","25919"
"9/18/2018","1537228800","26176"
"9/19/2018","1537315200","20024"
"9/20/2018","1537401600","24244"
"9/21/2018","1537488000","26244"
"9/22/2018","1537574400","25021"
"9/23/2018","1537660800","25761"
"9/24/2018","1537747200","28688"
"9/25/2018","1537833600","28211"
"9/26/2018","1537920000","29742"
"9/27/2018","1538006400","29477"
"9/28/2018","1538092800","28068"
"9/29/2018","1538179200","20428"
"9/30/2018","1538265600","23846"
"10/1/2018","1538352000","24593"
"10/2/2018","1538438400","24107"
"10/3/2018","1538524800","21423"
"10/4/2018","1538611200","22655"
"10/5/2018","1538697600","20849"
"10/6/2018","1538784000","17610"
"10/7/2018","1538870400","15402"
"10/8/2018","1538956800","17036"
"10/9/2018","1539043200","18245"
"10/10/2018","1539129600","16867"
"10/11/2018","1539216000","18166"
"10/12/2018","1539302400","20202"
"10/13/2018","1539388800","17319"
"10/14/2018","1539475200","15242"
"10/15/2018","1539561600","17581"
"10/16/2018","1539648000","17645"
"10/17/2018","1539734400","17763"
"10/18/2018","1539820800","17769"
"10/19/2018","1539907200","18544"
"10/20/2018","1539993600","15752"
"10/21/2018","1540080000","16116"
"10/22/2018","1540166400","19571"
"10/23/2018","1540252800","17617"
"10/24/2018","1540339200","20667"
"10/25/2018","1540425600","21879"
"10/26/2018","1540512000","20114"
"10/27/2018","1540598400","15214"
"10/28/2018","1540684800","15574"
"10/29/2018","1540771200","19679"
"10/30/2018","1540857600","19083"
"10/31/2018","1540944000","17867"
"11/1/2018","1541030400","18086"
"11/2/2018","1541116800","17166"
"11/3/2018","1541203200","15800"
"11/4/2018","1541289600","15888"
"11/5/2018","1541376000","17562"
"11/6/2018","1541462400","18894"
"11/7/2018","1541548800","17796"
"11/8/2018","1541635200","18379"
"11/9/2018","1541721600","17469"
"11/10/2018","1541808000","16375"
"11/11/2018","1541894400","17094"
"11/12/2018","1541980800","18419"
"11/13/2018","1542067200","17702"
"11/14/2018","1542153600","18832"
"11/15/2018","1542240000","17646"
"11/16/2018","1542326400","17100"
"11/17/2018","1542412800","15503"
"11/18/2018","1542499200","14681"
"11/19/2018","1542585600","19002"
"11/20/2018","1542672000","19756"
"11/21/2018","1542758400","17952"
"11/22/2018","1542844800","17791"
"11/23/2018","1542931200","17659"
"11/24/2018","1543017600","15618"
"11/25/2018","1543104000","16512"
"11/26/2018","1543190400","17255"
"11/27/2018","1543276800","17909"
"11/28/2018","1543363200","19897"
"11/29/2018","1543449600","17814"
"11/30/2018","1543536000","18642"
"12/1/2018","1543622400","16263"
"12/2/2018","1543708800","15282"
"12/3/2018","1543795200","18022"
"12/4/2018","1543881600","17972"
"12/5/2018","1543968000","18963"
"12/6/2018","1544054400","19164"
"12/7/2018","1544140800","18403"
"12/8/2018","1544227200","17322"
"12/9/2018","1544313600","16875"
"12/10/2018","1544400000","18196"
"12/11/2018","1544486400","17723"
"12/12/2018","1544572800","16675"
"12/13/2018","1544659200","17641"
"12/14/2018","1544745600","18675"
"12/15/2018","1544832000","16796"
"12/16/2018","1544918400","15879"
"12/17/2018","1545004800","18889"
"12/18/2018","1545091200","19672"
"12/19/2018","1545177600","19629"
"12/20/2018","1545264000","19588"
"12/21/2018","1545350400","19662"
"12/22/2018","1545436800","16613"
"12/23/2018","1545523200","17293"
"12/24/2018","1545609600","19050"
"12/25/2018","1545696000","16454"
"12/26/2018","1545782400","18494"
"12/27/2018","1545868800","17564"
"12/28/2018","1545955200","17910"
"12/29/2018","1546041600","16917"
"12/30/2018","1546128000","14545"
"12/31/2018","1546214400","16503"
"1/1/2019","1546300800","13666"
"1/2/2019","1546387200","18126"
"1/3/2019","1546473600","19343"
"1/4/2019","1546560000","18872"
"1/5/2019","1546646400","17351"
"1/6/2019","1546732800","15855"
"1/7/2019","1546819200","18204"
"1/8/2019","1546905600","17916"
"1/9/2019","1546992000","17865"
"1/10/2019","1547078400","19150"
"1/11/2019","1547164800","18683"
"1/12/2019","1547251200","15918"
"1/13/2019","1547337600","15798"
"1/14/2019","1547424000","18452"
"1/15/2019","1547510400","18074"
"1/16/2019","1547596800","18008"
"1/17/2019","1547683200","17900"
"1/18/2019","1547769600","17751"
"1/19/2019","1547856000","17863"
"1/20/2019","1547942400","17832"
"1/21/2019","1548028800","21357"
"1/22/2019","1548115200","22711"
"1/23/2019","1548201600","20710"
"1/24/2019","1548288000","19842"
"1/25/2019","1548374400","18310"
"1/26/2019","1548460800","17422"
"1/27/2019","1548547200","18274"
"1/28/2019","1548633600","21577"
"1/29/2019","1548720000","22103"
"1/30/2019","1548806400","21568"
"1/31/2019","1548892800","20803"
"2/1/2019","1548979200","20373"
"2/2/2019","1549065600","17499"
"2/3/2019","1549152000","16597"
"2/4/2019","1549238400","16326"
"2/5/2019","1549324800","16601"
"2/6/2019","1549411200","17023"
"2/7/2019","1549497600","17432"
"2/8/2019","1549584000","18982"
"2/9/2019","1549670400","17138"
"2/10/2019","1549756800","18598"
"2/11/2019","1549843200","20700"
"2/12/2019","1549929600","20824"
"2/13/2019","1550016000","23368"
"2/14/2019","1550102400","23305"
"2/15/2019","1550188800","22751"
"2/16/2019","1550275200","21513"
"2/17/2019","1550361600","22199"
"2/18/2019","1550448000","24106"
"2/19/2019","1550534400","24581"
"2/20/2019","1550620800","24759"
"2/21/2019","1550707200","25217"
"2/22/2019","1550793600","24969"
"2/23/2019","1550880000","21843"
"2/24/2019","1550966400","24399"
"2/25/2019","1551052800","26690"
"2/26/2019","1551139200","26269"
"2/27/2019","1551225600","25340"
"2/28/2019","1551312000","25117"
"3/1/2019","1551398400","18943"
"3/2/2019","1551484800","16459"
"3/3/2019","1551571200","15337"
"3/4/2019","1551657600","19803"
"3/5/2019","1551744000","18740"
"3/6/2019","1551830400","17726"
"3/7/2019","1551916800","17116"
"3/8/2019","1552003200","18800"
"3/9/2019","1552089600","17547"
"3/10/2019","1552176000","15045"
"3/11/2019","1552262400","17059"
"3/12/2019","1552348800","17676"
"3/13/2019","1552435200","19134"
"3/14/2019","1552521600","18486"
"3/15/2019","1552608000","17922"
"3/16/2019","1552694400","16269"
"3/17/2019","1552780800","15331"
"3/18/2019","1552867200","19382"
"3/19/2019","1552953600","21169"
"3/20/2019","1553040000","19680"
"3/21/2019","1553126400","20227"
"3/22/2019","1553212800","19821"
"3/23/2019","1553299200","17356"
"3/24/2019","1553385600","16938"
"3/25/2019","1553472000","20021"
"3/26/2019","1553558400","20393"
"3/27/2019","1553644800","20194"
"3/28/2019","1553731200","19719"
"3/29/2019","1553817600","20950"
"3/30/2019","1553904000","20715"
"3/31/2019","1553990400","19955"
"4/1/2019","1554076800","20491"
"4/2/2019","1554163200","23063"
"4/3/2019","1554249600","23145"
"4/4/2019","1554336000","21792"
"4/5/2019","1554422400","19259"
"4/6/2019","1554508800","17014"
"4/7/2019","1554595200","17631"
"4/8/2019","1554681600","20225"
"4/9/2019","1554768000","19618"
"4/10/2019","1554854400","22604"
"4/11/2019","1554940800","24120"
"4/12/2019","1555027200","20339"
"4/13/2019","1555113600","17601"
"4/14/2019","1555200000","17002"
"4/15/2019","1555286400","21486"
"4/16/2019","1555372800","22688"
"4/17/2019","1555459200","20874"
"4/18/2019","1555545600","21212"
"4/19/2019","1555632000","20811"
"4/20/2019","1555718400","20168"
"4/21/2019","1555804800","20870"
"4/22/2019","1555891200","21123"
"4/23/2019","1555977600","21970"
"4/24/2019","1556064000","20009"
"4/25/2019","1556150400","20132"
"4/26/2019","1556236800","20024"
"4/27/2019","1556323200","16417"
"4/28/2019","1556409600","17957"
"4/29/2019","1556496000","19214"
"4/30/2019","1556582400","20890"
"5/1/2019","1556668800","20186"
"5/2/2019","1556755200","24056"
"5/3/2019","1556841600","21965"
"5/4/2019","1556928000","18463"
"5/5/2019","1557014400","19106"
"5/6/2019","1557100800","24830"
"5/7/2019","1557187200","28009"
"5/8/2019","1557273600","24559"
"5/9/2019","1557360000","22854"
"5/10/2019","1557446400","22895"
"5/11/2019","1557532800","22665"
"5/12/2019","1557619200","21533"
"5/13/2019","1557705600","23003"
"5/14/2019","1557792000","24211"
"5/15/2019","1557878400","25388"
"5/16/2019","1557964800","26549"
"5/17/2019","1558051200","25690"
"5/18/2019","1558137600","23032"
"5/19/2019","1558224000","21899"
"5/20/2019","1558310400","24951"
"5/21/2019","1558396800","23950"
"5/22/2019","1558483200","25634"
"5/23/2019","1558569600","25428"
"5/24/2019","1558656000","25641"
"5/25/2019","1558742400","23055"
"5/26/2019","1558828800","21835"
"5/27/2019","1558915200","26746"
"5/28/2019","1559001600","25652"
"5/29/2019","1559088000","26071"
"5/30/2019","1559174400","25711"
"5/31/2019","1559260800","23397"
"6/1/2019","1559347200","25187"
"6/2/2019","1559433600","24320"
"6/3/2019","1559520000","25335"
"6/4/2019","1559606400","25298"
"6/5/2019","1559692800","23410"
"6/6/2019","1559779200","23387"
"6/7/2019","1559865600","22693"
"6/8/2019","1559952000","28245"
"6/9/2019","1560038400","20388"
"6/10/2019","1560124800","27708"
"6/11/2019","1560211200","27086"
"6/12/2019","1560297600","24645"
"6/13/2019","1560384000","22168"
"6/14/2019","1560470400","23694"
"6/15/2019","1560556800","26219"
"6/16/2019","1560643200","23509"
"6/17/2019","1560729600","26723"
"6/18/2019","1560816000","24478"
"6/19/2019","1560902400","26787"
"6/20/2019","1560988800","28152"
"6/21/2019","1561075200","22975"
"6/22/2019","1561161600","21933"
"6/23/2019","1561248000","22344"
"6/24/2019","1561334400","24260"
"6/25/2019","1561420800","26961"
"6/26/2019","1561507200","27234"
"6/27/2019","1561593600","25364"
"6/28/2019","1561680000","28620"
"6/29/2019","1561766400","21175"
"6/30/2019","1561852800","20644"
"7/1/2019","1561939200","27639"
"7/2/2019","1562025600","26119"
"7/3/2019","1562112000","23075"
"7/4/2019","1562198400","22679"
"7/5/2019","1562284800","24935"
"7/6/2019","1562371200","26562"
"7/7/2019","1562457600","25644"
"7/8/2019","1562544000","30983"
"7/9/2019","1562630400","23460"
"7/10/2019","1562716800","22416"
"7/11/2019","1562803200","28000"
"7/12/2019","1562889600","22371"
"7/13/2019","1562976000","17767"
"7/14/2019","1563062400","19199"
"7/15/2019","1563148800","36630"
"7/16/2019","1563235200","30145"
"7/17/2019","1563321600","25513"
"7/18/2019","1563408000","25430"
"7/19/2019","1563494400","24035"
"7/20/2019","1563580800","17756"
"7/21/2019","1563667200","16272"
"7/22/2019","1563753600","19019"
"7/23/2019","1563840000","19176"
"7/24/2019","1563926400","26210"
"7/25/2019","1564012800","27839"
"7/26/2019","1564099200","19444"
"7/27/2019","1564185600","17755"
"7/28/2019","1564272000","17274"
"7/29/2019","1564358400","20132"
"7/30/2019","1564444800","20527"
"7/31/2019","1564531200","20452"
"8/1/2019","1564617600","25699"
"8/2/2019","1564704000","22452"
"8/3/2019","1564790400","22397"
"8/4/2019","1564876800","18037"
"8/5/2019","1564963200","21331"
"8/6/2019","1565049600","21464"
"8/7/2019","1565136000","21790"
"8/8/2019","1565222400","21149"
"8/9/2019","1565308800","21193"
"8/10/2019","1565395200","18119"
"8/11/2019","1565481600","16995"
"8/12/2019","1565568000","20175"
"8/13/2019","1565654400","20533"
"8/14/2019","1565740800","21869"
"8/15/2019","1565827200","20987"
"8/16/2019","1565913600","21163"
"8/17/2019","1566000000","18717"
"8/18/2019","1566086400","18467"
"8/19/2019","1566172800","21289"
"8/20/2019","1566259200","21151"
"8/21/2019","1566345600","21228"
"8/22/2019","1566432000","21494"
"8/23/2019","1566518400","21119"
"8/24/2019","1566604800","19992"
"8/25/2019","1566691200","22498"
"8/26/2019","1566777600","24261"
"8/27/2019","1566864000","22150"
"8/28/2019","1566950400","21543"
"8/29/2019","1567036800","21323"
"8/30/2019","1567123200","21067"
"8/31/2019","1567209600","19888"
"9/1/2019","1567296000","20134"
"9/2/2019","1567382400","22052"
"9/3/2019","1567468800","21631"
"9/4/2019","1567555200","20683"
"9/5/2019","1567641600","21712"
"9/6/2019","1567728000","22022"
"9/7/2019","1567814400","19515"
"9/8/2019","1567900800","19207"
"9/9/2019","1567987200","21393"
"9/10/2019","1568073600","19760"
"9/11/2019","1568160000","19801"
"9/12/2019","1568246400","20315"
"9/13/2019","1568332800","17954"
"9/14/2019","1568419200","17794"
"9/15/2019","1568505600","18290"
"9/16/2019","1568592000","20696"
"9/17/2019","1568678400","19884"
"9/18/2019","1568764800","20004"
"9/19/2019","1568851200","20232"
"9/20/2019","1568937600","20405"
"9/21/2019","1569024000","17460"
"9/22/2019","1569110400","17263"
"9/23/2019","1569196800","18540"
"9/24/2019","1569283200","21929"
"9/25/2019","1569369600","20201"
"9/26/2019","1569456000","19594"
"9/27/2019","1569542400","18864"
"9/28/2019","1569628800","17824"
"9/29/2019","1569715200","17629"
"9/30/2019","1569801600","20424"
"10/1/2019","1569888000","21073"
"10/2/2019","1569974400","20496"
"10/3/2019","1570060800","20571"
"10/4/2019","1570147200","20375"
"10/5/2019","1570233600","17833"
"10/6/2019","1570320000","17138"
"10/7/2019","1570406400","20757"
"10/8/2019","1570492800","21786"
"10/9/2019","1570579200","23163"
"10/10/2019","1570665600","21463"
"10/11/2019","1570752000","21115"
"10/12/2019","1570838400","19119"
"10/13/2019","1570924800","17463"
"10/14/2019","1571011200","20292"
"10/15/2019","1571097600","21538"
"10/16/2019","1571184000","21974"
"10/17/2019","1571270400","22039"
"10/18/2019","1571356800","22807"
"10/19/2019","1571443200","20248"
"10/20/2019","1571529600","18765"
"10/21/2019","1571616000","20915"
"10/22/2019","1571702400","22240"
"10/23/2019","1571788800","24468"
"10/24/2019","1571875200","23565"
"10/25/2019","1571961600","24096"
"10/26/2019","1572048000","23163"
"10/27/2019","1572134400","20478"
"10/28/2019","1572220800","23136"
"10/29/2019","1572307200","22707"
"10/30/2019","1572393600","22813"
"10/31/2019","1572480000","23960"
"11/1/2019","1572566400","22541"
"11/2/2019","1572652800","19180"
"11/3/2019","1572739200","18029"
"11/4/2019","1572825600","21459"
"11/5/2019","1572912000","23013"
"11/6/2019","1572998400","22415"
"11/7/2019","1573084800","25894"
"11/8/2019","1573171200","21548"
"11/9/2019","1573257600","19819"
"11/10/2019","1573344000","19801"
"11/11/2019","1573430400","23472"
"11/12/2019","1573516800","23057"
"11/13/2019","1573603200","22898"
"11/14/2019","1573689600","21895"
"11/15/2019","1573776000","22444"
"11/16/2019","1573862400","19589"
"11/17/2019","1573948800","19970"
"11/18/2019","1574035200","24983"
"11/19/2019","1574121600","25545"
"11/20/2019","1574208000","22934"
"11/21/2019","1574294400","28973"
"11/22/2019","1574380800","31687"
"11/23/2019","1574467200","23859"
"11/24/2019","1574553600","23468"
"11/25/2019","1574640000","30507"
"11/26/2019","1574726400","30709"
"11/27/2019","1574812800","28400"
"11/28/2019","1574899200","27609"
"11/29/2019","1574985600","27639"
"11/30/2019","1575072000","24380"
"12/1/2019","1575158400","25933"
"12/2/2019","1575244800","27066"
"12/3/2019","1575331200","24340"
"12/4/2019","1575417600","29349"
"12/5/2019","1575504000","24676"
"12/6/2019","1575590400","23017"
"12/7/2019","1575676800","19382"
"12/8/2019","1575763200","20648"
"12/9/2019","1575849600","24920"
"12/10/2019","1575936000","25190"
"12/11/2019","1576022400","24671"
"12/12/2019","1576108800","24847"
"12/13/2019","1576195200","24562"
"12/14/2019","1576281600","23121"
"12/15/2019","1576368000","22918"
"12/16/2019","1576454400","26804"
"12/17/2019","1576540800","27159"
"12/18/2019","1576627200","28105"
"12/19/2019","1576713600","27176"
"12/20/2019","1576800000","27193"
"12/21/2019","1576886400","24585"
"12/22/2019","1576972800","24407"
"12/23/2019","1577059200","27160"
"12/24/2019","1577145600","24708"
"12/25/2019","1577232000","24056"
"12/26/2019","1577318400","24563"
"12/27/2019","1577404800","24641"
"12/28/2019","1577491200","21575"
"12/29/2019","1577577600","21031"
"12/30/2019","1577664000","24593"
"12/31/2019","1577750400","24239"
"1/1/2020","1577836800","20546"
"1/2/2020","1577923200","20138"
"1/3/2020","1578009600","19394"
"1/4/2020","1578096000","19029"
"1/5/2020","1578182400","18408"
"1/6/2020","1578268800","20292"
"1/7/2020","1578355200","21160"
"1/8/2020","1578441600","22383"
"1/9/2020","1578528000","20203"
"1/10/2020","1578614400","20076"
"1/11/2020","1578700800","18343"
"1/12/2020","1578787200","58220"
"1/13/2020","1578873600","23743"
"1/14/2020","1578960000","22776"
"1/15/2020","1579046400","23365"
"1/16/2020","1579132800","21422"
"1/17/2020","1579219200","22155"
"1/18/2020","1579305600","20423"
"1/19/2020","1579392000","20571"
"1/20/2020","1579478400","20165"
"1/21/2020","1579564800","18522"
"1/22/2020","1579651200","17212"
"1/23/2020","1579737600","18583"
"1/24/2020","1579824000","19244"
"1/25/2020","1579910400","16540"
"1/26/2020","1579996800","16844"
"1/27/2020","1580083200","17354"
"1/28/2020","1580169600","19065"
"1/29/2020","1580256000","19057"
"1/30/2020","1580342400","20606"
"1/31/2020","1580428800","21319"
"2/1/2020","1580515200","18761"
"2/2/2020","1580601600","17803"
"2/3/2020","1580688000","20790"
"2/4/2020","1580774400","17656"
"2/5/2020","1580860800","20346"
"2/6/2020","1580947200","20244"
"2/7/2020","1581033600","21437"
"2/8/2020","1581120000","21965"
"2/9/2020","1581206400","20937"
"2/10/2020","1581292800","21715"
"2/11/2020","1581379200","23173"
"2/12/2020","1581465600","26521"
"2/13/2020","1581552000","25627"
"2/14/2020","1581638400","26041"
"2/15/2020","1581724800","23067"
"2/16/2020","1581811200","22163"
"2/17/2020","1581897600","24138"
"2/18/2020","1581984000","24219"
"2/19/2020","1582070400","23010"
"2/20/2020","1582156800","23417"
"2/21/2020","1582243200","22264"
"2/22/2020","1582329600","20004"
"2/23/2020","1582416000","19887"
"2/24/2020","1582502400","23637"
"2/25/2020","1582588800","24109"
"2/26/2020","1582675200","25491"
"2/27/2020","1582761600","24706"
"2/28/2020","1582848000","24027"
"2/29/2020","1582934400","20707"
"3/1/2020","1583020800","21400"
"3/2/2020","1583107200","22782"
"3/3/2020","1583193600","22382"
"3/4/2020","1583280000","21477"
"3/5/2020","1583366400","23417"
"3/6/2020","1583452800","22543"
"3/7/2020","1583539200","20794"
"3/8/2020","1583625600","23673"
"3/9/2020","1583712000","27887"
"3/10/2020","1583798400","25113"
"3/11/2020","1583884800","24782"
"3/12/2020","1583971200","27723"
"3/13/2020","1584057600","27582"
"3/14/2020","1584144000","23303"
"3/15/2020","1584230400","23169"
"3/16/2020","1584316800","26369"
"3/17/2020","1584403200","24937"
"3/18/2020","1584489600","24088"
"3/19/2020","1584576000","27413"
"3/20/2020","1584662400","27084"
"3/21/2020","1584748800","26578"
"3/22/2020","1584835200","25601"
"3/23/2020","1584921600","25426"
"3/24/2020","1585008000","26101"
"3/25/2020","1585094400","24775"
"3/26/2020","1585180800","24661"
"3/27/2020","1585267200","23262"
"3/28/2020","1585353600","22245"
"3/29/2020","1585440000","19253"
"3/30/2020","1585526400","22915"
"3/31/2020","1585612800","24057"
"4/1/2020","1585699200","23177"
"4/2/2020","1585785600","24853"
"4/3/2020","1585872000","24127"
"4/4/2020","1585958400","21335"
"4/5/2020","1586044800","20359"
"4/6/2020","1586131200","26036"
"4/7/2020","1586217600","25184"
"4/8/2020","1586304000","25393"
"4/9/2020","1586390400","23447"
"4/10/2020","1586476800","24575"
"4/11/2020","1586563200","22996"
"4/12/2020","1586649600","22760"
"4/13/2020","1586736000","24305"
"4/14/2020","1586822400","24940"
"4/15/2020","1586908800","24633"
"4/16/2020","1586995200","26129"
"4/17/2020","1587081600","24920"
"4/18/2020","1587168000","24272"
"4/19/2020","1587254400","23224"
"4/20/2020","1587340800","26206"
"4/21/2020","1587427200","25515"
"4/22/2020","1587513600","25228"
"4/23/2020","1587600000","25963"
"4/24/2020","1587686400","25533"
"4/25/2020","1587772800","24986"
"4/26/2020","1587859200","25058"
"4/27/2020","1587945600","25766"
"4/28/2020","1588032000","26056"
"4/29/2020","1588118400","27928"
"4/30/2020","1588204800","28663"
"5/1/2020","1588291200","25890"
"5/2/2020","1588377600","23861"
"5/3/2020","1588464000","24822"
"5/4/2020","1588550400","26939"
"5/5/2020","1588636800","24540"
"5/6/2020","1588723200","27907"
"5/7/2020","1588809600","31419"
"5/8/2020","1588896000","27078"
"5/9/2020","1588982400","27758"
"5/10/2020","1589068800","27547"
"5/11/2020","1589155200","27592"
"5/12/2020","1589241600","26833"
"5/13/2020","1589328000","25703"
"5/14/2020","1589414400","25607"
"5/15/2020","1589500800","27276"
"5/16/2020","1589587200","26716"
"5/17/2020","1589673600","25429"
"5/18/2020","1589760000","26532"
"5/19/2020","1589846400","26817"
"5/20/2020","1589932800","27680"
"5/21/2020","1590019200","28609"
"5/22/2020","1590105600","28545"
"5/23/2020","1590192000","26836"
"5/24/2020","1590278400","26739"
"5/25/2020","1590364800","26743"
"5/26/2020","1590451200","28230"
"5/27/2020","1590537600","26742"
"5/28/2020","1590624000","27984"
"5/29/2020","1590710400","30559"
"5/30/2020","1590796800","27272"
"5/31/2020","1590883200","29261"
"6/1/2020","1590969600","29940"
"6/2/2020","1591056000","30160"
"6/3/2020","1591142400","27391"
"6/4/2020","1591228800","28846"
"6/5/2020","1591315200","27446"
"6/6/2020","1591401600","29092"
"6/7/2020","1591488000","29164"
"6/8/2020","1591574400","29047"
"6/9/2020","1591660800","28817"
"6/10/2020","1591747200","31137"
"6/11/2020","1591833600","30366"
"6/12/2020","1591920000","27921"
"6/13/2020","1592006400","25744"
"6/14/2020","1592092800","25218"
"6/15/2020","1592179200","29458"
"6/16/2020","1592265600","28873"
"6/17/2020","1592352000","28123"
"6/18/2020","1592438400","28974"
"6/19/2020","1592524800","30653"
"6/20/2020","1592611200","31027"
"6/21/2020","1592697600","34003"
"6/22/2020","1592784000","36756"
"6/23/2020","1592870400","37098"
"6/24/2020","1592956800","38433"
"6/25/2020","1593043200","38239"
"6/26/2020","1593129600","35309"
"6/27/2020","1593216000","36473"
"6/28/2020","1593302400","33612"
"6/29/2020","1593388800","34827"
"6/30/2020","1593475200","34511"
"7/1/2020","1593561600","35255"
"7/2/2020","1593648000","36414"
"7/3/2020","1593734400","35935"
"7/4/2020","1593820800","32081"
"7/5/2020","1593907200","29736"
"7/6/2020","1593993600","34649"
"7/7/2020","1594080000","35739"
"7/8/2020","1594166400","36696"
"7/9/2020","1594252800","36306"
"7/10/2020","1594339200","33660"
"7/11/2020","1594425600","31408"
"7/12/2020","1594512000","33339"
"7/13/2020","1594598400","38813"
"7/14/2020","1594684800","35595"
"7/15/2020","1594771200","36339"
"7/16/2020","1594857600","34885"
"7/17/2020","1594944000","35469"
"7/18/2020","1595030400","37273"
"7/19/2020","1595116800","39012"
"7/20/2020","1595203200","38791"
"7/21/2020","1595289600","38915"
"7/22/2020","1595376000","39086"
"7/23/2020","1595462400","38977"
"7/24/2020","1595548800","40054"
"7/25/2020","1595635200","43155"
"7/26/2020","1595721600","38987"
"7/27/2020","1595808000","42468"
"7/28/2020","1595894400","40420"
"7/29/2020","1595980800","40069"
"7/30/2020","1596067200","40034"
"7/31/2020","1596153600","41294"
"8/1/2020","1596240000","39194"
"8/2/2020","1596326400","38262"
"8/3/2020","1596412800","39135"
"8/4/2020","1596499200","38779"
"8/5/2020","1596585600","39224"
"8/6/2020","1596672000","40071"
"8/7/2020","1596758400","41244"
"8/8/2020","1596844800","40882"
"8/9/2020","1596931200","42761"
"8/10/2020","1597017600","43623"
"8/11/2020","1597104000","42282"
"8/12/2020","1597190400","42490"
"8/13/2020","1597276800","40820"
"8/14/2020","1597363200","41348"
"8/15/2020","1597449600","37635"
"8/16/2020","1597536000","39415"
"8/17/2020","1597622400","40568"
"8/18/2020","1597708800","41973"
"8/19/2020","1597795200","41021"
"8/20/2020","1597881600","40494"
"8/21/2020","1597968000","43296"
"8/22/2020","1598054400","38709"
"8/23/2020","1598140800","37975"
"8/24/2020","1598227200","39426"
"8/25/2020","1598313600","38422"
"8/26/2020","1598400000","38849"
"8/27/2020","1598486400","37975"
"8/28/2020","1598572800","38556"
"8/29/2020","1598659200","39752"
"8/30/2020","1598745600","41266"
"8/31/2020","1598832000","41082"
"9/1/2020","1598918400","41299"
"9/2/2020","1599004800","39767"
"9/3/2020","1599091200","39339"
"9/4/2020","1599177600","37490"
"9/5/2020","1599264000","36170"
"9/6/2020","1599350400","35851"
"9/7/2020","1599436800","36290"
"9/8/2020","1599523200","36065"
"9/9/2020","1599609600","36405"
"9/10/2020","1599696000","39037"
"9/11/2020","1599782400","37013"
"9/12/2020","1599868800","36747"
"9/13/2020","1599955200","37461"
"9/14/2020","1600041600","38902"
"9/15/2020","1600128000","38490"
"9/16/2020","1600214400","37243"
"9/17/2020","1600300800","58953"
"9/18/2020","1600387200","44691"
"9/19/2020","1600473600","39058"
"9/20/2020","1600560000","37327"
"9/21/2020","1600646400","38593"
"9/22/2020","1600732800","40218"
"9/23/2020","1600819200","38870"
"9/24/2020","1600905600","37690"
"9/25/2020","1600992000","37258"
"9/26/2020","1601078400","36638"
"9/27/2020","1601164800","36580"
"9/28/2020","1601251200","38712"
"9/29/2020","1601337600","38831"
"9/30/2020","1601424000","38201"
"10/1/2020","1601510400","36977"
"10/2/2020","1601596800","36763"
"10/3/2020","1601683200","34866"
"10/4/2020","1601769600","37145"
"10/5/2020","1601856000","37933"
"10/6/2020","1601942400","39563"
"10/7/2020","1602028800","37957"
"10/8/2020","1602115200","37115"
"10/9/2020","1602201600","37292"
"10/10/2020","1602288000","35619"
"10/11/2020","1602374400","35265"
"10/12/2020","1602460800","38657"
"10/13/2020","1602547200","38207"
"10/14/2020","1602633600","37253"
"10/15/2020","1602720000","39335"
"10/16/2020","1602806400","37897"
"10/17/2020","1602892800","34983"
"10/18/2020","1602979200","34916"
"10/19/2020","1603065600","38376"
"10/20/2020","1603152000","38673"
"10/21/2020","1603238400","39300"
"10/22/2020","1603324800","39041"
"10/23/2020","1603411200","37597"
"10/24/2020","1603497600","33663"
"10/25/2020","1603584000","33759"
"10/26/2020","1603670400","37969"
"10/27/2020","1603756800","38239"
"10/28/2020","1603843200","39478"
"10/29/2020","1603929600","38598"
"10/30/2020","1604016000","38732"
"10/31/2020","1604102400","37664"
"11/1/2020","1604188800","36823"
"11/2/2020","1604275200","39219"
"11/3/2020","1604361600","38720"
"11/4/2020","1604448000","38593"
"11/5/2020","1604534400","38977"
"11/6/2020","1604620800","40265"
"11/7/2020","1604707200","39353"
"11/8/2020","1604793600","35311"
"11/9/2020","1604880000","39368"
"11/10/2020","1604966400","40206"
"11/11/2020","1605052800","36840"
"11/12/2020","1605139200","37937"
"11/13/2020","1605225600","39425"
"11/14/2020","1605312000","36612"
"11/15/2020","1605398400","36704"
"11/16/2020","1605484800","38425"
"11/17/2020","1605571200","39870"
"11/18/2020","1605657600","38280"
"11/19/2020","1605744000","38221"
"11/20/2020","1605830400","40044"
"11/21/2020","1605916800","40073"
"11/22/2020","1606003200","40163"
"11/23/2020","1606089600","42075"
"11/24/2020","1606176000","41631"
"11/25/2020","1606262400","41409"
"11/26/2020","1606348800","40851"
"11/27/2020","1606435200","38212"
"11/28/2020","1606521600","34215"
"11/29/2020","1606608000","34741"
"11/30/2020","1606694400","40058"
"12/1/2020","1606780800","40453"
"12/2/2020","1606867200","38852"
"12/3/2020","1606953600","40532"
"12/4/2020","1607040000","41262"
"12/5/2020","1607126400","37952"
"12/6/2020","1607212800","38320"
"12/7/2020","1607299200","40459"
"12/8/2020","1607385600","42595"
"12/9/2020","1607472000","40708"
"12/10/2020","1607558400","39910"
"12/11/2020","1607644800","42280"
"12/12/2020","1607731200","36771"
"12/13/2020","1607817600","37847"
"12/14/2020","1607904000","40676"
"12/15/2020","1607990400","40999"
"12/16/2020","1608076800","42017"
"12/17/2020","1608163200","43508"
"12/18/2020","1608249600","40747"
"12/19/2020","1608336000","40848"
"12/20/2020","1608422400","39616"
"12/21/2020","1608508800","42079"
"12/22/2020","1608595200","42003"
"12/23/2020","1608681600","48714"
"12/24/2020","1608768000","42719"
"12/25/2020","1608854400","53908"
"12/26/2020","1608940800","45645"
"12/27/2020","1609027200","45278"
"12/28/2020","1609113600","46018"
"12/29/2020","1609200000","44851"
"12/30/2020","1609286400","43028"
"12/31/2020","1609372800","41259"
"1/1/2021","1609459200","40957"
"1/2/2021","1609545600","40870"
"1/3/2021","1609632000","43196"
"1/4/2021","1609718400","43280"
"1/5/2021","1609804800","43617"
"1/6/2021","1609891200","44121"
"1/7/2021","1609977600","44985"
"1/8/2021","1610064000","43536"
"1/9/2021","1610150400","42520"
"1/10/2021","1610236800","42576"
"1/11/2021","1610323200","45238"
"1/12/2021","1610409600","41753"
"1/13/2021","1610496000","40868"
"1/14/2021","1610582400","42959"
"1/15/2021","1610668800","43197"
"1/16/2021","1610755200","42907"
"1/17/2021","1610841600","42376"
"1/18/2021","1610928000","44473"
"1/19/2021","1611014400","45834"
"1/20/2021","1611100800","43997"
"1/21/2021","1611187200","43868"
"1/22/2021","1611273600","43221"
"1/23/2021","1611360000","42081"
"1/24/2021","1611446400","42593"
"1/25/2021","1611532800","45118"
"1/26/2021","1611619200","44228"
"1/27/2021","1611705600","44547"
"1/28/2021","1611792000","45210"
"1/29/2021","1611878400","46505"
"1/30/2021","1611964800","44634"
"1/31/2021","1612051200","44764"
