gossips,p2p mean,p2p std,p2p min,p2p q1,p2p q2,p2p q3,p2p max,p2s mean,p2s std,p2s min,p2s q1,p2s q2,p2s q3,p2s max,s2s mean,s2s std,s2s min,s2s q1,s2s q2,s2s q3,s2s max
1,49.632,1.2191937226435081,47.6,48.8,49.4,50.6,52.0,58.692,1.4227086841655256,56.1,57.9,58.5,59.4,62.0,0.34243443999999995,0.013981761965980298,0.313514,0.33303299999999997,0.343644,0.352252,0.363163
2,22.019999999999996,1.0778064142816495,20.3,21.2,21.7,22.9,24.8,19.927999999999997,0.9572181917758702,17.8,19.2,20.1,20.8,21.1,0.0002667777777777777,0.00015361049119944883,0.0001,0.0001,0.0003,0.000375,0.000601
3,1.824,0.47546468498371847,0.9,1.5,1.9,2.1,2.6,0.15333333333333335,0.09904304018720249,0.1,0.1,0.1,0.15000000000000002,0.4,,,,,,,
