round,P mean,P std,P min,P q1,P q2,P q3,P max,S mean,S std,S min,S q1,S q2,S q3,S max,P+S mean,P+S std,P+S min,P+S q1,P+S q2,P+S q3,P+S max
0,0.0,0.0,0.0,0.0,0.0,0.0,0.0,0.0,0.0,0.0,0.0,0.0,0.0,0.0,0.0,0.0,0.0,0.0,0.0,0.0,0.0
1,0.0,0.0,0.0,0.0,0.0,0.0,0.0,0.0,0.0,0.0,0.0,0.0,0.0,0.0,0.0,0.0,0.0,0.0,0.0,0.0,0.0
2,0.0,0.0,0.0,0.0,0.0,0.0,0.0,0.0,0.0,0.0,0.0,0.0,0.0,0.0,0.0,0.0,0.0,0.0,0.0,0.0,0.0
3,0.0,0.0,0.0,0.0,0.0,0.0,0.0,0.0,0.0,0.0,0.0,0.0,0.0,0.0,0.0,0.0,0.0,0.0,0.0,0.0,0.0
4,0.0,0.0,0.0,0.0,0.0,0.0,0.0,0.0,0.0,0.0,0.0,0.0,0.0,0.0,0.0,0.0,0.0,0.0,0.0,0.0,0.0
5,0.0,0.0,0.0,0.0,0.0,0.0,0.0,0.0,0.0,0.0,0.0,0.0,0.0,0.0,0.0,0.0,0.0,0.0,0.0,0.0,0.0
6,0.0,0.0,0.0,0.0,0.0,0.0,0.0,0.0,0.0,0.0,0.0,0.0,0.0,0.0,0.0,0.0,0.0,0.0,0.0,0.0,0.0
7,0.0,0.0,0.0,0.0,0.0,0.0,0.0,0.0,0.0,0.0,0.0,0.0,0.0,0.0,0.0,0.0,0.0,0.0,0.0,0.0,0.0
8,0.0,0.0,0.0,0.0,0.0,0.0,0.0,0.0,0.0,0.0,0.0,0.0,0.0,0.0,0.0,0.0,0.0,0.0,0.0,0.0,0.0
9,0.0,0.0,0.0,0.0,0.0,0.0,0.0,0.0,0.0,0.0,0.0,0.0,0.0,0.0,0.0,0.0,0.0,0.0,0.0,0.0,0.0
10,0.0,0.0,0.0,0.0,0.0,0.0,0.0,0.0,0.0,0.0,0.0,0.0,0.0,0.0,0.0,0.0,0.0,0.0,0.0,0.0,0.0
11,0.0,0.0,0.0,0.0,0.0,0.0,0.0,0.0,0.0,0.0,0.0,0.0,0.0,0.0,0.0,0.0,0.0,0.0,0.0,0.0,0.0
12,0.016,0.03741657386773942,0.0,0.0,0.0,0.0,0.1,0.0,0.0,0.0,0.0,0.0,0.0,0.0,1.6e-05,3.7416573867739416e-05,0.0,0.0,0.0,0.0,0.0001
13,0.5319999999999999,0.39551653989856517,0.0,0.2,0.4,0.7,1.9,0.0,0.0,0.0,0.0,0.0,0.0,0.0,0.0005319999999999999,0.00039551653989856525,0.0,0.0002,0.0004,0.0007,0.0019
14,6.3400000000000025,3.0243456592570013,1.2,4.2,5.7,8.3,14.5,0.0,0.0,0.0,0.0,0.0,0.0,0.0,0.00634,0.0030243456592570018,0.0012,0.0042,0.0057,0.0083,0.0145
15,32.624,10.373414738326685,6.3,27.0,30.6,41.1,52.3,0.0,0.0,0.0,0.0,0.0,0.0,0.0,0.032624,0.010373414738326685,0.0063,0.027,0.0306,0.0411,0.0523
16,70.964,13.788397296277763,21.9,65.8,73.0,81.2,86.1,0.0,0.0,0.0,0.0,0.0,0.0,0.0,0.070964,0.013788397296277762,0.0219,0.0658,0.073,0.0812,0.0861
17,92.204,9.44759581410354,49.5,91.2,94.3,97.0,97.8,8e-06,2.768874620972692e-05,0.0,0.0,0.0,0.0,0.0001,0.092212,0.009449793648540686,0.0495,0.0912,0.0943,0.097,0.0978
18,98.19999999999999,4.022644238143197,79.1,98.4,99.1,99.5,99.8,0.0004725199999999999,0.0003438225220468646,0.0,0.0002,0.0005009999999999999,0.000601,0.001301,0.09867199999999998,0.0041393960912191035,0.0792,0.0989,0.0994,0.1001,0.1008
19,99.56400000000002,1.0250528441662583,94.7,99.6,99.8,99.9,100.0,0.02283076,0.015115887975019308,0.004905,0.009409,0.02022,0.029830000000000002,0.05956,0.12237199999999997,0.015473970617351793,0.0999,0.1089,0.1201,0.1297,0.1594
20,99.88400000000001,0.20141168453361064,99.0,99.9,99.9,100.0,100.0,0.6502060799999999,0.406363593879496,0.134234,0.356156,0.513814,0.904905,1.6443439999999998,0.7494400000000002,0.4060230145365325,0.2331,0.4556,0.6133,1.0039,1.7427
21,99.92400000000002,0.11647603473104265,99.5,99.9,100.0,100.0,100.0,7.61715312,3.6786041111479855,1.58038,5.488989,6.521822,10.764264,16.163864,7.709459999999999,3.674962272028562,1.6783,5.5834,6.6153,10.8535,16.2477
22,99.95200000000003,0.07141428428542507,99.7,99.9,100.0,100.0,100.0,35.230030119999995,11.300158963278175,8.383283,29.574775,33.791792,44.651952,53.795696,35.294751999999995,11.288862627132405,8.4749,29.6449,33.858,44.7072,53.8419
23,99.95200000000003,0.07141428428542507,99.7,99.9,100.0,100.0,100.0,73.00238632,13.287086464458561,25.815115,68.54024,75.134835,82.47057099999999,86.569069,73.029336,13.273798441914304,25.8893,68.5714,75.1597,82.488,86.5825
24,99.95200000000003,0.07141428428542507,99.7,99.9,100.0,100.0,100.0,92.94388387999999,8.122852922011907,56.598999,92.751652,95.234134,96.771872,97.647247,92.95089200000001,8.114723310179262,56.6424,92.7588,95.2389,96.775,97.6495
25,99.95200000000003,0.07141428428542507,99.7,99.9,100.0,100.0,100.0,98.54200208000002,2.688092301256628,85.883083,98.7998,99.237638,99.456757,99.60470500000001,98.54341199999999,2.6853955418336413,85.8972,98.8009,99.2384,99.4572,99.605
26,99.95200000000003,0.07141428428542507,99.7,99.9,100.0,100.0,100.0,99.72140136000002,0.48672066765572924,97.415616,99.778378,99.84614599999999,99.876777,99.896496,99.72163199999999,0.48622513965583347,97.4182,99.7785,99.8463,99.8768,99.8966
27,99.95200000000003,0.07141428428542507,99.7,99.9,100.0,100.0,100.0,99.91881488000001,0.07060163029947082,99.584585,99.926627,99.936837,99.941642,99.947748,99.91884799999998,0.07052248530315151,99.585,99.9266,99.9369,99.9417,99.9478
28,99.95200000000003,0.07141428428542507,99.7,99.9,100.0,100.0,100.0,99.9488968,0.010227530632237688,99.901101,99.949149,99.951051,99.952152,99.956356,99.94890000000001,0.010208289115552199,99.9012,99.9492,99.9511,99.9521,99.9564
29,99.95200000000003,0.07141428428542507,99.7,99.9,100.0,100.0,100.0,99.95406603999999,0.002090674621581543,99.948348,99.952753,99.954054,99.95525500000001,99.958959,99.95406400000002,0.0020902312471740058,99.9484,99.9528,99.954,99.9552,99.959
30,99.95200000000003,0.07141428428542507,99.7,99.9,100.0,100.0,100.0,99.95503108000001,0.0019404186386783211,99.952252,99.953754,99.954555,99.95585600000001,99.95985999999999,99.955028,0.0019473315074742936,99.9523,99.9537,99.9546,99.9558,99.9599
31,99.95200000000003,0.07141428428542507,99.7,99.9,100.0,100.0,100.0,99.95519528000001,0.0021456094612009938,99.952252,99.953754,99.954655,99.95615600000001,99.960561,99.95519200000001,0.0021532765730430327,99.9523,99.9537,99.9547,99.9562,99.9606
32,99.95200000000003,0.07141428428542507,99.7,99.9,100.0,100.0,100.0,99.95520728,0.002177471689826907,99.952252,99.953754,99.954655,99.95615600000001,99.960861,99.95520400000001,0.0021852688621757516,99.9523,99.9537,99.9547,99.9562,99.9609
33,99.95200000000003,0.07141428428542507,99.7,99.9,100.0,100.0,100.0,99.95520728,0.002177471689826907,99.952252,99.953754,99.954655,99.95615600000001,99.960861,99.95520400000001,0.0021852688621757516,99.9523,99.9537,99.9547,99.9562,99.9609
34,99.95200000000003,0.07141428428542507,99.7,99.9,100.0,100.0,100.0,99.95520728,0.002177471689826907,99.952252,99.953754,99.954655,99.95615600000001,99.960861,99.95520400000001,0.0021852688621757516,99.9523,99.9537,99.9547,99.9562,99.9609
35,99.95200000000003,0.07141428428542507,99.7,99.9,100.0,100.0,100.0,99.95520728,0.002177471689826907,99.952252,99.953754,99.954655,99.95615600000001,99.960861,99.95520400000001,0.0021852688621757516,99.9523,99.9537,99.9547,99.9562,99.9609
36,99.95200000000003,0.07141428428542507,99.7,99.9,100.0,100.0,100.0,99.95520728,0.002177471689826907,99.952252,99.953754,99.954655,99.95615600000001,99.960861,99.95520400000001,0.0021852688621757516,99.9523,99.9537,99.9547,99.9562,99.9609
37,99.95200000000003,0.07141428428542507,99.7,99.9,100.0,100.0,100.0,99.95520728,0.002177471689826907,99.952252,99.953754,99.954655,99.95615600000001,99.960861,99.95520400000001,0.0021852688621757516,99.9523,99.9537,99.9547,99.9562,99.9609
38,99.95200000000003,0.07141428428542507,99.7,99.9,100.0,100.0,100.0,99.95520728,0.002177471689826907,99.952252,99.953754,99.954655,99.95615600000001,99.960861,99.95520400000001,0.0021852688621757516,99.9523,99.9537,99.9547,99.9562,99.9609
39,99.95200000000003,0.07141428428542507,99.7,99.9,100.0,100.0,100.0,99.95520728,0.002177471689826907,99.952252,99.953754,99.954655,99.95615600000001,99.960861,99.95520400000001,0.0021852688621757516,99.9523,99.9537,99.9547,99.9562,99.9609
40,99.95200000000003,0.07141428428542507,99.7,99.9,100.0,100.0,100.0,99.95520728,0.002177471689826907,99.952252,99.953754,99.954655,99.95615600000001,99.960861,99.95520400000001,0.0021852688621757516,99.9523,99.9537,99.9547,99.9562,99.9609
41,99.95200000000003,0.07141428428542507,99.7,99.9,100.0,100.0,100.0,99.95520728,0.002177471689826907,99.952252,99.953754,99.954655,99.95615600000001,99.960861,99.95520400000001,0.0021852688621757516,99.9523,99.9537,99.9547,99.9562,99.9609
42,99.95200000000003,0.07141428428542507,99.7,99.9,100.0,100.0,100.0,99.95520728,0.002177471689826907,99.952252,99.953754,99.954655,99.95615600000001,99.960861,99.95520400000001,0.0021852688621757516,99.9523,99.9537,99.9547,99.9562,99.9609
43,99.95200000000003,0.07141428428542507,99.7,99.9,100.0,100.0,100.0,99.95520728,0.002177471689826907,99.952252,99.953754,99.954655,99.95615600000001,99.960861,99.95520400000001,0.0021852688621757516,99.9523,99.9537,99.9547,99.9562,99.9609
44,99.95200000000003,0.07141428428542507,99.7,99.9,100.0,100.0,100.0,99.95520728,0.002177471689826907,99.952252,99.953754,99.954655,99.95615600000001,99.960861,99.95520400000001,0.0021852688621757516,99.9523,99.9537,99.9547,99.9562,99.9609
45,99.95200000000003,0.07141428428542507,99.7,99.9,100.0,100.0,100.0,99.95520728,0.002177471689826907,99.952252,99.953754,99.954655,99.95615600000001,99.960861,99.95520400000001,0.0021852688621757516,99.9523,99.9537,99.9547,99.9562,99.9609
46,99.95200000000003,0.07141428428542507,99.7,99.9,100.0,100.0,100.0,99.95520728,0.002177471689826907,99.952252,99.953754,99.954655,99.95615600000001,99.960861,99.95520400000001,0.0021852688621757516,99.9523,99.9537,99.9547,99.9562,99.9609
47,99.95200000000003,0.07141428428542507,99.7,99.9,100.0,100.0,100.0,99.95520728,0.002177471689826907,99.952252,99.953754,99.954655,99.95615600000001,99.960861,99.95520400000001,0.0021852688621757516,99.9523,99.9537,99.9547,99.9562,99.9609
48,99.95200000000003,0.07141428428542507,99.7,99.9,100.0,100.0,100.0,99.95520728,0.002177471689826907,99.952252,99.953754,99.954655,99.95615600000001,99.960861,99.95520400000001,0.0021852688621757516,99.9523,99.9537,99.9547,99.9562,99.9609
49,99.95200000000003,0.07141428428542507,99.7,99.9,100.0,100.0,100.0,99.95520728,0.002177471689826907,99.952252,99.953754,99.954655,99.95615600000001,99.960861,99.95520400000001,0.0021852688621757516,99.9523,99.9537,99.9547,99.9562,99.9609
50,99.95200000000003,0.07141428428542507,99.7,99.9,100.0,100.0,100.0,99.95520728,0.002177471689826907,99.952252,99.953754,99.954655,99.95615600000001,99.960861,99.95520400000001,0.0021852688621757516,99.9523,99.9537,99.9547,99.9562,99.9609
