round,Simple mean,Simple std,Simple min,Simple q1,Simple q2,Simple q3,Simple max
0,100.0,0.0,100.0,100.0,100.0,100.0,100.0
1,99.99989999999998,0.0,99.9999,99.9999,99.9999,99.9999,99.9999
2,99.99879999999999,0.0,99.9988,99.9988,99.9988,99.9988,99.9988
3,99.98770799999998,3.999999999846902e-05,99.9876,99.9877,99.9877,99.9877,99.9878
4,99.87546399999998,0.000420198365854654,99.8749,99.8752,99.8753,99.8756,99.8769
5,98.85930799999997,0.00769111608719199,98.8504,98.8544,98.8576,98.8621,98.8897
6,95.191944,0.02040584230067589,95.1493,95.1784,95.1906,95.2076,95.2388
7,95.09908800000001,0.022039024479318218,95.0527,95.0877,95.0966,95.1116,95.1539
8,95.09625999999999,0.01744878219246246,95.0638,95.0838,95.0966,95.1006,95.1498
9,95.09339200000001,0.02155330446436005,95.0576,95.0824,95.0924,95.0983,95.1659
10,95.080696,0.028138429830630925,95.0311,95.0625,95.0757,95.092,95.1518
11,95.072232,0.026620006887056354,95.0167,95.0603,95.0711,95.0868,95.1483
12,95.094272,0.02471693953546879,95.0618,95.0763,95.0909,95.1006,95.1611
13,95.196844,0.027463461787128957,95.1542,95.1766,95.1905,95.2057,95.2608
14,96.203088,0.026461754162058832,96.1469,96.1854,96.1989,96.2197,96.2717
15,99.86818399999999,0.0029114257675603105,99.8616,99.866,99.8687,99.8696,99.8738
16,99.95859599999999,0.0019136527027289567,99.9546,99.9576,99.9581,99.9599,99.9617
17,99.95869199999999,0.0019159244939874862,99.9547,99.9577,99.9582,99.96,99.9619
18,99.95869199999999,0.0019159244939874862,99.9547,99.9577,99.9582,99.96,99.9619
19,99.95869199999999,0.0019159244939874862,99.9547,99.9577,99.9582,99.96,99.9619
20,99.95869199999999,0.0019159244939874862,99.9547,99.9577,99.9582,99.96,99.9619
21,99.95869199999999,0.0019159244939874862,99.9547,99.9577,99.9582,99.96,99.9619
22,99.95869199999999,0.0019159244939874862,99.9547,99.9577,99.9582,99.96,99.9619
23,99.95869199999999,0.0019159244939874862,99.9547,99.9577,99.9582,99.96,99.9619
24,99.95869199999999,0.0019159244939874862,99.9547,99.9577,99.9582,99.96,99.9619
