gossips,p2p mean,p2p std,p2p min,p2p q1,p2p q2,p2p q3,p2p max,p2s mean,p2s std,p2s min,p2s q1,p2s q2,p2s q3,p2s max,s2s mean,s2s std,s2s min,s2s q1,s2s q2,s2s q3,s2s max
1,0.1416,0.0414004830889689,0.07,0.11,0.14,0.16,0.23,1.0316,0.14432832939747714,0.64,0.93,1.05,1.12,1.31,53.65273524,0.18225724842816965,53.26959599999999,53.561212,53.664646,53.774242,54.084141
2,,,,,,,,,,,,,,,20.66421412,0.23603026403643745,20.270505,20.447879,20.60697,20.802222,21.210909
3,,,,,,,,,,,,,,,0.48381816,0.02449200988023101,0.44232299999999997,0.470505,0.485051,0.496364,0.538384
4,,,,,,,,,,,,,,,,,,,,,
5,,,,,,,,,,,,,,,,,,,,,
