round,Simple mean,Simple std,Simple min,Simple q1,Simple median,Simple q3,Simple max
0,100.0,0.0,100.0,100.0,100.0,100.0,100.0
1,100.0,0.0,100.0,100.0,100.0,100.0,100.0
2,100.0,0.0,100.0,100.0,100.0,100.0,100.0
3,100.0,0.0,100.0,100.0,100.0,100.0,100.0
4,100.0,0.0,100.0,100.0,100.0,100.0,100.0
5,99.99990399999999,3.440930106931278e-05,99.9998,99.9999,99.9999,99.9999,100.0
6,99.99960800000002,0.0001293676930299365,99.9993,99.9995,99.9996,99.9997,99.9998
7,99.999984,3.666060556086373e-05,99.9999,100.0,100.0,100.0,100.0
8,100.0,0.0,100.0,100.0,100.0,100.0,100.0
9,99.99995599999998,6.374950980415319e-05,99.9998,99.9999,100.0,100.0,100.0
10,99.99945199999998,0.0002670131082911887,99.9989,99.9992,99.9995,99.9996,99.9999
11,99.99684400000002,0.0006615617884967249,99.9955,99.9963,99.9969,99.9974,99.9979
12,99.99546799999999,0.0008278743866086803,99.9934,99.9951,99.9953,99.9961,99.997
13,99.99548399999999,0.0008230091129521992,99.9934,99.9952,99.9954,99.9961,99.997
14,99.99545599999999,0.0007950245279241024,99.9934,99.9952,99.9954,99.996,99.997
15,99.994908,0.0008503740353522034,99.9928,99.9944,99.9948,99.9957,99.9967
16,99.99231599999997,0.0010106156539458188,99.9899,99.9918,99.9923,99.9927,99.9945
17,99.99090800000002,0.001149928693441851,99.9882,99.9904,99.991,99.9915,99.9937
18,99.9909,0.001148564321229166,99.9882,99.9905,99.9909,99.9914,99.9937
19,99.99085599999998,0.0011356337437741415,99.9882,99.9905,99.9908,99.9914,99.9936
20,99.990332,0.0011073283162651639,99.9879,99.9897,99.9904,99.9908,99.9928
21,99.98742800000002,0.001194828858037677,99.9854,99.9866,99.9873,99.988,99.9908
22,99.98631999999999,0.0012374166638609732,99.9845,99.9853,99.9862,99.987,99.9895
23,99.98632800000001,0.0012314284388468,99.9845,99.9853,99.9862,99.987,99.9895
24,99.98628000000001,0.001250279968648037,99.9844,99.9853,99.9862,99.9869,99.9895
25,99.98573199999998,0.0012667185954261463,99.9836,99.985,99.9857,99.9863,99.9887
26,99.98301599999999,0.001427355596899913,99.9798,99.9823,99.9831,99.9836,99.9862
27,99.98160799999998,0.0015157625143796046,99.9787,99.9805,99.9818,99.9827,99.9845
28,99.98162799999999,0.0015101046321362485,99.9787,99.9805,99.9819,99.9827,99.9845
29,99.98156399999999,0.001514167758209059,99.9786,99.9805,99.9818,99.9826,99.9844
30,99.98105999999999,0.001532318504750334,99.9782,99.9802,99.9813,99.982,99.9838
31,99.97820000000003,0.0017001176429881056,99.9755,99.9771,99.9786,99.9793,99.9815
32,99.97712000000001,0.0016451139778145569,99.9745,99.9764,99.9777,99.978,99.9805
33,99.97712400000002,0.0016582593283326656,99.9745,99.9764,99.9777,99.978,99.9805
34,99.97706399999998,0.0016620180504428323,99.9744,99.9763,99.9777,99.978,99.9804
35,99.97659599999999,0.0016515398874997155,99.9738,99.976,99.9769,99.9777,99.98
36,99.97370000000001,0.0017850490189364574,99.9697,99.9728,99.9741,99.9749,99.977
37,99.972412,0.0016731574940819125,99.9694,99.9711,99.9729,99.9736,99.9759
38,99.97243200000001,0.0016675059220294863,99.9694,99.9713,99.9729,99.9736,99.9759
39,99.97240400000001,0.001684394253136396,99.9692,99.9713,99.9729,99.9736,99.9759
40,99.971936,0.001756332542543869,99.9683,99.9706,99.9724,99.973,99.9756
41,99.96918799999999,0.001893424410954047,99.9651,99.9683,99.9695,99.9703,99.9735
42,99.967892,0.0018139283337539921,99.9636,99.9668,99.9681,99.969,99.9717
43,99.96791200000001,0.0018214982843786907,99.9636,99.9669,99.968,99.9691,99.9717
44,99.96788000000001,0.001812622409657664,99.9636,99.9669,99.968,99.9691,99.9716
45,99.96740399999997,0.0017651016967887832,99.9634,99.9665,99.9676,99.9687,99.971
46,99.964732,0.001837328495396935,99.9611,99.964,99.9648,99.9657,99.9693
47,99.963412,0.0019008040403991617,99.9595,99.9622,99.9638,99.9645,99.9678
48,99.963416,0.0018924439225495742,99.9595,99.9622,99.9638,99.9645,99.9677
49,99.963364,0.0018825259626353164,99.9595,99.9622,99.9637,99.9645,99.9677
50,99.96294400000002,0.0018350106266723338,99.9593,99.962,99.9634,99.9641,99.9672
51,99.96050799999998,0.0018840212313016467,99.9565,99.9594,99.9608,99.9615,99.965
52,99.958948,0.0019231474202463558,99.9552,99.958,99.9591,99.9597,99.9637
53,99.95894399999999,0.0019239708937508128,99.9552,99.958,99.9591,99.9597,99.9637
54,99.95894399999999,0.0019239708937508128,99.9552,99.958,99.9591,99.9597,99.9637
55,99.95894399999999,0.0019239708937508128,99.9552,99.958,99.9591,99.9597,99.9637
56,99.95894399999999,0.0019239708937508128,99.9552,99.958,99.9591,99.9597,99.9637
57,99.95894399999999,0.0019239708937508128,99.9552,99.958,99.9591,99.9597,99.9637
58,99.95894399999999,0.0019239708937508128,99.9552,99.958,99.9591,99.9597,99.9637
59,99.95894399999999,0.0019239708937508128,99.9552,99.958,99.9591,99.9597,99.9637
60,99.95894399999999,0.0019239708937508128,99.9552,99.958,99.9591,99.9597,99.9637
61,99.95894399999999,0.0019239708937508128,99.9552,99.958,99.9591,99.9597,99.9637
62,99.95894399999999,0.0019239708937508128,99.9552,99.958,99.9591,99.9597,99.9637
63,99.95894399999999,0.0019239708937508128,99.9552,99.958,99.9591,99.9597,99.9637
64,99.95894399999999,0.0019239708937508128,99.9552,99.958,99.9591,99.9597,99.9637
65,99.95894399999999,0.0019239708937508128,99.9552,99.958,99.9591,99.9597,99.9637
66,99.95894399999999,0.0019239708937508128,99.9552,99.958,99.9591,99.9597,99.9637
67,99.95894399999999,0.0019239708937508128,99.9552,99.958,99.9591,99.9597,99.9637
68,99.95894399999999,0.0019239708937508128,99.9552,99.958,99.9591,99.9597,99.9637
69,99.95894399999999,0.0019239708937508128,99.9552,99.958,99.9591,99.9597,99.9637
70,99.95894399999999,0.0019239708937508128,99.9552,99.958,99.9591,99.9597,99.9637
71,99.95894399999999,0.0019239708937508128,99.9552,99.958,99.9591,99.9597,99.9637
72,99.95894399999999,0.0019239708937508128,99.9552,99.958,99.9591,99.9597,99.9637
73,99.95894399999999,0.0019239708937508128,99.9552,99.958,99.9591,99.9597,99.9637
