gossips,p2p mean,p2p std,p2p min,p2p q1,p2p q2,p2p q3,p2p max,p2s mean,p2s std,p2s min,p2s q1,p2s q2,p2s q3,p2s max,s2s mean,s2s std,s2s min,s2s q1,s2s q2,s2s q3,s2s max
1,10.228399999999999,0.1357288964566256,10.0,10.12,10.22,10.32,10.57,0.5732,0.06986415389883426,0.42,0.53,0.57,0.61,0.69,0.001346666666666667,0.000657852336751719,0.00101,0.00101,0.00101,0.0012625000000000002,0.00303
2,0.10679999999999999,0.031585861816114294,0.05,0.09,0.11,0.12,0.17,,,,,,,,,,,,,,
3,,,,,,,,,,,,,,,,,,,,,
