round,nodes,nodesP,nodesS,nodesSent,nodesSentP,nodesSentS,nodesRecv,nodesRecvP,nodesRecvS,msgSent,msgSentP,msgSentS,msgRecv,msgRecvP,msgRecvS,msgInfect,msgInfectP,msgInfectS
0,1000000.0,900000.0,100000.0,0.0,0.0,0.0,0.0,0.0,0.0,0.0,0.0,0.0,0.0,0.0,0.0,0.0,0.0,0.0
1,1000000.0,900000.0,100000.0,0.000108,0.00011988,0.0,0.000108,0.00011988,0.0,10.8,10.8,0.0,1.08,1.08,0.0,0.9,1.0,0.0
2,1000000.0,900000.0,100000.0,0.001148,0.00127528,0.0,0.001148,0.00127528,0.0,114.8,114.8,0.0,11.48,11.48,0.0,0.9,1.0,0.0
3,1000000.0,900000.0,100000.0,0.01188,0.01319992,0.0,0.01188,0.01319992,0.0,1188.0,1188.0,0.0,118.8,118.8,0.0,0.9,1.0,0.0
4,1000000.0,900000.0,100000.0,0.117112,0.13012448,0.0,0.117112,0.13012448,0.0,11711.2,11711.2,0.0,1171.96,1171.96,0.0,0.9,1.0,0.0
5,1000000.0,900000.0,100000.0,1.165012,1.2944578,0.0,1.165012,1.2944578,0.0,116501.2,116501.2,0.0,11724.72,11724.72,0.0,0.9,1.0,0.0
6,1000000.0,900000.0,100000.0,10.96636,12.18484448,0.0,10.96636,12.18484448,0.0,1096636.0,1096636.0,0.0,116927.24,116927.24,0.0,0.9,1.0,0.0
7,1000000.0,900000.0,100000.0,63.832008,69.09529772,16.4624,63.832008,69.09529772,16.4624,6383200.8,6218576.8,164624.0,1074855.12,1056815.04,18040.08,1.0,1.0,1.0
8,1000000.0,900000.0,100000.0,98.348016,98.16446224,100.0,98.348016,98.16446224,100.0,9834801.6,8834801.6,1000000.0,6188286.88,3600691.4,2587595.48,6.1,4.0,25.0
9,1000000.0,900000.0,100000.0,98.348016,98.16446224,100.0,98.348016,98.16446224,100.0,9834801.6,8834801.6,1000000.0,9834802.6,3600691.4,6234111.2,9.8,4.0,62.0
10,1000000.0,900000.0,100000.0,98.348016,98.16446224,100.0,98.348016,98.16446224,100.0,9834801.6,8834801.6,1000000.0,9834802.6,3600691.4,6234111.2,9.8,4.0,62.0
11,1000000.0,900000.0,100000.0,98.348016,98.16446224,100.0,98.348016,98.16446224,100.0,9834801.6,8834801.6,1000000.0,9834802.6,3600691.4,6234111.2,9.8,4.0,62.0
12,1000000.0,900000.0,100000.0,98.348016,98.16446224,100.0,98.348016,98.16446224,100.0,9834801.6,8834801.6,1000000.0,9834802.6,3600691.4,6234111.2,9.8,4.0,62.0
13,1000000.0,900000.0,100000.0,98.348016,98.16446224,100.0,98.348016,98.16446224,100.0,9834801.6,8834801.6,1000000.0,9834802.6,3600691.4,6234111.2,9.8,4.0,62.0
14,1000000.0,900000.0,100000.0,98.348016,98.16446224,100.0,98.348016,98.16446224,100.0,9834801.6,8834801.6,1000000.0,9834802.6,3600691.4,6234111.2,9.8,4.0,62.0
15,1000000.0,900000.0,100000.0,98.348016,98.16446224,100.0,98.348016,98.16446224,100.0,9834801.6,8834801.6,1000000.0,9834802.6,3600691.4,6234111.2,9.8,4.0,62.0
16,1000000.0,900000.0,100000.0,98.348016,98.16446224,100.0,98.348016,98.16446224,100.0,9834801.6,8834801.6,1000000.0,9834802.6,3600691.4,6234111.2,9.8,4.0,62.0
17,1000000.0,900000.0,100000.0,98.348016,98.16446224,100.0,98.348016,98.16446224,100.0,9834801.6,8834801.6,1000000.0,9834802.6,3600691.4,6234111.2,9.8,4.0,62.0
18,1000000.0,900000.0,100000.0,98.348016,98.16446224,100.0,98.348016,98.16446224,100.0,9834801.6,8834801.6,1000000.0,9834802.6,3600691.4,6234111.2,9.8,4.0,62.0
19,1000000.0,900000.0,100000.0,98.348016,98.16446224,100.0,98.348016,98.16446224,100.0,9834801.6,8834801.6,1000000.0,9834802.6,3600691.4,6234111.2,9.8,4.0,62.0
