round,P mean,P std,P min,P q1,P q2,P q3,P max,S mean,S std,S min,S q1,S q2,S q3,S max,P+S mean,P+S std,P+S min,P+S q1,P+S q2,P+S q3,P+S max
0,0.0,0.0,0.0,0.0,0.0,0.0,0.0,0.0,0.0,0.0,0.0,0.0,0.0,0.0,0.0,0.0,0.0,0.0,0.0,0.0,0.0
1,0.0,0.0,0.0,0.0,0.0,0.0,0.0,0.0,0.0,0.0,0.0,0.0,0.0,0.0,0.0,0.0,0.0,0.0,0.0,0.0,0.0
2,0.0,0.0,0.0,0.0,0.0,0.0,0.0,0.0,0.0,0.0,0.0,0.0,0.0,0.0,0.0,0.0,0.0,0.0,0.0,0.0,0.0
3,0.0,0.0,0.0,0.0,0.0,0.0,0.0,0.0,0.0,0.0,0.0,0.0,0.0,0.0,0.0,0.0,0.0,0.0,0.0,0.0,0.0
4,0.0,0.0,0.0,0.0,0.0,0.0,0.0,0.0,0.0,0.0,0.0,0.0,0.0,0.0,0.0,0.0,0.0,0.0,0.0,0.0,0.0
5,0.0,0.0,0.0,0.0,0.0,0.0,0.0,0.0,0.0,0.0,0.0,0.0,0.0,0.0,0.0,0.0,0.0,0.0,0.0,0.0,0.0
6,0.0,0.0,0.0,0.0,0.0,0.0,0.0,0.0,0.0,0.0,0.0,0.0,0.0,0.0,0.0,0.0,0.0,0.0,0.0,0.0,0.0
7,0.0,0.0,0.0,0.0,0.0,0.0,0.0,0.0,0.0,0.0,0.0,0.0,0.0,0.0,0.0,0.0,0.0,0.0,0.0,0.0,0.0
8,0.0,0.0,0.0,0.0,0.0,0.0,0.0,0.0,0.0,0.0,0.0,0.0,0.0,0.0,0.0,0.0,0.0,0.0,0.0,0.0,0.0
9,0.0,0.0,0.0,0.0,0.0,0.0,0.0,0.0,0.0,0.0,0.0,0.0,0.0,0.0,0.0,0.0,0.0,0.0,0.0,0.0,0.0
10,0.0,0.0,0.0,0.0,0.0,0.0,0.0,0.0,0.0,0.0,0.0,0.0,0.0,0.0,0.0,0.0,0.0,0.0,0.0,0.0,0.0
11,0.00012,0.00033166247903553995,0.0,0.0,0.0,0.0,0.001,0.0,0.0,0.0,0.0,0.0,0.0,0.0,1.2e-05,3.3166247903554e-05,0.0,0.0,0.0,0.0,0.0001
12,0.083,0.008215838362577494,0.062,0.078,0.083,0.089,0.099,0.0,0.0,0.0,0.0,0.0,0.0,0.0,0.0083,0.0008215838362577493,0.0062,0.0078,0.0083,0.0089,0.0099
13,7.05208,0.11136760450567909,6.659,7.017,7.078,7.128,7.17,0.0,0.0,0.0,0.0,0.0,0.0,0.0,0.705208,0.011136760450567898,0.6659,0.7017,0.7078,0.7128,0.717
14,65.39031999999999,0.28850154823385893,64.357,65.339,65.462,65.535,65.749,4.440000000000001e-06,2.2200000000000004e-05,0.0,0.0,0.0,0.0,0.00011100000000000001,6.539035999999999,0.028847802920384365,6.4357,6.5339,6.5462,6.5535,6.5749
15,99.80908000000001,0.01638322312611373,99.774,99.802,99.808,99.817,99.849,0.5145600399999999,0.06307368307482393,0.293,0.518778,0.529667,0.539667,0.5675560000000001,10.444012,0.05645192143172205,10.2454,10.45,10.4573,10.4669,10.4906
16,99.95572,0.00739662085009236,99.944,99.949,99.953,99.961,99.968,60.560875560000014,0.2888580944577417,59.42933299999999,60.508444,60.626889,60.701221999999994,60.963333,64.50035999999999,0.2598829335809986,63.4825,64.4544,64.5591,64.6261,64.8623
17,99.95572,0.00739662085009236,99.944,99.949,99.953,99.961,99.968,99.90016,0.00406722738279544,99.894444,99.897444,99.899333,99.90244399999999,99.908889,99.905716,0.003616706605007215,99.9005,99.9035,99.9056,99.9075,99.9133
18,99.95572,0.00739662085009236,99.944,99.949,99.953,99.961,99.968,99.98464439999998,0.0011421678583569243,99.982333,99.983889,99.984778,99.985111,99.987444,99.981752,0.0012754476338362364,99.9796,99.9809,99.9818,99.9827,99.984
19,99.95572,0.00739662085009236,99.944,99.949,99.953,99.961,99.968,99.98466219999999,0.0011273972606549573,99.982444,99.984,99.984778,99.985222,99.987444,99.98176800000002,0.0012723731108964416,99.9796,99.9809,99.9818,99.9827,99.984
20,99.95572,0.00739662085009236,99.944,99.949,99.953,99.961,99.968,99.98466219999999,0.0011273972606549573,99.982444,99.984,99.984778,99.985222,99.987444,99.98176800000002,0.0012723731108964416,99.9796,99.9809,99.9818,99.9827,99.984
21,99.95572,0.00739662085009236,99.944,99.949,99.953,99.961,99.968,99.98466219999999,0.0011273972606549573,99.982444,99.984,99.984778,99.985222,99.987444,99.98176800000002,0.0012723731108964416,99.9796,99.9809,99.9818,99.9827,99.984
22,99.95572,0.00739662085009236,99.944,99.949,99.953,99.961,99.968,99.98466219999999,0.0011273972606549573,99.982444,99.984,99.984778,99.985222,99.987444,99.98176800000002,0.0012723731108964416,99.9796,99.9809,99.9818,99.9827,99.984
23,99.95572,0.00739662085009236,99.944,99.949,99.953,99.961,99.968,99.98466219999999,0.0011273972606549573,99.982444,99.984,99.984778,99.985222,99.987444,99.98176800000002,0.0012723731108964416,99.9796,99.9809,99.9818,99.9827,99.984
24,99.95572,0.00739662085009236,99.944,99.949,99.953,99.961,99.968,99.98466219999999,0.0011273972606549573,99.982444,99.984,99.984778,99.985222,99.987444,99.98176800000002,0.0012723731108964416,99.9796,99.9809,99.9818,99.9827,99.984
25,99.95572,0.00739662085009236,99.944,99.949,99.953,99.961,99.968,99.98466219999999,0.0011273972606549573,99.982444,99.984,99.984778,99.985222,99.987444,99.98176800000002,0.0012723731108964416,99.9796,99.9809,99.9818,99.9827,99.984
