gossips,p2p mean,p2p std,p2p min,p2p q1,p2p q2,p2p q3,p2p max,p2s mean,p2s std,p2s min,p2s q1,p2s q2,p2s q3,p2s max,s2s mean,s2s std,s2s min,s2s q1,s2s q2,s2s q3,s2s max
1,31.477160000000005,3.3805838460242343,24.021,29.622,31.916,34.054,37.138,10.5218,4.355146744561734,4.173,7.911,9.714,13.417,22.96,0.6614133199999999,0.39871108431729935,0.19711099999999998,0.394444,0.567667,0.811667,1.897444
2,4.0382,1.179791224468691,1.843,3.215,3.782,4.845,6.134,0.14296,0.09663224099647076,0.025,0.058,0.102,0.223,0.343,0.00041655,0.0003302189823674428,0.00011100000000000001,0.00022200000000000003,0.0002775,0.00058375,0.001333
3,0.16996,0.08930121313099093,0.046,0.114,0.141,0.201,0.397,0.0014285714285714288,0.0007867957924694431,0.001,0.001,0.001,0.0015,0.003,,,,,,,
4,0.0026190476190476202,0.0019358768162305803,0.001,0.001,0.002,0.003,0.008,,,,,,,,,,,,,,
5,,,,,,,,,,,,,,,,,,,,,
6,,,,,,,,,,,,,,,,,,,,,
7,,,,,,,,,,,,,,,,,,,,,
