gossips,p2p mean,p2p std,p2p min,p2p q1,p2p q2,p2p q3,p2p max,p2s mean,p2s std,p2s min,p2s q1,p2s q2,p2s q3,p2s max,s2s mean,s2s std,s2s min,s2s q1,s2s q2,s2s q3,s2s max
1,,,,,,,,,,,,,,,2.44968088,0.10727597376250346,2.185253,2.3870709999999997,2.4557580000000003,2.502828,2.727879
2,,,,,,,,,,,,,,,0.0001313,6.816980432876584e-05,0.000101,0.000101,0.000101,0.000101,0.000303
3,,,,,,,,,,,,,,,,,,,,,
