gossips,p2p mean,p2p std,p2p min,p2p q1,p2p q2,p2p q3,p2p max,p2s mean,p2s std,p2s min,p2s q1,p2s q2,p2s q3,p2s max,s2s mean,s2s std,s2s min,s2s q1,s2s q2,s2s q3,s2s max
1,49.443999999999996,1.7781263547153598,46.2,48.2,49.2,50.4,52.5,42.983999999999995,2.029302014651014,39.0,41.6,42.8,44.6,46.4,54.320824840000014,0.8142018392415402,52.411211,53.858258,54.43093100000001,54.802402,55.626326
2,22.063999999999997,1.3127198228614256,18.0,21.4,22.3,22.9,24.4,5.676,0.9444045743218317,3.8,5.2,5.5,6.2,7.4,19.64067276,0.9760666054345496,18.16977,18.678879000000002,19.800501,20.247648,21.616517
3,2.1959999999999997,0.3259345537578569,1.6,2.0,2.2,2.3,2.9,0.10000000000000002,0.0,0.1,0.1,0.1,0.1,0.1,2.0663862799999997,0.2239370343466216,1.7080080000000002,1.896096,2.0964959999999997,2.218919,2.52032
4,0.1142857142857143,0.03779644730092272,0.1,0.1,0.1,0.1,0.2,,,,,,,,0.033705799999999994,0.004677716020310198,0.025626,0.031731999999999996,0.034234,0.036036,0.044645
5,,,,,,,,,,,,,,,0.0001750625,0.0001392482046562899,0.0001,0.0001,0.0001,0.0002,0.000601
