gossips,p2p mean,p2p std,p2p min,p2p q1,p2p q2,p2p q3,p2p max,p2s mean,p2s std,p2s min,p2s q1,p2s q2,p2s q3,p2s max,s2s mean,s2s std,s2s min,s2s q1,s2s q2,s2s q3,s2s max
1,49.634800000000006,0.5626212461920252,48.68,49.24,49.6,50.08,50.74,58.1592,0.40804329835610875,57.32,57.93,58.17,58.49,58.8,52.56710708,0.14656599910504242,52.306566,52.473838,52.569192,52.649899,52.838788
2,21.8296,0.3432744286038985,20.85,21.71,21.82,21.95,22.62,20.4404,0.4109894564746563,19.8,20.11,20.49,20.62,21.48,21.857587879999997,0.264031384283403,21.406060999999998,21.676566,21.824645999999998,22.037273000000003,22.38
3,1.8176,0.15215890816292466,1.53,1.74,1.84,1.91,2.18,0.32599999999999996,0.057662812973353975,0.23,0.29,0.31,0.36,0.46,1.23071516,0.027354828497725987,1.185657,1.21202,1.225758,1.241515,1.291313
4,0.0125,0.005,0.01,0.01,0.01,0.0125,0.02,0.01,,0.01,0.01,0.01,0.01,0.01,0.01848904,0.0011035068524179329,0.016162,0.017778,0.018484999999999998,0.019293,0.020202
5,,,,,,,,,,,,,,,0.000101,0.0,0.000101,0.000101,0.000101,0.000101,0.000101
