round,nodes,nodesP,nodesS,nodesSent,nodesSentP,nodesSentS,nodesRecv,nodesRecvP,nodesRecvS,msgSent,msgSentP,msgSentS,msgRecv,msgRecvP,msgRecvS,msgInfect,msgInfectP,msgInfectS
00,10000.000000,100.000000,9900.000000,0.000000,0.000000,0.000000,0.000000,0.000000,0.000000,0.000000,0.000000,0.000000,0.000000,0.000000,0.000000,0.000000,0.000000,0.000000
01,10000.000000,100.000000,9900.000000,0.010000,1.000000,0.000000,0.010000,1.000000,0.000000,10.000000,10.000000,0.000000,1.000000,1.000000,0.000000,0.010000,1.000000,0.000000
02,10000.000000,100.000000,9900.000000,0.115000,11.500000,0.000000,0.115000,11.500000,0.000000,117.000000,117.000000,0.000000,11.700000,11.700000,0.000000,0.010000,1.000000,0.000000
03,10000.000000,100.000000,9900.000000,0.730000,70.200000,0.028283,0.730000,70.200000,0.028283,1037.000000,1009.000000,28.000000,114.100000,111.300000,2.800000,0.604000,1.000000,0.600000
04,10000.000000,100.000000,9900.000000,4.284000,99.900000,3.318182,4.284000,99.900000,3.318182,5274.000000,1989.000000,3285.000000,1031.400000,697.400000,334.000000,1.054000,6.400000,1.000000
05,10000.000000,100.000000,9900.000000,35.762000,100.000000,35.113131,35.762000,100.000000,35.113131,36762.000000,2000.000000,34762.000000,5293.900000,1000.000000,4293.900000,1.089000,9.900000,1.000000
06,10000.000000,100.000000,9900.000000,97.106000,100.000000,97.076768,97.106000,100.000000,97.076768,98106.000000,2000.000000,96106.000000,35965.500000,1001.000000,34964.500000,3.169000,10.000000,3.100000
07,10000.000000,100.000000,9900.000000,99.995000,100.000000,99.994950,99.995000,100.000000,99.994950,100995.000000,2000.000000,98995.000000,98003.800000,1001.000000,97002.800000,9.010000,10.000000,9.000000
08,10000.000000,100.000000,9900.000000,99.995000,100.000000,99.994950,99.995000,100.000000,99.994950,100995.000000,2000.000000,98995.000000,100996.000000,1001.000000,99995.000000,10.000000,10.000000,10.000000
09,10000.000000,100.000000,9900.000000,99.995000,100.000000,99.994950,99.995000,100.000000,99.994950,100995.000000,2000.000000,98995.000000,100996.000000,1001.000000,99995.000000,10.000000,10.000000,10.000000
10,10000.000000,100.000000,9900.000000,99.995000,100.000000,99.994950,99.995000,100.000000,99.994950,100995.000000,2000.000000,98995.000000,100996.000000,1001.000000,99995.000000,10.000000,10.000000,10.000000
11,10000.000000,100.000000,9900.000000,99.995000,100.000000,99.994950,99.995000,100.000000,99.994950,100995.000000,2000.000000,98995.000000,100996.000000,1001.000000,99995.000000,10.000000,10.000000,10.000000
12,10000.000000,100.000000,9900.000000,99.995000,100.000000,99.994950,99.995000,100.000000,99.994950,100995.000000,2000.000000,98995.000000,100996.000000,1001.000000,99995.000000,10.000000,10.000000,10.000000
13,10000.000000,100.000000,9900.000000,99.995000,100.000000,99.994950,99.995000,100.000000,99.994950,100995.000000,2000.000000,98995.000000,100996.000000,1001.000000,99995.000000,10.000000,10.000000,10.000000
14,10000.000000,100.000000,9900.000000,99.995000,100.000000,99.994950,99.995000,100.000000,99.994950,100995.000000,2000.000000,98995.000000,100996.000000,1001.000000,99995.000000,10.000000,10.000000,10.000000
15,10000.000000,100.000000,9900.000000,99.995000,100.000000,99.994950,99.995000,100.000000,99.994950,100995.000000,2000.000000,98995.000000,100996.000000,1001.000000,99995.000000,10.000000,10.000000,10.000000
16,10000.000000,100.000000,9900.000000,99.995000,100.000000,99.994950,99.995000,100.000000,99.994950,100995.000000,2000.000000,98995.000000,100996.000000,1001.000000,99995.000000,10.000000,10.000000,10.000000
17,10000.000000,100.000000,9900.000000,99.995000,100.000000,99.994950,99.995000,100.000000,99.994950,100995.000000,2000.000000,98995.000000,100996.000000,1001.000000,99995.000000,10.000000,10.000000,10.000000
18,10000.000000,100.000000,9900.000000,99.995000,100.000000,99.994950,99.995000,100.000000,99.994950,100995.000000,2000.000000,98995.000000,100996.000000,1001.000000,99995.000000,10.000000,10.000000,10.000000
19,10000.000000,100.000000,9900.000000,99.995000,100.000000,99.994950,99.995000,100.000000,99.994950,100995.000000,2000.000000,98995.000000,100996.000000,1001.000000,99995.000000,10.000000,10.000000,10.000000
