gossips,p2p mean,p2p std,p2p min,p2p q1,p2p q2,p2p q3,p2p max,p2s mean,p2s std,p2s min,p2s q1,p2s q2,p2s q3,p2s max,s2s mean,s2s std,s2s min,s2s q1,s2s q2,s2s q3,s2s max
1,42.824,2.010033167222206,38.9,41.3,42.7,44.4,46.2,43.14,2.1717888172349236,39.3,41.6,43.0,44.7,47.6,41.76325919999999,0.9761760333423052,38.669269,41.821121000000005,41.94985,42.213013000000004,42.749049
2,15.835999999999999,3.633854702653919,8.3,13.0,15.6,18.1,22.2,20.296,4.603484187728537,11.2,16.9,20.2,24.3,28.2,18.289213240000002,3.036333300411566,10.497598,16.155756,18.717217,20.46046,22.582482000000002
3,2.3879999999999995,1.0309057506225612,0.8,1.6,2.4,3.1,4.1,4.343999999999999,2.032461561752153,1.1,2.8,3.7,5.5,8.0,3.7551110799999985,1.1486066179136685,1.294294,2.713113,3.921922,4.56957,5.622723000000001
4,0.2076923076923077,0.14978617237881953,0.1,0.1,0.2,0.2,0.6,0.3833333333333333,0.324037034920393,0.1,0.1,0.3,0.575,1.3,0.37000600000000006,0.15683062346605015,0.076877,0.218218,0.39929899999999996,0.47207200000000005,0.721622
5,0.1,,0.1,0.1,0.1,0.1,0.1,0.13333333333333333,0.05773502691896258,0.1,0.1,0.1,0.15000000000000002,0.2,0.01551952,0.008724708486629606,0.002202,0.007908,0.017317,0.018819,0.040941000000000005
6,,,,,,,,0.1,,0.1,0.1,0.1,0.1,0.1,0.00029524999999999994,0.00016729327384471917,0.0001,0.00017500000000000003,0.00025,0.00042525,0.000601
7,,,,,,,,,,,,,,,,,,,,,
