round,P mean,P std,P min,P q1,P q2,P q3,P max,S mean,S std,S min,S q1,S q2,S q3,S max,P+S mean,P+S std,P+S min,P+S q1,P+S q2,P+S q3,P+S max
0,100.0,0.0,100.0,100.0,100.0,100.0,100.0,100.0,0.0,100.0,100.0,100.0,100.0,100.0,100.0,0.0,100.0,100.0,100.0,100.0,100.0
1,99.99988000000002,0.00033166247903607354,99.999,100.0,100.0,100.0,100.0,99.99990232,3.681453517439844e-05,99.999889,99.999889,99.999889,99.999889,100.0,99.99989999999998,0.0,99.9999,99.9999,99.9999,99.9999,99.9999
2,99.98971999999996,0.0005416025603051197,99.988,99.99,99.99,99.99,99.99,99.99980907999999,6.011788419231622e-05,99.999778,99.999778,99.999778,99.999778,100.0,99.99879999999999,0.0,99.9988,99.9988,99.9988,99.9988,99.9988
3,99.881,0.001290994448738024,99.878,99.88,99.881,99.882,99.883,99.99969808000003,6.011788419596468e-05,99.999667,99.999667,99.999667,99.999667,99.999889,99.98782799999998,0.00010614455552037837,99.9877,99.9877,99.9878,99.9879,99.988
4,98.86948000000002,0.011579867587042226,98.844,98.862,98.872,98.876,98.891,99.99962260000004,8.477765035020208e-05,99.99955600000001,99.99955600000001,99.99955600000001,99.999667,99.999778,99.886608,0.001170797449034664,99.8841,99.8858,99.8868,99.8874,99.8888
5,95.20396,0.04391229896054061,95.113,95.172,95.198,95.237,95.302,99.99952884000004,0.00010318255666963041,99.999444,99.999444,99.999444,99.99955600000001,99.999778,99.51997200000001,0.004383160959852326,99.5108,99.5167,99.5195,99.5232,99.5297
6,95.10820000000001,0.07073012088212512,94.996,95.05,95.096,95.149,95.266,99.99001767999998,0.0011086155299907916,99.988222,99.989333,99.989889,99.990444,99.993222,99.50183599999998,0.007389174514112853,99.4901,99.4967,99.5013,99.5058,99.5189
7,95.10904000000001,0.045226725137540634,94.986,95.086,95.109,95.142,95.194,99.25642215999997,0.018897260380544584,99.21844399999999,99.244222,99.25155600000001,99.26644399999999,99.296778,98.841684,0.01566587799433877,98.8108,98.8309,98.8371,98.8491,98.8739
8,95.09403999999999,0.04236102768662026,95.029,95.063,95.095,95.125,95.193,99.21953783999999,0.02085525499260675,99.18388900000001,99.206,99.21866700000001,99.23066700000001,99.264111,98.80698800000002,0.019397966388257422,98.7698,98.7915,98.8055,98.8182,98.8472
9,95.09307999999999,0.06444695493194162,94.998,95.047,95.086,95.134,95.226,99.22182227999996,0.018717769771262917,99.178556,99.213111,99.22322199999999,99.231667,99.254889,98.80894800000002,0.01713004475572995,98.7707,98.803,98.8082,98.8179,98.837
10,95.07712,0.03962671657690788,94.997,95.052,95.077,95.099,95.161,99.21491112000001,0.015501642110113673,99.183444,99.20577800000001,99.216,99.223667,99.252111,98.801132,0.015113562342038473,98.7665,98.7956,98.801,98.8101,98.834
11,95.05463999999998,0.04395440819758465,94.969,95.019,95.067,95.095,95.125,99.21835112000001,0.015845954708062687,99.19166700000001,99.206333,99.214889,99.229111,99.25366700000001,98.80197999999999,0.01435162592414487,98.7807,98.792,98.7982,98.8093,98.8355
12,95.20056000000001,0.048500068728473934,95.107,95.168,95.195,95.243,95.313,99.21855992000002,0.014465473822522227,99.18955600000001,99.208333,99.216222,99.228222,99.249111,98.81675999999999,0.014241839768795167,98.7895,98.807,98.814,98.8293,98.8463
13,96.20612000000003,0.05832832359440147,96.092,96.163,96.208,96.254,96.295,99.2139956,0.012647084664062757,99.183,99.206333,99.216667,99.220556,99.237667,98.91320799999998,0.012885292649632257,98.8761,98.9046,98.9149,98.9223,98.9357
14,99.87004,0.010557303948764573,99.856,99.862,99.869,99.875,99.893,99.21995996000001,0.01781896931755513,99.183,99.212333,99.221556,99.234,99.250222,99.28496799999999,0.016001008301563695,99.2514,99.2772,99.2864,99.2976,99.3145
15,99.95835999999997,0.00530628558095578,99.95,99.954,99.957,99.961,99.972,99.22607988000001,0.011662366338355148,99.20133299999999,99.21866700000001,99.226333,99.229111,99.251333,99.299308,0.010609544445135037,99.2768,99.2925,99.2999,99.3017,99.3222
16,99.95835999999997,0.00530628558095578,99.95,99.954,99.957,99.961,99.972,99.96904,0.0014989708691837743,99.966778,99.968,99.968889,99.970111,99.972111,99.96797199999999,0.0013749303012646084,99.9657,99.9671,99.9679,99.9689,99.9704
17,99.95835999999997,0.00530628558095578,99.95,99.954,99.957,99.961,99.972,99.98675568,0.0012355517566390957,99.984,99.985889,99.986889,99.987667,99.989222,99.983916,0.0011477078606200177,99.9817,99.9833,99.9838,99.9845,99.9861
18,99.95835999999997,0.00530628558095578,99.95,99.954,99.957,99.961,99.972,99.98676012000001,0.001232919682431293,99.984,99.985889,99.986889,99.987667,99.989222,99.98392,0.0011460075625094098,99.9817,99.9833,99.9838,99.9845,99.9861
19,99.95835999999997,0.00530628558095578,99.95,99.954,99.957,99.961,99.972,99.98676012000001,0.001232919682431293,99.984,99.985889,99.986889,99.987667,99.989222,99.98392,0.0011460075625094098,99.9817,99.9833,99.9838,99.9845,99.9861
20,99.95835999999997,0.00530628558095578,99.95,99.954,99.957,99.961,99.972,99.98676012000001,0.001232919682431293,99.984,99.985889,99.986889,99.987667,99.989222,99.98392,0.0011460075625094098,99.9817,99.9833,99.9838,99.9845,99.9861
21,99.95835999999997,0.00530628558095578,99.95,99.954,99.957,99.961,99.972,99.98676012000001,0.001232919682431293,99.984,99.985889,99.986889,99.987667,99.989222,99.98392,0.0011460075625094098,99.9817,99.9833,99.9838,99.9845,99.9861
22,99.95835999999997,0.00530628558095578,99.95,99.954,99.957,99.961,99.972,99.98676012000001,0.001232919682431293,99.984,99.985889,99.986889,99.987667,99.989222,99.98392,0.0011460075625094098,99.9817,99.9833,99.9838,99.9845,99.9861
23,99.95835999999997,0.00530628558095578,99.95,99.954,99.957,99.961,99.972,99.98676012000001,0.001232919682431293,99.984,99.985889,99.986889,99.987667,99.989222,99.98392,0.0011460075625094098,99.9817,99.9833,99.9838,99.9845,99.9861
24,99.95835999999997,0.00530628558095578,99.95,99.954,99.957,99.961,99.972,99.98676012000001,0.001232919682431293,99.984,99.985889,99.986889,99.987667,99.989222,99.98392,0.0011460075625094098,99.9817,99.9833,99.9838,99.9845,99.9861
25,99.95835999999997,0.00530628558095578,99.95,99.954,99.957,99.961,99.972,99.98676012000001,0.001232919682431293,99.984,99.985889,99.986889,99.987667,99.989222,99.98392,0.0011460075625094098,99.9817,99.9833,99.9838,99.9845,99.9861
