gossips,p2p mean,p2p std,p2p min,p2p q1,p2p q2,p2p q3,p2p max,p2s mean,p2s std,p2s min,p2s q1,p2s q2,p2s q3,p2s max,s2s mean,s2s std,s2s min,s2s q1,s2s q2,s2s q3,s2s max
1,10.460360000000003,0.043478807098017755,10.377,10.437,10.473,10.491,10.536,0.58612,0.018083878640011573,0.552,0.572,0.589,0.6,0.616,0.008835560000000003,0.0038465117756221676,0.003333,0.006667,0.008667,0.010667,0.021667
2,0.10784000000000005,0.011111855530618336,0.085,0.103,0.109,0.111,0.145,,,,,,,,,,,,,,
3,0.0013333333333333333,0.0005773502691896257,0.001,0.001,0.001,0.0015,0.002,,,,,,,,,,,,,,
