gossips,p2p mean,p2p std,p2p min,p2p q1,p2p q2,p2p q3,p2p max,p2s mean,p2s std,p2s min,p2s q1,p2s q2,p2s q3,p2s max,s2s mean,s2s std,s2s min,s2s q1,s2s q2,s2s q3,s2s max
1,0.01,,0.01,0.01,0.01,0.01,0.01,0.012,0.004472135954999579,0.01,0.01,0.01,0.01,0.02,60.55518787999999,0.34843894089666944,59.849293,60.357071,60.602525,60.728283,61.107778
2,,,,,,,,,,,,,,,1.57087272,0.06760083860335368,1.4219190000000002,1.548384,1.5737370000000002,1.612323,1.691212
3,,,,,,,,,,,,,,,0.000101,0.0,0.000101,0.000101,0.000101,0.000101,0.000101
4,,,,,,,,,,,,,,,,,,,,,
5,,,,,,,,,,,,,,,,,,,,,
