gossips,p2p mean,p2p std,p2p min,p2p q1,p2p q2,p2p q3,p2p max,p2s mean,p2s std,p2s min,p2s q1,p2s q2,p2s q3,p2s max,s2s mean,s2s std,s2s min,s2s q1,s2s q2,s2s q3,s2s max
1,52.38399999999999,1.6473918780909416,48.9,51.6,52.5,53.5,55.4,58.88400000000001,1.5151127570800356,55.4,58.2,59.3,60.0,61.3,52.117429519999995,0.30019841522956436,51.594595,51.887688,52.086587,52.341741999999996,52.71931899999999
2,18.2,1.1075498483890769,16.3,17.5,18.2,18.7,20.3,19.952,1.4731259280862579,17.1,19.3,19.8,20.6,24.8,21.903835720000004,0.44361098308583063,20.977176999999998,21.676176,21.840339999999998,22.217717999999998,22.639439000000003
3,0.11666666666666665,0.04082482904638631,0.1,0.1,0.1,0.1,0.2,0.22222222222222227,0.10602749674192764,0.1,0.125,0.2,0.3,0.4,1.4232150799999999,0.07161034546530268,1.243343,1.366466,1.426326,1.4730729999999999,1.544144
4,,,,,,,,,,,,,,,0.02911712,0.0031024433962067183,0.023323,0.026326,0.028929000000000003,0.031431,0.035636
5,,,,,,,,,,,,,,,0.00021433333333333333,0.00011096996590669625,0.0001,0.0001,0.0002,0.0002,0.0005009999999999999
6,,,,,,,,,,,,,,,,,,,,,
