gossips,p2p mean,p2p std,p2p min,p2p q1,p2p q2,p2p q3,p2p max,p2s mean,p2s std,p2s min,p2s q1,p2s q2,p2s q3,p2s max,s2s mean,s2s std,s2s min,s2s q1,s2s q2,s2s q3,s2s max
1,49.852,2.0261046369820095,45.9,48.6,50.4,51.4,53.1,77.36000000000001,1.0432321569685852,75.0,76.9,77.2,78.0,79.6,54.73788584000001,0.33709808953610243,54.075976000000004,54.55976,54.729029000000004,54.91021,55.657456999999994
2,21.660000000000004,1.0677078252031311,20.0,21.0,21.5,22.2,24.4,10.752,0.9097252332435326,8.8,10.1,10.6,11.5,12.5,19.500992919999998,0.5277981894225698,18.501201000000002,19.194294,19.497998000000003,19.904404,20.297798
3,2.116,0.4412859994757745,1.4,1.8,2.1,2.4,2.9,0.29047619047619044,0.14458479140200708,0.1,0.2,0.3,0.3,0.7,2.01069872,0.12503508640594968,1.7715720000000001,1.948248,2.017117,2.102202,2.217718
4,0.16666666666666666,0.05773502691896258,0.1,0.15000000000000002,0.2,0.2,0.2,,,,,,,,0.030017960000000007,0.002427590772075612,0.025425,0.028529000000000002,0.02973,0.031231000000000002,0.035035000000000004
5,,,,,,,,,,,,,,,0.00019375,8.539125638299666e-05,0.0001,0.0001,0.0002,0.0002,0.0004
