round,nodes,nodesP,nodesS,nodesSent,nodesSentP,nodesSentS,nodesRecv,nodesRecvP,nodesRecvS,msgSent,msgSentP,msgSentS,msgRecv,msgRecvP,msgRecvS,msgInfect,msgInfectP,msgInfectS
00,1000.000000,100.000000,900.000000,0.000000,0.000000,0.000000,0.000000,0.000000,0.000000,0.000000,0.000000,0.000000,0.000000,0.000000,0.000000,0.000000,0.000000,0.000000
01,1000.000000,100.000000,900.000000,0.100000,1.000000,0.000000,0.100000,1.000000,0.000000,10.000000,10.000000,0.000000,1.000000,1.000000,0.000000,0.100000,1.000000,0.000000
02,1000.000000,100.000000,900.000000,1.180000,11.800000,0.000000,1.180000,11.800000,0.000000,118.000000,118.000000,0.000000,12.100000,12.100000,0.000000,0.100000,1.000000,0.000000
03,1000.000000,100.000000,900.000000,6.900000,69.000000,0.000000,6.900000,69.000000,0.000000,690.000000,690.000000,0.000000,113.100000,113.100000,0.000000,0.100000,1.000000,0.000000
04,1000.000000,100.000000,900.000000,10.060000,99.800000,0.088889,10.060000,99.800000,0.088889,1006.000000,998.000000,8.000000,680.300000,679.500000,0.800000,0.990000,6.300000,0.400000
05,1000.000000,100.000000,900.000000,25.180000,100.000000,16.866667,25.180000,100.000000,16.866667,2518.000000,1000.000000,1518.000000,1007.400000,842.300000,165.100000,1.700000,8.000000,1.000000
06,1000.000000,100.000000,900.000000,68.230000,100.000000,64.700000,68.230000,100.000000,64.700000,6823.000000,1000.000000,5823.000000,2501.800000,1576.000000,925.800000,2.420000,15.200000,1.000000
07,1000.000000,100.000000,900.000000,99.700000,100.000000,99.666667,99.700000,100.000000,99.666667,9970.000000,1000.000000,8970.000000,6733.100000,1576.000000,5157.100000,6.200000,15.200000,5.200000
08,1000.000000,100.000000,900.000000,100.000000,100.000000,100.000000,100.000000,100.000000,100.000000,10000.000000,1000.000000,9000.000000,9969.000000,1576.000000,8393.000000,9.620000,15.200000,9.000000
09,1000.000000,100.000000,900.000000,100.000000,100.000000,100.000000,100.000000,100.000000,100.000000,10000.000000,1000.000000,9000.000000,10001.000000,1576.000000,8425.000000,9.620000,15.200000,9.000000
10,1000.000000,100.000000,900.000000,100.000000,100.000000,100.000000,100.000000,100.000000,100.000000,10000.000000,1000.000000,9000.000000,10001.000000,1576.000000,8425.000000,9.620000,15.200000,9.000000
11,1000.000000,100.000000,900.000000,100.000000,100.000000,100.000000,100.000000,100.000000,100.000000,10000.000000,1000.000000,9000.000000,10001.000000,1576.000000,8425.000000,9.620000,15.200000,9.000000
12,1000.000000,100.000000,900.000000,100.000000,100.000000,100.000000,100.000000,100.000000,100.000000,10000.000000,1000.000000,9000.000000,10001.000000,1576.000000,8425.000000,9.620000,15.200000,9.000000
13,1000.000000,100.000000,900.000000,100.000000,100.000000,100.000000,100.000000,100.000000,100.000000,10000.000000,1000.000000,9000.000000,10001.000000,1576.000000,8425.000000,9.620000,15.200000,9.000000
14,1000.000000,100.000000,900.000000,100.000000,100.000000,100.000000,100.000000,100.000000,100.000000,10000.000000,1000.000000,9000.000000,10001.000000,1576.000000,8425.000000,9.620000,15.200000,9.000000
15,1000.000000,100.000000,900.000000,100.000000,100.000000,100.000000,100.000000,100.000000,100.000000,10000.000000,1000.000000,9000.000000,10001.000000,1576.000000,8425.000000,9.620000,15.200000,9.000000
16,1000.000000,100.000000,900.000000,100.000000,100.000000,100.000000,100.000000,100.000000,100.000000,10000.000000,1000.000000,9000.000000,10001.000000,1576.000000,8425.000000,9.620000,15.200000,9.000000
17,1000.000000,100.000000,900.000000,100.000000,100.000000,100.000000,100.000000,100.000000,100.000000,10000.000000,1000.000000,9000.000000,10001.000000,1576.000000,8425.000000,9.620000,15.200000,9.000000
18,1000.000000,100.000000,900.000000,100.000000,100.000000,100.000000,100.000000,100.000000,100.000000,10000.000000,1000.000000,9000.000000,10001.000000,1576.000000,8425.000000,9.620000,15.200000,9.000000
19,1000.000000,100.000000,900.000000,100.000000,100.000000,100.000000,100.000000,100.000000,100.000000,10000.000000,1000.000000,9000.000000,10001.000000,1576.000000,8425.000000,9.620000,15.200000,9.000000
