,mean,std,min,q1,q2,q3,max
Simple,,,,,,,
P,5.236218889057919,0.6664172958453436,1.0,5.0,5.0,6.0,8.0
S,7.035528751606592,0.4772637314210436,4.0,7.0,7.0,7.0,10.0
P+S,6.855602916515582,0.7353789552090997,1.0,7.0,7.0,7.0,10.0
