gossips,p2p mean,p2p std,p2p min,p2p q1,p2p q2,p2p q3,p2p max,p2s mean,p2s std,p2s min,p2s q1,p2s q2,p2s q3,p2s max,s2s mean,s2s std,s2s min,s2s q1,s2s q2,s2s q3,s2s max
1,34.18919999999999,0.16165395138999925,33.952,34.038,34.173,34.284,34.486,43.06211999999999,0.14323969421916513,42.833,42.971,43.066,43.175,43.312,59.77331552,0.13074512327843626,59.442111,59.706332999999994,59.821,59.86666700000001,59.955222
2,0.05428,0.007829005896876903,0.042,0.047,0.054,0.06,0.069,5.614759999999999,0.07944981644619017,5.464,5.557,5.609,5.667,5.745,18.110502280000002,0.16177378649921476,17.840667,18.029332999999998,18.071444,18.218110999999997,18.454
3,,,,,,,,0.011720000000000003,0.0031026870075253586,0.006,0.009,0.012,0.014,0.018,1.3566488799999996,0.027093040610582323,1.3071110000000001,1.3411110000000002,1.355111,1.373667,1.405889
4,,,,,,,,,,,,,,,0.0008756000000000002,0.0003031068293522929,0.00044400000000000006,0.000667,0.000889,0.001,0.001556
5,,,,,,,,,,,,,,,,,,,,,
