round,P mean,P std,P min,P q1,P q2,P q3,P max,S mean,S std,S min,S q1,S q2,S q3,S max,P+S mean,P+S std,P+S min,P+S q1,P+S q2,P+S q3,P+S max
0,100.0,0.0,100.0,100.0,100.0,100.0,100.0,100.0,0.0,100.0,100.0,100.0,100.0,100.0,100.0,0.0,100.0,100.0,100.0,100.0,100.0
1,100.0,0.0,100.0,100.0,100.0,100.0,100.0,99.99989599999999,2.000000000021866e-05,99.9998,99.9999,99.9999,99.9999,99.9999,99.99989599999999,2.000000000021866e-05,99.9998,99.9999,99.9999,99.9999,99.9999
2,99.09599999999996,0.08406346808611587,99.0,99.0,99.1,99.1,99.3,99.99980000000004,0.0,99.9998,99.9998,99.9998,99.9998,99.9998,99.998896,8.406346807862943e-05,99.9988,99.9988,99.9989,99.9989,99.9991
3,95.40800000000002,0.5619311938900232,94.1,95.1,95.5,95.7,96.6,99.99970400000001,1.999999999374004e-05,99.9997,99.9997,99.9997,99.9997,99.9998,99.99511199999999,0.0005659210781246343,99.9938,99.9948,99.9952,99.9954,99.9963
4,95.564,0.39251326941476217,94.9,95.3,95.5,95.8,96.3,99.99960400000005,1.9999999996489162e-05,99.9996,99.9996,99.9996,99.9996,99.9997,99.99516799999998,0.00039127995092904185,99.9945,99.9949,99.9951,99.9954,99.9959
5,95.28399999999999,0.6039315634517962,94.1,94.9,95.5,95.6,96.3,99.99929900000001,0.00015811388301220836,99.998999,99.999199,99.999299,99.999499,99.999499,99.99458400000002,0.000572771042100961,99.9935,99.9941,99.9947,99.995,99.9956
6,95.35200000000003,0.4673685198356128,94.5,94.9,95.3,95.8,96.1,99.6872192,0.01957809151619704,99.64995,99.674474,99.685285,99.699199,99.736036,99.68288400000002,0.019478891994501462,99.6456,99.6704,99.6805,99.6945,99.7321
7,95.40800000000002,0.42122836245121664,94.4,95.1,95.5,95.7,96.0,97.01985988,0.14745540610534763,96.784384,96.919219,96.991191,97.070971,97.434535,97.018248,0.14711580506526395,96.7829,96.9183,96.9896,97.0698,97.4315
8,95.38400000000001,0.5617532079718526,94.2,95.0,95.4,95.8,96.2,95.96810812000001,0.27291918761043893,95.306507,95.781181,96.002903,96.136236,96.48999,95.967524,0.2724150789389866,95.3071,95.7816,96.0023,96.1359,96.4884
9,95.48000000000002,0.5708181263181222,94.4,95.1,95.5,95.9,96.5,95.89044232000002,0.1724528546651039,95.526326,95.794294,95.85645600000001,96.01992,96.228829,95.89003199999999,0.17213400477535012,95.5261,95.7942,95.8568,96.0197,96.2276
10,95.39200000000001,0.5469003565550121,94.1,95.0,95.3,95.7,96.5,95.80670276000001,0.24641712709013563,95.143744,95.675676,95.84014,95.997698,96.143343,95.80628799999998,0.24632431927575812,95.1434,95.6749,95.8396,95.9975,96.1428
11,96.20400000000001,0.5968528573554253,94.5,95.9,96.3,96.6,97.0,95.88081676000002,0.20097918339703616,95.514915,95.711712,95.876276,95.988088,96.267067,95.88114000000002,0.20065079325368676,95.516,95.7128,95.8767,95.9885,96.2671
12,99.89600000000002,0.09780933834080971,99.6,99.9,99.9,100.0,100.0,95.87388983999999,0.20904654314942292,95.423824,95.776076,95.87267299999999,96.034234,96.319319,95.87791200000001,0.208851754281996,95.4283,95.7801,95.8767,96.0381,96.3229
13,99.96400000000003,0.04898979485566058,99.9,99.9,100.0,100.0,100.0,95.84450848,0.19656557095430807,95.454755,95.708809,95.862362,95.95966,96.19439399999999,95.84862799999999,0.19637951887438132,95.4592,95.7131,95.8665,95.9637,96.1981
14,99.96400000000003,0.04898979485566058,99.9,99.9,100.0,100.0,100.0,95.96415624,0.20012372783341012,95.404505,95.85976,95.958659,96.08048000000001,96.35986,95.968156,0.19992993581085958,95.4091,95.8639,95.9626,96.0844,96.3635
15,99.96400000000003,0.04898979485566058,99.9,99.9,100.0,100.0,100.0,96.19961556000003,0.2113080896736026,95.79349300000001,96.09049,96.196597,96.371371,96.54934899999999,96.20338,0.21109407065729366,95.7977,96.0944,96.2004,96.3749,96.5528
16,99.96400000000003,0.04898979485566058,99.9,99.9,100.0,100.0,100.0,98.79541132,0.17881486353622195,98.351952,98.713814,98.83103100000001,98.925826,99.034234,98.79657999999999,0.17863071311134396,98.3536,98.7151,98.8322,98.9268,99.0352
17,99.96400000000003,0.04898979485566058,99.9,99.9,100.0,100.0,100.0,99.95770972,0.0018161567828775004,99.95295300000001,99.956757,99.957758,99.958659,99.960861,99.95771600000003,0.0018206409127914343,99.953,99.9568,99.9578,99.9587,99.9608
18,99.96400000000003,0.04898979485566058,99.9,99.9,100.0,100.0,100.0,99.95939544000001,0.0015515512420388724,99.956456,99.958659,99.95966,99.96036,99.961962,99.9594,0.001551343503763904,99.9565,99.9586,99.9597,99.9604,99.9619
19,99.96400000000003,0.04898979485566058,99.9,99.9,100.0,100.0,100.0,99.95939944000001,0.00154970134434813,99.956456,99.958659,99.95966,99.96036,99.961962,99.95940399999999,0.0015495913439802426,99.9565,99.9586,99.9597,99.9604,99.9619
20,99.96400000000003,0.04898979485566058,99.9,99.9,100.0,100.0,100.0,99.95939944000001,0.00154970134434813,99.956456,99.958659,99.95966,99.96036,99.961962,99.95940399999999,0.0015495913439802426,99.9565,99.9586,99.9597,99.9604,99.9619
21,99.96400000000003,0.04898979485566058,99.9,99.9,100.0,100.0,100.0,99.95939944000001,0.00154970134434813,99.956456,99.958659,99.95966,99.96036,99.961962,99.95940399999999,0.0015495913439802426,99.9565,99.9586,99.9597,99.9604,99.9619
22,99.96400000000003,0.04898979485566058,99.9,99.9,100.0,100.0,100.0,99.95939944000001,0.00154970134434813,99.956456,99.958659,99.95966,99.96036,99.961962,99.95940399999999,0.0015495913439802426,99.9565,99.9586,99.9597,99.9604,99.9619
23,99.96400000000003,0.04898979485566058,99.9,99.9,100.0,100.0,100.0,99.95939944000001,0.00154970134434813,99.956456,99.958659,99.95966,99.96036,99.961962,99.95940399999999,0.0015495913439802426,99.9565,99.9586,99.9597,99.9604,99.9619
24,99.96400000000003,0.04898979485566058,99.9,99.9,100.0,100.0,100.0,99.95939944000001,0.00154970134434813,99.956456,99.958659,99.95966,99.96036,99.961962,99.95940399999999,0.0015495913439802426,99.9565,99.9586,99.9597,99.9604,99.9619
25,99.96400000000003,0.04898979485566058,99.9,99.9,100.0,100.0,100.0,99.95939944000001,0.00154970134434813,99.956456,99.958659,99.95966,99.96036,99.961962,99.95940399999999,0.0015495913439802426,99.9565,99.9586,99.9597,99.9604,99.9619
