round,P+S mean,P+S std,P+S min,P+S q1,P+S median,P+S q3,P+S max,P mean,P std,P min,P q1,P median,P q3,P max,S mean,S std,S min,S q1,S median,S q3,S max
0,99.999056,6.974238309687944e-05,99.9988,99.999,99.9991,99.9991,99.9991,99.99560000000001,0.006974238309666559,99.97,99.99,100.0,100.0,100.0,99.99909099999999,1.4210854715202004e-14,99.999091,99.999091,99.999091,99.999091,99.999091
1,99.98953599999996,0.00023812601705870996,99.989,99.9894,99.9896,99.9897,99.9899,99.04360000000001,0.023812601705818476,98.99,99.03,99.05,99.06,99.08,99.99909099999999,1.4210854715202004e-14,99.999091,99.999091,99.999091,99.999091,99.999091
2,99.89987599999999,0.0013339505238199696,99.8973,99.899,99.9001,99.9009,99.9031,90.08080000000001,0.13431068460848672,89.82,89.99,90.1,90.18,90.42,99.99905868,6.206365764326682e-05,99.998889,99.999091,99.999091,99.999091,99.999091
3,99.34800000000001,0.0032296129799100114,99.341,99.3452,99.3483,99.3507,99.3546,35.7768,0.3486628170596921,35.04,35.64,35.77,35.97,36.62,99.99013332,0.0024062126044065496,99.985455,99.98949499999999,99.990303,99.991515,99.994747
4,98.26178799999998,0.04717073940484655,98.1915,98.2268,98.2592,98.2781,98.3835,3.630000000000001,0.2067849124090053,3.29,3.47,3.63,3.8,4.0,99.21766459999998,0.048129541638371846,99.145758,99.18060600000001,99.21404,99.234646,99.343333
5,73.686632,0.28549170736818247,73.2437,73.5551,73.653,73.7145,74.6627,98.70679999999997,0.08614963725983037,98.49,98.63,98.74,98.79,98.81,73.43390300000002,0.28816323726110615,72.987273,73.302626,73.39899,73.463131,74.41888900000001
6,4.013404000000001,0.09599324759585952,3.8826,3.9622,3.9901,4.0293,4.3328,99.95280000000001,0.02049780476051055,99.91,99.94,99.95,99.97,99.98,3.0443191600000006,0.09691817199624844,2.912525,2.992929,3.020707,3.060606,3.36697
7,80.46027600000001,0.24655121704019134,80.0459,80.329,80.3723,80.6161,80.9652,99.95280000000001,0.02049780476051055,99.91,99.94,99.95,99.97,99.98,80.2633818,0.2490870900905129,79.844747,80.130505,80.174949,80.420707,80.773434
8,99.952788,0.0021307876477968004,99.948,99.9519,99.9523,99.954,99.9575,99.95280000000001,0.02049780476051055,99.91,99.94,99.95,99.97,99.98,99.95278772,0.0021528573481796984,99.94798,99.951616,99.952424,99.953939,99.957778
9,99.96281200000001,0.002010834652575607,99.9574,99.9622,99.9627,99.9639,99.9672,99.95280000000001,0.02049780476051055,99.91,99.94,99.95,99.97,99.98,99.96291292,0.0020461961571643685,99.957475,99.96202,99.962727,99.963838,99.96737399999999
10,99.96281599999999,0.0020148806416260484,99.9574,99.9622,99.9627,99.9639,99.9672,99.95280000000001,0.02049780476051055,99.91,99.94,99.95,99.97,99.98,99.962917,0.0020503493946139955,99.957475,99.96202,99.962727,99.963838,99.96737399999999
11,99.96281599999999,0.0020148806416260484,99.9574,99.9622,99.9627,99.9639,99.9672,99.95280000000001,0.02049780476051055,99.91,99.94,99.95,99.97,99.98,99.962917,0.0020503493946139955,99.957475,99.96202,99.962727,99.963838,99.96737399999999
12,99.96281599999999,0.0020148806416260484,99.9574,99.9622,99.9627,99.9639,99.9672,99.95280000000001,0.02049780476051055,99.91,99.94,99.95,99.97,99.98,99.962917,0.0020503493946139955,99.957475,99.96202,99.962727,99.963838,99.96737399999999
13,99.96281599999999,0.0020148806416260484,99.9574,99.9622,99.9627,99.9639,99.9672,99.95280000000001,0.02049780476051055,99.91,99.94,99.95,99.97,99.98,99.962917,0.0020503493946139955,99.957475,99.96202,99.962727,99.963838,99.96737399999999
14,99.96281599999999,0.0020148806416260484,99.9574,99.9622,99.9627,99.9639,99.9672,99.95280000000001,0.02049780476051055,99.91,99.94,99.95,99.97,99.98,99.962917,0.0020503493946139955,99.957475,99.96202,99.962727,99.963838,99.96737399999999
15,99.96281599999999,0.0020148806416260484,99.9574,99.9622,99.9627,99.9639,99.9672,99.95280000000001,0.02049780476051055,99.91,99.94,99.95,99.97,99.98,99.962917,0.0020503493946139955,99.957475,99.96202,99.962727,99.963838,99.96737399999999
16,99.96281599999999,0.0020148806416260484,99.9574,99.9622,99.9627,99.9639,99.9672,99.95280000000001,0.02049780476051055,99.91,99.94,99.95,99.97,99.98,99.962917,0.0020503493946139955,99.957475,99.96202,99.962727,99.963838,99.96737399999999
17,99.96281599999999,0.0020148806416260484,99.9574,99.9622,99.9627,99.9639,99.9672,99.95280000000001,0.02049780476051055,99.91,99.94,99.95,99.97,99.98,99.962917,0.0020503493946139955,99.957475,99.96202,99.962727,99.963838,99.96737399999999
18,99.96281599999999,0.0020148806416260484,99.9574,99.9622,99.9627,99.9639,99.9672,99.95280000000001,0.02049780476051055,99.91,99.94,99.95,99.97,99.98,99.962917,0.0020503493946139955,99.957475,99.96202,99.962727,99.963838,99.96737399999999
19,99.96281599999999,0.0020148806416260484,99.9574,99.9622,99.9627,99.9639,99.9672,99.95280000000001,0.02049780476051055,99.91,99.94,99.95,99.97,99.98,99.962917,0.0020503493946139955,99.957475,99.96202,99.962727,99.963838,99.96737399999999
20,99.96281599999999,0.0020148806416260484,99.9574,99.9622,99.9627,99.9639,99.9672,99.95280000000001,0.02049780476051055,99.91,99.94,99.95,99.97,99.98,99.962917,0.0020503493946139955,99.957475,99.96202,99.962727,99.963838,99.96737399999999
21,99.96281599999999,0.0020148806416260484,99.9574,99.9622,99.9627,99.9639,99.9672,99.95280000000001,0.02049780476051055,99.91,99.94,99.95,99.97,99.98,99.962917,0.0020503493946139955,99.957475,99.96202,99.962727,99.963838,99.96737399999999
22,99.96281599999999,0.0020148806416260484,99.9574,99.9622,99.9627,99.9639,99.9672,99.95280000000001,0.02049780476051055,99.91,99.94,99.95,99.97,99.98,99.962917,0.0020503493946139955,99.957475,99.96202,99.962727,99.963838,99.96737399999999
23,99.96281599999999,0.0020148806416260484,99.9574,99.9622,99.9627,99.9639,99.9672,99.95280000000001,0.02049780476051055,99.91,99.94,99.95,99.97,99.98,99.962917,0.0020503493946139955,99.957475,99.96202,99.962727,99.963838,99.96737399999999
