miner,PMF
1,0.264380807847
2,0.234446929782
3,0.116570403860
4,0.104347984501
5,0.048534830449
6,0.034889854862
7,0.015926926866
8,0.015168124602
9,0.013430324844
10,0.013271911009
11,0.013256861695
12,0.012664393957
13,0.011366192586
14,0.009353544827
15,0.008605831530
16,0.007527825390
17,0.006750013465
18,0.005698145608
19,0.005686264570
20,0.004174204525
21,0.003984899993
22,0.003541341258
23,0.003437580197
24,0.003099366662
25,0.002808677276
26,0.002483928916
27,0.002305713354
28,0.002252644719
29,0.001905718422
30,0.001898589800
31,0.001887500832
32,0.001883540486
33,0.001805125638
34,0.001398794154
35,0.001265726533
36,0.001128698567
37,0.001060580619
38,0.000968700594
39,0.000855434704
40,0.000824544005
41,0.000816623314
42,0.000732663983
43,0.000619398090
44,0.000614645676
45,0.000563161180
46,0.000533854620
47,0.000514844961
48,0.000511676683
49,0.000508508407
50,0.000476033571
51,0.000452271496
52,0.000394450447
53,0.000386529755
54,0.000356431126
55,0.000355639058
56,0.000313659391
57,0.000308906976
58,0.000300986285
59,0.000264551102
60,0.000254254204
61,0.000222571436
62,0.000189304532
63,0.000178215563
64,0.000165542457
65,0.000163958318
66,0.000156829696
67,0.000152869349
68,0.000152077281
69,0.000130691413
70,0.000124354860
71,0.000121186583
72,0.000120394513
73,0.000119602445
74,0.000118810376
75,0.000118018306
76,0.000094256231
77,0.000089503816
78,0.000083959332
79,0.000080791056
80,0.000067325879
81,0.000064157603
82,0.000061781395
83,0.000058613119
84,0.000058613118
85,0.000049108289
86,0.000046732081
87,0.000045940012
88,0.000043563804
89,0.000037227251
90,0.000035643112
91,0.000032474836
92,0.000030098629
93,0.000028514490
94,0.000024554144
95,0.000022970006
96,0.000022177937
97,0.000022177937
98,0.000022177936
99,0.000019801730
100,0.000019801729
101,0.000019009660
102,0.000018217591
103,0.000017425522
104,0.000017425521
105,0.000016633453
106,0.000015049314
107,0.000014257245
108,0.000013465176
109,0.000012673107
110,0.000011088968
111,0.000011088969
112,0.000010296899
113,0.000010296899
114,0.000009504830
115,0.000008712761
116,0.000008712761
117,0.000007920691
118,0.000007128623
119,0.000006336553
120,0.000006336554
121,0.000005544484
122,0.000005544484
123,0.000005544484
124,0.000004752415
125,0.000004752415
126,0.000004752415
127,0.000003960346
128,0.000003960346
129,0.000003960346
130,0.000003168277
131,0.000003168276
132,0.000003168277
133,0.000003168277
134,0.000003168276
135,0.000003168277
136,0.000002376207
137,0.000002376208
138,0.000002376208
139,0.000002376207
140,0.000002376208
141,0.000002376207
142,0.000002376208
143,0.000001584138
144,0.000001584138
145,0.000001584139
146,0.000001584138
147,0.000001584138
148,0.000001584139
149,0.000001584138
150,0.000001584138
151,0.000001584139
152,0.000001584138
153,0.000001584138
154,0.000000792069
155,0.000000792070
156,0.000000792069
157,0.000000792069
158,0.000000792069
159,0.000000792069
160,0.000000792069
161,0.000000792070
162,0.000000792069
163,0.000000792069
164,0.000000792069
165,0.000000792069
166,0.000000792069
167,0.000000792070
168,0.000000792069
169,0.000000792069
170,0.000000792069
171,0.000000792069
172,0.000000792070
173,0.000000792069
174,0.000000792069
175,0.000000792069
176,0.000000792069
177,0.000000792069
178,0.000000792070
179,0.000000792069
180,0.000000792069
181,0.000000792069
182,0.000000792069
183,0.000000792069
184,0.000000792070
185,0.000000792069
186,0.000000792069
187,0.000000792069
188,0.000000792069
189,0.000000792069
190,0.000000792070
191,0.000000792069
192,0.000000792069
193,0.000000792069
194,0.000000792069
195,0.000000792069
196,0.000000792070
197,0.000000792069
198,0.000000792069
199,0.000000792069
200,0.000000792069
201,0.000000792069
202,0.000000792070
203,0.000000792069
204,0.000000792069
205,0.000000792069
206,0.000000792069
207,0.000000792069
208,0.000000792070
209,0.000000792069
210,0.000000792069
211,0.000000792069
212,0.000000792069
213,0.000000792069
214,0.000000792070
215,0.000000792069
216,0.000000792069
217,0.000000792069
218,0.000000792069
219,0.000000792069
220,0.000000792070
221,0.000000792069
222,0.000000792069
223,0.000000792069
224,0.000000792069
225,0.000000792070
226,0.000000792069
227,0.000000792069
228,0.000000792069
229,0.000000792069
230,0.000000792069
231,0.000000792070
232,0.000000792069
233,0.000000792069
234,0.000000792069
235,0.000000792069
236,0.000000792069
237,0.000000792070
238,0.000000792069
239,0.000000792069
240,0.000000792069
241,0.000000792069
242,0.000000792069
243,0.000000792070
244,0.000000792069
245,0.000000792069
246,0.000000792069
247,0.000000792069
248,0.000000792069
249,0.000000792070
250,0.000000792069
251,0.000000792069
252,0.000000792069
253,0.000000792069
254,0.000000792069
255,0.000000792070
256,0.000000792069
257,0.000000792069
258,0.000000792069
259,0.000000792069
260,0.000000792069
261,0.000000792070
262,0.000000792069
263,0.000000792069
264,0.000000792069
265,0.000000792069
266,0.000000792069
267,0.000000792070
268,0.000000792069
269,0.000000792069
270,0.000000792069
271,0.000000792069
272,0.000000792069
273,0.000000792070
274,0.000000792069
275,0.000000792069
276,0.000000792069
277,0.000000792069
278,0.000000792070
279,0.000000792069
280,0.000000792069
281,0.000000792069
282,0.000000792069
283,0.000000792069
284,0.000000792070
285,0.000000792069
286,0.000000792069
287,0.000000792069
288,0.000000792069
289,0.000000792069
290,0.000000792070
291,0.000000792069
292,0.000000792069
293,0.000000792069
294,0.000000792069
295,0.000000792069
296,0.000000792070
297,0.000000792069
298,0.000000792069
299,0.000000792069
300,0.000000792069
301,0.000000792069
302,0.000000792070
303,0.000000792069
304,0.000000792069
305,0.000000792069
306,0.000000792069
307,0.000000792069
308,0.000000792070
309,0.000000792069
310,0.000000792069
311,0.000000792069
312,0.000000792069
313,0.000000792069
314,0.000000792070
315,0.000000792069
316,0.000000792069
317,0.000000792069
318,0.000000792069
319,0.000000792069
320,0.000000792070
321,0.000000792069
322,0.000000792069
323,0.000000792069
324,0.000000792069
325,0.000000792069
326,0.000000792070
327,0.000000792069
328,0.000000792069
