round,P mean,P std,P min,P q1,P q2,P q3,P max,S mean,S std,S min,S q1,S q2,S q3,S max,P+S mean,P+S std,P+S min,P+S q1,P+S q2,P+S q3,P+S max
0,0.0,0.0,0.0,0.0,0.0,0.0,0.0,0.0,0.0,0.0,0.0,0.0,0.0,0.0,0.0,0.0,0.0,0.0,0.0,0.0,0.0
1,0.0,0.0,0.0,0.0,0.0,0.0,0.0,0.0,0.0,0.0,0.0,0.0,0.0,0.0,0.0,0.0,0.0,0.0,0.0,0.0,0.0
2,0.0,0.0,0.0,0.0,0.0,0.0,0.0,0.0,0.0,0.0,0.0,0.0,0.0,0.0,0.0,0.0,0.0,0.0,0.0,0.0,0.0
3,0.0,0.0,0.0,0.0,0.0,0.0,0.0,0.0,0.0,0.0,0.0,0.0,0.0,0.0,0.0,0.0,0.0,0.0,0.0,0.0,0.0
4,0.0,0.0,0.0,0.0,0.0,0.0,0.0,0.0,0.0,0.0,0.0,0.0,0.0,0.0,0.0,0.0,0.0,0.0,0.0,0.0,0.0
5,0.0,0.0,0.0,0.0,0.0,0.0,0.0,0.0,0.0,0.0,0.0,0.0,0.0,0.0,0.0,0.0,0.0,0.0,0.0,0.0,0.0
6,0.0,0.0,0.0,0.0,0.0,0.0,0.0,0.0,0.0,0.0,0.0,0.0,0.0,0.0,0.0,0.0,0.0,0.0,0.0,0.0,0.0
7,0.0,0.0,0.0,0.0,0.0,0.0,0.0,0.0,0.0,0.0,0.0,0.0,0.0,0.0,0.0,0.0,0.0,0.0,0.0,0.0,0.0
8,0.0,0.0,0.0,0.0,0.0,0.0,0.0,0.0,0.0,0.0,0.0,0.0,0.0,0.0,0.0,0.0,0.0,0.0,0.0,0.0,0.0
9,0.0,0.0,0.0,0.0,0.0,0.0,0.0,0.0,0.0,0.0,0.0,0.0,0.0,0.0,0.0,0.0,0.0,0.0,0.0,0.0,0.0
10,0.0,0.0,0.0,0.0,0.0,0.0,0.0,0.0,0.0,0.0,0.0,0.0,0.0,0.0,0.0,0.0,0.0,0.0,0.0,0.0,0.0
11,0.08520000000000001,0.022568414506414343,0.04,0.07,0.09,0.1,0.13,0.0,0.0,0.0,0.0,0.0,0.0,0.0,0.000852,0.00022568414506414343,0.0004,0.0007,0.0009,0.001,0.0013
12,7.032,0.20898564544006346,6.58,6.98,7.08,7.13,7.42,0.0,0.0,0.0,0.0,0.0,0.0,0.0,0.07032000000000001,0.002089856454400636,0.0658,0.0698,0.0708,0.0713,0.0742
13,65.2068,0.5300292444761866,64.36,64.72,65.2,65.6,66.27,0.0,0.0,0.0,0.0,0.0,0.0,0.0,0.652068,0.005300292444761909,0.6436,0.6472,0.652,0.656,0.6627
14,99.8,0.043874821936960615,99.73,99.76,99.8,99.83,99.88,0.0019311200000000001,0.0010113962016275652,0.000101,0.001515,0.002121,0.0028280000000000002,0.003333,0.9999119999999999,0.0011281696089979968,0.9979,0.9992,1.0002,1.0008,1.0015
15,99.95160000000001,0.025113077602453345,99.89,99.94,99.96,99.97,100.0,3.5730020000000007,0.08770739348870954,3.405354,3.5097980000000004,3.587071,3.649293,3.729394,4.536788,0.0869533510950939,4.3707,4.4738,4.5509,4.6126,4.6919
16,99.95160000000001,0.025113077602453345,99.89,99.94,99.96,99.97,100.0,51.504674720000004,0.5475287016662177,50.465657,51.210909,51.557879,51.943333,52.369192,51.989143999999996,0.5421651901404234,50.9605,51.6984,52.0415,52.4233,52.8453
17,99.95160000000001,0.025113077602453345,99.89,99.94,99.96,99.97,100.0,99.42458992,0.020705898827225,99.388788,99.409091,99.42949499999999,99.43575799999999,99.469596,99.42986,0.02054342960656695,99.3944,99.4142,99.4348,99.4409,99.4747
18,99.95160000000001,0.025113077602453345,99.89,99.94,99.96,99.97,100.0,99.95840004000001,0.0022383549107898365,99.95424200000001,99.95666700000001,99.958586,99.95979799999999,99.962525,99.95833199999998,0.0022362021375541673,99.9542,99.9569,99.9587,99.9598,99.9625
19,99.95160000000001,0.025113077602453345,99.89,99.94,99.96,99.97,100.0,99.95862223999998,0.002222575632007574,99.954545,99.957071,99.959091,99.960202,99.962525,99.958552,0.0022200075074945503,99.9545,99.957,99.9589,99.96,99.9625
20,99.95160000000001,0.025113077602453345,99.89,99.94,99.96,99.97,100.0,99.95862223999998,0.002222575632007574,99.954545,99.957071,99.959091,99.960202,99.962525,99.958552,0.0022200075074945503,99.9545,99.957,99.9589,99.96,99.9625
21,99.95160000000001,0.025113077602453345,99.89,99.94,99.96,99.97,100.0,99.95862223999998,0.002222575632007574,99.954545,99.957071,99.959091,99.960202,99.962525,99.958552,0.0022200075074945503,99.9545,99.957,99.9589,99.96,99.9625
22,99.95160000000001,0.025113077602453345,99.89,99.94,99.96,99.97,100.0,99.95862223999998,0.002222575632007574,99.954545,99.957071,99.959091,99.960202,99.962525,99.958552,0.0022200075074945503,99.9545,99.957,99.9589,99.96,99.9625
23,99.95160000000001,0.025113077602453345,99.89,99.94,99.96,99.97,100.0,99.95862223999998,0.002222575632007574,99.954545,99.957071,99.959091,99.960202,99.962525,99.958552,0.0022200075074945503,99.9545,99.957,99.9589,99.96,99.9625
24,99.95160000000001,0.025113077602453345,99.89,99.94,99.96,99.97,100.0,99.95862223999998,0.002222575632007574,99.954545,99.957071,99.959091,99.960202,99.962525,99.958552,0.0022200075074945503,99.9545,99.957,99.9589,99.96,99.9625
25,99.95160000000001,0.025113077602453345,99.89,99.94,99.96,99.97,100.0,99.95862223999998,0.002222575632007574,99.954545,99.957071,99.959091,99.960202,99.962525,99.958552,0.0022200075074945503,99.9545,99.957,99.9589,99.96,99.9625
