gossips,p2p mean,p2p std,p2p min,p2p q1,p2p q2,p2p q3,p2p max,p2s mean,p2s std,p2s min,p2s q1,p2s q2,p2s q3,p2s max,s2s mean,s2s std,s2s min,s2s q1,s2s q2,s2s q3,s2s max
1,51.775999999999996,1.6358687803936676,48.7,50.4,52.1,53.0,54.2,57.96800000000001,1.7437316307276185,54.2,56.6,58.2,59.2,61.1,4.387559639999999,0.1305664283049948,4.118619,4.294294,4.382783,4.469169,4.597698
2,19.2,1.0054020754570452,17.2,18.7,19.3,19.8,21.4,20.791999999999998,1.3717142559585795,17.2,20.2,20.7,21.8,23.0,0.03396996,0.002190964294551603,0.028327999999999996,0.033033,0.033934,0.035235,0.037838
3,0.11666666666666665,0.04082482904638631,0.1,0.1,0.1,0.1,0.2,0.2708333333333334,0.13014763077790334,0.1,0.2,0.2,0.4,0.5,0.00019999999999999998,0.00014142135623730948,0.0001,0.00015000000000000001,0.00019999999999999998,0.00025,0.0003
