gossips,p2p mean,p2p std,p2p min,p2p q1,p2p q2,p2p q3,p2p max,p2s mean,p2s std,p2s min,p2s q1,p2s q2,p2s q3,p2s max,s2s mean,s2s std,s2s min,s2s q1,s2s q2,s2s q3,s2s max
1,49.32272,0.12733895711839338,49.041,49.254,49.323,49.408,49.581,48.26835999999999,0.19086751076772088,47.859,48.147,48.27,48.419,48.747,56.611862239999994,0.11465161112775545,56.421556,56.539889,56.611,56.699667000000005,56.891
2,22.197599999999998,0.12966366748887906,21.942,22.109,22.231,22.3,22.416,14.785720000000003,0.14082244139340871,14.552,14.664,14.789,14.896,15.06,21.05345336,0.16968125810002294,20.496111,20.978333,21.067556,21.145111,21.340778
3,2.0269999999999997,0.050570907315043115,1.909,1.996,2.031,2.046,2.164,0.01844000000000001,0.003355095627052479,0.013,0.016,0.018,0.02,0.028,0.42068436,0.011907107540876575,0.40355599999999997,0.412,0.42022200000000004,0.42622200000000005,0.447333
4,0.01980000000000001,0.004291464396527911,0.011,0.017,0.019,0.023,0.027,,,,,,,,0.0006111666666666664,0.00021747616894264763,0.00022200000000000003,0.00044400000000000006,0.0006115,0.000667,0.001111
5,0.001,,0.001,0.001,0.001,0.001,0.001,,,,,,,,,,,,,,
