gossips,p2p mean,p2p std,p2p min,p2p q1,p2p q2,p2p q3,p2p max,p2s mean,p2s std,p2s min,p2s q1,p2s q2,p2s q3,p2s max,s2s mean,s2s std,s2s min,s2s q1,s2s q2,s2s q3,s2s max
1,51.68639999999999,0.468480522540692,50.87,51.35,51.73,52.0,52.59,48.38120000000001,0.5336456377285108,47.5,47.75,48.51,48.72,49.24,53.461870720000015,0.16963160479244313,53.015859,53.380202000000004,53.44,53.588081,53.800404
2,18.717600000000004,0.5934172225340283,17.69,18.41,18.61,18.96,20.58,14.693600000000002,0.7391147858530953,12.23,14.37,14.68,15.25,15.73,21.29477176,0.3111782936984939,20.836869,21.038182,21.308788,21.530808,21.870504999999998
3,0.0340909090909091,0.01790426682561368,0.01,0.02,0.03,0.04,0.08,0.02222222222222223,0.015167905573187227,0.01,0.01,0.02,0.03,0.06,1.26425052,0.03613472441908659,1.178182,1.240202,1.261414,1.2911110000000001,1.3177780000000001
4,,,,,,,,,,,,,,,0.01992728,0.0017208376719880737,0.016465,0.018788,0.020202,0.020909,0.023737
5,,,,,,,,,,,,,,,,,,,,,
