gossips,p2p mean,p2p std,p2p min,p2p q1,p2p q2,p2p q3,p2p max,p2s mean,p2s std,p2s min,p2s q1,p2s q2,p2s q3,p2s max,s2s mean,s2s std,s2s min,s2s q1,s2s q2,s2s q3,s2s max
1,,,,,,,,,,,,,,,0.00187456,0.00041446934747940055,0.000909,0.0017170000000000002,0.0019190000000000001,0.002121,0.002727
2,,,,,,,,,,,,,,,,,,,,,
3,,,,,,,,,,,,,,,,,,,,,
4,,,,,,,,,,,,,,,,,,,,,
5,,,,,,,,,,,,,,,,,,,,,
