,mean,std,min,q1,q2,q3,max
Simple,,,,,,,
P,4.236329416470824,0.6650164748604417,1.0,4.0,4.0,5.0,7.0
S,6.633953363024069,0.5949332094597067,3.0,6.0,7.0,7.0,10.0
P+S,6.609977307799757,0.6416691076718127,1.0,6.0,7.0,7.0,10.0
