gossips,p2p mean,p2p std,p2p min,p2p q1,p2p q2,p2p q3,p2p max,p2s mean,p2s std,p2s min,p2s q1,p2s q2,p2s q3,p2s max,s2s mean,s2s std,s2s min,s2s q1,s2s q2,s2s q3,s2s max
1,,,,,,,,,,,,,,,0.016432319999999997,0.01172673753550691,0.004343,0.010808,0.013938999999999998,0.018889,0.064747
2,,,,,,,,,,,,,,,,,,,,,
3,,,,,,,,,,,,,,,,,,,,,
4,,,,,,,,,,,,,,,,,,,,,
5,,,,,,,,,,,,,,,,,,,,,
6,,,,,,,,,,,,,,,,,,,,,
7,,,,,,,,,,,,,,,,,,,,,
