round,nodes,nodesP,nodesS,nodesSent,nodesSentP,nodesSentS,nodesRecv,nodesRecvP,nodesRecvS,msgSent,msgSentP,msgSentS,msgRecv,msgRecvP,msgRecvS,msgInfect,msgInfectP,msgInfectS
00,1000.000000,500.000000,500.000000,0.000000,0.000000,0.000000,0.000000,0.000000,0.000000,0.000000,0.000000,0.000000,0.000000,0.000000,0.000000,0.000000,0.000000,0.000000
01,1000.000000,500.000000,500.000000,0.120000,0.240000,0.000000,0.120000,0.240000,0.000000,12.000000,12.000000,0.000000,1.200000,1.200000,0.000000,0.500000,1.000000,0.000000
02,1000.000000,500.000000,500.000000,1.170000,2.340000,0.000000,1.170000,2.340000,0.000000,117.000000,117.000000,0.000000,11.700000,11.700000,0.000000,0.500000,1.000000,0.000000
03,1000.000000,500.000000,500.000000,10.290000,20.580000,0.000000,10.290000,20.580000,0.000000,1029.000000,1029.000000,0.000000,115.500000,115.500000,0.000000,0.500000,1.000000,0.000000
04,1000.000000,500.000000,500.000000,44.080000,86.160000,2.000000,44.080000,86.160000,2.000000,4408.000000,4308.000000,100.000000,1012.300000,1002.100000,10.200000,1.500000,2.000000,1.000000
05,1000.000000,500.000000,500.000000,98.190000,99.380000,97.000000,98.190000,99.380000,97.000000,9819.000000,4969.000000,4850.000000,4332.200000,2646.500000,1685.700000,4.000000,5.000000,3.000000
06,1000.000000,500.000000,500.000000,99.690000,99.380000,100.000000,99.690000,99.380000,100.000000,9969.000000,4969.000000,5000.000000,9800.600000,2646.500000,7154.100000,9.500000,5.000000,14.000000
07,1000.000000,500.000000,500.000000,99.690000,99.380000,100.000000,99.690000,99.380000,100.000000,9969.000000,4969.000000,5000.000000,9970.000000,2646.500000,7323.500000,9.500000,5.000000,14.000000
08,1000.000000,500.000000,500.000000,99.690000,99.380000,100.000000,99.690000,99.380000,100.000000,9969.000000,4969.000000,5000.000000,9970.000000,2646.500000,7323.500000,9.500000,5.000000,14.000000
09,1000.000000,500.000000,500.000000,99.690000,99.380000,100.000000,99.690000,99.380000,100.000000,9969.000000,4969.000000,5000.000000,9970.000000,2646.500000,7323.500000,9.500000,5.000000,14.000000
10,1000.000000,500.000000,500.000000,99.690000,99.380000,100.000000,99.690000,99.380000,100.000000,9969.000000,4969.000000,5000.000000,9970.000000,2646.500000,7323.500000,9.500000,5.000000,14.000000
11,1000.000000,500.000000,500.000000,99.690000,99.380000,100.000000,99.690000,99.380000,100.000000,9969.000000,4969.000000,5000.000000,9970.000000,2646.500000,7323.500000,9.500000,5.000000,14.000000
12,1000.000000,500.000000,500.000000,99.690000,99.380000,100.000000,99.690000,99.380000,100.000000,9969.000000,4969.000000,5000.000000,9970.000000,2646.500000,7323.500000,9.500000,5.000000,14.000000
13,1000.000000,500.000000,500.000000,99.690000,99.380000,100.000000,99.690000,99.380000,100.000000,9969.000000,4969.000000,5000.000000,9970.000000,2646.500000,7323.500000,9.500000,5.000000,14.000000
14,1000.000000,500.000000,500.000000,99.690000,99.380000,100.000000,99.690000,99.380000,100.000000,9969.000000,4969.000000,5000.000000,9970.000000,2646.500000,7323.500000,9.500000,5.000000,14.000000
15,1000.000000,500.000000,500.000000,99.690000,99.380000,100.000000,99.690000,99.380000,100.000000,9969.000000,4969.000000,5000.000000,9970.000000,2646.500000,7323.500000,9.500000,5.000000,14.000000
16,1000.000000,500.000000,500.000000,99.690000,99.380000,100.000000,99.690000,99.380000,100.000000,9969.000000,4969.000000,5000.000000,9970.000000,2646.500000,7323.500000,9.500000,5.000000,14.000000
17,1000.000000,500.000000,500.000000,99.690000,99.380000,100.000000,99.690000,99.380000,100.000000,9969.000000,4969.000000,5000.000000,9970.000000,2646.500000,7323.500000,9.500000,5.000000,14.000000
18,1000.000000,500.000000,500.000000,99.690000,99.380000,100.000000,99.690000,99.380000,100.000000,9969.000000,4969.000000,5000.000000,9970.000000,2646.500000,7323.500000,9.500000,5.000000,14.000000
19,1000.000000,500.000000,500.000000,99.690000,99.380000,100.000000,99.690000,99.380000,100.000000,9969.000000,4969.000000,5000.000000,9970.000000,2646.500000,7323.500000,9.500000,5.000000,14.000000
