round,P mean,P std,P min,P q1,P q2,P q3,P max,S mean,S std,S min,S q1,S q2,S q3,S max,P+S mean,P+S std,P+S min,P+S q1,P+S q2,P+S q3,P+S max
0,0.0,0.0,0.0,0.0,0.0,0.0,0.0,0.0,0.0,0.0,0.0,0.0,0.0,0.0,0.0,0.0,0.0,0.0,0.0,0.0,0.0
1,0.0,0.0,0.0,0.0,0.0,0.0,0.0,0.0,0.0,0.0,0.0,0.0,0.0,0.0,0.0,0.0,0.0,0.0,0.0,0.0,0.0
2,0.0,0.0,0.0,0.0,0.0,0.0,0.0,0.0,0.0,0.0,0.0,0.0,0.0,0.0,0.0,0.0,0.0,0.0,0.0,0.0,0.0
3,0.0,0.0,0.0,0.0,0.0,0.0,0.0,0.0,0.0,0.0,0.0,0.0,0.0,0.0,0.0,0.0,0.0,0.0,0.0,0.0,0.0
4,0.0,0.0,0.0,0.0,0.0,0.0,0.0,0.0,0.0,0.0,0.0,0.0,0.0,0.0,0.0,0.0,0.0,0.0,0.0,0.0,0.0
5,0.0,0.0,0.0,0.0,0.0,0.0,0.0,0.0,0.0,0.0,0.0,0.0,0.0,0.0,0.0,0.0,0.0,0.0,0.0,0.0,0.0
6,0.0,0.0,0.0,0.0,0.0,0.0,0.0,0.0,0.0,0.0,0.0,0.0,0.0,0.0,0.0,0.0,0.0,0.0,0.0,0.0,0.0
7,0.0,0.0,0.0,0.0,0.0,0.0,0.0,0.0,0.0,0.0,0.0,0.0,0.0,0.0,0.0,0.0,0.0,0.0,0.0,0.0,0.0
8,0.0,0.0,0.0,0.0,0.0,0.0,0.0,0.0,0.0,0.0,0.0,0.0,0.0,0.0,0.0,0.0,0.0,0.0,0.0,0.0,0.0
9,0.0,0.0,0.0,0.0,0.0,0.0,0.0,0.0,0.0,0.0,0.0,0.0,0.0,0.0,0.0,0.0,0.0,0.0,0.0,0.0,0.0
10,0.0,0.0,0.0,0.0,0.0,0.0,0.0,0.0,0.0,0.0,0.0,0.0,0.0,0.0,0.0,0.0,0.0,0.0,0.0,0.0,0.0
11,0.07520000000000004,0.026476404589747454,0.02,0.06,0.08,0.09,0.14,0.0,0.0,0.0,0.0,0.0,0.0,0.0,0.0007520000000000001,0.00026476404589747453,0.0002,0.0006,0.0008,0.0009,0.0014
12,7.053600000000001,0.1924595195532469,6.68,6.96,7.05,7.1,7.45,0.0,0.0,0.0,0.0,0.0,0.0,0.0,0.070536,0.0019245951955324712,0.0668,0.0696,0.0705,0.071,0.0745
13,65.38839999999999,0.4567884265901074,64.15,65.11,65.53,65.72,66.03,0.0,0.0,0.0,0.0,0.0,0.0,0.0,0.6538840000000001,0.004567884265901095,0.6415,0.6511,0.6553,0.6572,0.6603
14,99.80239999999998,0.04576024475458981,99.71,99.76,99.81,99.83,99.9,9.291999999999998e-05,0.00010878032910411699,0.0,0.0,0.000101,0.000101,0.000404,0.9981159999999999,0.0005063595560468765,0.9971,0.9977,0.9981,0.9985,0.999
15,99.95079999999999,0.01846618531261846,99.92,99.94,99.95,99.97,99.99,0.5876041200000001,0.02025139651217497,0.5450510000000001,0.580505,0.589091,0.5979800000000001,0.626667,1.581236,0.020066221202143023,1.539,1.574,1.5829,1.5913,1.6199
16,99.95079999999999,0.01846618531261846,99.92,99.94,99.95,99.97,99.99,22.470998000000005,0.4464257481633976,21.610707,22.188384,22.423535,22.848485,23.217273000000002,23.245796,0.4419731764862365,22.3941,22.966,23.199,23.6197,23.9846
17,99.95079999999999,0.01846618531261846,99.92,99.94,99.95,99.97,99.99,91.53202415999998,0.34159350689997625,91.022727,91.25666700000001,91.473636,91.80899000000001,92.12101,91.61621200000002,0.3381951228211327,91.112,91.3438,91.5582,91.8903,92.1992
18,99.95079999999999,0.01846618531261846,99.92,99.94,99.95,99.97,99.99,99.95200796,0.0020467696393761184,99.94868699999999,99.950505,99.951818,99.953636,99.95596,99.95199599999998,0.0020214433787107016,99.9489,99.9506,99.9522,99.9537,99.9558
19,99.95079999999999,0.01846618531261846,99.92,99.94,99.95,99.97,99.99,99.95780212000001,0.0020576103113380704,99.953232,99.95666700000001,99.957879,99.959192,99.961111,99.95773200000002,0.002028077907773745,99.9534,99.9566,99.9578,99.9592,99.961
20,99.95079999999999,0.01846618531261846,99.92,99.94,99.95,99.97,99.99,99.95780616000002,0.0020553866562422946,99.953232,99.95676800000001,99.957879,99.959192,99.961111,99.95773600000001,0.0020258496160047565,99.9534,99.9567,99.9578,99.9592,99.961
21,99.95079999999999,0.01846618531261846,99.92,99.94,99.95,99.97,99.99,99.95780616000002,0.0020553866562422946,99.953232,99.95676800000001,99.957879,99.959192,99.961111,99.95773600000001,0.0020258496160047565,99.9534,99.9567,99.9578,99.9592,99.961
22,99.95079999999999,0.01846618531261846,99.92,99.94,99.95,99.97,99.99,99.95780616000002,0.0020553866562422946,99.953232,99.95676800000001,99.957879,99.959192,99.961111,99.95773600000001,0.0020258496160047565,99.9534,99.9567,99.9578,99.9592,99.961
23,99.95079999999999,0.01846618531261846,99.92,99.94,99.95,99.97,99.99,99.95780616000002,0.0020553866562422946,99.953232,99.95676800000001,99.957879,99.959192,99.961111,99.95773600000001,0.0020258496160047565,99.9534,99.9567,99.9578,99.9592,99.961
24,99.95079999999999,0.01846618531261846,99.92,99.94,99.95,99.97,99.99,99.95780616000002,0.0020553866562422946,99.953232,99.95676800000001,99.957879,99.959192,99.961111,99.95773600000001,0.0020258496160047565,99.9534,99.9567,99.9578,99.9592,99.961
25,99.95079999999999,0.01846618531261846,99.92,99.94,99.95,99.97,99.99,99.95780616000002,0.0020553866562422946,99.953232,99.95676800000001,99.957879,99.959192,99.961111,99.95773600000001,0.0020258496160047565,99.9534,99.9567,99.9578,99.9592,99.961
