gossips,p2p mean,p2p std,p2p min,p2p q1,p2p q2,p2p q3,p2p max,p2s mean,p2s std,p2s min,p2s q1,p2s q2,p2s q3,p2s max,s2s mean,s2s std,s2s min,s2s q1,s2s q2,s2s q3,s2s max
1,49.188,1.8749044420094225,46.3,47.9,49.0,50.5,54.4,49.188,1.8749044420094225,46.3,47.9,49.0,50.5,54.4,55.574374399999996,0.08364757671674279,55.327528,55.541441000000006,55.57077099999999,55.634034,55.730731000000006
2,22.184,1.0761350596773003,19.4,21.8,22.2,22.7,24.8,22.184,1.0761350596773003,19.4,21.8,22.2,22.7,24.8,19.5971692,0.1315365653462307,19.282382000000002,19.537036999999998,19.612112,19.637337,19.918318
3,1.9559999999999997,0.42532340636273475,1.2,1.7,1.9,2.3,2.6,1.9559999999999997,0.42532340636273475,1.2,1.7,1.9,2.3,2.6,1.7212732800000001,0.0319665835750397,1.671672,1.697497,1.718118,1.7379380000000002,1.81972
4,0.1142857142857143,0.03779644730092272,0.1,0.1,0.1,0.1,0.2,0.1142857142857143,0.03779644730092272,0.1,0.1,0.1,0.1,0.2,0.03467468,0.002037871984857407,0.02953,0.033533999999999994,0.034935,0.035736000000000004,0.038438
5,,,,,,,,,,,,,,,0.00016111111111111108,8.498365855987973e-05,0.0001,0.0001,0.0001,0.0002,0.0003
