round,P+S mean,P+S std,P+S min,P+S q1,P+S median,P+S q3,P+S max,P mean,P std,P min,P q1,P median,P q3,P max,S mean,S std,S min,S q1,S median,S q3,S max
0,0.0,0.0,0.0,0.0,0.0,0.0,0.0,0.0,0.0,0.0,0.0,0.0,0.0,0.0,0.0,0.0,0.0,0.0,0.0,0.0,0.0
1,0.0,0.0,0.0,0.0,0.0,0.0,0.0,0.0,0.0,0.0,0.0,0.0,0.0,0.0,0.0,0.0,0.0,0.0,0.0,0.0,0.0
2,0.0,0.0,0.0,0.0,0.0,0.0,0.0,0.0,0.0,0.0,0.0,0.0,0.0,0.0,0.0,0.0,0.0,0.0,0.0,0.0,0.0
3,0.0,0.0,0.0,0.0,0.0,0.0,0.0,0.0,0.0,0.0,0.0,0.0,0.0,0.0,0.0,0.0,0.0,0.0,0.0,0.0,0.0
4,0.0,0.0,0.0,0.0,0.0,0.0,0.0,0.0,0.0,0.0,0.0,0.0,0.0,0.0,0.0,0.0,0.0,0.0,0.0,0.0,0.0
5,0.0,0.0,0.0,0.0,0.0,0.0,0.0,0.0,0.0,0.0,0.0,0.0,0.0,0.0,0.0,0.0,0.0,0.0,0.0,0.0,0.0
6,0.0,0.0,0.0,0.0,0.0,0.0,0.0,0.0,0.0,0.0,0.0,0.0,0.0,0.0,0.0,0.0,0.0,0.0,0.0,0.0,0.0
7,0.0,0.0,0.0,0.0,0.0,0.0,0.0,0.0,0.0,0.0,0.0,0.0,0.0,0.0,0.0,0.0,0.0,0.0,0.0,0.0,0.0
8,0.0,0.0,0.0,0.0,0.0,0.0,0.0,0.0,0.0,0.0,0.0,0.0,0.0,0.0,0.0,0.0,0.0,0.0,0.0,0.0,0.0
9,0.0,0.0,0.0,0.0,0.0,0.0,0.0,0.0,0.0,0.0,0.0,0.0,0.0,0.0,0.0,0.0,0.0,0.0,0.0,0.0,0.0
10,0.0,0.0,0.0,0.0,0.0,0.0,0.0,0.0,0.0,0.0,0.0,0.0,0.0,0.0,0.0,0.0,0.0,0.0,0.0,0.0,0.0
11,0.0,0.0,0.0,0.0,0.0,0.0,0.0,0.0,0.0,0.0,0.0,0.0,0.0,0.0,0.0,0.0,0.0,0.0,0.0,0.0,0.0
12,0.0,0.0,0.0,0.0,0.0,0.0,0.0,0.0,0.0,0.0,0.0,0.0,0.0,0.0,0.0,0.0,0.0,0.0,0.0,0.0,0.0
13,0.0,0.0,0.0,0.0,0.0,0.0,0.0,0.0,0.0,0.0,0.0,0.0,0.0,0.0,0.0,0.0,0.0,0.0,0.0,0.0,0.0
14,0.0,0.0,0.0,0.0,0.0,0.0,0.0,0.0,0.0,0.0,0.0,0.0,0.0,0.0,0.0,0.0,0.0,0.0,0.0,0.0,0.0
15,0.0,0.0,0.0,0.0,0.0,0.0,0.0,0.0,0.0,0.0,0.0,0.0,0.0,0.0,0.0,0.0,0.0,0.0,0.0,0.0,0.0
16,0.0,0.0,0.0,0.0,0.0,0.0,0.0,0.0,0.0,0.0,0.0,0.0,0.0,0.0,0.0,0.0,0.0,0.0,0.0,0.0,0.0
17,0.0,0.0,0.0,0.0,0.0,0.0,0.0,0.0,0.0,0.0,0.0,0.0,0.0,0.0,0.0,0.0,0.0,0.0,0.0,0.0,0.0
18,0.0,0.0,0.0,0.0,0.0,0.0,0.0,0.0,0.0,0.0,0.0,0.0,0.0,0.0,0.0,0.0,0.0,0.0,0.0,0.0,0.0
19,0.0,0.0,0.0,0.0,0.0,0.0,0.0,0.0,0.0,0.0,0.0,0.0,0.0,0.0,0.0,0.0,0.0,0.0,0.0,0.0,0.0
20,0.0,0.0,0.0,0.0,0.0,0.0,0.0,0.0,0.0,0.0,0.0,0.0,0.0,0.0,0.0,0.0,0.0,0.0,0.0,0.0,0.0
21,0.0,0.0,0.0,0.0,0.0,0.0,0.0,0.0,0.0,0.0,0.0,0.0,0.0,0.0,0.0,0.0,0.0,0.0,0.0,0.0,0.0
22,0.0,0.0,0.0,0.0,0.0,0.0,0.0,0.0,0.0,0.0,0.0,0.0,0.0,0.0,0.0,0.0,0.0,0.0,0.0,0.0,0.0
23,0.0,0.0,0.0,0.0,0.0,0.0,0.0,0.0,0.0,0.0,0.0,0.0,0.0,0.0,0.0,0.0,0.0,0.0,0.0,0.0,0.0
24,0.0,0.0,0.0,0.0,0.0,0.0,0.0,0.0,0.0,0.0,0.0,0.0,0.0,0.0,0.0,0.0,0.0,0.0,0.0,0.0,0.0
25,0.0,0.0,0.0,0.0,0.0,0.0,0.0,0.0,0.0,0.0,0.0,0.0,0.0,0.0,0.0,0.0,0.0,0.0,0.0,0.0,0.0
26,0.0,0.0,0.0,0.0,0.0,0.0,0.0,0.0,0.0,0.0,0.0,0.0,0.0,0.0,0.0,0.0,0.0,0.0,0.0,0.0,0.0
27,0.0,0.0,0.0,0.0,0.0,0.0,0.0,0.0,0.0,0.0,0.0,0.0,0.0,0.0,0.0,0.0,0.0,0.0,0.0,0.0,0.0
28,0.0,0.0,0.0,0.0,0.0,0.0,0.0,0.0,0.0,0.0,0.0,0.0,0.0,0.0,0.0,0.0,0.0,0.0,0.0,0.0,0.0
29,0.0,0.0,0.0,0.0,0.0,0.0,0.0,0.0,0.0,0.0,0.0,0.0,0.0,0.0,0.0,0.0,0.0,0.0,0.0,0.0,0.0
30,0.0,0.0,0.0,0.0,0.0,0.0,0.0,0.0,0.0,0.0,0.0,0.0,0.0,0.0,0.0,0.0,0.0,0.0,0.0,0.0,0.0
31,0.0,0.0,0.0,0.0,0.0,0.0,0.0,0.0,0.0,0.0,0.0,0.0,0.0,0.0,0.0,0.0,0.0,0.0,0.0,0.0,0.0
32,0.0,0.0,0.0,0.0,0.0,0.0,0.0,0.0,0.0,0.0,0.0,0.0,0.0,0.0,0.0,0.0,0.0,0.0,0.0,0.0,0.0
33,0.0,0.0,0.0,0.0,0.0,0.0,0.0,0.0,0.0,0.0,0.0,0.0,0.0,0.0,0.0,0.0,0.0,0.0,0.0,0.0,0.0
34,0.0,0.0,0.0,0.0,0.0,0.0,0.0,0.0,0.0,0.0,0.0,0.0,0.0,0.0,0.0,0.0,0.0,0.0,0.0,0.0,0.0
35,0.0,0.0,0.0,0.0,0.0,0.0,0.0,0.0,0.0,0.0,0.0,0.0,0.0,0.0,0.0,0.0,0.0,0.0,0.0,0.0,0.0
36,0.0,0.0,0.0,0.0,0.0,0.0,0.0,0.0,0.0,0.0,0.0,0.0,0.0,0.0,0.0,0.0,0.0,0.0,0.0,0.0,0.0
37,0.0,0.0,0.0,0.0,0.0,0.0,0.0,0.0,0.0,0.0,0.0,0.0,0.0,0.0,0.0,0.0,0.0,0.0,0.0,0.0,0.0
38,0.0,0.0,0.0,0.0,0.0,0.0,0.0,0.0,0.0,0.0,0.0,0.0,0.0,0.0,0.0,0.0,0.0,0.0,0.0,0.0,0.0
39,0.0,0.0,0.0,0.0,0.0,0.0,0.0,0.0,0.0,0.0,0.0,0.0,0.0,0.0,0.0,0.0,0.0,0.0,0.0,0.0,0.0
40,0.0,0.0,0.0,0.0,0.0,0.0,0.0,0.0,0.0,0.0,0.0,0.0,0.0,0.0,0.0,0.0,0.0,0.0,0.0,0.0,0.0
41,0.0,0.0,0.0,0.0,0.0,0.0,0.0,0.0,0.0,0.0,0.0,0.0,0.0,0.0,0.0,0.0,0.0,0.0,0.0,0.0,0.0
42,0.0,0.0,0.0,0.0,0.0,0.0,0.0,0.0,0.0,0.0,0.0,0.0,0.0,0.0,0.0,0.0,0.0,0.0,0.0,0.0,0.0
43,0.0,0.0,0.0,0.0,0.0,0.0,0.0,0.0,0.0,0.0,0.0,0.0,0.0,0.0,0.0,0.0,0.0,0.0,0.0,0.0,0.0
44,0.0,0.0,0.0,0.0,0.0,0.0,0.0,0.0,0.0,0.0,0.0,0.0,0.0,0.0,0.0,0.0,0.0,0.0,0.0,0.0,0.0
45,0.0,0.0,0.0,0.0,0.0,0.0,0.0,0.0,0.0,0.0,0.0,0.0,0.0,0.0,0.0,0.0,0.0,0.0,0.0,0.0,0.0
46,0.0,0.0,0.0,0.0,0.0,0.0,0.0,0.0,0.0,0.0,0.0,0.0,0.0,0.0,0.0,0.0,0.0,0.0,0.0,0.0,0.0
47,0.0,0.0,0.0,0.0,0.0,0.0,0.0,0.0,0.0,0.0,0.0,0.0,0.0,0.0,0.0,0.0,0.0,0.0,0.0,0.0,0.0
48,0.0,0.0,0.0,0.0,0.0,0.0,0.0,0.0,0.0,0.0,0.0,0.0,0.0,0.0,0.0,0.0,0.0,0.0,0.0,0.0,0.0
49,0.0,0.0,0.0,0.0,0.0,0.0,0.0,0.0,0.0,0.0,0.0,0.0,0.0,0.0,0.0,0.0,0.0,0.0,0.0,0.0,0.0
50,0.0,0.0,0.0,0.0,0.0,0.0,0.0,0.0,0.0,0.0,0.0,0.0,0.0,0.0,0.0,0.0,0.0,0.0,0.0,0.0,0.0
51,0.0,0.0,0.0,0.0,0.0,0.0,0.0,0.0,0.0,0.0,0.0,0.0,0.0,0.0,0.0,0.0,0.0,0.0,0.0,0.0,0.0
52,0.0,0.0,0.0,0.0,0.0,0.0,0.0,0.0,0.0,0.0,0.0,0.0,0.0,0.0,0.0,0.0,0.0,0.0,0.0,0.0,0.0
53,0.0,0.0,0.0,0.0,0.0,0.0,0.0,0.0,0.0,0.0,0.0,0.0,0.0,0.0,0.0,0.0,0.0,0.0,0.0,0.0,0.0
54,0.0,0.0,0.0,0.0,0.0,0.0,0.0,0.0,0.0,0.0,0.0,0.0,0.0,0.0,0.0,0.0,0.0,0.0,0.0,0.0,0.0
55,0.0,0.0,0.0,0.0,0.0,0.0,0.0,0.0,0.0,0.0,0.0,0.0,0.0,0.0,0.0,0.0,0.0,0.0,0.0,0.0,0.0
56,0.0,0.0,0.0,0.0,0.0,0.0,0.0,0.0,0.0,0.0,0.0,0.0,0.0,0.0,0.0,0.0,0.0,0.0,0.0,0.0,0.0
57,0.0,0.0,0.0,0.0,0.0,0.0,0.0,0.0,0.0,0.0,0.0,0.0,0.0,0.0,0.0,0.0,0.0,0.0,0.0,0.0,0.0
58,0.0,0.0,0.0,0.0,0.0,0.0,0.0,0.0,0.0,0.0,0.0,0.0,0.0,0.0,0.0,0.0,0.0,0.0,0.0,0.0,0.0
59,0.0,0.0,0.0,0.0,0.0,0.0,0.0,0.0,0.0,0.0,0.0,0.0,0.0,0.0,0.0,0.0,0.0,0.0,0.0,0.0,0.0
60,0.0,0.0,0.0,0.0,0.0,0.0,0.0,0.0,0.0,0.0,0.0,0.0,0.0,0.0,0.0,0.0,0.0,0.0,0.0,0.0,0.0
61,0.0,0.0,0.0,0.0,0.0,0.0,0.0,0.0,0.0,0.0,0.0,0.0,0.0,0.0,0.0,0.0,0.0,0.0,0.0,0.0,0.0
62,0.0,0.0,0.0,0.0,0.0,0.0,0.0,0.0,0.0,0.0,0.0,0.0,0.0,0.0,0.0,0.0,0.0,0.0,0.0,0.0,0.0
63,0.0,0.0,0.0,0.0,0.0,0.0,0.0,0.0,0.0,0.0,0.0,0.0,0.0,0.0,0.0,0.0,0.0,0.0,0.0,0.0,0.0
64,0.0,0.0,0.0,0.0,0.0,0.0,0.0,0.0,0.0,0.0,0.0,0.0,0.0,0.0,0.0,0.0,0.0,0.0,0.0,0.0,0.0
65,0.0,0.0,0.0,0.0,0.0,0.0,0.0,0.0,0.0,0.0,0.0,0.0,0.0,0.0,0.0,0.0,0.0,0.0,0.0,0.0,0.0
66,0.0,0.0,0.0,0.0,0.0,0.0,0.0,0.0,0.0,0.0,0.0,0.0,0.0,0.0,0.0,0.0,0.0,0.0,0.0,0.0,0.0
67,0.0,0.0,0.0,0.0,0.0,0.0,0.0,0.0,0.0,0.0,0.0,0.0,0.0,0.0,0.0,0.0,0.0,0.0,0.0,0.0,0.0
68,0.0,0.0,0.0,0.0,0.0,0.0,0.0,0.0,0.0,0.0,0.0,0.0,0.0,0.0,0.0,0.0,0.0,0.0,0.0,0.0,0.0
69,0.0,0.0,0.0,0.0,0.0,0.0,0.0,0.0,0.0,0.0,0.0,0.0,0.0,0.0,0.0,0.0,0.0,0.0,0.0,0.0,0.0
70,0.0,0.0,0.0,0.0,0.0,0.0,0.0,0.0,0.0,0.0,0.0,0.0,0.0,0.0,0.0,0.0,0.0,0.0,0.0,0.0,0.0
71,0.0,0.0,0.0,0.0,0.0,0.0,0.0,0.0,0.0,0.0,0.0,0.0,0.0,0.0,0.0,0.0,0.0,0.0,0.0,0.0,0.0
72,0.0,0.0,0.0,0.0,0.0,0.0,0.0,0.0,0.0,0.0,0.0,0.0,0.0,0.0,0.0,0.0,0.0,0.0,0.0,0.0,0.0
73,0.0,0.0,0.0,0.0,0.0,0.0,0.0,0.0,0.0,0.0,0.0,0.0,0.0,0.0,0.0,0.0,0.0,0.0,0.0,0.0,0.0
74,0.0,0.0,0.0,0.0,0.0,0.0,0.0,0.0,0.0,0.0,0.0,0.0,0.0,0.0,0.0,0.0,0.0,0.0,0.0,0.0,0.0
75,0.0,0.0,0.0,0.0,0.0,0.0,0.0,0.0,0.0,0.0,0.0,0.0,0.0,0.0,0.0,0.0,0.0,0.0,0.0,0.0,0.0
76,0.0,0.0,0.0,0.0,0.0,0.0,0.0,0.0,0.0,0.0,0.0,0.0,0.0,0.0,0.0,0.0,0.0,0.0,0.0,0.0,0.0
77,0.0,0.0,0.0,0.0,0.0,0.0,0.0,0.0,0.0,0.0,0.0,0.0,0.0,0.0,0.0,0.0,0.0,0.0,0.0,0.0,0.0
78,0.0,0.0,0.0,0.0,0.0,0.0,0.0,0.0,0.0,0.0,0.0,0.0,0.0,0.0,0.0,0.0,0.0,0.0,0.0,0.0,0.0
79,0.0,0.0,0.0,0.0,0.0,0.0,0.0,0.0,0.0,0.0,0.0,0.0,0.0,0.0,0.0,0.0,0.0,0.0,0.0,0.0,0.0
80,0.0,0.0,0.0,0.0,0.0,0.0,0.0,0.0,0.0,0.0,0.0,0.0,0.0,0.0,0.0,0.0,0.0,0.0,0.0,0.0,0.0
81,0.0,0.0,0.0,0.0,0.0,0.0,0.0,0.0,0.0,0.0,0.0,0.0,0.0,0.0,0.0,0.0,0.0,0.0,0.0,0.0,0.0
82,0.0,0.0,0.0,0.0,0.0,0.0,0.0,0.0,0.0,0.0,0.0,0.0,0.0,0.0,0.0,0.0,0.0,0.0,0.0,0.0,0.0
83,0.0,0.0,0.0,0.0,0.0,0.0,0.0,0.0,0.0,0.0,0.0,0.0,0.0,0.0,0.0,0.0,0.0,0.0,0.0,0.0,0.0
84,0.0,0.0,0.0,0.0,0.0,0.0,0.0,0.0,0.0,0.0,0.0,0.0,0.0,0.0,0.0,0.0,0.0,0.0,0.0,0.0,0.0
85,0.0,0.0,0.0,0.0,0.0,0.0,0.0,0.0,0.0,0.0,0.0,0.0,0.0,0.0,0.0,0.0,0.0,0.0,0.0,0.0,0.0
86,0.0,0.0,0.0,0.0,0.0,0.0,0.0,0.0,0.0,0.0,0.0,0.0,0.0,0.0,0.0,0.0,0.0,0.0,0.0,0.0,0.0
87,0.0,0.0,0.0,0.0,0.0,0.0,0.0,0.0,0.0,0.0,0.0,0.0,0.0,0.0,0.0,0.0,0.0,0.0,0.0,0.0,0.0
88,0.0,0.0,0.0,0.0,0.0,0.0,0.0,0.0,0.0,0.0,0.0,0.0,0.0,0.0,0.0,0.0,0.0,0.0,0.0,0.0,0.0
89,0.0,0.0,0.0,0.0,0.0,0.0,0.0,0.0,0.0,0.0,0.0,0.0,0.0,0.0,0.0,0.0,0.0,0.0,0.0,0.0,0.0
90,9.999999999999999e-05,1.3552527156068805e-20,0.0001,0.0001,0.0001,0.0001,0.0001,0.0,0.0,0.0,0.0,0.0,0.0,0.0,9.999999999999999e-05,1.3552527156068805e-20,0.0001,0.0001,0.0001,0.0001,0.0001
91,0.001148,8.541662601625046e-05,0.0011,0.0011,0.0011,0.0012,0.0014,1.048,0.08541662601625051,1.0,1.0,1.0,1.1,1.3,9.999999999999999e-05,1.3552527156068805e-20,0.0001,0.0001,0.0001,0.0001,0.0001
92,0.010995999999999999,0.0002584260048834095,0.0106,0.0108,0.0109,0.0112,0.0115,10.868,0.2587972179139492,10.5,10.7,10.8,11.0,11.4,0.000128,4.48998886412873e-05,0.0001,0.0001,0.0001,0.0002,0.0002
93,0.07299599999999999,0.0016691267177778913,0.0707,0.0714,0.0729,0.0744,0.0767,66.2,0.9654014708917734,64.2,65.4,66.5,66.7,67.9,0.006802759999999999,0.001725827715155832,0.004104,0.005606,0.006906999999999999,0.008008,0.010511
94,0.4540840000000001,0.01142385854254157,0.4337,0.4451,0.4526,0.4639,0.4733,99.78000000000002,0.1854723699099154,99.3,99.7,99.8,99.9,100.0,0.35465864,0.011430396230682469,0.33423400000000003,0.345546,0.353153,0.364464,0.373974
95,4.63114,0.12126733772949749,4.444,4.5403,4.6014,4.7532,4.8343,99.94400000000002,0.08039900496896632,99.7,99.9,100.0,100.0,100.0,4.53573172,0.1213775873213898,4.348448,4.444845,4.5059059999999995,4.657858,4.739039
96,36.645052,0.706296828887119,35.6686,36.0096,36.5456,37.2865,37.8939,99.94400000000002,0.08039900496896632,99.7,99.9,100.0,100.0,100.0,36.58168968,0.706997745240462,35.604203999999996,35.945546,36.482282,37.223724,37.831732
97,97.19700800000003,0.1874359323502305,96.8549,97.0658,97.1569,97.354,97.501,99.94400000000002,0.08039900496896632,99.7,99.9,100.0,100.0,100.0,97.19425823999998,0.1876220105591612,96.85185200000001,97.06286300000001,97.154154,97.351351,97.498498
98,99.95328799999999,0.0018936356566132747,99.9501,99.9517,99.9537,99.9545,99.957,99.94400000000002,0.08039900496896632,99.7,99.9,100.0,100.0,100.0,99.95329724,0.0019084942814680888,99.95005,99.951752,99.953654,99.954454,99.95695699999999
99,99.954816,0.0018901174566675553,99.9515,99.9531,99.9553,99.9563,99.9582,99.94400000000002,0.08039900496896632,99.7,99.9,100.0,100.0,100.0,99.9548268,0.0019073627027903879,99.951451,99.953153,99.95535500000001,99.95625600000001,99.958158
100,99.954816,0.0018901174566675553,99.9515,99.9531,99.9553,99.9563,99.9582,99.94400000000002,0.08039900496896632,99.7,99.9,100.0,100.0,100.0,99.9548268,0.0019073627027903879,99.951451,99.953153,99.95535500000001,99.95625600000001,99.958158
101,99.954816,0.0018901174566675553,99.9515,99.9531,99.9553,99.9563,99.9582,99.94400000000002,0.08039900496896632,99.7,99.9,100.0,100.0,100.0,99.9548268,0.0019073627027903879,99.951451,99.953153,99.95535500000001,99.95625600000001,99.958158
102,99.954816,0.0018901174566675553,99.9515,99.9531,99.9553,99.9563,99.9582,99.94400000000002,0.08039900496896632,99.7,99.9,100.0,100.0,100.0,99.9548268,0.0019073627027903879,99.951451,99.953153,99.95535500000001,99.95625600000001,99.958158
103,99.954816,0.0018901174566675553,99.9515,99.9531,99.9553,99.9563,99.9582,99.94400000000002,0.08039900496896632,99.7,99.9,100.0,100.0,100.0,99.9548268,0.0019073627027903879,99.951451,99.953153,99.95535500000001,99.95625600000001,99.958158
104,99.954816,0.0018901174566675553,99.9515,99.9531,99.9553,99.9563,99.9582,99.94400000000002,0.08039900496896632,99.7,99.9,100.0,100.0,100.0,99.9548268,0.0019073627027903879,99.951451,99.953153,99.95535500000001,99.95625600000001,99.958158
105,99.954816,0.0018901174566675553,99.9515,99.9531,99.9553,99.9563,99.9582,99.94400000000002,0.08039900496896632,99.7,99.9,100.0,100.0,100.0,99.9548268,0.0019073627027903879,99.951451,99.953153,99.95535500000001,99.95625600000001,99.958158
106,99.954816,0.0018901174566675553,99.9515,99.9531,99.9553,99.9563,99.9582,99.94400000000002,0.08039900496896632,99.7,99.9,100.0,100.0,100.0,99.9548268,0.0019073627027903879,99.951451,99.953153,99.95535500000001,99.95625600000001,99.958158
107,99.954816,0.0018901174566675553,99.9515,99.9531,99.9553,99.9563,99.9582,99.94400000000002,0.08039900496896632,99.7,99.9,100.0,100.0,100.0,99.9548268,0.0019073627027903879,99.951451,99.953153,99.95535500000001,99.95625600000001,99.958158
108,99.954816,0.0018901174566675553,99.9515,99.9531,99.9553,99.9563,99.9582,99.94400000000002,0.08039900496896632,99.7,99.9,100.0,100.0,100.0,99.9548268,0.0019073627027903879,99.951451,99.953153,99.95535500000001,99.95625600000001,99.958158
109,99.954816,0.0018901174566675553,99.9515,99.9531,99.9553,99.9563,99.9582,99.94400000000002,0.08039900496896632,99.7,99.9,100.0,100.0,100.0,99.9548268,0.0019073627027903879,99.951451,99.953153,99.95535500000001,99.95625600000001,99.958158
110,99.954816,0.0018901174566675553,99.9515,99.9531,99.9553,99.9563,99.9582,99.94400000000002,0.08039900496896632,99.7,99.9,100.0,100.0,100.0,99.9548268,0.0019073627027903879,99.951451,99.953153,99.95535500000001,99.95625600000001,99.958158
111,99.954816,0.0018901174566675553,99.9515,99.9531,99.9553,99.9563,99.9582,99.94400000000002,0.08039900496896632,99.7,99.9,100.0,100.0,100.0,99.9548268,0.0019073627027903879,99.951451,99.953153,99.95535500000001,99.95625600000001,99.958158
112,99.954816,0.0018901174566675553,99.9515,99.9531,99.9553,99.9563,99.9582,99.94400000000002,0.08039900496896632,99.7,99.9,100.0,100.0,100.0,99.9548268,0.0019073627027903879,99.951451,99.953153,99.95535500000001,99.95625600000001,99.958158
113,99.954816,0.0018901174566675553,99.9515,99.9531,99.9553,99.9563,99.9582,99.94400000000002,0.08039900496896632,99.7,99.9,100.0,100.0,100.0,99.9548268,0.0019073627027903879,99.951451,99.953153,99.95535500000001,99.95625600000001,99.958158
114,99.954816,0.0018901174566675553,99.9515,99.9531,99.9553,99.9563,99.9582,99.94400000000002,0.08039900496896632,99.7,99.9,100.0,100.0,100.0,99.9548268,0.0019073627027903879,99.951451,99.953153,99.95535500000001,99.95625600000001,99.958158
115,99.954816,0.0018901174566675553,99.9515,99.9531,99.9553,99.9563,99.9582,99.94400000000002,0.08039900496896632,99.7,99.9,100.0,100.0,100.0,99.9548268,0.0019073627027903879,99.951451,99.953153,99.95535500000001,99.95625600000001,99.958158
116,99.954816,0.0018901174566675553,99.9515,99.9531,99.9553,99.9563,99.9582,99.94400000000002,0.08039900496896632,99.7,99.9,100.0,100.0,100.0,99.9548268,0.0019073627027903879,99.951451,99.953153,99.95535500000001,99.95625600000001,99.958158
117,99.954816,0.0018901174566675553,99.9515,99.9531,99.9553,99.9563,99.9582,99.94400000000002,0.08039900496896632,99.7,99.9,100.0,100.0,100.0,99.9548268,0.0019073627027903879,99.951451,99.953153,99.95535500000001,99.95625600000001,99.958158
118,99.954816,0.0018901174566675553,99.9515,99.9531,99.9553,99.9563,99.9582,99.94400000000002,0.08039900496896632,99.7,99.9,100.0,100.0,100.0,99.9548268,0.0019073627027903879,99.951451,99.953153,99.95535500000001,99.95625600000001,99.958158
119,99.954816,0.0018901174566675553,99.9515,99.9531,99.9553,99.9563,99.9582,99.94400000000002,0.08039900496896632,99.7,99.9,100.0,100.0,100.0,99.9548268,0.0019073627027903879,99.951451,99.953153,99.95535500000001,99.95625600000001,99.958158
120,99.954816,0.0018901174566675553,99.9515,99.9531,99.9553,99.9563,99.9582,99.94400000000002,0.08039900496896632,99.7,99.9,100.0,100.0,100.0,99.9548268,0.0019073627027903879,99.951451,99.953153,99.95535500000001,99.95625600000001,99.958158
121,99.954816,0.0018901174566675553,99.9515,99.9531,99.9553,99.9563,99.9582,99.94400000000002,0.08039900496896632,99.7,99.9,100.0,100.0,100.0,99.9548268,0.0019073627027903879,99.951451,99.953153,99.95535500000001,99.95625600000001,99.958158
122,99.954816,0.0018901174566675553,99.9515,99.9531,99.9553,99.9563,99.9582,99.94400000000002,0.08039900496896632,99.7,99.9,100.0,100.0,100.0,99.9548268,0.0019073627027903879,99.951451,99.953153,99.95535500000001,99.95625600000001,99.958158
123,99.954816,0.0018901174566675553,99.9515,99.9531,99.9553,99.9563,99.9582,99.94400000000002,0.08039900496896632,99.7,99.9,100.0,100.0,100.0,99.9548268,0.0019073627027903879,99.951451,99.953153,99.95535500000001,99.95625600000001,99.958158
