round,nodes,nodesP,nodesS,nodesSent,nodesSentP,nodesSentS,nodesRecv,nodesRecvP,nodesRecvS,msgSent,msgSentP,msgSentS,msgRecv,msgRecvP,msgRecvS,msgInfect,msgInfectP,msgInfectS
0,1000000.0,990000.0,10000.0,0.0,0.0,0.0,0.0,0.0,0.0,0.0,0.0,0.0,0.0,0.0,0.0,0.0,0.0,0.0
1,1000000.0,990000.0,10000.0,0.000104,0.00010504,0.0,0.000104,0.00010504,0.0,10.4,10.4,0.0,1.04,1.04,0.0,0.99,1.0,0.0
2,1000000.0,990000.0,10000.0,0.001192,0.00120392,0.0,0.001192,0.00120392,0.0,119.2,119.2,0.0,11.92,11.92,0.0,0.99,1.0,0.0
3,1000000.0,990000.0,10000.0,0.011748,0.01186648,0.0,0.011748,0.01186648,0.0,1174.8,1174.8,0.0,117.48,117.48,0.0,0.99,1.0,0.0
4,1000000.0,990000.0,10000.0,0.116748,0.11792748,0.0,0.116748,0.11792748,0.0,11682.4,11682.4,0.0,1168.24,1168.24,0.0,0.99,1.0,0.0
5,1000000.0,990000.0,10000.0,1.166524,1.1771434,0.1152,1.166524,1.1771434,0.1152,117310.8,117195.6,115.2,11731.32,11719.8,11.52,1.0,1.0,1.0
6,1000000.0,990000.0,10000.0,11.134016,11.14172936,10.3704,11.134016,11.14172936,10.3704,1176960.0,1166589.6,10370.4,118012.56,116917.08,1095.48,1.0,1.0,1.0
7,1000000.0,990000.0,10000.0,66.818352,66.48342224,99.9764,66.818352,66.48342224,99.9764,9636267.6,9536291.2,99976.4,1165008.08,1082249.68,82758.4,1.068,1.0,7.8
8,1000000.0,990000.0,10000.0,99.856792,99.85534552,100.0,99.856792,99.85534552,100.0,19778286.0,19678286.0,100000.0,9446668.92,6479577.0,2967091.92,8.9012,6.0,296.12
9,1000000.0,990000.0,10000.0,99.99556,99.99551544,100.0,99.99556,99.99551544,100.0,19894482.0,19794482.0,100000.0,19776352.44,9885399.76,9890952.68,18.7976,9.0,988.76
10,1000000.0,990000.0,10000.0,99.995648,99.99560432,100.0,99.995648,99.99560432,100.0,19894546.4,19794546.4,100000.0,19894482.48,9899557.0,9994925.48,19.3752,9.48,999.0
11,1000000.0,990000.0,10000.0,99.995648,99.99560432,100.0,99.995648,99.99560432,100.0,19894546.4,19794546.4,100000.0,19894547.4,9899565.8,9994981.6,19.89,10.0,999.0
12,1000000.0,990000.0,10000.0,99.995648,99.99560432,100.0,99.995648,99.99560432,100.0,19894546.4,19794546.4,100000.0,19894547.4,9899565.8,9994981.6,19.89,10.0,999.0
13,1000000.0,990000.0,10000.0,99.995648,99.99560432,100.0,99.995648,99.99560432,100.0,19894546.4,19794546.4,100000.0,19894547.4,9899565.8,9994981.6,19.89,10.0,999.0
14,1000000.0,990000.0,10000.0,99.995648,99.99560432,100.0,99.995648,99.99560432,100.0,19894546.4,19794546.4,100000.0,19894547.4,9899565.8,9994981.6,19.89,10.0,999.0
15,1000000.0,990000.0,10000.0,99.995648,99.99560432,100.0,99.995648,99.99560432,100.0,19894546.4,19794546.4,100000.0,19894547.4,9899565.8,9994981.6,19.89,10.0,999.0
16,1000000.0,990000.0,10000.0,99.995648,99.99560432,100.0,99.995648,99.99560432,100.0,19894546.4,19794546.4,100000.0,19894547.4,9899565.8,9994981.6,19.89,10.0,999.0
17,1000000.0,990000.0,10000.0,99.995648,99.99560432,100.0,99.995648,99.99560432,100.0,19894546.4,19794546.4,100000.0,19894547.4,9899565.8,9994981.6,19.89,10.0,999.0
18,1000000.0,990000.0,10000.0,99.995648,99.99560432,100.0,99.995648,99.99560432,100.0,19894546.4,19794546.4,100000.0,19894547.4,9899565.8,9994981.6,19.89,10.0,999.0
19,1000000.0,990000.0,10000.0,99.995648,99.99560432,100.0,99.995648,99.99560432,100.0,19894546.4,19794546.4,100000.0,19894547.4,9899565.8,9994981.6,19.89,10.0,999.0
