round,P mean,P std,P min,P q1,P q2,P q3,P max,S mean,S std,S min,S q1,S q2,S q3,S max,P+S mean,P+S std,P+S min,P+S q1,P+S q2,P+S q3,P+S max
0,0.08,0.2768874620972691,0,0,0,0,1,0.92,0.2768874620972691,0,1,1,1,1,0.0,0.0,0,0,0,0,0
1,1.0,0.0,1,1,1,1,1,0.92,0.2768874620972691,0,1,1,1,1,0.92,0.2768874620972691,0,1,1,1,1
2,1.0,0.0,1,1,1,1,1,0.92,0.2768874620972691,0,1,1,1,1,0.92,0.2768874620972691,0,1,1,1,1
3,1.0,0.0,1,1,1,1,1,0.92,0.2768874620972691,0,1,1,1,1,0.92,0.2768874620972691,0,1,1,1,1
4,1.0,0.0,1,1,1,1,1,0.92,0.2768874620972691,0,1,1,1,1,0.92,0.2768874620972691,0,1,1,1,1
5,1.0,0.0,1,1,1,1,1,0.92,0.2768874620972691,0,1,1,1,1,0.92,0.2768874620972691,0,1,1,1,1
6,1.0,0.0,1,1,1,1,1,1.0,0.0,1,1,1,1,1,1.0,0.0,1,1,1,1,1
7,1.0,0.0,1,1,1,1,1,1.0,0.0,1,1,1,1,1,1.0,0.0,1,1,1,1,1
8,1.04,0.19999999999999998,1,1,1,1,2,1.0,0.0,1,1,1,1,1,1.0,0.0,1,1,1,1,1
9,1.04,0.19999999999999998,1,1,1,1,2,1.0,0.0,1,1,1,1,1,1.0,0.0,1,1,1,1,1
10,1.04,0.19999999999999998,1,1,1,1,2,1.0,0.0,1,1,1,1,1,1.0,0.0,1,1,1,1,1
11,1.04,0.19999999999999998,1,1,1,1,2,1.0,0.0,1,1,1,1,1,1.0,0.0,1,1,1,1,1
12,1.04,0.19999999999999998,1,1,1,1,2,1.0,0.0,1,1,1,1,1,1.0,0.0,1,1,1,1,1
13,1.04,0.19999999999999998,1,1,1,1,2,1.0,0.0,1,1,1,1,1,1.0,0.0,1,1,1,1,1
14,1.04,0.19999999999999998,1,1,1,1,2,1.0,0.0,1,1,1,1,1,1.0,0.0,1,1,1,1,1
15,1.04,0.19999999999999998,1,1,1,1,2,1.0,0.0,1,1,1,1,1,1.0,0.0,1,1,1,1,1
16,1.04,0.19999999999999998,1,1,1,1,2,1.0,0.0,1,1,1,1,1,1.0,0.0,1,1,1,1,1
17,1.04,0.19999999999999998,1,1,1,1,2,1.0,0.0,1,1,1,1,1,1.0,0.0,1,1,1,1,1
18,1.04,0.19999999999999998,1,1,1,1,2,1.0,0.0,1,1,1,1,1,1.0,0.0,1,1,1,1,1
19,1.04,0.19999999999999998,1,1,1,1,2,1.0,0.0,1,1,1,1,1,1.0,0.0,1,1,1,1,1
20,1.04,0.19999999999999998,1,1,1,1,2,1.0,0.0,1,1,1,1,1,1.0,0.0,1,1,1,1,1
21,1.04,0.19999999999999998,1,1,1,1,2,1.0,0.0,1,1,1,1,1,1.0,0.0,1,1,1,1,1
22,1.04,0.19999999999999998,1,1,1,1,2,1.0,0.0,1,1,1,1,1,1.0,0.0,1,1,1,1,1
23,1.04,0.19999999999999998,1,1,1,1,2,1.0,0.0,1,1,1,1,1,1.0,0.0,1,1,1,1,1
24,1.04,0.19999999999999998,1,1,1,1,2,1.0,0.0,1,1,1,1,1,1.0,0.0,1,1,1,1,1
25,1.04,0.19999999999999998,1,1,1,1,2,1.0,0.0,1,1,1,1,1,1.0,0.0,1,1,1,1,1
