round,P mean,P std,P min,P q1,P q2,P q3,P max,S mean,S std,S min,S q1,S q2,S q3,S max,P+S mean,P+S std,P+S min,P+S q1,P+S q2,P+S q3,P+S max
0,0.0,0.0,0.0,0.0,0.0,0.0,0.0,0.0,0.0,0.0,0.0,0.0,0.0,0.0,0.0,0.0,0.0,0.0,0.0,0.0,0.0
1,0.0,0.0,0.0,0.0,0.0,0.0,0.0,0.0,0.0,0.0,0.0,0.0,0.0,0.0,0.0,0.0,0.0,0.0,0.0,0.0,0.0
2,0.0,0.0,0.0,0.0,0.0,0.0,0.0,0.0,0.0,0.0,0.0,0.0,0.0,0.0,0.0,0.0,0.0,0.0,0.0,0.0,0.0
3,0.0,0.0,0.0,0.0,0.0,0.0,0.0,0.0,0.0,0.0,0.0,0.0,0.0,0.0,0.0,0.0,0.0,0.0,0.0,0.0,0.0
4,0.0,0.0,0.0,0.0,0.0,0.0,0.0,0.0,0.0,0.0,0.0,0.0,0.0,0.0,0.0,0.0,0.0,0.0,0.0,0.0,0.0
5,0.0,0.0,0.0,0.0,0.0,0.0,0.0,0.0,0.0,0.0,0.0,0.0,0.0,0.0,0.0,0.0,0.0,0.0,0.0,0.0,0.0
6,0.0,0.0,0.0,0.0,0.0,0.0,0.0,0.0,0.0,0.0,0.0,0.0,0.0,0.0,0.0,0.0,0.0,0.0,0.0,0.0,0.0
7,0.0,0.0,0.0,0.0,0.0,0.0,0.0,0.0,0.0,0.0,0.0,0.0,0.0,0.0,0.0,0.0,0.0,0.0,0.0,0.0,0.0
8,0.0,0.0,0.0,0.0,0.0,0.0,0.0,0.0,0.0,0.0,0.0,0.0,0.0,0.0,0.0,0.0,0.0,0.0,0.0,0.0,0.0
9,0.0,0.0,0.0,0.0,0.0,0.0,0.0,0.0,0.0,0.0,0.0,0.0,0.0,0.0,0.0,0.0,0.0,0.0,0.0,0.0,0.0
10,0.0,0.0,0.0,0.0,0.0,0.0,0.0,0.0,0.0,0.0,0.0,0.0,0.0,0.0,0.0,0.0,0.0,0.0,0.0,0.0,0.0
11,0.0002,0.000408248290463863,0.0,0.0,0.0,0.0,0.001,0.0,0.0,0.0,0.0,0.0,0.0,0.0,2e-05,4.0824829046386304e-05,0.0,0.0,0.0,0.0,0.0001
12,0.0806,0.009486832980505136,0.062,0.076,0.082,0.085,0.099,0.0,0.0,0.0,0.0,0.0,0.0,0.0,0.008060000000000001,0.0009486832980505138,0.0062,0.0076,0.0082,0.0085,0.0099
13,7.03296,0.15295246538276724,6.719,6.995,7.06,7.128,7.278,0.0,0.0,0.0,0.0,0.0,0.0,0.0,0.703296,0.015295246538276751,0.6719,0.6995,0.706,0.7128,0.7278
14,65.3272,0.3866608117372793,64.629,65.012,65.507,65.632,65.843,0.0,0.0,0.0,0.0,0.0,0.0,0.0,6.53272,0.03866608117372813,6.4629,6.5012,6.5507,6.5632,6.5843
15,99.80915999999999,0.013960300856355908,99.78,99.802,99.807,99.819,99.836,0.07633332000000001,0.03404483427496747,0.021,0.026111000000000002,0.095222,0.098,0.10588900000000001,10.049616,0.030586335184196164,10.0006,10.0027,10.0672,10.0691,10.0758
16,99.95232,0.006472505954677314,99.939,99.949,99.952,99.955,99.967,41.47081332,0.43401085083917273,40.667778000000006,41.103333,41.637889,41.788,42.053778,47.318963999999994,0.39064022224206923,46.5957,46.9879,47.4706,47.6045,47.8434
17,99.9524,0.006461423991659207,99.939,99.949,99.952,99.955,99.967,99.35852004,0.012534683527050778,99.337111,99.352222,99.35866700000001,99.365778,99.382667,99.41790799999998,0.01117552832457741,99.3985,99.4123,99.4176,99.4247,99.4395
18,99.9524,0.006461423991659207,99.939,99.949,99.952,99.955,99.967,99.98239112000002,0.0020266387056746995,99.977778,99.981,99.982444,99.98355600000001,99.986778,99.97939199999999,0.0018526827395236006,99.9747,99.9783,99.9794,99.9805,99.9832
19,99.9524,0.006461423991659207,99.939,99.949,99.952,99.955,99.967,99.98252000000004,0.0020089872863360983,99.978,99.981111,99.982444,99.98366700000001,99.986778,99.97950800000001,0.0018346025909339613,99.9749,99.9784,99.9795,99.9807,99.9832
20,99.9524,0.006461423991659207,99.939,99.949,99.952,99.955,99.967,99.98252000000004,0.0020089872863360983,99.978,99.981111,99.982444,99.98366700000001,99.986778,99.97950800000001,0.0018346025909339613,99.9749,99.9784,99.9795,99.9807,99.9832
21,99.9524,0.006461423991659207,99.939,99.949,99.952,99.955,99.967,99.98252000000004,0.0020089872863360983,99.978,99.981111,99.982444,99.98366700000001,99.986778,99.97950800000001,0.0018346025909339613,99.9749,99.9784,99.9795,99.9807,99.9832
22,99.9524,0.006461423991659207,99.939,99.949,99.952,99.955,99.967,99.98252000000004,0.0020089872863360983,99.978,99.981111,99.982444,99.98366700000001,99.986778,99.97950800000001,0.0018346025909339613,99.9749,99.9784,99.9795,99.9807,99.9832
23,99.9524,0.006461423991659207,99.939,99.949,99.952,99.955,99.967,99.98252000000004,0.0020089872863360983,99.978,99.981111,99.982444,99.98366700000001,99.986778,99.97950800000001,0.0018346025909339613,99.9749,99.9784,99.9795,99.9807,99.9832
24,99.9524,0.006461423991659207,99.939,99.949,99.952,99.955,99.967,99.98252000000004,0.0020089872863360983,99.978,99.981111,99.982444,99.98366700000001,99.986778,99.97950800000001,0.0018346025909339613,99.9749,99.9784,99.9795,99.9807,99.9832
25,99.9524,0.006461423991659207,99.939,99.949,99.952,99.955,99.967,99.98252000000004,0.0020089872863360983,99.978,99.981111,99.982444,99.98366700000001,99.986778,99.97950800000001,0.0018346025909339613,99.9749,99.9784,99.9795,99.9807,99.9832
