gossips,p2p mean,p2p std,p2p min,p2p q1,p2p q2,p2p q3,p2p max,p2s mean,p2s std,p2s min,p2s q1,p2s q2,p2s q3,p2s max,s2s mean,s2s std,s2s min,s2s q1,s2s q2,s2s q3,s2s max
1,49.461600000000004,0.4275383023776927,48.44,49.25,49.45,49.77,50.62,32.965199999999996,0.5577119925792049,31.79,32.6,33.09,33.4,33.7,0.012575499999999995,0.0009413588236069225,0.010909,0.01202,0.012424,0.01280275,0.014949
2,22.386800000000008,0.38157262305708833,21.62,22.18,22.31,22.68,23.1,0.01,0.0,0.01,0.01,0.01,0.01,0.01,,,,,,,
3,2.022,0.14124446891825532,1.68,1.98,2.02,2.11,2.32,,,,,,,,,,,,,,
4,0.022083333333333333,0.010623667861928842,0.01,0.017499999999999998,0.02,0.03,0.05,,,,,,,,,,,,,,
5,,,,,,,,,,,,,,,,,,,,,
