gossips,p2p mean,p2p std,p2p min,p2p q1,p2p q2,p2p q3,p2p max,p2s mean,p2s std,p2s min,p2s q1,p2s q2,p2s q3,p2s max,s2s mean,s2s std,s2s min,s2s q1,s2s q2,s2s q3,s2s max
1,49.241600000000005,0.4411224319845909,48.25,48.98,49.17,49.55,49.93,43.2336,0.4535037669817815,42.38,42.94,43.21,43.57,44.23,54.30400008000001,0.2734151676304912,53.728788,54.145455000000005,54.30596,54.450908999999996,54.856263
2,22.252399999999994,0.4348685625182246,21.2,22.02,22.26,22.58,23.05,5.3924,0.2711746054973929,4.89,5.19,5.36,5.59,5.88,19.446371640000002,0.4632078676963755,18.535152,19.101515,19.549192,19.684646,20.513131
3,1.9512,0.1273878591807974,1.74,1.86,1.94,2.06,2.16,0.017333333333333333,0.00883715101688537,0.01,0.01,0.02,0.02,0.04,2.0439515999999998,0.09410870953760518,1.8517169999999998,1.956869,2.059293,2.101818,2.25101
4,0.029545454545454552,0.016468519095902984,0.01,0.02,0.03,0.0375,0.06,,,,,,,,0.02945868,0.0022281963692637142,0.025556,0.028081000000000002,0.02899,0.031313,0.035151999999999996
5,,,,,,,,,,,,,,,0.000101,0.0,0.000101,0.000101,0.000101,0.000101,0.000101
