gossips,p2p mean,p2p std,p2p min,p2p q1,p2p q2,p2p q3,p2p max,p2s mean,p2s std,p2s min,p2s q1,p2s q2,p2s q3,p2s max,s2s mean,s2s std,s2s min,s2s q1,s2s q2,s2s q3,s2s max
1,53.080799999999996,0.1557907250127555,52.78,52.998,53.075,53.182,53.439,27.74156,0.17250050241472772,27.228,27.714,27.749,27.834,27.942,0.7058444399999999,0.042775563262490574,0.649111,0.6788890000000001,0.696444,0.715667,0.831
2,5.769119999999998,0.052979021005174085,5.672,5.74,5.773,5.799,5.897,0.17079999999999995,0.013307266185559425,0.157,0.161,0.165,0.177,0.203,0.00019246666666666666,0.00012928477242487755,0.00011100000000000001,0.00011100000000000001,0.00011100000000000001,0.00022200000000000003,0.000556
3,0.07916000000000001,0.006256196927846821,0.065,0.076,0.08,0.083,0.088,0.001,0.0,0.001,0.001,0.001,0.001,0.001,,,,,,,
4,0.0013333333333333333,0.0008164965809277262,0.001,0.001,0.001,0.001,0.003,,,,,,,,,,,,,,
5,,,,,,,,,,,,,,,,,,,,,
