gossips,p2p mean,p2p std,p2p min,p2p q1,p2p q2,p2p q3,p2p max,p2s mean,p2s std,p2s min,p2s q1,p2s q2,p2s q3,p2s max,s2s mean,s2s std,s2s min,s2s q1,s2s q2,s2s q3,s2s max
1,0.14323999999999995,0.01071323169418702,0.122,0.135,0.143,0.151,0.159,39.52664,0.36305657043129425,38.779,39.315,39.501,39.811,40.176,52.87675996000001,0.15667194437408596,52.662443999999994,52.76566700000001,52.81544399999999,53.043222,53.142556000000006
2,,,,,,,,0.039320000000000015,0.008905616205518854,0.022,0.034,0.039,0.044,0.058,23.321324479999998,0.14373307120119133,23.051556,23.224556,23.296667000000003,23.407556,23.697111
3,,,,,,,,,,,,,,,0.14157332000000003,0.005166022419941032,0.126444,0.138222,0.142333,0.14544400000000002,0.149778
4,,,,,,,,,,,,,,,,,,,,,
5,,,,,,,,,,,,,,,,,,,,,
