gossips,p2p mean,p2p std,p2p min,p2p q1,p2p q2,p2p q3,p2p max,p2s mean,p2s std,p2s min,p2s q1,p2s q2,p2s q3,p2s max,s2s mean,s2s std,s2s min,s2s q1,s2s q2,s2s q3,s2s max
1,1.0920000000000003,0.008660254037844416,1.07,1.09,1.09,1.1,1.1,0.013846153846153848,0.006504436355879909,0.01,0.01,0.01,0.02,0.03,,,,,,,
2,0.01,,0.01,0.01,0.01,0.01,0.01,,,,,,,,,,,,,,
3,,,,,,,,,,,,,,,,,,,,,
4,,,,,,,,,,,,,,,,,,,,,
5,,,,,,,,,,,,,,,,,,,,,
