gossips,p2p mean,p2p std,p2p min,p2p q1,p2p q2,p2p q3,p2p max,p2s mean,p2s std,p2s min,p2s q1,p2s q2,p2s q3,p2s max,s2s mean,s2s std,s2s min,s2s q1,s2s q2,s2s q3,s2s max
1,49.262640000000005,0.16653174872477913,48.968,49.151,49.274,49.376,49.558,56.18372,0.22265809364733863,55.62,56.081,56.182,56.297,56.633,52.09003552,0.05076607904408352,51.995222,52.050556,52.099444,52.122222,52.195889
2,22.261440000000007,0.11576235715176728,22.04,22.216,22.236,22.301,22.51,18.472360000000002,0.18159843060995864,18.131,18.365,18.497,18.6,18.761,23.7226266,0.10893728128033182,23.433332999999998,23.647444,23.735889,23.784667000000002,23.948556
3,2.053,0.04410404365437102,1.981,2.029,2.048,2.079,2.165,0.023240000000000007,0.0057755230643350974,0.011,0.019,0.023,0.027,0.039,0.08353779999999998,0.0033435916068403682,0.077667,0.081444,0.08266699999999999,0.085556,0.09044400000000001
4,0.022680000000000006,0.0028242993231360346,0.015,0.021,0.023,0.025,0.027,,,,,,,,,,,,,,
5,0.001,,0.001,0.001,0.001,0.001,0.001,,,,,,,,,,,,,,
