,P+S mean,P+S std,P+S min,P+S q1,P+S median,P+S q3,P+S max,P mean,P std,P min,P q1,P median,P q3,P max,S mean,S std,S min,S q1,S median,S q3,S max
10% nodes,7,0,7,7,7,7,7,4.0,0.0,4,4,4,4,4,7,0,7,7,7,7,7
50% nodes,7,0,7,7,7,7,7,4.0,0.0,4,4,4,4,4,7,0,7,7,7,7,7
99% nodes,8,0,8,8,8,8,8,4.8,0.39999999999999997,4,5,5,5,5,8,0,8,8,8,8,8
