,mean,std,min,q1,q2,q3,max
Simple,,,,,,,
P,4.235510421152278,0.6647635877797433,1.0,4.0,4.0,5.0,7.0
S,6.634425621163125,0.5948421333201479,3.0,6.0,7.0,7.0,10.0
P+S,6.6104364921456,0.6416309728290571,1.0,6.0,7.0,7.0,10.0
