gossips,p2p mean,p2p std,p2p min,p2p q1,p2p q2,p2p q3,p2p max,p2s mean,p2s std,p2s min,p2s q1,p2s q2,p2s q3,p2s max,s2s mean,s2s std,s2s min,s2s q1,s2s q2,s2s q3,s2s max
1,44.85839999999999,0.25928330708576974,44.527,44.712,44.791,44.915,45.499,41.0018,0.28319339681567435,40.341,40.81,40.997,41.195,41.621,25.069275640000004,0.14316886865745768,24.797889,24.965889,25.075444,25.151332999999997,25.435667000000002
2,12.022519999999997,0.18877171398278925,11.742,11.893,11.978,12.156,12.39,49.00275999999999,0.3980104981865007,48.485,48.765,48.911,49.189,50.068,41.222795639999994,0.17968138823713162,41.008666999999996,41.123889,41.164556,41.219778000000005,41.692111
3,0.039480000000000015,0.005017635565350145,0.032,0.036,0.039,0.042,0.051,1.1079999999999999,0.033543504090459385,1.033,1.088,1.109,1.132,1.175,23.665364439999994,0.10798735990154884,23.373778,23.590778,23.686332999999998,23.732332999999997,23.846110999999997
4,,,,,,,,0.009160000000000003,0.0029108990592827733,0.003,0.007,0.01,0.011,0.014,4.81924004,0.0591748245607031,4.725889,4.783333,4.819333,4.841556,4.934444
5,,,,,,,,,,,,,,,0.11058664,0.0038709942508353087,0.10288900000000001,0.108222,0.11133299999999999,0.112444,0.11944400000000001
6,,,,,,,,,,,,,,,0.0007868000000000002,0.00028834296708376065,0.00044400000000000006,0.000556,0.000667,0.001111,0.001444
7,,,,,,,,,,,,,,,,,,,,,
8,,,,,,,,,,,,,,,,,,,,,
