gossips,p2p mean,p2p std,p2p min,p2p q1,p2p q2,p2p q3,p2p max,p2s mean,p2s std,p2s min,p2s q1,p2s q2,p2s q3,p2s max,s2s mean,s2s std,s2s min,s2s q1,s2s q2,s2s q3,s2s max
1,2.15776,0.5357529965696257,1.271,1.845,2.078,2.504,3.638,0.02884000000000001,0.020703622871372056,0.007,0.017,0.024,0.033,0.096,0.0012433333333333335,0.0011318208927800077,0.00011100000000000001,0.00044400000000000006,0.000778,0.001778,0.004111
2,0.011320000000000002,0.005595533933415112,0.002,0.006,0.011,0.016,0.02,,,,,,,,,,,,,,
3,0.001,0.0,0.001,0.001,0.001,0.001,0.001,,,,,,,,,,,,,,
4,,,,,,,,,,,,,,,,,,,,,
5,,,,,,,,,,,,,,,,,,,,,
6,,,,,,,,,,,,,,,,,,,,,
7,,,,,,,,,,,,,,,,,,,,,
