,mean,std,min,q1,q2,q3,max
Simple,,,,,,,
P,5.236116610800842,0.6662647153554236,1.0,5.0,5.0,6.0,8.0
S,7.7169421451330775,0.4934837078339317,6.0,7.0,8.0,8.0,10.0
P+S,7.4688650893326045,0.9041336432405097,1.0,7.0,8.0,8.0,10.0
