gossips,p2p mean,p2p std,p2p min,p2p q1,p2p q2,p2p q3,p2p max,p2s mean,p2s std,p2s min,p2s q1,p2s q2,p2s q3,p2s max,s2s mean,s2s std,s2s min,s2s q1,s2s q2,s2s q3,s2s max
1,26.392,1.7665691797002088,23.6,24.6,26.3,27.7,30.3,24.664,1.2711149961090586,22.5,23.8,24.6,25.3,28.4,25.65165564000001,0.3531110872372983,24.691992000000003,25.43003,25.673173000000002,25.775876,26.458859000000004
2,36.32399999999999,1.6394307955303666,33.7,35.3,36.1,37.5,39.9,42.303999999999995,1.934872950178728,39.4,41.0,42.3,43.8,47.4,37.64795584,0.14170741690383126,37.296396,37.592092,37.646246000000005,37.731031,37.973372999999995
3,22.164000000000005,1.187392100361123,19.7,21.5,22.1,23.0,24.3,23.607999999999997,1.3708026845611287,21.3,22.9,23.7,24.0,27.0,23.37483876,0.3103135533973766,22.665465,23.231131,23.347447,23.54034,24.14014
4,6.904000000000001,0.6133786215163787,5.8,6.5,6.9,7.4,8.1,4.747999999999999,0.6292323365286732,3.9,4.2,4.8,5.3,5.7,6.366422480000001,0.17410656779879607,6.012713,6.297998000000001,6.367968,6.40961,6.777878
5,0.8039999999999999,0.23180451534284946,0.3,0.7,0.9,1.0,1.2,0.18000000000000008,0.1105012502906165,0.1,0.1,0.15000000000000002,0.2,0.5,0.6983104000000001,0.026249301304987153,0.64955,0.686587,0.7054050000000001,0.707808,0.755656
6,0.11666666666666665,0.04082482904638631,0.1,0.1,0.1,0.1,0.2,,,,,,,,0.041357399999999996,0.0036595002732613654,0.035135,0.038939,0.041141000000000004,0.044244,0.049249
7,,,,,,,,,,,,,,,0.00164188,0.00043161753130906697,0.000801,0.0015019999999999999,0.0015019999999999999,0.001702,0.0026030000000000003
8,,,,,,,,,,,,,,,0.00011428571428571431,3.779644730092272e-05,0.0001,0.0001,0.0001,0.0001,0.0002
