gossips,p2p mean,p2p std,p2p min,p2p q1,p2p q2,p2p q3,p2p max,p2s mean,p2s std,p2s min,p2s q1,p2s q2,p2s q3,p2s max,s2s mean,s2s std,s2s min,s2s q1,s2s q2,s2s q3,s2s max
1,49.16159999999999,0.5655136308407311,48.01,48.78,49.19,49.59,50.08,56.2804,0.6523705491002261,54.87,55.93,56.32,56.64,57.35,48.82605247999999,0.052393684418324045,48.69101,48.791919,48.826162,48.863232,48.931212
2,22.3204,0.4348513155857602,21.38,22.11,22.35,22.69,22.92,18.308,0.550037877483603,17.06,17.98,18.37,18.61,19.34,23.51993132,0.19325381057836916,23.160303,23.338081,23.516364000000003,23.654747,23.820404
3,2.0852,0.11673045875006238,1.75,2.03,2.09,2.18,2.24,0.024347826086956535,0.007877520927828719,0.01,0.02,0.03,0.03,0.04,1.2407112,0.020634928951497145,1.175354,1.2369700000000001,1.245859,1.251111,1.267576
4,0.025454545454545455,0.01262170191802038,0.01,0.02,0.02,0.04,0.05,,,,,,,,0.00075952,0.00022227650198195338,0.000404,0.000606,0.0007070000000000001,0.000808,0.001515
5,,,,,,,,,,,,,,,,,,,,,
