round,P+S mean,P+S std,P mean,P std,S mean,S std
0,0.0,0.0,0.0,0.0,0.0,0.0
1,0.000108,2.71293199325e-05,0.000108,2.71293199325e-05,0.0,0.0
2,0.001212,9.92773891679e-05,0.00121304,9.93935531109e-05,0.0,0.0
3,0.011764,0.000309683709614,0.01177588,0.000310031523558,0.0,0.0
4,0.116924,0.00196616988076,0.11704108,0.00196818094534,0.0,0.0
5,1.164924,0.00301387192827,1.164977,0.00325610114094,1.112,0.613397098135
6,11.096868,0.128832550918,11.03994388,0.125519690409,67.964,5.32156969324
7,66.188676,0.247993521335,66.15483088,0.248241863698,100.0,0.0
8,99.85206,0.00371558878241,99.85191204,0.00371923871221,100.0,0.0
9,99.995284,0.000694365897781,99.99527932,0.000695116434565,100.0,0.0
10,99.99538,0.000699714227382,99.99537532,0.000700455150315,100.0,0.0
11,99.995392,0.000700810958819,99.99538732,0.000701545249861,100.0,0.0
12,99.995392,0.000700810958819,99.99538732,0.000701545249861,100.0,0.0
13,99.995392,0.000700810958819,99.99538732,0.000701545249861,100.0,0.0
14,99.995392,0.000700810958819,99.99538732,0.000701545249861,100.0,0.0
15,99.995392,0.000700810958819,99.99538732,0.000701545249861,100.0,0.0
16,99.995392,0.000700810958819,99.99538732,0.000701545249861,100.0,0.0
17,99.995392,0.000700810958819,99.99538732,0.000701545249861,100.0,0.0
18,99.995392,0.000700810958819,99.99538732,0.000701545249861,100.0,0.0
19,99.995392,0.000700810958819,99.99538732,0.000701545249861,100.0,0.0
