round,P mean,P std,P min,P q1,P q2,P q3,P max,S mean,S std,S min,S q1,S q2,S q3,S max,P+S mean,P+S std,P+S min,P+S q1,P+S q2,P+S q3,P+S max
0,100.0,0.0,100.0,100.0,100.0,100.0,100.0,100.0,0.0,100.0,100.0,100.0,100.0,100.0,100.0,0.0,100.0,100.0,100.0,100.0,100.0
1,100.0,0.0,100.0,100.0,100.0,100.0,100.0,99.99988456,2.2199999996358454e-05,99.999778,99.999889,99.999889,99.999889,99.999889,99.99989599999998,1.9999999999368474e-05,99.9998,99.9999,99.9999,99.9999,99.9999
2,99.98991999999997,0.00027688746209492257,99.989,99.99,99.99,99.99,99.99,99.99978244000002,2.2199999997880247e-05,99.999778,99.999778,99.999778,99.999778,99.999889,99.998796,1.9999999996489162e-05,99.9987,99.9988,99.9988,99.9988,99.9988
3,99.88068000000003,0.001029563014096817,99.878,99.88,99.881,99.881,99.883,99.99968476000004,4.15323969966788e-05,99.999667,99.999667,99.999667,99.999667,99.999778,99.987784,9.865765724328757e-05,99.9875,99.9877,99.9878,99.9878,99.988
4,98.87575999999999,0.010615554625170746,98.861,98.869,98.872,98.881,98.904,99.99958708000003,5.086659020850097e-05,99.99955600000001,99.99955600000001,99.99955600000001,99.999667,99.999667,99.88720399999998,0.00105809577386353,99.8858,99.8865,99.8868,99.8878,99.89
5,95.20132,0.05556656668657235,95.116,95.147,95.205,95.24,95.304,99.99948872000003,7.20893658407093e-05,99.999444,99.999444,99.999444,99.99955600000001,99.999667,99.51967200000001,0.0055707958737199505,99.5111,99.5142,99.5201,99.5235,99.5301
6,95.10759999999999,0.061844563221031816,94.992,95.047,95.124,95.156,95.188,99.99937752000004,7.877188585472322e-05,99.999333,99.999333,99.999333,99.999444,99.99955600000001,99.5102,0.00619058424814189,99.4986,99.5041,99.5119,99.515,99.5182
7,95.07991999999999,0.05044297109938482,94.988,95.045,95.068,95.122,95.187,99.90889768,0.0036580003954776305,99.901444,99.906111,99.90844399999999,99.911222,99.916,99.426,0.006599621201247097,99.4164,99.4216,99.4252,99.4293,99.4431
8,95.09944000000002,0.06436230781029607,95.008,95.063,95.103,95.122,95.343,99.32670668000003,0.014338295867825354,99.297889,99.319889,99.32655600000001,99.338222,99.354222,98.90397999999998,0.01267947817012651,98.8803,98.8939,98.9048,98.9163,98.9236
9,95.08664,0.04865514703845126,95.01,95.056,95.066,95.129,95.19,99.32869780000001,0.01925453772274965,99.283,99.317,99.334111,99.341444,99.360667,98.90449199999999,0.01833643731299385,98.8612,98.8954,98.9086,98.9184,98.9387
10,95.07911999999999,0.05951632829176555,94.954,95.045,95.052,95.11,95.198,99.31888887999999,0.013778637932562978,99.29777800000001,99.309667,99.315444,99.324,99.347889,98.894912,0.013620888370439132,98.871,98.8861,98.8941,98.9013,98.9285
11,95.06327999999999,0.04037585912398642,94.955,95.039,95.066,95.088,95.135,99.30249335999999,0.02031278068294473,99.267333,99.292222,99.304,99.31311099999999,99.355,98.87857199999999,0.01850440307962524,98.8485,98.8671,98.8768,98.8888,98.9283
12,95.19948000000002,0.054513851450803084,95.077,95.165,95.2,95.231,95.322,99.32341780000003,0.025207717935189146,99.281111,99.309667,99.32,99.334556,99.409778,98.911024,0.022084954909018743,98.8766,98.8991,98.9109,98.9169,98.9876
13,96.20540000000001,0.04429446918070153,96.133,96.179,96.2,96.235,96.292,99.32313335999997,0.019095028678691214,99.303889,99.309,99.320222,99.331889,99.395333,99.01135999999998,0.018573053958179857,98.9899,98.9996,99.0081,99.0179,99.0801
14,99.86896000000003,0.009972796331353761,99.851,99.862,99.87,99.873,99.889,99.3265112,0.0337283523636536,99.283556,99.30466700000001,99.317667,99.337222,99.412,99.38075599999998,0.030245510410636115,99.3423,99.3606,99.3733,99.3897,99.458
15,99.96060000000001,0.007449832212875052,99.945,99.958,99.963,99.966,99.969,99.32545771999999,0.028278974955669035,99.273444,99.306,99.324333,99.336,99.40033299999999,99.38897200000001,0.025407061354409722,99.3426,99.3714,99.3877,99.3993,99.4565
16,99.96068000000002,0.007481755587204373,99.945,99.958,99.963,99.966,99.969,99.40560440000002,0.015703057435843392,99.37844399999999,99.396556,99.40177800000001,99.416111,99.440333,99.461112,0.014256528329156555,99.4375,99.4528,99.4581,99.4711,99.4915
17,99.96068000000002,0.007481755587204373,99.945,99.958,99.963,99.966,99.969,99.98270668,0.0012817406367932479,99.980778,99.981667,99.982667,99.98355600000001,99.985333,99.980504,0.0012039795125617738,99.9781,99.9795,99.9805,99.981,99.983
18,99.96068000000002,0.007481755587204373,99.945,99.958,99.963,99.966,99.969,99.98300880000002,0.0012268513561142778,99.981222,99.982222,99.983,99.98366700000001,99.985444,99.980776,0.0011836666197328947,99.9783,99.9799,99.9809,99.9815,99.983
19,99.96068000000002,0.007481755587204373,99.945,99.958,99.963,99.966,99.969,99.98300880000002,0.0012268513561142778,99.981222,99.982222,99.983,99.98366700000001,99.985444,99.980776,0.0011836666197328947,99.9783,99.9799,99.9809,99.9815,99.983
20,99.96068000000002,0.007481755587204373,99.945,99.958,99.963,99.966,99.969,99.98300880000002,0.0012268513561142778,99.981222,99.982222,99.983,99.98366700000001,99.985444,99.980776,0.0011836666197328947,99.9783,99.9799,99.9809,99.9815,99.983
21,99.96068000000002,0.007481755587204373,99.945,99.958,99.963,99.966,99.969,99.98300880000002,0.0012268513561142778,99.981222,99.982222,99.983,99.98366700000001,99.985444,99.980776,0.0011836666197328947,99.9783,99.9799,99.9809,99.9815,99.983
22,99.96068000000002,0.007481755587204373,99.945,99.958,99.963,99.966,99.969,99.98300880000002,0.0012268513561142778,99.981222,99.982222,99.983,99.98366700000001,99.985444,99.980776,0.0011836666197328947,99.9783,99.9799,99.9809,99.9815,99.983
23,99.96068000000002,0.007481755587204373,99.945,99.958,99.963,99.966,99.969,99.98300880000002,0.0012268513561142778,99.981222,99.982222,99.983,99.98366700000001,99.985444,99.980776,0.0011836666197328947,99.9783,99.9799,99.9809,99.9815,99.983
24,99.96068000000002,0.007481755587204373,99.945,99.958,99.963,99.966,99.969,99.98300880000002,0.0012268513561142778,99.981222,99.982222,99.983,99.98366700000001,99.985444,99.980776,0.0011836666197328947,99.9783,99.9799,99.9809,99.9815,99.983
25,99.96068000000002,0.007481755587204373,99.945,99.958,99.963,99.966,99.969,99.98300880000002,0.0012268513561142778,99.981222,99.982222,99.983,99.98366700000001,99.985444,99.980776,0.0011836666197328947,99.9783,99.9799,99.9809,99.9815,99.983
