round,P mean,P std,P min,P q1,P q2,P q3,P max,S mean,S std,S min,S q1,S q2,S q3,S max,P+S mean,P+S std,P+S min,P+S q1,P+S q2,P+S q3,P+S max
0,100.0,0.0,100.0,100.0,100.0,100.0,100.0,100.0,0.0,100.0,100.0,100.0,100.0,100.0,100.0,0.0,100.0,100.0,100.0,100.0,100.0
1,100.0,0.0,100.0,100.0,100.0,100.0,100.0,99.99989899999997,0.0,99.999899,99.999899,99.999899,99.999899,99.999899,99.99989999999998,0.0,99.9999,99.9999,99.9999,99.9999,99.9999
2,99.98199999999999,0.016329931618554207,99.95,99.97,99.99,100.0,100.0,99.99980203999999,2.019999999983578e-05,99.999798,99.999798,99.999798,99.999798,99.999899,99.999624,0.00015885003409832948,99.9993,99.9995,99.9997,99.9998,99.9998
3,99.90800000000002,0.0477842372894397,99.79,99.88,99.92,99.94,99.98,99.99970104,2.019999999983578e-05,99.999697,99.999697,99.999697,99.999697,99.999798,99.998784,0.0004793050524807832,99.9976,99.9985,99.9989,99.9991,99.9995
4,99.67039999999999,0.12136309158883501,99.44,99.62,99.7,99.76,99.88,99.99960004000006,2.019999999983578e-05,99.999596,99.999596,99.999596,99.999596,99.999697,99.99630799999998,0.00121686756332389,99.994,99.9958,99.9966,99.9973,99.9984
5,98.93759999999999,0.3854897318130959,98.17,98.79,98.98,99.2,99.6,99.99948692000002,6.467155479777591e-05,99.99919200000001,99.999495,99.999495,99.999495,99.999596,99.98886799999998,0.0038757493899041822,99.9812,99.9874,99.9893,99.9915,99.9955
6,96.8892,1.0223662096659218,94.92,96.47,97.04,97.67,98.73,99.99932127999999,0.0002680467185645205,99.998081,99.999394,99.999394,99.999394,99.999495,99.96822,0.010331989159884702,99.9486,99.9641,99.9698,99.9761,99.9867
7,91.77120000000001,2.4778541119283033,87.11,90.46,92.29,93.6,96.43,99.99843244000002,0.00138196937013957,99.99303,99.998384,99.998889,99.99929300000001,99.99929300000001,99.91615999999998,0.02573384606570516,99.8685,99.9031,99.9216,99.9352,99.9636
8,82.0008,4.420150751576994,75.16,79.51,82.08,85.81,91.21,99.99135772,0.007584998448251009,99.970303,99.988788,99.99404,99.996465,99.998586,99.81145199999999,0.05028147538275341,99.7222,99.79,99.8171,99.8523,99.9107
9,70.90960000000001,5.580626070015205,61.07,66.64,70.29,74.55,82.7,99.93465051999998,0.05098919218824809,99.82757600000001,99.91454499999999,99.954747,99.97292900000001,99.99303,99.64439999999999,0.08048317111877193,99.518,99.5799,99.644,99.7016,99.8101
10,64.3208,8.363821853674311,47.26,58.29,66.48,69.65,76.91,99.56214536000002,0.29125569743367175,98.990505,99.433939,99.655051,99.79575799999999,99.932727,99.20973200000002,0.24364604915053553,98.6967,99.1624,99.261,99.3584,99.5889
11,63.995999999999995,7.162679317127077,50.84,58.72,64.49,68.46,75.81,97.83035968000002,1.1293483837529124,95.80100999999999,97.380202,98.035455,98.735556,99.514747,97.49201600000002,1.0760645983087338,95.5347,97.0732,97.7656,98.3063,99.0498
12,65.5744,6.052094045314676,52.91,61.22,64.86,68.99,78.31,92.49100607999999,2.9325865690131363,87.216061,91.18777800000001,92.849192,94.675758,97.617374,92.22183999999999,2.898799643674372,86.9925,90.9254,92.5907,94.4127,97.2178
13,66.0008,6.73809933636086,52.73,62.42,65.44,70.62,81.75,82.25465452,4.927853337517845,74.218687,79.496364,82.74303,86.089899,92.542424,82.09211600000002,4.87252572959514,74.1142,79.4005,82.4766,86.0465,92.2714
14,65.07599999999998,7.7617969354181575,50.11,59.34,65.24,71.36,76.55,71.74080404,6.224730897984376,59.667374,66.530909,72.353434,75.46343399999999,84.294848,71.67415599999998,6.143777677121789,59.8362,66.5524,72.355,75.2204,84.1043
15,65.07400000000001,8.73893061726281,43.56,61.91,65.79,71.7,78.59,66.45054952,8.764526191350807,48.492222,59.971414,68.109394,72.14798,79.08515200000001,66.436784,8.652569574635042,48.7014,60.0887,68.1458,72.0821,78.791
16,71.1476,8.079278680674406,52.28,65.64,70.43,79.07,83.28,67.06512732,7.014173379675833,53.286768,62.15201999999999,66.66686899999999,71.968687,78.714141,67.105952,6.928587926790472,53.5096,62.1896,66.8036,71.9054,78.6313
17,83.37080000000002,7.0204266964337725,62.66,77.82,85.19,87.75,92.48,68.26586676,6.147135309651038,57.588081,64.170303,67.366263,72.005152,82.995253,68.41691599999999,6.064732298686672,57.8902,64.4122,67.4681,72.1378,82.7919
18,94.4232,3.31326088116627,84.11,92.2,95.4,96.82,98.1,68.27021816,7.224203568536366,54.286667,63.613131,69.358788,73.079192,83.69070699999999,68.53174800000001,7.131660241201439,54.7159,63.9493,69.6114,73.3024,83.6949
19,98.86840000000001,0.7032109688185114,96.71,98.52,99.05,99.42,99.56,66.79825864000001,8.511671204701116,46.391212,61.229192000000005,67.661919,73.308788,79.476869,67.11896,8.424694074762199,46.9125,61.6125,67.9757,73.5656,79.6608
20,99.79,0.11676186592091281,99.44,99.74,99.84,99.87,99.92,66.91481208,8.866771823018391,46.916667,60.707273,68.061515,73.008485,80.084747,67.243564,8.77826421973995,47.4441,61.0988,68.3788,73.2772,80.2793
21,99.936,0.029011491975880776,99.87,99.92,99.94,99.95,99.99,74.18527268,7.951288365555083,55.67333299999999,68.757273,75.299798,81.005051,85.763535,74.44278,7.871863565202758,56.1154,69.0687,75.5462,81.1948,85.9058
22,99.9616,0.017953644012657262,99.93,99.95,99.96,99.97,99.99,86.48684448,6.292611331059116,67.324242,81.332727,88.33798,90.180808,94.29202,86.621592,6.229689508175079,67.6505,81.5191,88.4545,90.2786,94.3487
23,99.9648,0.01758787461102931,99.93,99.95,99.96,99.98,99.99,96.10389891999999,2.3345893567892375,88.497677,94.86828299999999,96.84424200000001,97.772222,98.621616,96.14250800000002,2.311227849347613,88.6123,94.9194,96.8752,97.7941,98.635
24,99.96519999999998,0.017587874611029154,99.93,99.95,99.97,99.98,99.99,99.27182224000003,0.43017441479603263,97.876667,99.008788,99.407071,99.592929,99.729798,99.27875600000002,0.42583892796064216,97.8976,99.0184,99.4124,99.5965,99.7321
25,99.96519999999998,0.017587874611029154,99.93,99.95,99.97,99.98,99.99,99.85324043999998,0.06574036513822272,99.641616,99.815556,99.873131,99.901414,99.923333,99.85436,0.06505021137552072,99.6449,99.8169,99.8738,99.9019,99.9237
26,99.96519999999998,0.017587874611029154,99.93,99.95,99.97,99.98,99.99,99.94484848,0.009756516916570809,99.91555600000001,99.937273,99.946566,99.95222199999999,99.959192,99.94505199999998,0.009618736923320128,99.9161,99.9374,99.947,99.9521,99.9589
27,99.96519999999998,0.017587874611029154,99.93,99.95,99.97,99.98,99.99,99.96001616,0.0024985678010910864,99.954646,99.958283,99.960202,99.961616,99.966061,99.960068,0.002427914056692163,99.9548,99.9584,99.9602,99.9619,99.9657
28,99.96519999999998,0.017587874611029154,99.93,99.95,99.97,99.98,99.99,99.96263420000002,0.0018691793653944904,99.959293,99.961515,99.962424,99.963535,99.967576,99.96266000000001,0.0018207141455971586,99.9595,99.9615,99.9627,99.9635,99.9672
29,99.96519999999998,0.017587874611029154,99.93,99.95,99.97,99.98,99.99,99.96301799999999,0.0018124537925124273,99.95969699999999,99.96171700000001,99.96303,99.96404,99.967677,99.96304,0.001769180601297376,99.96,99.9617,99.963,99.964,99.9673
30,99.96519999999998,0.017587874611029154,99.93,99.95,99.97,99.98,99.99,99.96306243999999,0.0018281908197240963,99.95969699999999,99.96181800000001,99.96303,99.964242,99.967677,99.96308399999998,0.0017843486206496457,99.96,99.9618,99.963,99.964,99.9673
31,99.96519999999998,0.017587874611029154,99.93,99.95,99.97,99.98,99.99,99.96307859999999,0.001825490801584597,99.95969699999999,99.96181800000001,99.96303,99.964242,99.967677,99.9631,0.001780917366600852,99.96,99.9618,99.9631,99.964,99.9673
32,99.96519999999998,0.017587874611029154,99.93,99.95,99.97,99.98,99.99,99.96308668,0.0018310628225133975,99.95969699999999,99.96181800000001,99.96303,99.964242,99.967677,99.96310799999999,0.0017865049678079717,99.96,99.9618,99.9631,99.964,99.9673
33,99.96519999999998,0.017587874611029154,99.93,99.95,99.97,99.98,99.99,99.96308668,0.0018310628225133975,99.95969699999999,99.96181800000001,99.96303,99.964242,99.967677,99.96310799999999,0.0017865049678079717,99.96,99.9618,99.9631,99.964,99.9673
34,99.96519999999998,0.017587874611029154,99.93,99.95,99.97,99.98,99.99,99.96308668,0.0018310628225133975,99.95969699999999,99.96181800000001,99.96303,99.964242,99.967677,99.96310799999999,0.0017865049678079717,99.96,99.9618,99.9631,99.964,99.9673
35,99.96519999999998,0.017587874611029154,99.93,99.95,99.97,99.98,99.99,99.96308668,0.0018310628225133975,99.95969699999999,99.96181800000001,99.96303,99.964242,99.967677,99.96310799999999,0.0017865049678079717,99.96,99.9618,99.9631,99.964,99.9673
36,99.96519999999998,0.017587874611029154,99.93,99.95,99.97,99.98,99.99,99.96308668,0.0018310628225133975,99.95969699999999,99.96181800000001,99.96303,99.964242,99.967677,99.96310799999999,0.0017865049678079717,99.96,99.9618,99.9631,99.964,99.9673
37,99.96519999999998,0.017587874611029154,99.93,99.95,99.97,99.98,99.99,99.96308668,0.0018310628225133975,99.95969699999999,99.96181800000001,99.96303,99.964242,99.967677,99.96310799999999,0.0017865049678079717,99.96,99.9618,99.9631,99.964,99.9673
38,99.96519999999998,0.017587874611029154,99.93,99.95,99.97,99.98,99.99,99.96308668,0.0018310628225133975,99.95969699999999,99.96181800000001,99.96303,99.964242,99.967677,99.96310799999999,0.0017865049678079717,99.96,99.9618,99.9631,99.964,99.9673
39,99.96519999999998,0.017587874611029154,99.93,99.95,99.97,99.98,99.99,99.96308668,0.0018310628225133975,99.95969699999999,99.96181800000001,99.96303,99.964242,99.967677,99.96310799999999,0.0017865049678079717,99.96,99.9618,99.9631,99.964,99.9673
40,99.96519999999998,0.017587874611029154,99.93,99.95,99.97,99.98,99.99,99.96308668,0.0018310628225133975,99.95969699999999,99.96181800000001,99.96303,99.964242,99.967677,99.96310799999999,0.0017865049678079717,99.96,99.9618,99.9631,99.964,99.9673
41,99.96519999999998,0.017587874611029154,99.93,99.95,99.97,99.98,99.99,99.96308668,0.0018310628225133975,99.95969699999999,99.96181800000001,99.96303,99.964242,99.967677,99.96310799999999,0.0017865049678079717,99.96,99.9618,99.9631,99.964,99.9673
42,99.96519999999998,0.017587874611029154,99.93,99.95,99.97,99.98,99.99,99.96308668,0.0018310628225133975,99.95969699999999,99.96181800000001,99.96303,99.964242,99.967677,99.96310799999999,0.0017865049678079717,99.96,99.9618,99.9631,99.964,99.9673
43,99.96519999999998,0.017587874611029154,99.93,99.95,99.97,99.98,99.99,99.96308668,0.0018310628225133975,99.95969699999999,99.96181800000001,99.96303,99.964242,99.967677,99.96310799999999,0.0017865049678079717,99.96,99.9618,99.9631,99.964,99.9673
44,99.96519999999998,0.017587874611029154,99.93,99.95,99.97,99.98,99.99,99.96308668,0.0018310628225133975,99.95969699999999,99.96181800000001,99.96303,99.964242,99.967677,99.96310799999999,0.0017865049678079717,99.96,99.9618,99.9631,99.964,99.9673
45,99.96519999999998,0.017587874611029154,99.93,99.95,99.97,99.98,99.99,99.96308668,0.0018310628225133975,99.95969699999999,99.96181800000001,99.96303,99.964242,99.967677,99.96310799999999,0.0017865049678079717,99.96,99.9618,99.9631,99.964,99.9673
46,99.96519999999998,0.017587874611029154,99.93,99.95,99.97,99.98,99.99,99.96308668,0.0018310628225133975,99.95969699999999,99.96181800000001,99.96303,99.964242,99.967677,99.96310799999999,0.0017865049678079717,99.96,99.9618,99.9631,99.964,99.9673
47,99.96519999999998,0.017587874611029154,99.93,99.95,99.97,99.98,99.99,99.96308668,0.0018310628225133975,99.95969699999999,99.96181800000001,99.96303,99.964242,99.967677,99.96310799999999,0.0017865049678079717,99.96,99.9618,99.9631,99.964,99.9673
48,99.96519999999998,0.017587874611029154,99.93,99.95,99.97,99.98,99.99,99.96308668,0.0018310628225133975,99.95969699999999,99.96181800000001,99.96303,99.964242,99.967677,99.96310799999999,0.0017865049678079717,99.96,99.9618,99.9631,99.964,99.9673
49,99.96519999999998,0.017587874611029154,99.93,99.95,99.97,99.98,99.99,99.96308668,0.0018310628225133975,99.95969699999999,99.96181800000001,99.96303,99.964242,99.967677,99.96310799999999,0.0017865049678079717,99.96,99.9618,99.9631,99.964,99.9673
50,99.96519999999998,0.017587874611029154,99.93,99.95,99.97,99.98,99.99,99.96308668,0.0018310628225133975,99.95969699999999,99.96181800000001,99.96303,99.964242,99.967677,99.96310799999999,0.0017865049678079717,99.96,99.9618,99.9631,99.964,99.9673
