gossips,p2p mean,p2p std,p2p min,p2p q1,p2p q2,p2p q3,p2p max,p2s mean,p2s std,p2s min,p2s q1,p2s q2,p2s q3,p2s max,s2s mean,s2s std,s2s min,s2s q1,s2s q2,s2s q3,s2s max
1,0.00125,0.0005,0.001,0.001,0.001,0.00125,0.002,0.0016250000000000004,0.000744023809142845,0.001,0.001,0.0015,0.002,0.003,1.3633689599999999,0.03354334443234106,1.325556,1.3325559999999999,1.356,1.377667,1.465889
2,,,,,,,,,,,,,,,,,,,,,
3,,,,,,,,,,,,,,,,,,,,,
4,,,,,,,,,,,,,,,,,,,,,
5,,,,,,,,,,,,,,,,,,,,,
