,mean,std,min,q1,q2,q3,max
Simple,,,,,,,
P,4.235759622158015,0.6648216940766631,1.0,4.0,4.0,5.0,7.0
S,7.669367993985615,0.5944007080166809,5.0,7.0,8.0,8.0,11.0
P+S,7.635032061764684,0.6862333004869213,1.0,7.0,8.0,8.0,11.0
