,P+S mean,P+S std,P+S min,P+S q1,P+S median,P+S q3,P+S max,P mean,P std,P min,P q1,P median,P q3,P max,S mean,S std,S min,S q1,S median,S q3,S max
10% nodes,51,0,51,51,51,51,51,48,0,48,48,48,48,48,51,0,51,51,51,51,51
50% nodes,52,0,52,52,52,52,52,49,0,49,49,49,49,49,52,0,52,52,52,52,52
99% nodes,53,0,53,53,53,53,53,50,0,50,50,50,50,50,53,0,53,53,53,53,53
