gossips,p2p mean,p2p std,p2p min,p2p q1,p2p q2,p2p q3,p2p max,p2s mean,p2s std,p2s min,p2s q1,p2s q2,p2s q3,p2s max,s2s mean,s2s std,s2s min,s2s q1,s2s q2,s2s q3,s2s max
1,0.14396,0.010741197946846217,0.128,0.135,0.144,0.152,0.168,1.0832400000000002,0.03311379370192028,1.024,1.058,1.079,1.11,1.141,65.49809340000002,0.37528131104579227,64.994667,65.29655600000001,65.403,65.50444399999999,66.421222
2,,,,,,,,,,,,,,,0.9171155599999998,0.025125883929857425,0.8797780000000001,0.8955559999999999,0.921222,0.931333,0.990778
3,,,,,,,,,,,,,,,0.00011100000000000001,0.0,0.00011100000000000001,0.00011100000000000001,0.00011100000000000001,0.00011100000000000001,0.00011100000000000001
4,,,,,,,,,,,,,,,,,,,,,
5,,,,,,,,,,,,,,,,,,,,,
