gossips,p2p mean,p2p std,p2p min,p2p q1,p2p q2,p2p q3,p2p max,p2s mean,p2s std,p2s min,p2s q1,p2s q2,p2s q3,p2s max,s2s mean,s2s std,s2s min,s2s q1,s2s q2,s2s q3,s2s max
1,49.404,1.409042227898086,47.3,48.3,49.0,50.2,52.7,46.37999999999999,1.440775254275743,43.1,45.3,46.0,47.1,50.2,55.183923959999994,0.5119797837622162,54.230230000000006,54.856156000000006,55.136537,55.564765,56.154454
2,22.156,0.92424744161579,20.7,21.4,22.1,22.6,24.3,9.82,1.1525334413080313,7.8,9.1,9.8,10.5,11.9,19.705141160000004,0.8295151295593648,18.390691,19.183083,19.581281,20.245145,21.358759
3,1.736,0.4786090958879352,0.8,1.4,1.7,2.1,3.1,0.12,0.044721359549995794,0.1,0.1,0.1,0.1,0.2,1.75905504,0.18228872245663835,1.338639,1.645245,1.7963959999999999,1.837838,2.178378
4,0.1,,0.1,0.1,0.1,0.1,0.1,,,,,,,,0.038782760000000006,0.005692907402197933,0.026527,0.034033999999999995,0.039939999999999996,0.042242,0.048448000000000005
5,,,,,,,,,,,,,,,0.0002546363636363636,0.00014070047397440912,0.0001,0.000125,0.0002,0.0003,0.000601
