gossips,p2p mean,p2p std,p2p min,p2p q1,p2p q2,p2p q3,p2p max,p2s mean,p2s std,p2s min,p2s q1,p2s q2,p2s q3,p2s max,s2s mean,s2s std,s2s min,s2s q1,s2s q2,s2s q3,s2s max
1,49.25739999999999,0.19250454540088124,48.795,49.145,49.276,49.368,49.637,58.33148,0.29522422551906785,57.792,58.158,58.259,58.421,59.015,55.79183552000001,0.20489951225582853,55.520444,55.681889,55.74244399999999,55.778778,56.380778
2,22.241920000000004,0.1385517111647,22.038,22.129,22.213,22.301,22.541,20.33296,0.2222679464070342,19.781,20.277,20.347,20.469,20.635,21.42882668,0.1530660960703802,21.093110999999997,21.326110999999997,21.465667,21.523556,21.776111
3,2.0504,0.040666325135178046,1.977,2.021,2.049,2.086,2.137,0.31892000000000004,0.01789534390095182,0.287,0.304,0.319,0.333,0.355,0.4458134,0.020781912177420047,0.4,0.43611099999999997,0.448333,0.458,0.48955600000000005
4,0.024360000000000007,0.004192055979269998,0.014,0.022,0.025,0.028,0.032,0.0017894736842105268,0.000854981960070962,0.001,0.001,0.002,0.002,0.004,0.0022488400000000006,0.00042108487663811107,0.001333,0.002,0.002333,0.0025559999999999997,0.003111
5,,,,,,,,,,,,,,,,,,,,,
