gossips,p2p mean,p2p std,p2p min,p2p q1,p2p q2,p2p q3,p2p max,p2s mean,p2s std,p2s min,p2s q1,p2s q2,p2s q3,p2s max,s2s mean,s2s std,s2s min,s2s q1,s2s q2,s2s q3,s2s max
1,51.69072,0.14669825038720372,51.343,51.593,51.706,51.76,52.021,77.80359999999999,0.17976025700916295,77.397,77.714,77.815,77.929,78.166,58.211644400000004,0.09762190452924167,57.95255600000001,58.150889,58.217889,58.255221999999996,58.408889
2,18.715279999999996,0.13511369286641509,18.489,18.593,18.727,18.795,18.972,10.2822,0.11558041933361107,10.089,10.181,10.258,10.346,10.481,20.121360039999995,0.09580915941446667,19.922667,20.051222,20.118555999999998,20.182444,20.359111
3,0.027720000000000012,0.006522525073415458,0.015,0.024,0.028,0.031,0.043,0.17695999999999998,0.013436517405935218,0.144,0.171,0.175,0.182,0.205,0.51863104,0.012547336827258079,0.49722200000000005,0.507444,0.520667,0.526556,0.549222
4,,,,,,,,,,,,,,,0.0002326190476190476,0.0001310127765488833,0.00011100000000000001,0.00011100000000000001,0.00022200000000000003,0.000333,0.000556
5,,,,,,,,,,,,,,,,,,,,,
