gossips,p2p mean,p2p std,p2p min,p2p q1,p2p q2,p2p q3,p2p max,p2s mean,p2s std,p2s min,p2s q1,p2s q2,p2s q3,p2s max,s2s mean,s2s std,s2s min,s2s q1,s2s q2,s2s q3,s2s max
1,,,,,,,,0.1,,0.1,0.1,0.1,0.1,0.1,19.539363280000003,6.3655109122269105,10.943143,14.041842,19.318217999999998,23.647347,32.018418
2,,,,,,,,,,,,,,,0.88881292,0.6413854020982573,0.164865,0.372873,0.8198200000000001,1.054254,2.711912
3,,,,,,,,,,,,,,,0.007968000000000001,0.009267676978797509,0.000801,0.002102,0.004404,0.01031,0.038639
4,,,,,,,,,,,,,,,,,,,,,
5,,,,,,,,,,,,,,,,,,,,,
6,,,,,,,,,,,,,,,,,,,,,
7,,,,,,,,,,,,,,,,,,,,,
