round,P mean,P std,P min,P q1,P q2,P q3,P max,S mean,S std,S min,S q1,S q2,S q3,S max,P+S mean,P+S std,P+S min,P+S q1,P+S q2,P+S q3,P+S max
0,0.0,0.0,0.0,0.0,0.0,0.0,0.0,0.0,0.0,0.0,0.0,0.0,0.0,0.0,0.0,0.0,0.0,0.0,0.0,0.0,0.0
1,0.0,0.0,0.0,0.0,0.0,0.0,0.0,0.0,0.0,0.0,0.0,0.0,0.0,0.0,0.0,0.0,0.0,0.0,0.0,0.0,0.0
2,0.0,0.0,0.0,0.0,0.0,0.0,0.0,0.0,0.0,0.0,0.0,0.0,0.0,0.0,0.0,0.0,0.0,0.0,0.0,0.0,0.0
3,0.0,0.0,0.0,0.0,0.0,0.0,0.0,0.0,0.0,0.0,0.0,0.0,0.0,0.0,0.0,0.0,0.0,0.0,0.0,0.0,0.0
4,0.0,0.0,0.0,0.0,0.0,0.0,0.0,0.0,0.0,0.0,0.0,0.0,0.0,0.0,0.0,0.0,0.0,0.0,0.0,0.0,0.0
5,0.0,0.0,0.0,0.0,0.0,0.0,0.0,0.0,0.0,0.0,0.0,0.0,0.0,0.0,0.0,0.0,0.0,0.0,0.0,0.0,0.0
6,0.0,0.0,0.0,0.0,0.0,0.0,0.0,0.0,0.0,0.0,0.0,0.0,0.0,0.0,0.0,0.0,0.0,0.0,0.0,0.0,0.0
7,0.0,0.0,0.0,0.0,0.0,0.0,0.0,0.0,0.0,0.0,0.0,0.0,0.0,0.0,0.0,0.0,0.0,0.0,0.0,0.0,0.0
8,0.0,0.0,0.0,0.0,0.0,0.0,0.0,0.0,0.0,0.0,0.0,0.0,0.0,0.0,0.0,0.0,0.0,0.0,0.0,0.0,0.0
9,0.0,0.0,0.0,0.0,0.0,0.0,0.0,0.0,0.0,0.0,0.0,0.0,0.0,0.0,0.0,0.0,0.0,0.0,0.0,0.0,0.0
10,0.0,0.0,0.0,0.0,0.0,0.0,0.0,0.0,0.0,0.0,0.0,0.0,0.0,0.0,0.0,0.0,0.0,0.0,0.0,0.0,0.0
11,0.07840000000000004,0.03261901286060018,0.02,0.07,0.07,0.09,0.15,0.0,0.0,0.0,0.0,0.0,0.0,0.0,0.000784,0.0003261901286060018,0.0002,0.0007,0.0007,0.0009,0.0015
12,7.075200000000001,0.14364655698391562,6.67,7.03,7.09,7.14,7.34,0.0,0.0,0.0,0.0,0.0,0.0,0.0,0.07075199999999998,0.001436465569839158,0.0667,0.0703,0.0709,0.0714,0.0734
13,65.6344,0.41891805085640665,64.85,65.34,65.61,65.89,66.73,0.0,0.0,0.0,0.0,0.0,0.0,0.0,0.656344,0.004189180508564112,0.6485,0.6534,0.6561,0.6589,0.6673
14,99.81519999999996,0.04744470465710414,99.73,99.79,99.81,99.85,99.9,0.0009453600000000001,0.0003205590013294485,0.000303,0.0007070000000000001,0.000909,0.001111,0.001818,0.9990880000000001,0.0005967411499134363,0.9981,0.9987,0.999,0.9997,1.0001
15,99.95839999999998,0.024097026095900035,99.89,99.94,99.96,99.97,100.0,2.3218303600000003,0.040848704638662324,2.2219189999999998,2.298485,2.319293,2.341414,2.3959599999999996,3.2981960000000003,0.040478980965434494,3.1994,3.2749,3.2958,3.3178,3.3714
16,99.95839999999998,0.024097026095900035,99.89,99.94,99.96,99.97,100.0,42.94547884000001,0.4641423180499773,41.798283000000005,42.666364,42.983131,43.194646,43.848687,43.515608,0.4595317779363387,42.3798,43.2392,43.5527,43.7626,44.4096
17,99.95839999999998,0.024097026095900035,99.89,99.94,99.96,99.97,100.0,98.70183435999999,0.05438728367219559,98.60202,98.66454499999999,98.71202,98.741414,98.821414,98.71439999999998,0.05387132818113909,98.6157,98.6773,98.7247,98.7537,98.8326
18,99.95839999999998,0.024097026095900035,99.89,99.94,99.96,99.97,100.0,99.95728904000002,0.0020930704216563616,99.953434,99.95565699999999,99.957374,99.958586,99.961616,99.95729999999999,0.0020447086181968354,99.9536,99.9558,99.9572,99.9584,99.9614
19,99.95839999999998,0.024097026095900035,99.89,99.94,99.96,99.97,100.0,99.95786279999999,0.0020323860361673063,99.954141,99.956061,99.95798,99.959293,99.962121,99.957868,0.001980892054941948,99.9543,99.9565,99.9578,99.9591,99.9619
20,99.95839999999998,0.024097026095900035,99.89,99.94,99.96,99.97,100.0,99.95786279999999,0.0020323860361673063,99.954141,99.956061,99.95798,99.959293,99.962121,99.957868,0.001980892054941948,99.9543,99.9565,99.9578,99.9591,99.9619
21,99.95839999999998,0.024097026095900035,99.89,99.94,99.96,99.97,100.0,99.95786279999999,0.0020323860361673063,99.954141,99.956061,99.95798,99.959293,99.962121,99.957868,0.001980892054941948,99.9543,99.9565,99.9578,99.9591,99.9619
22,99.95839999999998,0.024097026095900035,99.89,99.94,99.96,99.97,100.0,99.95786279999999,0.0020323860361673063,99.954141,99.956061,99.95798,99.959293,99.962121,99.957868,0.001980892054941948,99.9543,99.9565,99.9578,99.9591,99.9619
23,99.95839999999998,0.024097026095900035,99.89,99.94,99.96,99.97,100.0,99.95786279999999,0.0020323860361673063,99.954141,99.956061,99.95798,99.959293,99.962121,99.957868,0.001980892054941948,99.9543,99.9565,99.9578,99.9591,99.9619
24,99.95839999999998,0.024097026095900035,99.89,99.94,99.96,99.97,100.0,99.95786279999999,0.0020323860361673063,99.954141,99.956061,99.95798,99.959293,99.962121,99.957868,0.001980892054941948,99.9543,99.9565,99.9578,99.9591,99.9619
25,99.95839999999998,0.024097026095900035,99.89,99.94,99.96,99.97,100.0,99.95786279999999,0.0020323860361673063,99.954141,99.956061,99.95798,99.959293,99.962121,99.957868,0.001980892054941948,99.9543,99.9565,99.9578,99.9591,99.9619
