gossips,p2p mean,p2p std,p2p min,p2p q1,p2p q2,p2p q3,p2p max,p2s mean,p2s std,p2s min,p2s q1,p2s q2,p2s q3,p2s max,s2s mean,s2s std,s2s min,s2s q1,s2s q2,s2s q3,s2s max
1,49.232000000000006,1.270078737716682,47.1,48.4,49.0,50.0,52.1,58.66800000000001,1.2555609636068394,55.8,57.9,58.9,59.6,60.3,0.3386627200000001,0.012028416339097459,0.316517,0.333433,0.337337,0.345445,0.364064
2,21.964000000000002,1.320315618832609,19.0,20.9,22.2,22.7,24.7,20.168000000000003,1.0815575188896172,18.1,19.3,20.1,21.2,21.8,0.0002572857142857143,0.00017445714861620519,0.0001,0.0001,0.0002,0.0003,0.000601
3,1.7360000000000002,0.3672873534441392,1.0,1.6,1.7,1.9,2.7,0.2538461538461539,0.1560736183952123,0.1,0.1,0.2,0.4,0.5,,,,,,,
4,0.1,,0.1,0.1,0.1,0.1,0.1,,,,,,,,,,,,,,
5,,,,,,,,,,,,,,,,,,,,,
