round,P mean,P std,P min,P q1,P q2,P q3,P max,S mean,S std,S min,S q1,S q2,S q3,S max,P+S mean,P+S std,P+S min,P+S q1,P+S q2,P+S q3,P+S max
0,0.0,0.0,0.0,0.0,0.0,0.0,0.0,0.0,0.0,0.0,0.0,0.0,0.0,0.0,0.0,0.0,0.0,0.0,0.0,0.0,0.0
1,0.0,0.0,0.0,0.0,0.0,0.0,0.0,0.0,0.0,0.0,0.0,0.0,0.0,0.0,0.0,0.0,0.0,0.0,0.0,0.0,0.0
2,0.0,0.0,0.0,0.0,0.0,0.0,0.0,0.0,0.0,0.0,0.0,0.0,0.0,0.0,0.0,0.0,0.0,0.0,0.0,0.0,0.0
3,0.0,0.0,0.0,0.0,0.0,0.0,0.0,0.0,0.0,0.0,0.0,0.0,0.0,0.0,0.0,0.0,0.0,0.0,0.0,0.0,0.0
4,0.0,0.0,0.0,0.0,0.0,0.0,0.0,0.0,0.0,0.0,0.0,0.0,0.0,0.0,0.0,0.0,0.0,0.0,0.0,0.0,0.0
5,0.0,0.0,0.0,0.0,0.0,0.0,0.0,0.0,0.0,0.0,0.0,0.0,0.0,0.0,0.0,0.0,0.0,0.0,0.0,0.0,0.0
6,0.0,0.0,0.0,0.0,0.0,0.0,0.0,0.0,0.0,0.0,0.0,0.0,0.0,0.0,0.0,0.0,0.0,0.0,0.0,0.0,0.0
7,0.0,0.0,0.0,0.0,0.0,0.0,0.0,0.0,0.0,0.0,0.0,0.0,0.0,0.0,0.0,0.0,0.0,0.0,0.0,0.0,0.0
8,0.0,0.0,0.0,0.0,0.0,0.0,0.0,0.0,0.0,0.0,0.0,0.0,0.0,0.0,0.0,0.0,0.0,0.0,0.0,0.0,0.0
9,0.0,0.0,0.0,0.0,0.0,0.0,0.0,0.0,0.0,0.0,0.0,0.0,0.0,0.0,0.0,0.0,0.0,0.0,0.0,0.0,0.0
10,0.0,0.0,0.0,0.0,0.0,0.0,0.0,0.0,0.0,0.0,0.0,0.0,0.0,0.0,0.0,0.0,0.0,0.0,0.0,0.0,0.0
11,8e-05,0.00027688746209726916,0.0,0.0,0.0,0.0,0.001,0.0,0.0,0.0,0.0,0.0,0.0,0.0,8e-06,2.768874620972692e-05,0.0,0.0,0.0,0.0,0.0001
12,0.07956,0.010928098340211499,0.055,0.075,0.082,0.088,0.092,0.0,0.0,0.0,0.0,0.0,0.0,0.0,0.007956000000000001,0.0010928098340211498,0.0055,0.0075,0.0082,0.0088,0.0092
13,7.053999999999999,0.10957835856895594,6.761,7.052,7.069,7.107,7.202,0.0,0.0,0.0,0.0,0.0,0.0,0.0,0.7054,0.010957835856895562,0.6761,0.7052,0.7069,0.7107,0.7202
14,65.3254,0.2861798676823137,64.716,65.203,65.36,65.544,65.69,0.005804560000000002,0.0014579951440248354,0.0025559999999999997,0.005333,0.006,0.006778,0.007778,6.537763999999999,0.029530138277134185,6.4739,6.5259,6.541,6.5605,6.5752
15,99.80395999999999,0.01363659292736328,99.78,99.795,99.803,99.81,99.834,9.015782080000001,0.22066199391375327,8.434556,9.032111,9.094889,9.134333,9.227444,18.0946,0.1988625739885046,17.5698,18.1069,18.1688,18.201,18.287
16,99.95284,0.005451910979953982,99.944,99.948,99.953,99.957,99.964,87.16157784,0.13460223440743088,86.847111,87.100111,87.178111,87.260667,87.375556,88.44070399999998,0.12137349889219383,88.1569,88.3845,88.455,88.5299,88.6333
17,99.95288000000001,0.005387640176059529,99.944,99.948,99.953,99.957,99.964,99.98072,0.0014910180526523829,99.97855600000001,99.979778,99.980111,99.982222,99.983,99.97793599999999,0.001513241553750852,99.9755,99.9769,99.9776,99.9794,99.9806
18,99.95288000000001,0.005387640176059529,99.944,99.948,99.953,99.957,99.964,99.98487112,0.0012374690339561902,99.982667,99.984,99.984667,99.986,99.987111,99.98167199999997,0.0012742710334407578,99.9797,99.9809,99.9814,99.9828,99.9846
19,99.95288000000001,0.005387640176059529,99.944,99.948,99.953,99.957,99.964,99.98487112,0.0012374690339561902,99.982667,99.984,99.984667,99.986,99.987111,99.98167199999997,0.0012742710334407578,99.9797,99.9809,99.9814,99.9828,99.9846
20,99.95288000000001,0.005387640176059529,99.944,99.948,99.953,99.957,99.964,99.98487112,0.0012374690339561902,99.982667,99.984,99.984667,99.986,99.987111,99.98167199999997,0.0012742710334407578,99.9797,99.9809,99.9814,99.9828,99.9846
21,99.95288000000001,0.005387640176059529,99.944,99.948,99.953,99.957,99.964,99.98487112,0.0012374690339561902,99.982667,99.984,99.984667,99.986,99.987111,99.98167199999997,0.0012742710334407578,99.9797,99.9809,99.9814,99.9828,99.9846
22,99.95288000000001,0.005387640176059529,99.944,99.948,99.953,99.957,99.964,99.98487112,0.0012374690339561902,99.982667,99.984,99.984667,99.986,99.987111,99.98167199999997,0.0012742710334407578,99.9797,99.9809,99.9814,99.9828,99.9846
23,99.95288000000001,0.005387640176059529,99.944,99.948,99.953,99.957,99.964,99.98487112,0.0012374690339561902,99.982667,99.984,99.984667,99.986,99.987111,99.98167199999997,0.0012742710334407578,99.9797,99.9809,99.9814,99.9828,99.9846
24,99.95288000000001,0.005387640176059529,99.944,99.948,99.953,99.957,99.964,99.98487112,0.0012374690339561902,99.982667,99.984,99.984667,99.986,99.987111,99.98167199999997,0.0012742710334407578,99.9797,99.9809,99.9814,99.9828,99.9846
25,99.95288000000001,0.005387640176059529,99.944,99.948,99.953,99.957,99.964,99.98487112,0.0012374690339561902,99.982667,99.984,99.984667,99.986,99.987111,99.98167199999997,0.0012742710334407578,99.9797,99.9809,99.9814,99.9828,99.9846
