,mean,std,min,q1,q2,q3,max
Simple,,,,,,,
P,4.235676486953642,0.6648171835773898,1.0,4.0,4.0,5.0,7.0
S,6.9820032155834415,0.6016313765867201,4.0,7.0,7.0,7.0,10.0
P+S,6.954539987955742,0.6613843777241447,1.0,7.0,7.0,7.0,10.0
