,mean,std,sem,cistd,cisem,min,05th,25th,50th,75th,95th,max
Uniform,,,,,,,,,,,,
P,2.5792681099999983,1.3779814469056324,0.13849234628657647,0.13779814469056323,0.013849234628657647,1.2195119999999946,1.2195119999999946,1.5243899999999968,2.134146000000001,3.0487799999999936,4.878049000000004,8.231707
S,1.5738500799999997,1.2167984613201128,0.1222928467175937,0.12167984613201129,0.01222928467175937,0.3575529999999958,0.5118302999999997,0.8806387499999992,1.1565285000000003,1.8407347499999958,3.834201449999999,6.987728000000004
P+S,1.5738500799999997,1.2167984613201128,0.1222928467175937,0.12167984613201129,0.01222928467175937,0.3575529999999958,0.5118302999999997,0.8806387499999992,1.1565285000000003,1.8407347499999958,3.834201449999999,6.987728000000004
