,mean,std,min,q1,q2,q3,max
Simple,,,,,,,
P,5.236098464941458,0.6663076021535477,1.0,5.0,5.0,6.0,8.0
S,6.68899208903109,0.5063423209639912,3.0,6.0,7.0,7.0,10.0
P+S,6.543707019132675,0.6819943690796928,1.0,6.0,7.0,7.0,10.0
