gossips,p2p mean,p2p std,p2p min,p2p q1,p2p q2,p2p q3,p2p max,p2s mean,p2s std,p2s min,p2s q1,p2s q2,p2s q3,p2s max,s2s mean,s2s std,s2s min,s2s q1,s2s q2,s2s q3,s2s max
1,49.763999999999996,1.6471895256264022,47.2,48.7,49.4,50.7,52.6,48.58000000000001,1.9510680835549188,43.4,47.9,48.7,49.7,51.9,52.83238039999999,0.4583711312790092,51.855856,52.522822999999995,52.856056,53.14214200000001,53.669869999999996
2,22.028000000000002,1.0370310185010538,19.8,21.3,22.1,22.7,24.2,15.155999999999999,1.4902684321960258,12.5,14.0,15.9,16.2,17.8,21.589233240000002,0.8049798486506399,19.822823,21.128328,21.45976,21.914214,23.540641
3,1.9879999999999995,0.3218695387886217,1.3,1.8,1.9,2.3,2.5,0.125,0.05000000000000002,0.1,0.1,0.1,0.125,0.2,1.4201921999999996,0.08575602224673977,1.293293,1.34004,1.412012,1.467367,1.5997
4,0.1,0.0,0.1,0.1,0.1,0.1,0.1,,,,,,,,0.028456520000000013,0.00317030822791728,0.022823,0.026826999999999997,0.028127999999999997,0.03023,0.035035000000000004
5,,,,,,,,,,,,,,,0.00016111111111111108,6.978023391872253e-05,0.0001,0.0001,0.00015000000000000001,0.0002,0.0003
