gossips,p2p mean,p2p std,p2p min,p2p q1,p2p q2,p2p q3,p2p max,p2s mean,p2s std,p2s min,p2s q1,p2s q2,p2s q3,p2s max,s2s mean,s2s std,s2s min,s2s q1,s2s q2,s2s q3,s2s max
1,49.843999999999994,1.5245436475658332,47.0,48.9,49.5,50.8,53.1,57.604,1.1595545121582962,55.8,56.6,57.5,58.5,60.3,51.969205239999994,0.2964282519918426,51.389489000000005,51.761862,52.002903,52.174775,52.54384399999999
2,22.136000000000003,1.1481434289030847,20.1,21.3,22.1,22.7,25.1,20.543999999999997,1.0832358930537702,18.5,20.0,20.5,21.0,22.7,21.76551748,0.48696114904717347,20.568468,21.508308,21.762863,22.044945000000002,22.674474
3,1.6720000000000002,0.47479820274863443,0.9,1.3,1.7,2.0,2.6,0.3559999999999999,0.15567059238447492,0.1,0.3,0.4,0.4,0.8,1.4673673600000001,0.08395127612335622,1.2786790000000001,1.3990989999999999,1.4799799999999999,1.526527,1.674074
4,0.1,,0.1,0.1,0.1,0.1,0.1,,,,,,,,0.031844,0.0037446937124416477,0.024925,0.029830000000000002,0.031731999999999996,0.034935,0.038738999999999996
5,,,,,,,,,,,,,,,0.00023338095238095233,0.00013921223947285533,0.0001,0.0002,0.0002,0.0003,0.000701
6,,,,,,,,,,,,,,,,,,,,,
