gossips,p2p mean,p2p std,p2p min,p2p q1,p2p q2,p2p q3,p2p max,p2s mean,p2s std,p2s min,p2s q1,p2s q2,p2s q3,p2s max,s2s mean,s2s std,s2s min,s2s q1,s2s q2,s2s q3,s2s max
1,0.17777777777777778,0.10032626514091005,0.1,0.1,0.1,0.27499999999999997,0.4,9.244000000000002,1.331377732526223,6.6,8.3,9.0,10.4,11.3,50.100484480000006,0.30758608508393137,49.672072,49.786587,50.140240000000006,50.312312,50.698398
2,,,,,,,,,,,,,,,21.95626428,0.7499994381715959,20.173173000000002,21.350651,21.965666,22.346346,23.413113
3,,,,,,,,,,,,,,,2.0724124799999997,0.11311147486481347,1.886987,1.988989,2.048348,2.156356,2.317718
4,,,,,,,,,,,,,,,0.020300319999999993,0.0015469698801204893,0.017016999999999997,0.01962,0.02022,0.020821,0.023423
5,,,,,,,,,,,,,,,0.0001,0.0,0.0001,0.0001,0.0001,0.0001,0.0001
