,mean,std,sem,cistd,cisem,min,05th,25th,50th,75th,95th,max
Uniform,9.791159595593058,3.2098926748977687,0.0006697136652591516,0.0006697136506825446,1.3972940191434244e-07,1.0,5.0,8.0,10.0,12.0,15.0,31.0
P,,,,,,,,,,,,
S,,,,,,,,,,,,
P+S,,,,,,,,,,,,
