round,P mean,P std,P min,P q1,P q2,P q3,P max,S mean,S std,S min,S q1,S q2,S q3,S max,P+S mean,P+S std,P+S min,P+S q1,P+S q2,P+S q3,P+S max
0,0.2,0.408248290463863,0,0,0,0,1,0.8,0.40824829046386296,0,1,1,1,1,0.0,0.0,0,0,0,0,0
1,1.0,0.0,1,1,1,1,1,0.8,0.40824829046386296,0,1,1,1,1,0.8,0.40824829046386296,0,1,1,1,1
2,1.0,0.0,1,1,1,1,1,0.8,0.40824829046386296,0,1,1,1,1,0.8,0.40824829046386296,0,1,1,1,1
3,1.0,0.0,1,1,1,1,1,0.84,0.3741657386773941,0,1,1,1,1,0.84,0.3741657386773941,0,1,1,1,1
4,1.0,0.0,1,1,1,1,1,1.0,0.0,1,1,1,1,1,1.0,0.0,1,1,1,1,1
5,1.0,0.0,1,1,1,1,1,1.0,0.0,1,1,1,1,1,1.0,0.0,1,1,1,1,1
6,1.0,0.0,1,1,1,1,1,1.0,0.0,1,1,1,1,1,1.0,0.0,1,1,1,1,1
7,1.0,0.0,1,1,1,1,1,1.0,0.0,1,1,1,1,1,1.0,0.0,1,1,1,1,1
8,1.0,0.0,1,1,1,1,1,1.0,0.0,1,1,1,1,1,1.0,0.0,1,1,1,1,1
9,1.0,0.0,1,1,1,1,1,1.0,0.0,1,1,1,1,1,1.0,0.0,1,1,1,1,1
10,1.0,0.0,1,1,1,1,1,1.0,0.0,1,1,1,1,1,1.0,0.0,1,1,1,1,1
11,1.0,0.0,1,1,1,1,1,1.0,0.0,1,1,1,1,1,1.0,0.0,1,1,1,1,1
12,1.0,0.0,1,1,1,1,1,1.0,0.0,1,1,1,1,1,1.0,0.0,1,1,1,1,1
13,1.0,0.0,1,1,1,1,1,1.0,0.0,1,1,1,1,1,1.0,0.0,1,1,1,1,1
14,1.0,0.0,1,1,1,1,1,1.0,0.0,1,1,1,1,1,1.0,0.0,1,1,1,1,1
15,1.0,0.0,1,1,1,1,1,1.0,0.0,1,1,1,1,1,1.0,0.0,1,1,1,1,1
16,1.0,0.0,1,1,1,1,1,1.0,0.0,1,1,1,1,1,1.0,0.0,1,1,1,1,1
17,1.0,0.0,1,1,1,1,1,1.0,0.0,1,1,1,1,1,1.0,0.0,1,1,1,1,1
18,1.0,0.0,1,1,1,1,1,1.0,0.0,1,1,1,1,1,1.0,0.0,1,1,1,1,1
19,1.0,0.0,1,1,1,1,1,1.0,0.0,1,1,1,1,1,1.0,0.0,1,1,1,1,1
20,1.0,0.0,1,1,1,1,1,1.0,0.0,1,1,1,1,1,1.0,0.0,1,1,1,1,1
21,1.0,0.0,1,1,1,1,1,1.0,0.0,1,1,1,1,1,1.0,0.0,1,1,1,1,1
22,1.0,0.0,1,1,1,1,1,1.0,0.0,1,1,1,1,1,1.0,0.0,1,1,1,1,1
23,1.0,0.0,1,1,1,1,1,1.0,0.0,1,1,1,1,1,1.0,0.0,1,1,1,1,1
24,1.0,0.0,1,1,1,1,1,1.0,0.0,1,1,1,1,1,1.0,0.0,1,1,1,1,1
25,1.0,0.0,1,1,1,1,1,1.0,0.0,1,1,1,1,1,1.0,0.0,1,1,1,1,1
26,1.0,0.0,1,1,1,1,1,1.0,0.0,1,1,1,1,1,1.0,0.0,1,1,1,1,1
27,1.0,0.0,1,1,1,1,1,1.0,0.0,1,1,1,1,1,1.0,0.0,1,1,1,1,1
28,1.0,0.0,1,1,1,1,1,1.0,0.0,1,1,1,1,1,1.0,0.0,1,1,1,1,1
29,1.0,0.0,1,1,1,1,1,1.0,0.0,1,1,1,1,1,1.0,0.0,1,1,1,1,1
30,1.0,0.0,1,1,1,1,1,1.0,0.0,1,1,1,1,1,1.0,0.0,1,1,1,1,1
31,1.0,0.0,1,1,1,1,1,1.0,0.0,1,1,1,1,1,1.0,0.0,1,1,1,1,1
32,1.0,0.0,1,1,1,1,1,1.0,0.0,1,1,1,1,1,1.0,0.0,1,1,1,1,1
33,1.0,0.0,1,1,1,1,1,1.0,0.0,1,1,1,1,1,1.0,0.0,1,1,1,1,1
34,1.0,0.0,1,1,1,1,1,1.0,0.0,1,1,1,1,1,1.0,0.0,1,1,1,1,1
35,1.0,0.0,1,1,1,1,1,1.0,0.0,1,1,1,1,1,1.0,0.0,1,1,1,1,1
36,1.0,0.0,1,1,1,1,1,1.0,0.0,1,1,1,1,1,1.0,0.0,1,1,1,1,1
37,1.0,0.0,1,1,1,1,1,1.0,0.0,1,1,1,1,1,1.0,0.0,1,1,1,1,1
38,1.0,0.0,1,1,1,1,1,1.0,0.0,1,1,1,1,1,1.0,0.0,1,1,1,1,1
39,1.0,0.0,1,1,1,1,1,1.0,0.0,1,1,1,1,1,1.0,0.0,1,1,1,1,1
40,1.0,0.0,1,1,1,1,1,1.0,0.0,1,1,1,1,1,1.0,0.0,1,1,1,1,1
