gossips,p2p mean,p2p std,p2p min,p2p q1,p2p q2,p2p q3,p2p max,p2s mean,p2s std,p2s min,p2s q1,p2s q2,p2s q3,p2s max,s2s mean,s2s std,s2s min,s2s q1,s2s q2,s2s q3,s2s max
1,45.076000000000015,1.6241100126941306,42.1,43.8,44.9,46.1,48.8,41.47599999999999,1.6294886723550228,37.7,40.3,41.3,43.0,44.5,25.661389400000004,0.4530558694340764,24.924525,25.41041,25.699499,25.928028,26.532833
2,11.356,0.9174602625363851,9.5,10.7,11.2,11.7,13.1,48.472,1.4063901781985433,45.8,47.6,48.4,49.2,51.3,37.98632232,0.12728557700328816,37.682983,37.910610999999996,37.993894,38.03003,38.320721
3,0.09999999999999999,0.0,0.1,0.1,0.1,0.1,0.1,1.0479999999999998,0.2917190429162964,0.4,0.9,1.1,1.2,1.5,23.41212416000001,0.4285216589449993,22.603904,23.191391,23.344745,23.651351000000002,24.142342000000003
4,,,,,,,,0.1,,0.1,0.1,0.1,0.1,0.1,6.21357756,0.2389588994267772,5.744044000000001,6.0744739999999995,6.198599,6.37017,6.5999
5,,,,,,,,,,,,,,,0.63837432,0.032998002387417326,0.565866,0.625325,0.643243,0.662763,0.69039
6,,,,,,,,,,,,,,,0.03457459999999999,0.002888181377037576,0.02973,0.032933,0.033533999999999994,0.036136,0.04034
7,,,,,,,,,,,,,,,0.00111716,0.0003884090069329838,0.0004,0.000901,0.001101,0.001301,0.001802
8,,,,,,,,,,,,,,,0.0001,0.0,0.0001,0.0001,0.0001,0.0001,0.0001
