gossips,p2p mean,p2p std,p2p min,p2p q1,p2p q2,p2p q3,p2p max,p2s mean,p2s std,p2s min,p2s q1,p2s q2,p2s q3,p2s max,s2s mean,s2s std,s2s min,s2s q1,s2s q2,s2s q3,s2s max
1,41.22120000000001,0.9009601360030691,38.412,40.87,41.41,41.811,42.324,42.43232,1.3942146750052515,39.444,41.576,42.647,43.511,44.805,42.55068448,0.703868825799898,40.705778,41.944111,42.773778,43.106,43.512444
2,20.348080000000003,3.8178801482847344,13.099,17.608,19.524,23.764,28.204,21.44344,4.469226844768567,13.431,19.053,20.946,25.239,28.71,19.91380444,4.255887227635885,11.329222,16.690333,20.210556,23.664556,26.192556
3,5.052440000000001,2.0839632530349474,2.015,3.53,4.538,6.411,10.405,4.898639999999999,2.186618391489471,1.986,2.999,4.259,6.607,9.522,4.21628,1.8270515288958966,1.2315559999999999,2.488444,3.931222,5.806222,7.030778
4,0.6852000000000001,0.45976633558073093,0.196,0.369,0.556,0.877,2.034,0.5214,0.38481889679865433,0.104,0.234,0.378,0.8,1.5,0.40393767999999997,0.25358374136264467,0.060222000000000005,0.16711099999999998,0.335111,0.618222,0.898
5,0.05039999999999999,0.049104480447307454,0.008,0.016,0.028,0.055,0.198,0.024120000000000003,0.025303688795641367,0.002,0.006,0.012,0.031,0.097,0.014311239999999998,0.01217113070712824,0.001667,0.005111,0.010889,0.021,0.053778
6,0.0032500000000000003,0.0032761766334148306,0.001,0.001,0.002,0.0037500000000000003,0.012,0.0012000000000000001,0.00044721359549995795,0.001,0.001,0.001,0.001,0.002,0.0003331764705882353,0.0002750141440212934,0.00011100000000000001,0.00011100000000000001,0.00022200000000000003,0.00044400000000000006,0.001222
7,,,,,,,,,,,,,,,,,,,,,
