gossips,p2p mean,p2p std,p2p min,p2p q1,p2p q2,p2p q3,p2p max,p2s mean,p2s std,p2s min,p2s q1,p2s q2,p2s q3,p2s max,s2s mean,s2s std,s2s min,s2s q1,s2s q2,s2s q3,s2s max
1,49.43240000000001,0.5226716623910899,48.6,49.05,49.43,49.84,50.5,58.18240000000001,0.40702456928298547,57.47,57.83,58.16,58.51,59.05,52.72151112,0.11374642115883493,52.426869,52.648788,52.726969999999994,52.794242000000004,52.932323
2,22.094799999999996,0.4341862119720831,21.31,21.72,22.07,22.45,22.84,20.500000000000004,0.34509660483213495,19.91,20.27,20.51,20.78,21.11,21.688614159999997,0.18993871562442638,21.269798,21.620707,21.69404,21.803434,21.978182
3,2.0956,0.11597700921590738,1.85,1.99,2.12,2.18,2.32,0.30759999999999993,0.04511836285445946,0.23,0.28,0.3,0.34,0.39,1.20023836,0.029963631974000246,1.1345450000000001,1.1810100000000001,1.20404,1.219091,1.257172
4,0.02200000000000001,0.010052493799000691,0.01,0.01,0.02,0.03,0.04,0.01,0.0,0.01,0.01,0.01,0.01,0.01,0.01696592,0.0013795214423850033,0.014747,0.016061000000000002,0.016666999999999998,0.01798,0.019596000000000002
5,,,,,,,,,,,,,,,0.00010099999999999999,0.0,0.000101,0.000101,0.000101,0.000101,0.000101
