gossips,p2p mean,p2p std,p2p min,p2p q1,p2p q2,p2p q3,p2p max,p2s mean,p2s std,p2s min,p2s q1,p2s q2,p2s q3,p2s max,s2s mean,s2s std,s2s min,s2s q1,s2s q2,s2s q3,s2s max
1,49260.52,169.66440404516175,48953,49117,49244.0,49377.0,49627,58308.6,154.99193527406578,58033.0,58155.0,58364.0,58421.0,58587.0,505884.96,992.8349762170828,503270.0,505233.0,506125.0,506566.0,507693.0
2,22266.04,108.95086048306389,22015,22198,22256.0,22320.0,22480,20354.16,142.14888907995996,20139.0,20240.0,20315.0,20438.0,20608.0,188804.56,1147.76732833794,186649.0,188071.0,188654.0,189603.0,191322.0
3,2051.28,36.260079058564294,1989,2019,2046.0,2083.0,2107,326.96,18.811521292371147,288.0,315.0,331.0,341.0,354.0,1627.52,95.60470699709296,1451.0,1558.0,1643.0,1663.0,1827.0
4,23.44,4.610495273467555,14,21,23.0,26.0,33,1.8235294117647058,0.6359337738364604,1.0,1.0,2.0,2.0,3.0,1.0,0.0,1.0,1.0,1.0,1.0,1.0
5,1.0,,1,1,1.0,1.0,1,,,,,,,,,,,,,,
