gossips,p2p mean,p2p std,p2p min,p2p q1,p2p q2,p2p q3,p2p max,p2s mean,p2s std,p2s min,p2s q1,p2s q2,p2s q3,p2s max,s2s mean,s2s std,s2s min,s2s q1,s2s q2,s2s q3,s2s max
1,,,,,,,,,,,,,,,60.31306507999999,0.6812675663682569,58.96726700000001,59.869068999999996,60.334934999999994,60.780581000000005,61.515115
2,,,,,,,,,,,,,,,1.7682522,0.16094460073293337,1.491992,1.654655,1.7476479999999999,1.917417,2.055155
3,,,,,,,,,,,,,,,0.00011250000000000002,3.535533905932738e-05,0.0001,0.0001,0.0001,0.0001,0.0002
4,,,,,,,,,,,,,,,,,,,,,
5,,,,,,,,,,,,,,,,,,,,,
6,,,,,,,,,,,,,,,,,,,,,
