gossips,p2p mean,p2p std,p2p min,p2p q1,p2p q2,p2p q3,p2p max,p2s mean,p2s std,p2s min,p2s q1,p2s q2,p2s q3,p2s max,s2s mean,s2s std,s2s min,s2s q1,s2s q2,s2s q3,s2s max
1,51.3248,0.5373633159542373,50.36,50.78,51.51,51.6,52.23,58.6976,0.5237467581443008,57.52,58.32,58.71,58.94,59.65,33.23206456,0.35375550750048124,32.71697,32.974646,33.144847999999996,33.500403999999996,33.923333
2,18.735999999999997,0.45449605792203146,17.89,18.45,18.72,18.94,19.81,19.714399999999998,0.48370169870834,18.65,19.47,19.8,20.11,20.45,1.21890108,0.029978240137528655,1.160202,1.197677,1.221818,1.2350510000000001,1.301515
3,0.044400000000000016,0.016603212540549694,0.02,0.03,0.05,0.05,0.09,0.22399999999999998,0.04010403138505321,0.15,0.21,0.23,0.26,0.28,0.00237148,0.0005384983070230273,0.0014140000000000001,0.00202,0.002424,0.0028280000000000002,0.003232
4,0.01,,0.01,0.01,0.01,0.01,0.01,,,,,,,,,,,,,,
5,,,,,,,,,,,,,,,,,,,,,
