round,nodes,nodesP,nodesS,nodesSent,nodesSentP,nodesSentS,nodesRecv,nodesRecvP,nodesRecvS,msgSent,msgSentP,msgSentS,msgRecv,msgRecvP,msgRecvS,msgInfect,msgInfectP,msgInfectS
00,100000.000000,10000.000000,90000.000000,0.000000,0.000000,0.000000,0.000000,0.000000,0.000000,0.000000,0.000000,0.000000,0.000000,0.000000,0.000000,0.000000,0.000000,0.000000
01,100000.000000,10000.000000,90000.000000,0.001000,0.010000,0.000000,0.001000,0.010000,0.000000,10.000000,10.000000,0.000000,1.000000,1.000000,0.000000,0.100000,1.000000,0.000000
02,100000.000000,10000.000000,90000.000000,0.012200,0.122000,0.000000,0.012200,0.122000,0.000000,122.000000,122.000000,0.000000,12.200000,12.200000,0.000000,0.100000,1.000000,0.000000
03,100000.000000,10000.000000,90000.000000,0.117400,1.174000,0.000000,0.117400,1.174000,0.000000,1174.000000,1174.000000,0.000000,118.500000,118.500000,0.000000,0.100000,1.000000,0.000000
04,100000.000000,10000.000000,90000.000000,1.085500,10.642000,0.023667,1.085500,10.642000,0.023667,10855.000000,10642.000000,213.000000,1146.500000,1125.100000,21.400000,1.000000,1.000000,1.000000
05,100000.000000,10000.000000,90000.000000,9.288200,45.114000,5.307556,9.288200,45.114000,5.307556,92882.000000,45114.000000,47768.000000,10917.200000,6008.600000,4908.600000,1.000000,1.000000,1.000000
06,100000.000000,10000.000000,90000.000000,45.417800,98.992000,39.465111,45.417800,98.992000,39.465111,454178.000000,98992.000000,355186.000000,91389.800000,46234.800000,45155.000000,1.300000,4.000000,1.000000
07,100000.000000,10000.000000,90000.000000,92.738600,100.000000,91.931778,92.738600,100.000000,91.931778,927386.000000,100000.000000,827386.000000,450407.000000,224193.000000,226214.000000,3.990000,21.900000,2.000000
08,100000.000000,10000.000000,90000.000000,99.964600,100.000000,99.960667,99.964600,100.000000,99.960667,999646.000000,100000.000000,899646.000000,925300.000000,224193.000000,701107.000000,8.490000,21.900000,7.000000
09,100000.000000,10000.000000,90000.000000,99.984400,100.000000,99.982667,99.984400,100.000000,99.982667,999844.000000,100000.000000,899844.000000,999646.100000,224193.000000,775453.100000,9.390000,21.900000,8.000000
10,100000.000000,10000.000000,90000.000000,99.984500,100.000000,99.982778,99.984500,100.000000,99.982778,999845.000000,100000.000000,899845.000000,999845.000000,224193.000000,775652.000000,9.390000,21.900000,8.000000
11,100000.000000,10000.000000,90000.000000,99.984500,100.000000,99.982778,99.984500,100.000000,99.982778,999845.000000,100000.000000,899845.000000,999846.000000,224193.000000,775653.000000,9.390000,21.900000,8.000000
12,100000.000000,10000.000000,90000.000000,99.984500,100.000000,99.982778,99.984500,100.000000,99.982778,999845.000000,100000.000000,899845.000000,999846.000000,224193.000000,775653.000000,9.390000,21.900000,8.000000
13,100000.000000,10000.000000,90000.000000,99.984500,100.000000,99.982778,99.984500,100.000000,99.982778,999845.000000,100000.000000,899845.000000,999846.000000,224193.000000,775653.000000,9.390000,21.900000,8.000000
14,100000.000000,10000.000000,90000.000000,99.984500,100.000000,99.982778,99.984500,100.000000,99.982778,999845.000000,100000.000000,899845.000000,999846.000000,224193.000000,775653.000000,9.390000,21.900000,8.000000
15,100000.000000,10000.000000,90000.000000,99.984500,100.000000,99.982778,99.984500,100.000000,99.982778,999845.000000,100000.000000,899845.000000,999846.000000,224193.000000,775653.000000,9.390000,21.900000,8.000000
16,100000.000000,10000.000000,90000.000000,99.984500,100.000000,99.982778,99.984500,100.000000,99.982778,999845.000000,100000.000000,899845.000000,999846.000000,224193.000000,775653.000000,9.390000,21.900000,8.000000
17,100000.000000,10000.000000,90000.000000,99.984500,100.000000,99.982778,99.984500,100.000000,99.982778,999845.000000,100000.000000,899845.000000,999846.000000,224193.000000,775653.000000,9.390000,21.900000,8.000000
18,100000.000000,10000.000000,90000.000000,99.984500,100.000000,99.982778,99.984500,100.000000,99.982778,999845.000000,100000.000000,899845.000000,999846.000000,224193.000000,775653.000000,9.390000,21.900000,8.000000
19,100000.000000,10000.000000,90000.000000,99.984500,100.000000,99.982778,99.984500,100.000000,99.982778,999845.000000,100000.000000,899845.000000,999846.000000,224193.000000,775653.000000,9.390000,21.900000,8.000000
