gossips,p2p mean,p2p std,p2p min,p2p q1,p2p q2,p2p q3,p2p max,p2s mean,p2s std,p2s min,p2s q1,p2s q2,p2s q3,p2s max,s2s mean,s2s std,s2s min,s2s q1,s2s q2,s2s q3,s2s max
1,49.25024000000001,0.12804858452946677,48.967,49.165,49.267,49.323,49.47,46.994759999999985,0.21250064313628042,46.656,46.882,46.956,47.089,47.59,63.603528839999996,0.1049595622575992,63.383444,63.532111,63.60844399999999,63.658556000000004,63.869111
2,22.297039999999996,0.12010394109548098,21.891,22.259,22.294,22.376,22.543,9.830999999999998,0.10953652358916632,9.664,9.732,9.82,9.914,10.029,15.208222320000004,0.15286172262503578,14.899110999999998,15.12,15.240332999999998,15.309556,15.477556
3,2.0409200000000007,0.04346159223958551,1.94,2.021,2.04,2.064,2.117,0.015400000000000004,0.004102844541697057,0.007,0.012,0.015,0.018,0.023,0.014773400000000003,0.0013423049516906854,0.012667,0.013778,0.014333000000000002,0.015333000000000001,0.018
4,0.02504000000000001,0.003769173207305107,0.019,0.022,0.024,0.028,0.032,,,,,,,,,,,,,,
5,0.001,,0.001,0.001,0.001,0.001,0.001,,,,,,,,,,,,,,
