gossips,p2p mean,p2p std,p2p min,p2p q1,p2p q2,p2p q3,p2p max,p2s mean,p2s std,p2s min,p2s q1,p2s q2,p2s q3,p2s max,s2s mean,s2s std,s2s min,s2s q1,s2s q2,s2s q3,s2s max
1,34.42756,0.3066211125585877,34.049,34.278,34.34,34.489,35.501,69.66556,0.31985166874662174,69.342,69.437,69.586,69.764,70.656,56.10072,0.25537237972060783,55.82366700000001,55.968889000000004,56.019778,56.112,56.780221999999995
2,0.05216000000000001,0.006761903085177523,0.039,0.047,0.054,0.057,0.066,0.7700800000000001,0.03204023512190052,0.697,0.757,0.77,0.785,0.861,21.138106720000007,0.20801657844498814,20.455,21.037778,21.155110999999998,21.270111,21.423778
3,,,,,,,,,,,,,,,0.2672578,0.007343063234554546,0.248889,0.262444,0.267444,0.272,0.282111
4,,,,,,,,,,,,,,,,,,,,,
5,,,,,,,,,,,,,,,,,,,,,
