gossips,p2p mean,p2p std,p2p min,p2p q1,p2p q2,p2p q3,p2p max,p2s mean,p2s std,p2s min,p2s q1,p2s q2,p2s q3,p2s max,s2s mean,s2s std,s2s min,s2s q1,s2s q2,s2s q3,s2s max
1,10.233599999999997,0.11309582957238787,10.03,10.14,10.24,10.28,10.47,0.5748000000000001,0.060561263747272144,0.49,0.53,0.55,0.62,0.69,0.001270916666666667,0.00045262576521154133,0.00101,0.00101,0.00101,0.00133825,0.00202
2,0.10240000000000002,0.036318039594669754,0.03,0.08,0.1,0.12,0.19,,,,,,,,,,,,,,
3,0.01,,0.01,0.01,0.01,0.01,0.01,,,,,,,,,,,,,,
4,,,,,,,,,,,,,,,,,,,,,
5,,,,,,,,,,,,,,,,,,,,,
