round,nodes,nodesP,nodesS,nodesSent,nodesSentP,nodesSentS,nodesRecv,nodesRecvP,nodesRecvS,msgSent,msgSentP,msgSentS,msgRecv,msgRecvP,msgRecvS,msgInfect,msgInfectP,msgInfectS
00,100000.000000,100000.000000,0.000000,0.000000,0.000000,0.000000,0.000000,0.000000,0.000000,0.000000,0.000000,0.000000,0.000000,0.000000,0.000000,0.000000,0.000000,0.000000
01,100000.000000,100000.000000,0.000000,0.001000,0.001000,0.000000,0.001000,0.001000,0.000000,10.000000,10.000000,0.000000,1.000000,1.000000,0.000000,1.000000,1.000000,0.000000
02,100000.000000,100000.000000,0.000000,0.012200,0.012200,0.000000,0.012200,0.012200,0.000000,122.000000,122.000000,0.000000,12.200000,12.200000,0.000000,1.000000,1.000000,0.000000
03,100000.000000,100000.000000,0.000000,0.117500,0.117500,0.000000,0.117500,0.117500,0.000000,1175.000000,1175.000000,0.000000,117.500000,117.500000,0.000000,1.000000,1.000000,0.000000
04,100000.000000,100000.000000,0.000000,1.166800,1.166800,0.000000,1.166800,1.166800,0.000000,11668.000000,11668.000000,0.000000,1173.500000,1173.500000,0.000000,1.000000,1.000000,0.000000
05,100000.000000,100000.000000,0.000000,11.062600,11.062600,0.000000,11.062600,11.062600,0.000000,110626.000000,110626.000000,0.000000,11717.500000,11717.500000,0.000000,1.000000,1.000000,0.000000
06,100000.000000,100000.000000,0.000000,66.127800,66.127800,0.000000,66.127800,66.127800,0.000000,661278.000000,661278.000000,0.000000,108297.700000,108297.700000,0.000000,1.000000,1.000000,0.000000
07,100000.000000,100000.000000,0.000000,99.853300,99.853300,0.000000,99.853300,99.853300,0.000000,998533.000000,998533.000000,0.000000,651368.300000,651368.300000,0.000000,6.000000,6.000000,0.000000
08,100000.000000,100000.000000,0.000000,99.996500,99.996500,0.000000,99.996500,99.996500,0.000000,999965.000000,999965.000000,0.000000,998504.200000,998504.200000,0.000000,9.000000,9.000000,0.000000
09,100000.000000,100000.000000,0.000000,99.996600,99.996600,0.000000,99.996600,99.996600,0.000000,999966.000000,999966.000000,0.000000,999966.000000,999966.000000,0.000000,9.900000,9.900000,0.000000
10,100000.000000,100000.000000,0.000000,99.996600,99.996600,0.000000,99.996600,99.996600,0.000000,999966.000000,999966.000000,0.000000,999967.000000,999967.000000,0.000000,10.000000,10.000000,0.000000
11,100000.000000,100000.000000,0.000000,99.996600,99.996600,0.000000,99.996600,99.996600,0.000000,999966.000000,999966.000000,0.000000,999967.000000,999967.000000,0.000000,10.000000,10.000000,0.000000
12,100000.000000,100000.000000,0.000000,99.996600,99.996600,0.000000,99.996600,99.996600,0.000000,999966.000000,999966.000000,0.000000,999967.000000,999967.000000,0.000000,10.000000,10.000000,0.000000
13,100000.000000,100000.000000,0.000000,99.996600,99.996600,0.000000,99.996600,99.996600,0.000000,999966.000000,999966.000000,0.000000,999967.000000,999967.000000,0.000000,10.000000,10.000000,0.000000
14,100000.000000,100000.000000,0.000000,99.996600,99.996600,0.000000,99.996600,99.996600,0.000000,999966.000000,999966.000000,0.000000,999967.000000,999967.000000,0.000000,10.000000,10.000000,0.000000
15,100000.000000,100000.000000,0.000000,99.996600,99.996600,0.000000,99.996600,99.996600,0.000000,999966.000000,999966.000000,0.000000,999967.000000,999967.000000,0.000000,10.000000,10.000000,0.000000
16,100000.000000,100000.000000,0.000000,99.996600,99.996600,0.000000,99.996600,99.996600,0.000000,999966.000000,999966.000000,0.000000,999967.000000,999967.000000,0.000000,10.000000,10.000000,0.000000
17,100000.000000,100000.000000,0.000000,99.996600,99.996600,0.000000,99.996600,99.996600,0.000000,999966.000000,999966.000000,0.000000,999967.000000,999967.000000,0.000000,10.000000,10.000000,0.000000
18,100000.000000,100000.000000,0.000000,99.996600,99.996600,0.000000,99.996600,99.996600,0.000000,999966.000000,999966.000000,0.000000,999967.000000,999967.000000,0.000000,10.000000,10.000000,0.000000
19,100000.000000,100000.000000,0.000000,99.996600,99.996600,0.000000,99.996600,99.996600,0.000000,999966.000000,999966.000000,0.000000,999967.000000,999967.000000,0.000000,10.000000,10.000000,0.000000
