gossips,p2p mean,p2p std,p2p min,p2p q1,p2p q2,p2p q3,p2p max,p2s mean,p2s std,p2s min,p2s q1,p2s q2,p2s q3,p2s max,s2s mean,s2s std,s2s min,s2s q1,s2s q2,s2s q3,s2s max
1,,,,,,,,,,,,,,,31.149393359999994,1.329532037483579,28.631532,30.108408,31.032633,32.274274,33.820521
2,,,,,,,,,,,,,,,0.034622759999999995,0.004400234447163017,0.025526,0.031731999999999996,0.033533999999999994,0.037538,0.042743
3,,,,,,,,,,,,,,,,,,,,,
4,,,,,,,,,,,,,,,,,,,,,
5,,,,,,,,,,,,,,,,,,,,,
