gossips,p2p mean,p2p std,p2p min,p2p q1,p2p q2,p2p q3,p2p max,p2s mean,p2s std,p2s min,p2s q1,p2s q2,p2s q3,p2s max,s2s mean,s2s std,s2s min,s2s q1,s2s q2,s2s q3,s2s max
1,49.47788000000001,0.10564536588669302,49.289,49.407,49.468,49.554,49.702,58.400479999999995,0.36372862136488426,57.9,58.149,58.345,58.639,59.123,55.87080447999999,0.30272987398175627,55.463556000000004,55.684667000000005,55.748667000000005,55.905556000000004,56.421556
2,21.93772,0.11608241325311443,21.719,21.877,21.985,22.005,22.1,20.292360000000002,0.2039115167582905,19.721,20.225,20.293,20.417,20.605,21.413386679999995,0.16713930933174645,21.102110999999997,21.292556,21.403222,21.533333,21.739889
3,1.8308799999999998,0.042788549870263155,1.71,1.815,1.831,1.848,1.914,0.31868,0.019747826884664223,0.278,0.3,0.323,0.331,0.355,0.44143115999999993,0.017793582395721586,0.41,0.42922200000000005,0.440333,0.454667,0.47755600000000004
4,0.002708333333333334,0.0016805580508625225,0.001,0.001,0.0025,0.004,0.007,0.001470588235294118,0.0007174300539794392,0.001,0.001,0.001,0.002,0.003,0.002048880000000001,0.0004876224905942437,0.001111,0.001667,0.002111,0.002444,0.002667
5,,,,,,,,,,,,,,,,,,,,,
