round,nodes,nodesP,nodesS,nodesSent,nodesSentP,nodesSentS,nodesRecv,nodesRecvP,nodesRecvS,msgSent,msgSentP,msgSentS,msgRecv,msgRecvP,msgRecvS,msgInfect,msgInfectP,msgInfectS
00,100000.000000,1000.000000,99000.000000,0.000000,0.000000,0.000000,0.000000,0.000000,0.000000,0.000000,0.000000,0.000000,0.000000,0.000000,0.000000,0.000000,0.000000,0.000000
01,100000.000000,1000.000000,99000.000000,0.001000,0.100000,0.000000,0.001000,0.100000,0.000000,10.000000,10.000000,0.000000,1.000000,1.000000,0.000000,0.010000,1.000000,0.000000
02,100000.000000,1000.000000,99000.000000,0.011600,1.160000,0.000000,0.011600,1.160000,0.000000,116.000000,116.000000,0.000000,11.600000,11.600000,0.000000,0.010000,1.000000,0.000000
03,100000.000000,1000.000000,99000.000000,0.112600,11.260000,0.000000,0.112600,11.260000,0.000000,1126.000000,1126.000000,0.000000,118.300000,118.300000,0.000000,0.010000,1.000000,0.000000
04,100000.000000,1000.000000,99000.000000,0.681400,66.460000,0.016970,0.681400,66.460000,0.016970,6814.000000,6646.000000,168.000000,1093.300000,1076.500000,16.800000,1.000000,1.000000,1.000000
05,100000.000000,1000.000000,99000.000000,3.769500,97.850000,2.819192,3.769500,97.850000,2.819192,37695.000000,9785.000000,27910.000000,6730.600000,3896.300000,2834.300000,1.023000,3.300000,1.000000
06,100000.000000,1000.000000,99000.000000,17.821700,100.000000,16.991616,17.821700,100.000000,16.991616,178217.000000,10000.000000,168217.000000,37955.700000,19512.600000,18443.100000,1.181000,19.100000,1.000000
07,100000.000000,1000.000000,99000.000000,59.813700,100.000000,59.407778,59.813700,100.000000,59.407778,598137.000000,10000.000000,588137.000000,177033.100000,87767.000000,89266.100000,1.864000,87.400000,1.000000
08,100000.000000,1000.000000,99000.000000,99.375400,100.000000,99.369091,99.375400,100.000000,99.369091,993754.000000,10000.000000,983754.000000,590312.800000,87767.000000,502545.800000,5.824000,87.400000,5.000000
09,100000.000000,1000.000000,99000.000000,99.988900,100.000000,99.988788,99.988900,100.000000,99.988788,999889.000000,10000.000000,989889.000000,993595.400000,87767.000000,905828.400000,9.784000,87.400000,9.000000
10,100000.000000,1000.000000,99000.000000,99.989700,100.000000,99.989596,99.989700,100.000000,99.989596,999897.000000,10000.000000,989897.000000,999890.200000,87767.000000,912123.200000,9.784000,87.400000,9.000000
11,100000.000000,1000.000000,99000.000000,99.989700,100.000000,99.989596,99.989700,100.000000,99.989596,999897.000000,10000.000000,989897.000000,999898.000000,87767.000000,912131.000000,9.784000,87.400000,9.000000
12,100000.000000,1000.000000,99000.000000,99.989700,100.000000,99.989596,99.989700,100.000000,99.989596,999897.000000,10000.000000,989897.000000,999898.000000,87767.000000,912131.000000,9.784000,87.400000,9.000000
13,100000.000000,1000.000000,99000.000000,99.989700,100.000000,99.989596,99.989700,100.000000,99.989596,999897.000000,10000.000000,989897.000000,999898.000000,87767.000000,912131.000000,9.784000,87.400000,9.000000
14,100000.000000,1000.000000,99000.000000,99.989700,100.000000,99.989596,99.989700,100.000000,99.989596,999897.000000,10000.000000,989897.000000,999898.000000,87767.000000,912131.000000,9.784000,87.400000,9.000000
15,100000.000000,1000.000000,99000.000000,99.989700,100.000000,99.989596,99.989700,100.000000,99.989596,999897.000000,10000.000000,989897.000000,999898.000000,87767.000000,912131.000000,9.784000,87.400000,9.000000
16,100000.000000,1000.000000,99000.000000,99.989700,100.000000,99.989596,99.989700,100.000000,99.989596,999897.000000,10000.000000,989897.000000,999898.000000,87767.000000,912131.000000,9.784000,87.400000,9.000000
17,100000.000000,1000.000000,99000.000000,99.989700,100.000000,99.989596,99.989700,100.000000,99.989596,999897.000000,10000.000000,989897.000000,999898.000000,87767.000000,912131.000000,9.784000,87.400000,9.000000
18,100000.000000,1000.000000,99000.000000,99.989700,100.000000,99.989596,99.989700,100.000000,99.989596,999897.000000,10000.000000,989897.000000,999898.000000,87767.000000,912131.000000,9.784000,87.400000,9.000000
19,100000.000000,1000.000000,99000.000000,99.989700,100.000000,99.989596,99.989700,100.000000,99.989596,999897.000000,10000.000000,989897.000000,999898.000000,87767.000000,912131.000000,9.784000,87.400000,9.000000
