round,nodes,nodesP,nodesS,recvOne,recvOneP,recvOneS,recvAll,recvAllP,recvAllS,msgSent,msgSentP,msgSentS,msgRecv,msgRecvP,msgRecvS,consist,consistP,consistS,Unnamed: 19
0,1000000.0,1000.0,999000.0,1.6e-05,0.016,0.0,0.0,0.0,0.0,11.6,1.6,10.0,0.16,0.16,0.0,100.0,100.0,100.0,
1,1000000.0,1000.0,999000.0,0.0010800000000000004,1.0800000000000003,0.0,0.0,0.0,0.0,118.4,108.4,10.0,10.84,10.84,0.0,100.0,100.0,100.0,
2,1000000.0,1000.0,999000.0,0.011088,11.048,4.000000000000001e-05,0.0,0.0,0.0,1182.8,1168.8,14.0,117.56,117.16,0.4,100.0,100.0,100.0,
3,1000000.0,1000.0,999000.0,0.07399200000000002,66.32799999999999,0.007671799999999999,0.0,0.0,0.0,10383.6,9597.2,786.4,1161.72,1085.08,76.64,99.99989999999998,100.0,99.99989999999998,
4,1000000.0,1000.0,999000.0,0.45708,99.83200000000002,0.3576055600000001,0.0,0.0,0.0,55715.2,19970.4,35744.8,10132.36,6552.88,3579.48,99.99989599999998,99.99600000000001,99.99989999999998,
5,1000000.0,1000.0,999000.0,4.664820000000001,99.992,4.5693974399999995,0.0,0.0,0.0,477664.8,21161.2,456503.6,56840.8,10109.36,46731.44,99.99985999999997,99.99600000000001,99.99986399999997,
6,1000000.0,1000.0,999000.0,37.00396,99.992,36.940909039999994,0.0,0.0,0.0,3720424.0,29677.2,3690746.8,471928.0,11105.2,460822.8,99.99588399999999,99.992,99.99588784000001,
7,1000000.0,1000.0,999000.0,97.29588799999999,100.0,97.29318104000002,0.0,0.0,0.0,9794989.6,39989.6,9755000.0,3626904.44,16609.48,3610294.96,99.99074799999998,99.988,99.99075068,
8,1000000.0,1000.0,999000.0,99.99453199999998,100.0,99.99452640000001,0.0,0.0,0.0,10475440.0,41140.8,10434299.2,9783921.2,20122.24,9763798.96,99.99965200000001,99.988,99.99966380000002,
9,1000000.0,1000.0,999000.0,99.99710799999997,100.0,99.99710512,0.0,0.0,0.0,13664786.0,49560.4,13615225.6,10471023.72,21099.68,10449924.04,99.994336,99.98400000000001,99.99434640000001,
10,1000000.0,1000.0,999000.0,99.999852,100.0,99.999852,0.0,0.0,0.0,19792754.0,59977.2,19732776.8,13593874.76,26581.6,13567293.16,99.98646400000001,99.98400000000001,99.98646652,
11,1000000.0,1000.0,999000.0,100.0,100.0,100.0,0.0,0.0,0.0,20488709.6,61122.4,20427587.2,19785718.28,30130.12,19755588.16,99.99526,99.98400000000001,99.99527128,
12,1000000.0,1000.0,999000.0,100.0,100.0,100.0,0.0,0.0,0.0,23696247.6,69555.2,23626692.4,20483870.04,31110.52,20452759.52,99.98957999999999,99.976,99.98959364000001,
13,1000000.0,1000.0,999000.0,100.0,100.0,100.0,0.0,0.0,0.0,29807814.8,79950.4,29727864.4,23624460.24,36620.48,23587839.76,99.98205200000002,99.976,99.982058,
14,1000000.0,1000.0,999000.0,100.0,100.0,100.0,0.0,0.0,0.0,30497238.4,81140.4,30416098.0,29801058.36,40133.08,29760925.28,99.99088000000003,99.976,99.99089484,
15,1000000.0,1000.0,999000.0,100.0,100.0,100.0,0.0,0.0,0.0,33699480.8,89600.0,33609880.8,30492423.96,41123.72,30451300.24,99.98540399999997,99.96400000000001,99.98542531999999,
16,1000000.0,1000.0,999000.0,100.0,100.0,100.0,0.0,0.0,0.0,39814475.6,99967.2,39714508.4,33621968.72,46631.6,33575337.12,99.97747599999997,99.964,99.97748940000001,
17,1000000.0,1000.0,999000.0,100.0,100.0,100.0,0.0,0.0,0.0,40505916.4,101117.2,40404799.2,39806079.52,50147.6,39755931.92,99.98660800000002,99.97200000000001,99.98662259999998,
18,1000000.0,1000.0,999000.0,100.0,100.0,100.0,0.0,0.0,0.0,43703699.2,109550.0,43594149.2,40501337.28,51133.08,40450204.2,99.98139599999999,99.97200000000001,99.98140532000001,
19,1000000.0,1000.0,999000.0,100.0,100.0,100.0,0.0,0.0,0.0,49823347.6,119960.8,49703386.8,43632976.36,56622.04,43576354.32,99.97338399999998,99.97200000000001,99.97338548000002,
20,1000000.0,1000.0,999000.0,100.0,100.0,100.0,0.0,0.0,0.0,50515689.6,121117.6,50394572.0,49816585.4,60159.56,49756425.84,99.981844,99.97200000000001,99.98185375999999,
21,1000000.0,1000.0,999000.0,100.0,100.0,100.0,0.0,0.0,0.0,53712666.4,129578.4,53583088.0,50510631.36,61140.16,50449491.2,99.97568400000002,99.96,99.97569976000001,
22,1000000.0,1000.0,999000.0,100.0,100.0,100.0,0.0,0.0,0.0,59832150.4,139952.0,59692198.4,53635385.48,66631.6,53568753.88,99.967908,99.96400000000001,99.96791191999999,
23,1000000.0,1000.0,999000.0,100.0,100.0,100.0,0.0,0.0,0.0,60531028.0,141112.8,60389915.2,59824293.28,70167.52,59754125.76,99.977388,99.96400000000001,99.97740136000002,
24,1000000.0,1000.0,999000.0,100.0,100.0,100.0,0.0,0.0,0.0,63760757.2,149627.6,63611129.6,60526364.0,71155.64,60455208.36,99.97241999999999,99.956,99.9724364,
25,1000000.0,1000.0,999000.0,100.0,100.0,100.0,0.0,0.0,0.0,69851403.2,159951.2,69691452.0,63681670.84,76679.0,63604991.84,99.96450800000001,99.94800000000001,99.96452444,
26,1000000.0,1000.0,999000.0,100.0,100.0,100.0,0.0,0.0,0.0,70534709.6,161109.6,70373600.0,69843598.64,80178.28,69763420.36,99.97298,99.95200000000001,99.97300096000001,
27,1000000.0,1000.0,999000.0,100.0,100.0,100.0,4e-06,0.004,0.0,73733912.0,169555.6,73564356.4,70529996.52,81161.92,70448834.6,99.96754400000002,99.95200000000001,99.96755955999998,
28,1000000.0,1000.0,999000.0,100.0,100.0,100.0,0.0010760000000000004,1.072,4e-06,79851105.2,179927.6,79671177.6,73654792.84,86615.68,73568177.16,99.95921999999999,99.95200000000001,99.95922723999998,
29,1000000.0,1000.0,999000.0,100.0,100.0,100.0,0.010939999999999998,10.924,1.6e-05,80550258.8,181091.2,80369167.6,79842912.4,90183.84,79752728.56,99.96817600000003,99.95200000000001,99.968192,
30,1000000.0,1000.0,999000.0,100.0,100.0,100.0,0.06942,66.68,0.0027428400000000003,83778988.8,189602.0,83589386.8,80545321.92,91177.52,80454144.4,99.96335599999999,99.95200000000001,99.96336732,
31,1000000.0,1000.0,999000.0,100.0,100.0,100.0,0.4430999999999999,99.77600000000002,0.34366772000000007,89869984.4,199819.6,89670164.8,83701569.88,96681.52,83604888.36,99.954544,99.95200000000001,99.95454647999999,
32,1000000.0,1000.0,999000.0,100.0,100.0,100.0,4.5407280000000005,99.944,4.4452292,90550025.6,199941.2,90350084.4,89862551.0,100077.72,89762473.28,99.963684,99.95200000000001,99.96369567999999,
33,1000000.0,1000.0,999000.0,100.0,100.0,100.0,36.267896,99.944,36.20415612,93724097.2,199941.2,93524156.0,90545216.28,100094.4,90445121.88,99.96241199999997,99.95200000000001,99.96242244,
34,1000000.0,1000.0,999000.0,100.0,100.0,100.0,97.09355199999999,99.944,97.09069872000002,99809175.2,199941.2,99609234.0,93648509.28,100094.4,93548414.88,99.959804,99.95200000000001,99.95981191999999,
35,1000000.0,1000.0,999000.0,100.0,100.0,100.0,99.95326000000001,99.944,99.95326932000003,100095271.6,199941.2,99895330.4,99801107.2,100094.4,99701012.8,99.95956,99.95200000000001,99.95956756,
36,1000000.0,1000.0,999000.0,100.0,100.0,100.0,99.95483200000002,99.944,99.95484292,100095428.8,199941.2,99895487.6,100095271.12,100094.4,99995176.72,99.95956,99.95200000000001,99.95956756,
37,1000000.0,1000.0,999000.0,100.0,100.0,100.0,99.95483200000002,99.944,99.95484292,100095428.8,199941.2,99895487.6,100095428.8,100094.4,99995334.4,99.95956,99.95200000000001,99.95956756,
38,1000000.0,1000.0,999000.0,100.0,100.0,100.0,99.95483200000002,99.944,99.95484292,100095428.8,199941.2,99895487.6,100095428.8,100094.4,99995334.4,99.95956,99.95200000000001,99.95956756,
39,1000000.0,1000.0,999000.0,100.0,100.0,100.0,99.95483200000002,99.944,99.95484292,100095428.8,199941.2,99895487.6,100095428.8,100094.4,99995334.4,99.95956,99.95200000000001,99.95956756,
40,1000000.0,1000.0,999000.0,100.0,100.0,100.0,99.95483200000002,99.944,99.95484292,100095428.8,199941.2,99895487.6,100095428.8,100094.4,99995334.4,99.95956,99.95200000000001,99.95956756,
41,1000000.0,1000.0,999000.0,100.0,100.0,100.0,99.95483200000002,99.944,99.95484292,100095428.8,199941.2,99895487.6,100095428.8,100094.4,99995334.4,99.95956,99.95200000000001,99.95956756,
42,1000000.0,1000.0,999000.0,100.0,100.0,100.0,99.95483200000002,99.944,99.95484292,100095428.8,199941.2,99895487.6,100095428.8,100094.4,99995334.4,99.95956,99.95200000000001,99.95956756,
43,1000000.0,1000.0,999000.0,100.0,100.0,100.0,99.95483200000002,99.944,99.95484292,100095428.8,199941.2,99895487.6,100095428.8,100094.4,99995334.4,99.95956,99.95200000000001,99.95956756,
44,1000000.0,1000.0,999000.0,100.0,100.0,100.0,99.95483200000002,99.944,99.95484292,100095428.8,199941.2,99895487.6,100095428.8,100094.4,99995334.4,99.95956,99.95200000000001,99.95956756,
45,1000000.0,1000.0,999000.0,100.0,100.0,100.0,99.95483200000002,99.944,99.95484292,100095428.8,199941.2,99895487.6,100095428.8,100094.4,99995334.4,99.95956,99.95200000000001,99.95956756,
46,1000000.0,1000.0,999000.0,100.0,100.0,100.0,99.95483200000002,99.944,99.95484292,100095428.8,199941.2,99895487.6,100095428.8,100094.4,99995334.4,99.95956,99.95200000000001,99.95956756,
47,1000000.0,1000.0,999000.0,100.0,100.0,100.0,99.95483200000002,99.944,99.95484292,100095428.8,199941.2,99895487.6,100095428.8,100094.4,99995334.4,99.95956,99.95200000000001,99.95956756,
48,1000000.0,1000.0,999000.0,100.0,100.0,100.0,99.95483200000002,99.944,99.95484292,100095428.8,199941.2,99895487.6,100095428.8,100094.4,99995334.4,99.95956,99.95200000000001,99.95956756,
