gossips,p2p mean,p2p std,p2p min,p2p q1,p2p q2,p2p q3,p2p max,p2s mean,p2s std,p2s min,p2s q1,p2s q2,p2s q3,p2s max,s2s mean,s2s std,s2s min,s2s q1,s2s q2,s2s q3,s2s max
1,49.24124,0.1643320520572092,48.933,49.127,49.254,49.354,49.516,58.36256,0.26527047203436177,57.924,58.137,58.345,58.527,59.057,55.766919919999985,0.2420539399935721,55.566,55.646333,55.704333,55.746667,56.411556000000004
2,22.298079999999995,0.14521590821945046,22.005,22.213,22.331,22.408,22.581,20.35644,0.20096663902250136,19.883,20.242,20.397,20.504,20.652,21.515324360000005,0.1806620636558957,21.147555999999998,21.421111,21.492778,21.667444,21.813667000000002
3,2.04528,0.037217289888795885,1.995,2.023,2.042,2.063,2.176,0.32376000000000005,0.02004636292863788,0.277,0.313,0.325,0.337,0.365,0.44861332,0.018237156358928332,0.40622199999999997,0.43533299999999997,0.454222,0.459556,0.489333
4,0.02224000000000001,0.005889821729050889,0.011,0.016,0.023,0.027,0.03,0.0016111111111111118,0.0006076849889141856,0.001,0.001,0.002,0.002,0.003,0.002062240000000001,0.00043158460738693317,0.001222,0.001778,0.002111,0.002333,0.002889
5,0.001,0.0,0.001,0.001,0.001,0.001,0.001,,,,,,,,,,,,,,
