gossips,p2p mean,p2p std,p2p min,p2p q1,p2p q2,p2p q3,p2p max,p2s mean,p2s std,p2s min,p2s q1,p2s q2,p2s q3,p2s max,s2s mean,s2s std,s2s min,s2s q1,s2s q2,s2s q3,s2s max
1,34.257760000000005,0.19606488721849152,33.921,34.089,34.199,34.436,34.599,69.52856000000001,0.17701249485088164,69.211,69.393,69.527,69.618,69.886,55.92856003999997,0.08143851101213352,55.787889,55.879111,55.94344399999999,55.979222,56.11533299999999
2,0.0522,0.007170541588099652,0.042,0.047,0.05,0.056,0.07,0.78044,0.02850742593313772,0.709,0.762,0.779,0.798,0.843,20.869550999999998,0.12830241448559415,20.660332999999998,20.771444,20.855444,20.953222,21.220667000000002
3,,,,,,,,,,,,,,,0.47185340000000003,0.012406991543749309,0.44377799999999995,0.46511099999999994,0.47322200000000003,0.48055600000000004,0.493889
4,,,,,,,,,,,,,,,0.0028223200000000014,0.0004938555558055412,0.001889,0.0025559999999999997,0.002667,0.003111,0.003778
5,,,,,,,,,,,,,,,,,,,,,
