round,nodes,nodesP,nodesS,nodesSent,nodesSentP,nodesSentS,nodesRecv,nodesRecvP,nodesRecvS,msgSent,msgSentP,msgSentS,msgRecv,msgRecvP,msgRecvS,msgInfect,msgInfectP,msgInfectS
00,10000.000000,10000.000000,0.000000,0.000000,0.000000,0.000000,0.000000,0.000000,0.000000,0.000000,0.000000,0.000000,0.000000,0.000000,0.000000,0.000000,0.000000,0.000000
01,10000.000000,10000.000000,0.000000,0.010000,0.010000,0.000000,0.010000,0.010000,0.000000,13.000000,13.000000,0.000000,1.000000,1.000000,0.000000,1.000000,1.000000,0.000000
02,10000.000000,10000.000000,0.000000,0.149000,0.149000,0.000000,0.149000,0.149000,0.000000,193.700000,193.700000,0.000000,14.900000,14.900000,0.000000,1.000000,1.000000,0.000000
03,10000.000000,10000.000000,0.000000,1.949000,1.949000,0.000000,1.949000,1.949000,0.000000,2533.700000,2533.700000,0.000000,196.400000,196.400000,0.000000,1.000000,1.000000,0.000000
04,10000.000000,10000.000000,0.000000,22.139000,22.139000,0.000000,22.139000,22.139000,0.000000,28780.700000,28780.700000,0.000000,2501.300000,2501.300000,0.000000,1.000000,1.000000,0.000000
05,10000.000000,10000.000000,0.000000,93.905000,93.905000,0.000000,93.905000,93.905000,0.000000,122076.500000,122076.500000,0.000000,27962.700000,27962.700000,0.000000,2.200000,2.200000,0.000000
06,10000.000000,10000.000000,0.000000,99.999000,99.999000,0.000000,99.999000,99.999000,0.000000,129998.700000,129998.700000,0.000000,121674.200000,121674.200000,0.000000,12.000000,12.000000,0.000000
07,10000.000000,10000.000000,0.000000,99.999000,99.999000,0.000000,99.999000,99.999000,0.000000,129998.700000,129998.700000,0.000000,129999.700000,129999.700000,0.000000,13.000000,13.000000,0.000000
08,10000.000000,10000.000000,0.000000,99.999000,99.999000,0.000000,99.999000,99.999000,0.000000,129998.700000,129998.700000,0.000000,129999.700000,129999.700000,0.000000,13.000000,13.000000,0.000000
09,10000.000000,10000.000000,0.000000,99.999000,99.999000,0.000000,99.999000,99.999000,0.000000,129998.700000,129998.700000,0.000000,129999.700000,129999.700000,0.000000,13.000000,13.000000,0.000000
10,10000.000000,10000.000000,0.000000,99.999000,99.999000,0.000000,99.999000,99.999000,0.000000,129998.700000,129998.700000,0.000000,129999.700000,129999.700000,0.000000,13.000000,13.000000,0.000000
11,10000.000000,10000.000000,0.000000,99.999000,99.999000,0.000000,99.999000,99.999000,0.000000,129998.700000,129998.700000,0.000000,129999.700000,129999.700000,0.000000,13.000000,13.000000,0.000000
12,10000.000000,10000.000000,0.000000,99.999000,99.999000,0.000000,99.999000,99.999000,0.000000,129998.700000,129998.700000,0.000000,129999.700000,129999.700000,0.000000,13.000000,13.000000,0.000000
13,10000.000000,10000.000000,0.000000,99.999000,99.999000,0.000000,99.999000,99.999000,0.000000,129998.700000,129998.700000,0.000000,129999.700000,129999.700000,0.000000,13.000000,13.000000,0.000000
14,10000.000000,10000.000000,0.000000,99.999000,99.999000,0.000000,99.999000,99.999000,0.000000,129998.700000,129998.700000,0.000000,129999.700000,129999.700000,0.000000,13.000000,13.000000,0.000000
15,10000.000000,10000.000000,0.000000,99.999000,99.999000,0.000000,99.999000,99.999000,0.000000,129998.700000,129998.700000,0.000000,129999.700000,129999.700000,0.000000,13.000000,13.000000,0.000000
16,10000.000000,10000.000000,0.000000,99.999000,99.999000,0.000000,99.999000,99.999000,0.000000,129998.700000,129998.700000,0.000000,129999.700000,129999.700000,0.000000,13.000000,13.000000,0.000000
17,10000.000000,10000.000000,0.000000,99.999000,99.999000,0.000000,99.999000,99.999000,0.000000,129998.700000,129998.700000,0.000000,129999.700000,129999.700000,0.000000,13.000000,13.000000,0.000000
18,10000.000000,10000.000000,0.000000,99.999000,99.999000,0.000000,99.999000,99.999000,0.000000,129998.700000,129998.700000,0.000000,129999.700000,129999.700000,0.000000,13.000000,13.000000,0.000000
19,10000.000000,10000.000000,0.000000,99.999000,99.999000,0.000000,99.999000,99.999000,0.000000,129998.700000,129998.700000,0.000000,129999.700000,129999.700000,0.000000,13.000000,13.000000,0.000000
