round,P mean,P std,P min,P q1,P q2,P q3,P max,S mean,S std,S min,S q1,S q2,S q3,S max,P+S mean,P+S std,P+S min,P+S q1,P+S q2,P+S q3,P+S max
0,0.0,0.0,0.0,0.0,0.0,0.0,0.0,0.0,0.0,0.0,0.0,0.0,0.0,0.0,0.0,0.0,0.0,0.0,0.0,0.0,0.0
1,0.0,0.0,0.0,0.0,0.0,0.0,0.0,0.0,0.0,0.0,0.0,0.0,0.0,0.0,0.0,0.0,0.0,0.0,0.0,0.0,0.0
2,0.0,0.0,0.0,0.0,0.0,0.0,0.0,0.0,0.0,0.0,0.0,0.0,0.0,0.0,0.0,0.0,0.0,0.0,0.0,0.0,0.0
3,0.0,0.0,0.0,0.0,0.0,0.0,0.0,0.0,0.0,0.0,0.0,0.0,0.0,0.0,0.0,0.0,0.0,0.0,0.0,0.0,0.0
4,0.0,0.0,0.0,0.0,0.0,0.0,0.0,0.0,0.0,0.0,0.0,0.0,0.0,0.0,0.0,0.0,0.0,0.0,0.0,0.0,0.0
5,0.0,0.0,0.0,0.0,0.0,0.0,0.0,0.0,0.0,0.0,0.0,0.0,0.0,0.0,0.0,0.0,0.0,0.0,0.0,0.0,0.0
6,0.0,0.0,0.0,0.0,0.0,0.0,0.0,0.0,0.0,0.0,0.0,0.0,0.0,0.0,0.0,0.0,0.0,0.0,0.0,0.0,0.0
7,0.0,0.0,0.0,0.0,0.0,0.0,0.0,0.0,0.0,0.0,0.0,0.0,0.0,0.0,0.0,0.0,0.0,0.0,0.0,0.0,0.0
8,0.0,0.0,0.0,0.0,0.0,0.0,0.0,0.0,0.0,0.0,0.0,0.0,0.0,0.0,0.0,0.0,0.0,0.0,0.0,0.0,0.0
9,0.0,0.0,0.0,0.0,0.0,0.0,0.0,0.0,0.0,0.0,0.0,0.0,0.0,0.0,0.0,0.0,0.0,0.0,0.0,0.0,0.0
10,0.07200000000000002,0.07371114795831994,0.0,0.0,0.1,0.1,0.3,0.0,0.0,0.0,0.0,0.0,0.0,0.0,7.200000000000002e-05,7.371114795831993e-05,0.0,0.0,0.0001,0.0001,0.0003
11,7.123999999999999,0.5230360089579555,6.2,6.8,7.1,7.4,8.2,0.0,0.0,0.0,0.0,0.0,0.0,0.0,0.007124000000000002,0.0005230360089579557,0.0062,0.0068,0.0071,0.0074,0.0082
12,65.884,1.4735671006099444,63.3,64.8,66.1,67.0,68.5,8e-06,2.768874620972692e-05,0.0,0.0,0.0,0.0,0.0001,0.065892,0.001470804768372289,0.0633,0.0648,0.0661,0.067,0.0685
13,99.836,0.17530925056406452,99.3,99.7,99.9,100.0,100.0,0.018070160000000005,0.0014494083758554727,0.015816,0.016916999999999998,0.017818,0.019419,0.020921000000000002,0.117888,0.001508398709448754,0.1157,0.1168,0.1176,0.1193,0.1209
14,99.94800000000001,0.0770281333886073,99.7,99.9,100.0,100.0,100.0,1.6393753599999998,0.08463532890873643,1.447247,1.606206,1.6415419999999998,1.69029,1.802603,1.7376839999999998,0.08455427093490508,1.5458,1.7046,1.7397,1.7886,1.9008
15,99.94800000000001,0.0770281333886073,99.7,99.9,100.0,100.0,100.0,35.298810759999995,1.1600443632293154,32.941340999999994,34.77978,35.448448,36.165265000000005,37.857858,35.36346,1.158886410884749,33.0083,34.845,35.5129,36.2291,37.92
16,99.94800000000001,0.0770281333886073,99.7,99.9,100.0,100.0,100.0,97.19686487999999,0.32612240132238307,96.507808,97.046947,97.24694699999999,97.41031,97.861161,97.199616,0.32579755431862606,96.5113,97.0499,97.2496,97.4129,97.8633
17,99.94800000000001,0.0770281333886073,99.7,99.9,100.0,100.0,100.0,99.95379772,0.0015917506483967459,99.950851,99.952853,99.953854,99.954955,99.95615600000001,99.953792,0.0016012807374139301,99.9507,99.9529,99.9539,99.955,99.9562
18,99.94800000000001,0.0770281333886073,99.7,99.9,100.0,100.0,100.0,99.95519116000001,0.0014992326837383748,99.952152,99.954054,99.955455,99.955956,99.957758,99.95518399999999,0.0015076692829190442,99.952,99.9541,99.9555,99.956,99.9575
19,99.94800000000001,0.0770281333886073,99.7,99.9,100.0,100.0,100.0,99.95519116000001,0.0014992326837383748,99.952152,99.954054,99.955455,99.955956,99.957758,99.95518399999999,0.0015076692829190442,99.952,99.9541,99.9555,99.956,99.9575
20,99.94800000000001,0.0770281333886073,99.7,99.9,100.0,100.0,100.0,99.95519116000001,0.0014992326837383748,99.952152,99.954054,99.955455,99.955956,99.957758,99.95518399999999,0.0015076692829190442,99.952,99.9541,99.9555,99.956,99.9575
21,99.94800000000001,0.0770281333886073,99.7,99.9,100.0,100.0,100.0,99.95519116000001,0.0014992326837383748,99.952152,99.954054,99.955455,99.955956,99.957758,99.95518399999999,0.0015076692829190442,99.952,99.9541,99.9555,99.956,99.9575
22,99.94800000000001,0.0770281333886073,99.7,99.9,100.0,100.0,100.0,99.95519116000001,0.0014992326837383748,99.952152,99.954054,99.955455,99.955956,99.957758,99.95518399999999,0.0015076692829190442,99.952,99.9541,99.9555,99.956,99.9575
23,99.94800000000001,0.0770281333886073,99.7,99.9,100.0,100.0,100.0,99.95519116000001,0.0014992326837383748,99.952152,99.954054,99.955455,99.955956,99.957758,99.95518399999999,0.0015076692829190442,99.952,99.9541,99.9555,99.956,99.9575
24,99.94800000000001,0.0770281333886073,99.7,99.9,100.0,100.0,100.0,99.95519116000001,0.0014992326837383748,99.952152,99.954054,99.955455,99.955956,99.957758,99.95518399999999,0.0015076692829190442,99.952,99.9541,99.9555,99.956,99.9575
25,99.94800000000001,0.0770281333886073,99.7,99.9,100.0,100.0,100.0,99.95519116000001,0.0014992326837383748,99.952152,99.954054,99.955455,99.955956,99.957758,99.95518399999999,0.0015076692829190442,99.952,99.9541,99.9555,99.956,99.9575
