,mean,std,min,q1,q2,q3,max
Simple,,,,,,,
P,5.8488015891873815,1.4639058965454395,1.0,5.0,6.0,7.0,12.0
S,9.292662266090382,1.7081345767695832,2.0,8.0,9.0,10.0,18.0
P+S,9.258223666071602,1.7399403508428273,1.0,8.0,9.0,10.0,18.0
