gossips,p2p mean,p2p std,p2p min,p2p q1,p2p q2,p2p q3,p2p max,p2s mean,p2s std,p2s min,p2s q1,p2s q2,p2s q3,p2s max,s2s mean,s2s std,s2s min,s2s q1,s2s q2,s2s q3,s2s max
1,,,,,,,,0.1,,0.1,0.1,0.1,0.1,0.1,37.478810839999994,3.7996383218128544,25.937037,35.623022999999996,38.990790999999994,39.955656,42.767668
2,,,,,,,,,,,,,,,6.7887488,2.5824839934068162,2.66016,4.952553,6.820621000000001,8.514814999999999,11.168769000000001
3,,,,,,,,,,,,,,,0.31101092,0.2319698668498274,0.062863,0.136236,0.221021,0.496196,0.861762
4,,,,,,,,,,,,,,,0.0024544400000000004,0.002901525792291589,0.0001,0.0005009999999999999,0.001201,0.003003,0.010409999999999999
5,,,,,,,,,,,,,,,0.0001,0.0,0.0001,0.0001,0.0001,0.0001,0.0001
6,,,,,,,,,,,,,,,,,,,,,
7,,,,,,,,,,,,,,,,,,,,,
