round,P+S mean,P+S std,P+S min,P+S q1,P+S median,P+S q3,P+S max,P mean,P std,P min,P q1,P median,P q3,P max,S mean,S std,S min,S q1,S median,S q3,S max
0,0.00010799999999999998,2.712931993250108e-05,0.0001,0.0001,0.0001,0.0001,0.0002,0.0008,0.0027129319932501063,0.0,0.0,0.0,0.0,0.01,0.00010099999999999997,2.710505431213761e-20,0.000101,0.000101,0.000101,0.000101,0.000101
1,0.0011560000000000001,6.374950980203685e-05,0.0011,0.0011,0.0011,0.0012,0.0013,0.10560000000000003,0.006374950980203687,0.1,0.1,0.1,0.11,0.12,0.00010099999999999997,2.710505431213761e-20,0.000101,0.000101,0.000101,0.000101,0.000101
2,0.011732,0.00034839058540666717,0.011,0.0115,0.0117,0.0119,0.0128,1.1623999999999999,0.0344418350266068,1.09,1.14,1.16,1.18,1.27,0.00010907999999999998,2.7400613131826084e-05,0.000101,0.000101,0.000101,0.000101,0.000202
3,0.11054000000000003,0.0014915763473587254,0.1078,0.1093,0.1104,0.1118,0.1139,10.934799999999997,0.1768416240594958,10.67,10.78,10.9,11.09,11.33,0.0012039199999999998,0.0008673871532366618,0.000101,0.000404,0.0014140000000000001,0.001616,0.003636
4,0.7454480000000001,0.008482835375038222,0.7294,0.7391,0.7462,0.7511,0.7649,65.9068,0.5896556283119817,64.74,65.41,65.97,66.38,67.07,0.08725252000000001,0.012622776541221035,0.060404,0.07949500000000001,0.08545499999999999,0.096263,0.116869
5,4.663216,0.09385179670096888,4.4387,4.6024,4.6724,4.7171,4.8607,99.85959999999999,0.04247163759498874,99.78,99.82,99.85,99.88,99.94,3.70163636,0.09491969090757939,3.474646,3.640404,3.710404,3.75596,3.9015150000000003
6,37.746368000000004,0.5507932401328114,36.4743,37.426,37.7943,38.075,39.0112,99.99599999999998,0.005656854249493666,99.98,99.99,100.0,100.0,100.0,37.11758395999999,0.556357944899611,35.832626,36.793939,37.16596,37.449495,38.395152
7,97.58249599999999,0.11131266407736375,97.3614,97.5342,97.5931,97.6357,97.8408,99.9964,0.005571355310874823,99.98,99.99,100.0,100.0,100.0,97.55811312000002,0.1124473656610312,97.334848,97.509293,97.568889,97.611818,97.81899
8,99.99488799999999,0.000500655570228147,99.994,99.9945,99.9948,99.9952,99.996,99.9964,0.005571355310874823,99.98,99.99,100.0,100.0,100.0,99.99487256,0.0004995294649962534,99.99404,99.994545,99.994747,99.995152,99.99596
9,99.996068,0.0005112494498773705,99.9953,99.9957,99.9959,99.9965,99.9971,99.9964,0.005571355310874823,99.98,99.99,100.0,100.0,100.0,99.99606503999999,0.0005145888051619107,99.995253,99.995758,99.995859,99.996465,99.99717199999999
10,99.996068,0.0005112494498773705,99.9953,99.9957,99.9959,99.9965,99.9971,99.9964,0.005571355310874823,99.98,99.99,100.0,100.0,100.0,99.99606503999999,0.0005145888051619107,99.995253,99.995758,99.995859,99.996465,99.99717199999999
11,99.996068,0.0005112494498773705,99.9953,99.9957,99.9959,99.9965,99.9971,99.9964,0.005571355310874823,99.98,99.99,100.0,100.0,100.0,99.99606503999999,0.0005145888051619107,99.995253,99.995758,99.995859,99.996465,99.99717199999999
12,99.996068,0.0005112494498773705,99.9953,99.9957,99.9959,99.9965,99.9971,99.9964,0.005571355310874823,99.98,99.99,100.0,100.0,100.0,99.99606503999999,0.0005145888051619107,99.995253,99.995758,99.995859,99.996465,99.99717199999999
13,99.996068,0.0005112494498773705,99.9953,99.9957,99.9959,99.9965,99.9971,99.9964,0.005571355310874823,99.98,99.99,100.0,100.0,100.0,99.99606503999999,0.0005145888051619107,99.995253,99.995758,99.995859,99.996465,99.99717199999999
14,99.996068,0.0005112494498773705,99.9953,99.9957,99.9959,99.9965,99.9971,99.9964,0.005571355310874823,99.98,99.99,100.0,100.0,100.0,99.99606503999999,0.0005145888051619107,99.995253,99.995758,99.995859,99.996465,99.99717199999999
15,99.996068,0.0005112494498773705,99.9953,99.9957,99.9959,99.9965,99.9971,99.9964,0.005571355310874823,99.98,99.99,100.0,100.0,100.0,99.99606503999999,0.0005145888051619107,99.995253,99.995758,99.995859,99.996465,99.99717199999999
16,99.996068,0.0005112494498773705,99.9953,99.9957,99.9959,99.9965,99.9971,99.9964,0.005571355310874823,99.98,99.99,100.0,100.0,100.0,99.99606503999999,0.0005145888051619107,99.995253,99.995758,99.995859,99.996465,99.99717199999999
17,99.996068,0.0005112494498773705,99.9953,99.9957,99.9959,99.9965,99.9971,99.9964,0.005571355310874823,99.98,99.99,100.0,100.0,100.0,99.99606503999999,0.0005145888051619107,99.995253,99.995758,99.995859,99.996465,99.99717199999999
18,99.996068,0.0005112494498773705,99.9953,99.9957,99.9959,99.9965,99.9971,99.9964,0.005571355310874823,99.98,99.99,100.0,100.0,100.0,99.99606503999999,0.0005145888051619107,99.995253,99.995758,99.995859,99.996465,99.99717199999999
19,99.996068,0.0005112494498773705,99.9953,99.9957,99.9959,99.9965,99.9971,99.9964,0.005571355310874823,99.98,99.99,100.0,100.0,100.0,99.99606503999999,0.0005145888051619107,99.995253,99.995758,99.995859,99.996465,99.99717199999999
20,99.996068,0.0005112494498773705,99.9953,99.9957,99.9959,99.9965,99.9971,99.9964,0.005571355310874823,99.98,99.99,100.0,100.0,100.0,99.99606503999999,0.0005145888051619107,99.995253,99.995758,99.995859,99.996465,99.99717199999999
21,99.996068,0.0005112494498773705,99.9953,99.9957,99.9959,99.9965,99.9971,99.9964,0.005571355310874823,99.98,99.99,100.0,100.0,100.0,99.99606503999999,0.0005145888051619107,99.995253,99.995758,99.995859,99.996465,99.99717199999999
22,99.996068,0.0005112494498773705,99.9953,99.9957,99.9959,99.9965,99.9971,99.9964,0.005571355310874823,99.98,99.99,100.0,100.0,100.0,99.99606503999999,0.0005145888051619107,99.995253,99.995758,99.995859,99.996465,99.99717199999999
23,99.996068,0.0005112494498773705,99.9953,99.9957,99.9959,99.9965,99.9971,99.9964,0.005571355310874823,99.98,99.99,100.0,100.0,100.0,99.99606503999999,0.0005145888051619107,99.995253,99.995758,99.995859,99.996465,99.99717199999999
24,99.996068,0.0005112494498773705,99.9953,99.9957,99.9959,99.9965,99.9971,99.9964,0.005571355310874823,99.98,99.99,100.0,100.0,100.0,99.99606503999999,0.0005145888051619107,99.995253,99.995758,99.995859,99.996465,99.99717199999999
