round,nodes,nodesP,nodesS,nodesSent,nodesSentP,nodesSentS,nodesRecv,nodesRecvP,nodesRecvS,msgSent,msgSentP,msgSentS,msgRecv,msgRecvP,msgRecvS,msgInfect,msgInfectP,msgInfectS
00,1000.000000,10.000000,990.000000,0.000000,0.000000,0.000000,0.000000,0.000000,0.000000,0.000000,0.000000,0.000000,0.000000,0.000000,0.000000,0.000000,0.000000,0.000000
01,1000.000000,10.000000,990.000000,0.100000,10.000000,0.000000,0.100000,10.000000,0.000000,10.000000,10.000000,0.000000,1.000000,1.000000,0.000000,0.010000,1.000000,0.000000
02,1000.000000,10.000000,990.000000,1.000000,100.000000,0.000000,1.000000,100.000000,0.000000,100.000000,100.000000,0.000000,11.700000,11.700000,0.000000,0.010000,1.000000,0.000000
03,1000.000000,10.000000,990.000000,5.570000,100.000000,4.616162,5.570000,100.000000,4.616162,557.000000,100.000000,457.000000,103.600000,57.000000,46.600000,1.041000,5.100000,1.000000
04,1000.000000,10.000000,990.000000,25.020000,100.000000,24.262626,25.020000,100.000000,24.262626,2502.000000,100.000000,2402.000000,552.400000,277.000000,275.400000,1.263000,27.300000,1.000000
05,1000.000000,10.000000,990.000000,89.360000,100.000000,89.252525,89.360000,100.000000,89.252525,8936.000000,100.000000,8836.000000,2459.000000,277.000000,2182.000000,2.253000,27.300000,2.000000
06,1000.000000,10.000000,990.000000,99.970000,100.000000,99.969697,99.970000,100.000000,99.969697,9997.000000,100.000000,9897.000000,8906.900000,277.000000,8629.900000,8.193000,27.300000,8.000000
07,1000.000000,10.000000,990.000000,99.990000,100.000000,99.989899,99.990000,100.000000,99.989899,9999.000000,100.000000,9899.000000,9998.000000,277.000000,9721.000000,9.183000,27.300000,9.000000
08,1000.000000,10.000000,990.000000,99.990000,100.000000,99.989899,99.990000,100.000000,99.989899,9999.000000,100.000000,9899.000000,10000.000000,277.000000,9723.000000,9.183000,27.300000,9.000000
09,1000.000000,10.000000,990.000000,99.990000,100.000000,99.989899,99.990000,100.000000,99.989899,9999.000000,100.000000,9899.000000,10000.000000,277.000000,9723.000000,9.183000,27.300000,9.000000
10,1000.000000,10.000000,990.000000,99.990000,100.000000,99.989899,99.990000,100.000000,99.989899,9999.000000,100.000000,9899.000000,10000.000000,277.000000,9723.000000,9.183000,27.300000,9.000000
11,1000.000000,10.000000,990.000000,99.990000,100.000000,99.989899,99.990000,100.000000,99.989899,9999.000000,100.000000,9899.000000,10000.000000,277.000000,9723.000000,9.183000,27.300000,9.000000
12,1000.000000,10.000000,990.000000,99.990000,100.000000,99.989899,99.990000,100.000000,99.989899,9999.000000,100.000000,9899.000000,10000.000000,277.000000,9723.000000,9.183000,27.300000,9.000000
13,1000.000000,10.000000,990.000000,99.990000,100.000000,99.989899,99.990000,100.000000,99.989899,9999.000000,100.000000,9899.000000,10000.000000,277.000000,9723.000000,9.183000,27.300000,9.000000
14,1000.000000,10.000000,990.000000,99.990000,100.000000,99.989899,99.990000,100.000000,99.989899,9999.000000,100.000000,9899.000000,10000.000000,277.000000,9723.000000,9.183000,27.300000,9.000000
15,1000.000000,10.000000,990.000000,99.990000,100.000000,99.989899,99.990000,100.000000,99.989899,9999.000000,100.000000,9899.000000,10000.000000,277.000000,9723.000000,9.183000,27.300000,9.000000
16,1000.000000,10.000000,990.000000,99.990000,100.000000,99.989899,99.990000,100.000000,99.989899,9999.000000,100.000000,9899.000000,10000.000000,277.000000,9723.000000,9.183000,27.300000,9.000000
17,1000.000000,10.000000,990.000000,99.990000,100.000000,99.989899,99.990000,100.000000,99.989899,9999.000000,100.000000,9899.000000,10000.000000,277.000000,9723.000000,9.183000,27.300000,9.000000
18,1000.000000,10.000000,990.000000,99.990000,100.000000,99.989899,99.990000,100.000000,99.989899,9999.000000,100.000000,9899.000000,10000.000000,277.000000,9723.000000,9.183000,27.300000,9.000000
19,1000.000000,10.000000,990.000000,99.990000,100.000000,99.989899,99.990000,100.000000,99.989899,9999.000000,100.000000,9899.000000,10000.000000,277.000000,9723.000000,9.183000,27.300000,9.000000
