gossips,p2p mean,p2p std,p2p min,p2p q1,p2p q2,p2p q3,p2p max,p2s mean,p2s std,p2s min,p2s q1,p2s q2,p2s q3,p2s max,s2s mean,s2s std,s2s min,s2s q1,s2s q2,s2s q3,s2s max
1,10.46584,0.039243555734243575,10.39,10.438,10.471,10.49,10.531,,,,,,,,,,,,,,
2,0.11064,0.010419852846049859,0.092,0.104,0.109,0.12,0.13,,,,,,,,,,,,,,
3,0.001,0.0,0.001,0.001,0.001,0.001,0.001,,,,,,,,,,,,,,
4,,,,,,,,,,,,,,,,,,,,,
5,,,,,,,,,,,,,,,,,,,,,
