round,nodes,nodesP,nodesS,nodesSent,nodesSentP,nodesSentS,nodesRecv,nodesRecvP,nodesRecvS,msgSent,msgSentP,msgSentS,msgRecv,msgRecvP,msgRecvS,msgInfect,msgInfectP,msgInfectS
00,1000000.000000,100000.000000,900000.000000,0.000010,0.000100,0.000000,0.000010,0.000100,0.000000,2.000000,2.000000,0.000000,0.100000,0.100000,0.000000,0.010000,0.100000,0.000000
01,1000000.000000,100000.000000,900000.000000,0.000120,0.001200,0.000000,0.000120,0.001200,0.000000,24.000000,24.000000,0.000000,1.200000,1.200000,0.000000,0.100000,1.000000,0.000000
02,1000000.000000,100000.000000,900000.000000,0.002440,0.024400,0.000000,0.002440,0.024400,0.000000,488.000000,488.000000,0.000000,24.400000,24.400000,0.000000,0.100000,1.000000,0.000000
03,1000000.000000,100000.000000,900000.000000,0.046830,0.468300,0.000000,0.046830,0.468300,0.000000,9366.000000,9366.000000,0.000000,469.400000,469.400000,0.000000,0.100000,1.000000,0.000000
04,1000000.000000,100000.000000,900000.000000,0.899170,8.991700,0.000000,0.899170,8.991700,0.000000,179834.000000,179834.000000,0.000000,9419.400000,9419.400000,0.000000,0.100000,1.000000,0.000000
05,1000000.000000,100000.000000,900000.000000,8.209270,82.092700,0.000000,8.209270,82.092700,0.000000,1641854.000000,1641854.000000,0.000000,171852.500000,171852.500000,0.000000,0.200000,2.000000,0.000000
06,1000000.000000,100000.000000,900000.000000,10.118300,100.000000,0.131444,10.118300,100.000000,0.131444,2023660.000000,2000000.000000,23660.000000,1603302.000000,1602117.500000,1184.500000,2.480000,15.800000,1.000000
07,1000000.000000,100000.000000,900000.000000,29.477650,100.000000,21.641833,29.477650,100.000000,21.641833,5895530.000000,2000000.000000,3895530.000000,2019987.900000,1800460.000000,219527.900000,2.680000,17.800000,1.000000
08,1000000.000000,100000.000000,900000.000000,98.751780,100.000000,98.613089,98.751780,100.000000,98.613089,19750356.000000,2000000.000000,17750356.000000,5654684.600000,1800460.000000,3854224.600000,5.380000,17.800000,4.000000
09,1000000.000000,100000.000000,900000.000000,100.000000,100.000000,100.000000,100.000000,100.000000,100.000000,20000000.000000,2000000.000000,18000000.000000,19730423.900000,1800460.000000,17929963.900000,18.880000,17.800000,19.000000
10,1000000.000000,100000.000000,900000.000000,100.000000,100.000000,100.000000,100.000000,100.000000,100.000000,20000000.000000,2000000.000000,18000000.000000,20000001.000000,1800460.000000,18199541.000000,19.780000,17.800000,20.000000
11,1000000.000000,100000.000000,900000.000000,100.000000,100.000000,100.000000,100.000000,100.000000,100.000000,20000000.000000,2000000.000000,18000000.000000,20000001.000000,1800460.000000,18199541.000000,19.780000,17.800000,20.000000
12,1000000.000000,100000.000000,900000.000000,100.000000,100.000000,100.000000,100.000000,100.000000,100.000000,20000000.000000,2000000.000000,18000000.000000,20000001.000000,1800460.000000,18199541.000000,19.780000,17.800000,20.000000
13,1000000.000000,100000.000000,900000.000000,100.000000,100.000000,100.000000,100.000000,100.000000,100.000000,20000000.000000,2000000.000000,18000000.000000,20000001.000000,1800460.000000,18199541.000000,19.780000,17.800000,20.000000
14,1000000.000000,100000.000000,900000.000000,100.000000,100.000000,100.000000,100.000000,100.000000,100.000000,20000000.000000,2000000.000000,18000000.000000,20000001.000000,1800460.000000,18199541.000000,19.780000,17.800000,20.000000
15,1000000.000000,100000.000000,900000.000000,100.000000,100.000000,100.000000,100.000000,100.000000,100.000000,20000000.000000,2000000.000000,18000000.000000,20000001.000000,1800460.000000,18199541.000000,19.780000,17.800000,20.000000
16,1000000.000000,100000.000000,900000.000000,100.000000,100.000000,100.000000,100.000000,100.000000,100.000000,20000000.000000,2000000.000000,18000000.000000,20000001.000000,1800460.000000,18199541.000000,19.780000,17.800000,20.000000
17,1000000.000000,100000.000000,900000.000000,100.000000,100.000000,100.000000,100.000000,100.000000,100.000000,20000000.000000,2000000.000000,18000000.000000,20000001.000000,1800460.000000,18199541.000000,19.780000,17.800000,20.000000
18,1000000.000000,100000.000000,900000.000000,100.000000,100.000000,100.000000,100.000000,100.000000,100.000000,20000000.000000,2000000.000000,18000000.000000,20000001.000000,1800460.000000,18199541.000000,19.780000,17.800000,20.000000
19,1000000.000000,100000.000000,900000.000000,100.000000,100.000000,100.000000,100.000000,100.000000,100.000000,20000000.000000,2000000.000000,18000000.000000,20000001.000000,1800460.000000,18199541.000000,19.780000,17.800000,20.000000
