gossips,p2p mean,p2p std,p2p min,p2p q1,p2p q2,p2p q3,p2p max,p2s mean,p2s std,p2s min,p2s q1,p2s q2,p2s q3,p2s max,s2s mean,s2s std,s2s min,s2s q1,s2s q2,s2s q3,s2s max
1,34.419999999999995,1.5465014279549385,31.6,33.3,34.5,35.9,37.3,70.152,1.2984349553725574,68.0,69.1,70.0,70.9,72.8,53.2557998,0.2766053656312553,52.512012,53.13013,53.278278,53.39589599999999,53.878178000000005
2,0.12727272727272726,0.06466697906828632,0.1,0.1,0.1,0.1,0.3,0.7040000000000001,0.24745369937289954,0.3,0.5,0.7,0.9,1.2,20.659555560000005,0.44415148035449614,19.697698000000003,20.472072,20.699299,20.838839,21.772673
3,,,,,,,,,,,,,,,0.8255896399999999,0.03093267181837569,0.771872,0.804304,0.8177180000000001,0.841742,0.901401
4,,,,,,,,,,,,,,,0.0063504799999999995,0.0009509505384964388,0.004104,0.005806,0.006506999999999999,0.006906999999999999,0.007908
5,,,,,,,,,,,,,,,0.0001,0.0,0.0001,0.0001,0.0001,0.0001,0.0001
