gossips,p2p mean,p2p std,p2p min,p2p q1,p2p q2,p2p q3,p2p max,p2s mean,p2s std,p2s min,p2s q1,p2s q2,p2s q3,p2s max,s2s mean,s2s std,s2s min,s2s q1,s2s q2,s2s q3,s2s max
1,49.038799999999995,0.40723989653929055,48.24,48.8,49.01,49.26,49.97,58.2756,0.48104123177402014,57.38,58.08,58.17,58.39,59.3,53.494852599999994,0.13444808669705816,53.239394,53.387677000000004,53.475556000000005,53.57656600000001,53.76404
2,22.422800000000002,0.41271984040831655,21.74,22.11,22.4,22.75,23.15,20.437599999999996,0.3059994553372052,19.94,20.24,20.48,20.59,21.12,20.96330104,0.23535155365050564,20.565556,20.808989999999998,20.935152,21.140909,21.365253
3,2.0587999999999997,0.13842326394071192,1.79,1.96,2.07,2.18,2.3,0.3164,0.04794788837894741,0.22,0.27,0.32,0.36,0.39,0.7080890000000001,0.01674994799245656,0.682525,0.696869,0.7055560000000001,0.716162,0.746667
4,0.024285714285714292,0.009783367810436533,0.01,0.02,0.02,0.03,0.04,0.01,,0.01,0.01,0.01,0.01,0.01,0.0008524399999999999,0.0002736335871197101,0.000303,0.0007070000000000001,0.000808,0.00101,0.001616
5,,,,,,,,,,,,,,,,,,,,,
