gossips,p2p mean,p2p std,p2p min,p2p q1,p2p q2,p2p q3,p2p max,p2s mean,p2s std,p2s min,p2s q1,p2s q2,p2s q3,p2s max,s2s mean,s2s std,s2s min,s2s q1,s2s q2,s2s q3,s2s max
1,49.25200000000001,1.7935346851027623,45.5,47.9,49.1,50.1,52.9,56.12400000000002,1.3379960139452327,52.8,55.3,56.2,57.0,58.8,48.29799812000001,0.05739388096182412,48.171572,48.273573999999996,48.297798,48.327728,48.426026
2,22.691999999999997,1.1503332850381525,20.7,22.0,22.7,23.7,24.5,18.355999999999998,1.6548111674750081,14.6,17.2,18.5,19.6,21.6,23.307483400000002,0.544273865065266,21.783082999999998,22.995796,23.346246,23.710911,24.109309
3,1.9039999999999997,0.2776088375154268,1.6,1.7,1.8,2.0,2.6,0.15000000000000002,0.08366600265340754,0.1,0.1,0.1,0.17500000000000002,0.3,1.61260068,0.05816137859490613,1.414715,1.587588,1.612012,1.6530529999999999,1.7083080000000002
4,0.1,0.0,0.1,0.1,0.1,0.1,0.1,,,,,,,,0.01819828,0.0017052487726624127,0.014413999999999998,0.017317,0.017918,0.019319,0.021522
5,,,,,,,,,,,,,,,0.00015,8.548504142651104e-05,0.0001,0.0001,0.0001,0.0002,0.0004
6,,,,,,,,,,,,,,,,,,,,,
