round,nodes,nodesP,nodesS,nodesSent,nodesSentP,nodesSentS,nodesRecv,nodesRecvP,nodesRecvS,msgSent,msgSentP,msgSentS,msgRecv,msgRecvP,msgRecvS,msgInfect,msgInfectP,msgInfectS
00,100000.000000,1000.000000,99000.000000,0.000000,0.000000,0.000000,0.000000,0.000000,0.000000,0.000000,0.000000,0.000000,0.000000,0.000000,0.000000,0.000000,0.000000,0.000000
01,100000.000000,1000.000000,99000.000000,0.001000,0.100000,0.000000,0.001000,0.100000,0.000000,10.000000,10.000000,0.000000,1.000000,1.000000,0.000000,0.010000,1.000000,0.000000
02,100000.000000,1000.000000,99000.000000,0.011700,1.170000,0.000000,0.011700,1.170000,0.000000,117.000000,117.000000,0.000000,11.700000,11.700000,0.000000,0.010000,1.000000,0.000000
03,100000.000000,1000.000000,99000.000000,0.110800,11.080000,0.000000,0.110800,11.080000,0.000000,1108.000000,1108.000000,0.000000,116.900000,116.900000,0.000000,0.010000,1.000000,0.000000
04,100000.000000,1000.000000,99000.000000,0.675700,65.800000,0.017879,0.675700,65.800000,0.017879,6757.000000,6580.000000,177.000000,1090.700000,1073.000000,17.700000,1.000000,1.000000,1.000000
05,100000.000000,1000.000000,99000.000000,3.801200,97.850000,2.851212,3.801200,97.850000,2.851212,38012.000000,9785.000000,28227.000000,6656.300000,3790.500000,2865.800000,1.020000,3.000000,1.000000
06,100000.000000,1000.000000,99000.000000,30.150400,97.850000,29.466566,30.150400,97.850000,29.466566,301504.000000,9785.000000,291719.000000,38376.300000,3790.500000,34585.800000,1.020000,3.000000,1.000000
07,100000.000000,1000.000000,99000.000000,94.748700,97.850000,94.717374,94.748700,97.850000,94.717374,947487.000000,9785.000000,937702.000000,294155.400000,3790.500000,290364.900000,3.000000,3.000000,3.000000
08,100000.000000,1000.000000,99000.000000,99.970900,97.850000,99.992323,99.970900,97.850000,99.992323,999709.000000,9785.000000,989924.000000,945475.800000,3790.500000,941685.300000,8.940000,3.000000,9.000000
09,100000.000000,1000.000000,99000.000000,99.973500,97.850000,99.994949,99.973500,97.850000,99.994949,999735.000000,9785.000000,989950.000000,999710.000000,3790.500000,995919.500000,9.930000,3.000000,10.000000
10,100000.000000,1000.000000,99000.000000,99.973500,97.850000,99.994949,99.973500,97.850000,99.994949,999735.000000,9785.000000,989950.000000,999736.000000,3790.500000,995945.500000,9.930000,3.000000,10.000000
11,100000.000000,1000.000000,99000.000000,99.973500,97.850000,99.994949,99.973500,97.850000,99.994949,999735.000000,9785.000000,989950.000000,999736.000000,3790.500000,995945.500000,9.930000,3.000000,10.000000
12,100000.000000,1000.000000,99000.000000,99.973500,97.850000,99.994949,99.973500,97.850000,99.994949,999735.000000,9785.000000,989950.000000,999736.000000,3790.500000,995945.500000,9.930000,3.000000,10.000000
13,100000.000000,1000.000000,99000.000000,99.973500,97.850000,99.994949,99.973500,97.850000,99.994949,999735.000000,9785.000000,989950.000000,999736.000000,3790.500000,995945.500000,9.930000,3.000000,10.000000
14,100000.000000,1000.000000,99000.000000,99.973500,97.850000,99.994949,99.973500,97.850000,99.994949,999735.000000,9785.000000,989950.000000,999736.000000,3790.500000,995945.500000,9.930000,3.000000,10.000000
15,100000.000000,1000.000000,99000.000000,99.973500,97.850000,99.994949,99.973500,97.850000,99.994949,999735.000000,9785.000000,989950.000000,999736.000000,3790.500000,995945.500000,9.930000,3.000000,10.000000
16,100000.000000,1000.000000,99000.000000,99.973500,97.850000,99.994949,99.973500,97.850000,99.994949,999735.000000,9785.000000,989950.000000,999736.000000,3790.500000,995945.500000,9.930000,3.000000,10.000000
17,100000.000000,1000.000000,99000.000000,99.973500,97.850000,99.994949,99.973500,97.850000,99.994949,999735.000000,9785.000000,989950.000000,999736.000000,3790.500000,995945.500000,9.930000,3.000000,10.000000
18,100000.000000,1000.000000,99000.000000,99.973500,97.850000,99.994949,99.973500,97.850000,99.994949,999735.000000,9785.000000,989950.000000,999736.000000,3790.500000,995945.500000,9.930000,3.000000,10.000000
19,100000.000000,1000.000000,99000.000000,99.973500,97.850000,99.994949,99.973500,97.850000,99.994949,999735.000000,9785.000000,989950.000000,999736.000000,3790.500000,995945.500000,9.930000,3.000000,10.000000
