gossips,p2p mean,p2p std,p2p min,p2p q1,p2p q2,p2p q3,p2p max,p2s mean,p2s std,p2s min,p2s q1,p2s q2,p2s q3,p2s max,s2s mean,s2s std,s2s min,s2s q1,s2s q2,s2s q3,s2s max
1,34.9712,0.4624871169376862,34.15,34.69,34.93,35.24,36.09,69.9884,0.38199781849289555,69.43,69.77,69.88,70.27,70.79,52.91356772,0.16316154648525671,52.46828299999999,52.85828299999999,52.899091000000006,53.046061,53.180101
2,0.1788,0.05585099223230804,0.09,0.13,0.18,0.21,0.32,1.0412000000000003,0.1081403409155591,0.87,0.96,1.02,1.14,1.29,21.16286464,0.22710228225366474,20.800101,20.997677,21.143232,21.354747,21.701616
3,,,,,,,,0.012222222222222223,0.004409585518440985,0.01,0.01,0.01,0.01,0.02,0.83984648,0.02218111459500329,0.786768,0.831414,0.845354,0.8539389999999999,0.8753540000000001
4,,,,,,,,,,,,,,,0.0038300000000000005,0.0009710666386333466,0.0019190000000000001,0.003333,0.003737,0.004444,0.00596
5,,,,,,,,,,,,,,,,,,,,,
