gossips,p2p mean,p2p std,p2p min,p2p q1,p2p q2,p2p q3,p2p max,p2s mean,p2s std,p2s min,p2s q1,p2s q2,p2s q3,p2s max,s2s mean,s2s std,s2s min,s2s q1,s2s q2,s2s q3,s2s max
1,0.001,,0.001,0.001,0.001,0.001,0.001,0.05396000000000001,0.0077377860744100024,0.04,0.049,0.053,0.056,0.073,48.11610663999999,0.24189680866864108,47.786889,47.992333,48.045,48.194111,48.866667
2,,,,,,,,,,,,,,,0.11347547999999998,0.0028161429905694314,0.108444,0.111222,0.112889,0.11533299999999999,0.12022200000000001
3,,,,,,,,,,,,,,,,,,,,,
4,,,,,,,,,,,,,,,,,,,,,
5,,,,,,,,,,,,,,,,,,,,,
