round,P mean,P std,P min,P q1,P q2,P q3,P max,S mean,S std,S min,S q1,S q2,S q3,S max,P+S mean,P+S std,P+S min,P+S q1,P+S q2,P+S q3,P+S max
0,100.0,0.0,100.0,100.0,100.0,100.0,100.0,100.0,0.0,100.0,100.0,100.0,100.0,100.0,100.0,0.0,100.0,100.0,100.0,100.0,100.0
1,100.0,0.0,100.0,100.0,100.0,100.0,100.0,99.99989999999998,0.0,99.9999,99.9999,99.9999,99.9999,99.9999,99.99989999999998,0.0,99.9999,99.9999,99.9999,99.9999,99.9999
2,99.09199999999998,0.09539392014169326,99.0,99.0,99.1,99.1,99.3,99.99980000000004,0.0,99.9998,99.9998,99.9998,99.9998,99.9998,99.998892,9.539392013637534e-05,99.9988,99.9988,99.9989,99.9989,99.9991
3,95.50399999999999,0.4148091930835989,94.8,95.2,95.4,95.8,96.4,99.99969999999999,2.8867513457830503e-05,99.9996,99.9997,99.9997,99.9997,99.9998,99.99520400000003,0.0004056681731002824,99.9945,99.9949,99.9952,99.9955,99.996
4,95.352,0.5523585791856593,93.8,95.1,95.4,95.6,96.4,99.99960400000005,2.000000000060371e-05,99.9996,99.9996,99.9996,99.9996,99.9997,99.99495599999999,0.0005568363014995474,99.9934,99.9947,99.995,99.9952,99.996
5,95.444,0.4555948492538819,94.8,95.1,95.2,95.8,96.4,99.99824215999998,0.0004748708315595952,99.997197,99.997998,99.99829799999999,99.998498,99.998999,99.99368799999998,0.0006591155690282072,99.9921,99.9934,99.9937,99.994,99.995
6,95.316,0.5193585787616639,94.3,95.0,95.4,95.6,96.5,99.56362364,0.019154529979618525,99.526627,99.54955,99.565465,99.577277,99.601101,99.55937599999999,0.01918876146776168,99.5227,99.5457,99.5611,99.5729,99.5968
7,95.26800000000001,0.4913586605864767,94.0,94.9,95.4,95.6,95.9,96.44088087999998,0.13700589596659965,96.19779799999999,96.347748,96.46996999999999,96.539239,96.675576,96.439708,0.13676960529786394,96.1969,96.3469,96.4689,96.538,96.6746
8,95.24400000000003,0.5164623251829077,94.2,94.9,95.4,95.5,96.1,95.91332923999998,0.1678759897174312,95.638739,95.76016,95.92963,96.003303,96.212412,95.91266000000002,0.16751282040488844,95.6385,95.7599,95.9291,96.0019,96.2104
9,95.27600000000001,0.56736231810017,94.3,94.9,95.3,95.7,96.3,95.88550560000002,0.16631701196259802,95.522723,95.816517,95.89009,95.954755,96.241742,95.88489600000003,0.16603607409234758,95.5222,95.8157,95.8895,95.9531,96.24
10,95.288,0.5002665955934562,94.2,94.9,95.4,95.6,96.3,95.81345748000001,0.13481971547593088,95.623524,95.73003,95.817317,95.85825799999999,96.21021,95.812932,0.13460823625123183,95.6228,95.73,95.8166,95.858,96.2082
11,96.288,0.4065300316909766,95.6,96.0,96.4,96.5,97.2,95.79700499999998,0.17114202484096533,95.351151,95.71861899999999,95.851051,95.93483499999999,96.046146,95.797496,0.17096231183119093,95.3518,95.7193,95.851,95.9351,96.0466
12,99.9,0.08660254037844448,99.7,99.8,99.9,100.0,100.0,95.81151544000002,0.1757664119449593,95.532032,95.643443,95.819119,95.913814,96.133534,95.81560399999996,0.17560903896629348,95.5362,95.6477,95.8233,95.9178,96.1373
13,99.96799999999999,0.0690410505906855,99.7,100.0,100.0,100.0,100.0,95.84637848,0.17164671365290735,95.55635600000001,95.771872,95.823123,95.95935899999999,96.18979,95.8505,0.17145805609536025,95.5608,95.7761,95.8273,95.9634,96.1935
14,99.96799999999999,0.0690410505906855,99.7,100.0,100.0,100.0,100.0,95.86149351999998,0.16535944044114997,95.56746700000001,95.74975,95.843343,95.973674,96.23353399999999,95.8656,0.16520456006619955,95.5719,95.754,95.8475,95.9777,96.2373
15,99.96799999999999,0.0690410505906855,99.7,100.0,100.0,100.0,100.0,96.24586992000002,0.1749626683978867,96.00550600000001,96.124825,96.188889,96.367568,96.686587,96.24959199999999,0.1747999163806039,96.0095,96.1287,96.1926,96.3711,96.6899
16,99.96799999999999,0.0690410505906855,99.7,100.0,100.0,100.0,100.0,99.39777784,0.06496167858673535,99.265966,99.362663,99.40430400000001,99.441041,99.514815,99.39834799999998,0.06489085785635279,99.2667,99.3633,99.4049,99.4415,99.5153
17,99.96799999999999,0.0690410505906855,99.7,100.0,100.0,100.0,100.0,99.95874279999998,0.0014617126940683573,99.95585600000001,99.957658,99.959059,99.95935899999999,99.961662,99.958752,0.001460627718936286,99.9559,99.9577,99.9591,99.9594,99.9617
18,99.96799999999999,0.0690410505906855,99.7,100.0,100.0,100.0,100.0,99.95930727999999,0.001429746175606528,99.956456,99.958559,99.959459,99.95985999999999,99.962162,99.95931600000002,0.0014311067977865045,99.9565,99.9586,99.9594,99.9598,99.9622
19,99.96799999999999,0.0690410505906855,99.7,100.0,100.0,100.0,100.0,99.95930727999999,0.001429746175606528,99.956456,99.958559,99.959459,99.95985999999999,99.962162,99.95931600000002,0.0014311067977865045,99.9565,99.9586,99.9594,99.9598,99.9622
20,99.96799999999999,0.0690410505906855,99.7,100.0,100.0,100.0,100.0,99.95930727999999,0.001429746175606528,99.956456,99.958559,99.959459,99.95985999999999,99.962162,99.95931600000002,0.0014311067977865045,99.9565,99.9586,99.9594,99.9598,99.9622
21,99.96799999999999,0.0690410505906855,99.7,100.0,100.0,100.0,100.0,99.95930727999999,0.001429746175606528,99.956456,99.958559,99.959459,99.95985999999999,99.962162,99.95931600000002,0.0014311067977865045,99.9565,99.9586,99.9594,99.9598,99.9622
22,99.96799999999999,0.0690410505906855,99.7,100.0,100.0,100.0,100.0,99.95930727999999,0.001429746175606528,99.956456,99.958559,99.959459,99.95985999999999,99.962162,99.95931600000002,0.0014311067977865045,99.9565,99.9586,99.9594,99.9598,99.9622
23,99.96799999999999,0.0690410505906855,99.7,100.0,100.0,100.0,100.0,99.95930727999999,0.001429746175606528,99.956456,99.958559,99.959459,99.95985999999999,99.962162,99.95931600000002,0.0014311067977865045,99.9565,99.9586,99.9594,99.9598,99.9622
24,99.96799999999999,0.0690410505906855,99.7,100.0,100.0,100.0,100.0,99.95930727999999,0.001429746175606528,99.956456,99.958559,99.959459,99.95985999999999,99.962162,99.95931600000002,0.0014311067977865045,99.9565,99.9586,99.9594,99.9598,99.9622
25,99.96799999999999,0.0690410505906855,99.7,100.0,100.0,100.0,100.0,99.95930727999999,0.001429746175606528,99.956456,99.958559,99.959459,99.95985999999999,99.962162,99.95931600000002,0.0014311067977865045,99.9565,99.9586,99.9594,99.9598,99.9622
