gossips,p2p mean,p2p std,p2p min,p2p q1,p2p q2,p2p q3,p2p max,p2s mean,p2s std,p2s min,p2s q1,p2s q2,p2s q3,p2s max,s2s mean,s2s std,s2s min,s2s q1,s2s q2,s2s q3,s2s max
1,53.492000000000004,1.458858000857747,51.2,52.5,53.9,54.5,56.5,,,,,,,,,,,,,,
2,5.816000000000002,0.48792075859371525,5.1,5.4,5.8,6.2,6.7,,,,,,,,,,,,,,
3,0.11818181818181818,0.04045199174779453,0.1,0.1,0.1,0.1,0.2,,,,,,,,,,,,,,
4,,,,,,,,,,,,,,,,,,,,,
5,,,,,,,,,,,,,,,,,,,,,
