gossips,p2p mean,p2p std,p2p min,p2p q1,p2p q2,p2p q3,p2p max,p2s mean,p2s std,p2s min,p2s q1,p2s q2,p2s q3,p2s max,s2s mean,s2s std,s2s min,s2s q1,s2s q2,s2s q3,s2s max
1,49.17720000000001,0.36745203768655255,48.4,48.96,49.18,49.37,49.98,77.5204,0.5660792052943373,76.46,77.14,77.54,77.91,78.44,50.232137359999996,0.11607888952341844,50.016667,50.159797999999995,50.198081,50.312222,50.493131
2,22.208400000000005,0.34454898055283767,21.62,22.02,22.23,22.42,22.99,10.3824,0.38824691456168275,9.46,10.16,10.24,10.64,11.18,21.815200079999997,0.26300939935658213,20.915454999999998,21.69697,21.820808,21.962020000000003,22.301212
3,2.0007999999999995,0.10770020117591857,1.8,1.94,2.01,2.05,2.24,0.21400000000000002,0.0447213595499958,0.12,0.18,0.21,0.25,0.29,2.0031353600000004,0.040074958684611674,1.843131,1.98899,2.007374,2.023535,2.053131
4,0.02500000000000001,0.01566007966895747,0.01,0.01,0.02,0.0375,0.06,0.01,,0.01,0.01,0.01,0.01,0.01,0.010904960000000002,0.0007896322709548622,0.009394,0.010404,0.011009999999999999,0.011212,0.012525
5,,,,,,,,,,,,,,,0.000101,0.0,0.000101,0.000101,0.000101,0.000101,0.000101
