gossips,p2p mean,p2p std,p2p min,p2p q1,p2p q2,p2p q3,p2p max,p2s mean,p2s std,p2s min,p2s q1,p2s q2,p2s q3,p2s max,s2s mean,s2s std,s2s min,s2s q1,s2s q2,s2s q3,s2s max
1,49.22771999999999,0.15573254851400362,48.874,49.157,49.233,49.373,49.437,66.97959999999999,0.1680877746892981,66.636,66.893,66.959,67.071,67.302,53.92367555999999,0.06169144023558004,53.830222,53.877221999999996,53.914556000000005,53.950556000000006,54.068
2,22.298199999999998,0.14705072820855655,22.011,22.205,22.285,22.409,22.595,14.997919999999997,0.11178883367015392,14.731,14.931,15.007,15.099,15.185,22.751595520000002,0.09414127705879127,22.610222,22.682778,22.756110999999997,22.812444,22.956667000000003
3,2.06464,0.040394801645756304,1.994,2.042,2.055,2.07,2.162,0.06784000000000001,0.00808125402809902,0.054,0.061,0.07,0.072,0.086,0.17973332,0.015144888069686523,0.113889,0.178222,0.183222,0.188111,0.192778
4,0.022440000000000012,0.006331666447310692,0.012,0.017,0.023,0.027,0.035,0.001,,0.001,0.001,0.001,0.001,0.001,0.00011100000000000001,,0.00011100000000000001,0.00011100000000000001,0.00011100000000000001,0.00011100000000000001,0.00011100000000000001
5,0.001,0.0,0.001,0.001,0.001,0.001,0.001,,,,,,,,,,,,,,
