gossips,p2p mean,p2p std,p2p min,p2p q1,p2p q2,p2p q3,p2p max,p2s mean,p2s std,p2s min,p2s q1,p2s q2,p2s q3,p2s max,s2s mean,s2s std,s2s min,s2s q1,s2s q2,s2s q3,s2s max
1,49.299279999999996,0.15245505348571928,49.058,49.183,49.3,49.41,49.666,50.02235999999999,0.21179154059278882,49.591,49.89,49.973,50.179,50.521,52.79235103999999,0.1735663733576868,52.599,52.69733299999999,52.721332999999994,52.775332999999996,53.142444
2,22.2592,0.13927819882044182,21.948,22.186,22.229,22.367,22.546,18.45368,0.1657663315232214,18.2,18.33,18.402,18.552,18.779,23.337226720000004,0.1606595213166965,23.054778,23.263222,23.290556,23.453,23.690777999999998
3,2.0114,0.04633123496447445,1.927,1.979,2.013,2.041,2.094,0.01952000000000001,0.004933896364267631,0.013,0.016,0.018,0.02,0.035,0.18547999999999998,0.020290841456184122,0.145222,0.188889,0.195,0.199,0.203556
4,0.02172000000000001,0.004903400180826906,0.014,0.018,0.021,0.026,0.032,,,,,,,,0.0002961111111111111,0.0001477059435216944,0.00011100000000000001,0.00022200000000000003,0.0002775,0.000333,0.000667
5,0.001,,0.001,0.001,0.001,0.001,0.001,,,,,,,,,,,,,,
