gossips,p2p mean,p2p std,p2p min,p2p q1,p2p q2,p2p q3,p2p max,p2s mean,p2s std,p2s min,p2s q1,p2s q2,p2s q3,p2s max,s2s mean,s2s std,s2s min,s2s q1,s2s q2,s2s q3,s2s max
1,51.62799999999999,1.322409417187683,48.9,50.8,51.8,52.4,54.7,48.096,1.7081861725233578,44.9,47.0,47.9,49.1,51.1,52.68350352,0.3901981904661958,51.832432,52.441341,52.708408,52.969969999999996,53.413013
2,19.183999999999997,0.9361623790774748,17.9,18.5,19.1,19.6,21.8,14.531999999999998,1.1632282665066214,11.9,13.6,14.7,15.5,16.7,21.234382359999998,0.6078183251000303,20.04955,20.882583,21.294194,21.607708,22.612913
3,0.13333333333333333,0.051639777949432225,0.1,0.1,0.1,0.17500000000000002,0.2,0.10000000000000002,0.0,0.1,0.1,0.1,0.1,0.1,1.4168769199999998,0.10160607827164346,1.1818819999999999,1.3377379999999999,1.4531530000000001,1.484685,1.6020020000000001
4,,,,,,,,,,,,,,,0.02927328,0.004249175523165249,0.01962,0.027027,0.02963,0.032232,0.03984
5,,,,,,,,,,,,,,,0.00019505,0.0001318513816465541,0.0001,0.0001,0.00015000000000000001,0.000225,0.000601
