gossips,p2p mean,p2p std,p2p min,p2p q1,p2p q2,p2p q3,p2p max,p2s mean,p2s std,p2s min,p2s q1,p2s q2,p2s q3,p2s max,s2s mean,s2s std,s2s min,s2s q1,s2s q2,s2s q3,s2s max
1,53.78,1.0152996273678705,51.8,53.2,53.6,54.5,55.5,0.1230769230769231,0.043852900965351466,0.1,0.1,0.1,0.1,0.2,,,,,,,
2,5.756,0.3819685850956856,5.1,5.5,5.7,6.1,6.5,,,,,,,,,,,,,,
3,0.1076923076923077,0.02773500981126146,0.1,0.1,0.1,0.1,0.2,,,,,,,,,,,,,,
4,,,,,,,,,,,,,,,,,,,,,
5,,,,,,,,,,,,,,,,,,,,,
6,,,,,,,,,,,,,,,,,,,,,
