round,nodes,nodesP,nodesS,nodesSent,nodesSentP,nodesSentS,nodesRecv,nodesRecvP,nodesRecvS,msgSent,msgSentP,msgSentS,msgRecv,msgRecvP,msgRecvS,msgInfect,msgInfectP,msgInfectS
00,1000000.000000,100.000000,999900.000000,0.000000,0.000000,0.000000,0.000000,0.000000,0.000000,0.000000,0.000000,0.000000,0.000000,0.000000,0.000000,0.000000,0.000000,0.000000
01,1000000.000000,100.000000,999900.000000,0.000100,1.000000,0.000000,0.000100,1.000000,0.000000,10.000000,10.000000,0.000000,1.000000,1.000000,0.000000,0.000100,1.000000,0.000000
02,1000000.000000,100.000000,999900.000000,0.001150,11.500000,0.000000,0.001150,11.500000,0.000000,115.000000,115.000000,0.000000,11.500000,11.500000,0.000000,0.000100,1.000000,0.000000
03,1000000.000000,100.000000,999900.000000,0.007400,71.300000,0.000270,0.007400,71.300000,0.000270,1069.000000,1042.000000,27.000000,118.700000,116.000000,2.700000,1.000000,1.000000,1.000000
04,1000000.000000,100.000000,999900.000000,0.043810,100.000000,0.033813,0.043810,100.000000,0.033813,5376.000000,1995.000000,3381.000000,1042.400000,704.200000,338.200000,1.000550,6.500000,1.000000
05,1000000.000000,100.000000,999900.000000,0.436250,100.000000,0.426293,0.436250,100.000000,0.426293,44625.000000,2000.000000,42625.000000,5272.700000,1001.000000,4271.700000,1.000900,10.000000,1.000000
06,1000000.000000,100.000000,999900.000000,4.357580,100.000000,4.348015,4.357580,100.000000,4.348015,436758.000000,2000.000000,434758.000000,45466.600000,1001.000000,44465.600000,1.000900,10.000000,1.000000
07,1000000.000000,100.000000,999900.000000,34.990390,100.000000,34.983888,34.990390,100.000000,34.983888,3500039.000000,2000.000000,3498039.000000,431753.200000,1001.000000,430752.200000,1.000900,10.000000,1.000000
08,1000000.000000,100.000000,999900.000000,96.639380,100.000000,96.639044,96.639380,100.000000,96.639044,9664938.000000,2000.000000,9662938.000000,3403347.900000,1001.000000,3402346.900000,3.000700,10.000000,3.000000
09,1000000.000000,100.000000,999900.000000,99.993820,100.000000,99.993819,99.993820,100.000000,99.993819,10000382.000000,2000.000000,9998382.000000,9650503.100000,1001.000000,9649502.100000,9.000100,10.000000,9.000000
10,1000000.000000,100.000000,999900.000000,99.995550,100.000000,99.995550,99.995550,100.000000,99.995550,10000555.000000,2000.000000,9998555.000000,10000382.100000,1001.000000,9999381.100000,10.000000,10.000000,10.000000
11,1000000.000000,100.000000,999900.000000,99.995550,100.000000,99.995550,99.995550,100.000000,99.995550,10000555.000000,2000.000000,9998555.000000,10000556.000000,1001.000000,9999555.000000,10.000000,10.000000,10.000000
12,1000000.000000,100.000000,999900.000000,99.995550,100.000000,99.995550,99.995550,100.000000,99.995550,10000555.000000,2000.000000,9998555.000000,10000556.000000,1001.000000,9999555.000000,10.000000,10.000000,10.000000
13,1000000.000000,100.000000,999900.000000,99.995550,100.000000,99.995550,99.995550,100.000000,99.995550,10000555.000000,2000.000000,9998555.000000,10000556.000000,1001.000000,9999555.000000,10.000000,10.000000,10.000000
14,1000000.000000,100.000000,999900.000000,99.995550,100.000000,99.995550,99.995550,100.000000,99.995550,10000555.000000,2000.000000,9998555.000000,10000556.000000,1001.000000,9999555.000000,10.000000,10.000000,10.000000
15,1000000.000000,100.000000,999900.000000,99.995550,100.000000,99.995550,99.995550,100.000000,99.995550,10000555.000000,2000.000000,9998555.000000,10000556.000000,1001.000000,9999555.000000,10.000000,10.000000,10.000000
16,1000000.000000,100.000000,999900.000000,99.995550,100.000000,99.995550,99.995550,100.000000,99.995550,10000555.000000,2000.000000,9998555.000000,10000556.000000,1001.000000,9999555.000000,10.000000,10.000000,10.000000
17,1000000.000000,100.000000,999900.000000,99.995550,100.000000,99.995550,99.995550,100.000000,99.995550,10000555.000000,2000.000000,9998555.000000,10000556.000000,1001.000000,9999555.000000,10.000000,10.000000,10.000000
18,1000000.000000,100.000000,999900.000000,99.995550,100.000000,99.995550,99.995550,100.000000,99.995550,10000555.000000,2000.000000,9998555.000000,10000556.000000,1001.000000,9999555.000000,10.000000,10.000000,10.000000
19,1000000.000000,100.000000,999900.000000,99.995550,100.000000,99.995550,99.995550,100.000000,99.995550,10000555.000000,2000.000000,9998555.000000,10000556.000000,1001.000000,9999555.000000,10.000000,10.000000,10.000000
