gossips,p2p mean,p2p std,p2p min,p2p q1,p2p q2,p2p q3,p2p max,p2s mean,p2s std,p2s min,p2s q1,p2s q2,p2s q3,p2s max,s2s mean,s2s std,s2s min,s2s q1,s2s q2,s2s q3,s2s max
1,2.376,0.7160540016879546,1.2,1.8,2.5,2.8,4.1,0.1125,0.035355339059327376,0.1,0.1,0.1,0.1,0.2,0.00015000000000000001,7.071067811865475e-05,0.0001,0.000125,0.00015000000000000001,0.00017500000000000003,0.0002
2,0.1,,0.1,0.1,0.1,0.1,0.1,,,,,,,,,,,,,,
3,,,,,,,,,,,,,,,,,,,,,
4,,,,,,,,,,,,,,,,,,,,,
5,,,,,,,,,,,,,,,,,,,,,
6,,,,,,,,,,,,,,,,,,,,,
7,,,,,,,,,,,,,,,,,,,,,
