gossips,p2p mean,p2p std,p2p min,p2p q1,p2p q2,p2p q3,p2p max,p2s mean,p2s std,p2s min,p2s q1,p2s q2,p2s q3,p2s max,s2s mean,s2s std,s2s min,s2s q1,s2s q2,s2s q3,s2s max
1,49.53283999999999,0.16765606659666932,49.237,49.466,49.57,49.654,49.858,49.53283999999999,0.16765606659666932,49.237,49.466,49.57,49.654,49.858,52.19931992000001,0.10365509286407622,52.093556,52.141,52.170111,52.225444,52.610222
2,21.950239999999997,0.09431343135170855,21.761,21.875,21.96,22.005,22.166,21.950239999999997,0.09431343135170855,21.761,21.875,21.96,22.005,22.166,22.344413400000004,0.072991188333478,22.144,22.296667000000003,22.365222,22.394444,22.480222
3,1.8320400000000001,0.03811110949141554,1.749,1.809,1.829,1.857,1.89,1.8320400000000001,0.03811110949141554,1.749,1.809,1.829,1.857,1.89,0.9533599600000002,0.01042267995559044,0.928889,0.945667,0.9562219999999999,0.959333,0.9704440000000001
4,0.0025454545454545465,0.0014050003466284176,0.001,0.001,0.002,0.004,0.005,0.0025454545454545465,0.0014050003466284176,0.001,0.001,0.002,0.004,0.005,0.007555680000000004,0.0007569255643720854,0.005556,0.007111,0.007667,0.008111,0.008889
5,,,,,,,,,,,,,,,,,,,,,
