round,nodes,nodesP,nodesS,nodesSent,nodesSentP,nodesSentS,nodesRecv,nodesRecvP,nodesRecvS,msgSent,msgSentP,msgSentS,msgRecv,msgRecvP,msgRecvS,msgInfect,msgInfectP,msgInfectS
00,10000.000000,5000.000000,5000.000000,0.000000,0.000000,0.000000,0.000000,0.000000,0.000000,0.000000,0.000000,0.000000,0.000000,0.000000,0.000000,0.000000,0.000000,0.000000
01,10000.000000,5000.000000,5000.000000,0.010000,0.020000,0.000000,0.010000,0.020000,0.000000,10.000000,10.000000,0.000000,1.000000,1.000000,0.000000,0.500000,1.000000,0.000000
02,10000.000000,5000.000000,5000.000000,0.115000,0.230000,0.000000,0.115000,0.230000,0.000000,115.000000,115.000000,0.000000,11.500000,11.500000,0.000000,0.500000,1.000000,0.000000
03,10000.000000,5000.000000,5000.000000,1.149000,2.298000,0.000000,1.149000,2.298000,0.000000,1149.000000,1149.000000,0.000000,116.300000,116.300000,0.000000,0.500000,1.000000,0.000000
04,10000.000000,5000.000000,5000.000000,10.223000,20.446000,0.000000,10.223000,20.446000,0.000000,10223.000000,10223.000000,0.000000,1142.200000,1142.200000,0.000000,0.500000,1.000000,0.000000
05,10000.000000,5000.000000,5000.000000,44.199000,86.480000,1.918000,44.199000,86.480000,1.918000,44199.000000,43240.000000,959.000000,10085.200000,9988.400000,96.800000,1.500000,2.000000,1.000000
06,10000.000000,5000.000000,5000.000000,98.036000,99.542000,96.530000,98.036000,99.542000,96.530000,98036.000000,49771.000000,48265.000000,43442.300000,26655.300000,16787.000000,4.000000,5.000000,3.000000
07,10000.000000,5000.000000,5000.000000,99.989000,100.000000,99.978000,99.989000,100.000000,99.978000,99989.000000,50000.000000,49989.000000,97989.000000,53929.000000,44060.000000,9.000000,10.000000,8.000000
08,10000.000000,5000.000000,5000.000000,99.992000,100.000000,99.984000,99.992000,100.000000,99.984000,99992.000000,50000.000000,49992.000000,99990.000000,53929.000000,46061.000000,9.500000,10.000000,9.000000
09,10000.000000,5000.000000,5000.000000,99.992000,100.000000,99.984000,99.992000,100.000000,99.984000,99992.000000,50000.000000,49992.000000,99993.000000,53929.000000,46064.000000,9.500000,10.000000,9.000000
10,10000.000000,5000.000000,5000.000000,99.992000,100.000000,99.984000,99.992000,100.000000,99.984000,99992.000000,50000.000000,49992.000000,99993.000000,53929.000000,46064.000000,9.500000,10.000000,9.000000
11,10000.000000,5000.000000,5000.000000,99.992000,100.000000,99.984000,99.992000,100.000000,99.984000,99992.000000,50000.000000,49992.000000,99993.000000,53929.000000,46064.000000,9.500000,10.000000,9.000000
12,10000.000000,5000.000000,5000.000000,99.992000,100.000000,99.984000,99.992000,100.000000,99.984000,99992.000000,50000.000000,49992.000000,99993.000000,53929.000000,46064.000000,9.500000,10.000000,9.000000
13,10000.000000,5000.000000,5000.000000,99.992000,100.000000,99.984000,99.992000,100.000000,99.984000,99992.000000,50000.000000,49992.000000,99993.000000,53929.000000,46064.000000,9.500000,10.000000,9.000000
14,10000.000000,5000.000000,5000.000000,99.992000,100.000000,99.984000,99.992000,100.000000,99.984000,99992.000000,50000.000000,49992.000000,99993.000000,53929.000000,46064.000000,9.500000,10.000000,9.000000
15,10000.000000,5000.000000,5000.000000,99.992000,100.000000,99.984000,99.992000,100.000000,99.984000,99992.000000,50000.000000,49992.000000,99993.000000,53929.000000,46064.000000,9.500000,10.000000,9.000000
16,10000.000000,5000.000000,5000.000000,99.992000,100.000000,99.984000,99.992000,100.000000,99.984000,99992.000000,50000.000000,49992.000000,99993.000000,53929.000000,46064.000000,9.500000,10.000000,9.000000
17,10000.000000,5000.000000,5000.000000,99.992000,100.000000,99.984000,99.992000,100.000000,99.984000,99992.000000,50000.000000,49992.000000,99993.000000,53929.000000,46064.000000,9.500000,10.000000,9.000000
18,10000.000000,5000.000000,5000.000000,99.992000,100.000000,99.984000,99.992000,100.000000,99.984000,99992.000000,50000.000000,49992.000000,99993.000000,53929.000000,46064.000000,9.500000,10.000000,9.000000
19,10000.000000,5000.000000,5000.000000,99.992000,100.000000,99.984000,99.992000,100.000000,99.984000,99992.000000,50000.000000,49992.000000,99993.000000,53929.000000,46064.000000,9.500000,10.000000,9.000000
