,P+S mean,P+S std,P+S min,P+S q1,P+S median,P+S q3,P+S max,P mean,P std,P min,P q1,P median,P q3,P max,S mean,S std,S min,S q1,S median,S q3,S max
10% nodes,96,0,96,96,96,96,96,92,0,92,92,92,92,92,96,0,96,96,96,96,96
50% nodes,97,0,97,97,97,97,97,93,0,93,93,93,93,93,97,0,97,97,97,97,97
99% nodes,98,0,98,98,98,98,98,94,0,94,94,94,94,94,98,0,98,98,98,98,98
