gossips,p2p mean,p2p std,p2p min,p2p q1,p2p q2,p2p q3,p2p max,p2s mean,p2s std,p2s min,p2s q1,p2s q2,p2s q3,p2s max,s2s mean,s2s std,s2s min,s2s q1,s2s q2,s2s q3,s2s max
1,25.208,1.6605521170181115,22.3,23.9,25.1,26.3,29.2,23.907999999999998,1.3910188112794646,20.2,23.4,23.8,24.6,27.0,8.209345359999999,0.15890606042037234,7.925826,8.128028,8.213914,8.331832,8.447447
2,36.304,1.6473412923050688,33.3,34.9,36.4,37.8,38.9,42.98400000000001,1.4191194452899296,39.9,41.9,43.1,44.0,45.4,0.33634440000000004,0.010194058653614519,0.314715,0.33303299999999997,0.336737,0.341942,0.350951
3,23.564,1.0660988071781452,21.8,22.9,23.7,24.5,25.9,24.196000000000005,1.0553356496079023,22.4,23.4,24.1,25.0,26.4,0.0085486,0.0010358456287819467,0.006506999999999999,0.007908,0.008408,0.009109,0.010811
4,7.052,0.7095303611074957,5.3,6.8,7.1,7.3,8.3,4.484000000000001,0.6650062656346429,3.0,4.1,4.3,4.7,6.0,0.00017619047619047616,9.436504599035548e-05,0.0001,0.0001,0.0001,0.0002,0.0004
5,0.948,0.347754702819866,0.3,0.7,0.9,1.2,1.5,0.15263157894736848,0.0772328445721233,0.1,0.1,0.1,0.2,0.3,,,,,,,
6,0.1142857142857143,0.03779644730092272,0.1,0.1,0.1,0.1,0.2,,,,,,,,,,,,,,
7,,,,,,,,,,,,,,,,,,,,,
8,,,,,,,,,,,,,,,,,,,,,
