gossips,p2p mean,p2p std,p2p min,p2p q1,p2p q2,p2p q3,p2p max,p2s mean,p2s std,p2s min,p2s q1,p2s q2,p2s q3,p2s max,s2s mean,s2s std,s2s min,s2s q1,s2s q2,s2s q3,s2s max
1,49.25268,0.1568937326132999,48.939,49.177,49.236,49.354,49.55,58.43988000000001,0.349996942843792,57.972,58.197,58.364,58.599,59.172,55.83847548,0.2971756237352369,55.559332999999995,55.614111,55.736889,55.80644399999999,56.440332999999995
2,22.233080000000005,0.10993025061374136,21.976,22.199,22.268,22.298,22.372,20.27252,0.20205179204022597,19.799,20.135,20.324,20.409,20.682,21.38048896,0.12988267117783633,21.109,21.321556,21.396110999999998,21.476222,21.599778
3,2.0225999999999997,0.04106295978940954,1.939,2.001,2.023,2.052,2.113,0.32924,0.020421149167794982,0.288,0.319,0.327,0.338,0.385,0.4456356000000001,0.014299697718250315,0.42555600000000005,0.43444399999999994,0.44288900000000003,0.45055600000000007,0.482333
4,0.019520000000000003,0.00662771956759387,0.009,0.015,0.019,0.023,0.042,0.0016,0.0006324555320336759,0.001,0.001,0.002,0.002,0.003,0.002186600000000001,0.0003937138343179387,0.001333,0.002,0.002111,0.002444,0.003333
5,0.001,,0.001,0.001,0.001,0.001,0.001,,,,,,,,,,,,,,
