gossips,p2p mean,p2p std,p2p min,p2p q1,p2p q2,p2p q3,p2p max,p2s mean,p2s std,p2s min,p2s q1,p2s q2,p2s q3,p2s max,s2s mean,s2s std,s2s min,s2s q1,s2s q2,s2s q3,s2s max
1,,,,,,,,,,,,,,,534354.04,2976.2669778320196,529822.0,532313.0,533850.0,536537.0,541151.0
2,,,,,,,,,,,,,,,201250.2,5270.369919022128,189256.0,197903.0,200718.0,204822.0,209888.0
3,,,,,,,,,,,,,,,5149.4,375.5464906861288,4289.0,5008.0,5131.0,5423.0,5903.0
4,,,,,,,,,,,,,,,1.0,0.0,1.0,1.0,1.0,1.0,1.0
5,,,,,,,,,,,,,,,,,,,,,
