round,P mean,P std,P min,P q1,P q2,P q3,P max,S mean,S std,S min,S q1,S q2,S q3,S max,P+S mean,P+S std,P+S min,P+S q1,P+S q2,P+S q3,P+S max
0,0.0,0.0,0.0,0.0,0.0,0.0,0.0,0.0,0.0,0.0,0.0,0.0,0.0,0.0,0.0,0.0,0.0,0.0,0.0,0.0,0.0
1,0.0,0.0,0.0,0.0,0.0,0.0,0.0,0.0,0.0,0.0,0.0,0.0,0.0,0.0,0.0,0.0,0.0,0.0,0.0,0.0,0.0
2,0.0,0.0,0.0,0.0,0.0,0.0,0.0,0.0,0.0,0.0,0.0,0.0,0.0,0.0,0.0,0.0,0.0,0.0,0.0,0.0,0.0
3,0.0,0.0,0.0,0.0,0.0,0.0,0.0,0.0,0.0,0.0,0.0,0.0,0.0,0.0,0.0,0.0,0.0,0.0,0.0,0.0,0.0
4,0.0,0.0,0.0,0.0,0.0,0.0,0.0,0.0,0.0,0.0,0.0,0.0,0.0,0.0,0.0,0.0,0.0,0.0,0.0,0.0,0.0
5,0.0,0.0,0.0,0.0,0.0,0.0,0.0,0.0,0.0,0.0,0.0,0.0,0.0,0.0,0.0,0.0,0.0,0.0,0.0,0.0,0.0
6,0.0,0.0,0.0,0.0,0.0,0.0,0.0,0.0,0.0,0.0,0.0,0.0,0.0,0.0,0.0,0.0,0.0,0.0,0.0,0.0,0.0
7,0.0,0.0,0.0,0.0,0.0,0.0,0.0,0.0,0.0,0.0,0.0,0.0,0.0,0.0,0.0,0.0,0.0,0.0,0.0,0.0,0.0
8,0.0,0.0,0.0,0.0,0.0,0.0,0.0,0.0,0.0,0.0,0.0,0.0,0.0,0.0,0.0,0.0,0.0,0.0,0.0,0.0,0.0
9,0.0,0.0,0.0,0.0,0.0,0.0,0.0,0.0,0.0,0.0,0.0,0.0,0.0,0.0,0.0,0.0,0.0,0.0,0.0,0.0,0.0
10,0.07200000000000001,0.08426149773176358,0.0,0.0,0.1,0.1,0.3,0.0,0.0,0.0,0.0,0.0,0.0,0.0,7.200000000000002e-05,8.426149773176359e-05,0.0,0.0,0.0001,0.0001,0.0003
11,7.14,0.33040379335998354,6.3,7.0,7.1,7.3,7.9,0.0,0.0,0.0,0.0,0.0,0.0,0.0,0.007139999999999999,0.0003304037933599836,0.0063,0.007,0.0071,0.0073,0.0079
12,65.78,1.1489125293076041,62.9,65.2,66.0,66.7,67.3,2e-05,4.0824829046386304e-05,0.0,0.0,0.0,0.0,0.0001,0.0658,0.0011528949070347518,0.0629,0.0652,0.066,0.0667,0.0673
13,99.85200000000003,0.11944315244779345,99.6,99.8,99.9,99.9,100.0,0.017769800000000002,0.0018076043077325673,0.015015,0.016617,0.017417,0.018519,0.022923,0.11760400000000003,0.0017704707471931475,0.115,0.1164,0.1173,0.1184,0.1225
14,99.98,0.04082482904638544,99.9,100.0,100.0,100.0,100.0,1.6517958800000003,0.07752294760548863,1.501702,1.600701,1.678478,1.6987990000000002,1.7785790000000001,1.7501240000000002,0.07743276266111995,1.6002,1.6991,1.7768,1.797,1.8767
15,99.98,0.04082482904638544,99.9,100.0,100.0,100.0,100.0,35.27423824,0.8842707566560751,33.745646,34.592893,35.392993,35.965065,36.727127,35.338944,0.8833814012456161,33.8118,34.6583,35.4576,36.0291,36.7903
16,99.98,0.04082482904638544,99.9,100.0,100.0,100.0,100.0,97.17322923999998,0.24028238474800662,96.667067,96.987087,97.225125,97.334935,97.54424399999999,97.17603599999998,0.24004050505418642,96.6703,96.9901,97.2279,97.3376,97.5466
17,99.98,0.04082482904638544,99.9,100.0,100.0,100.0,100.0,99.95324136,0.0021438782008331644,99.947648,99.951652,99.953554,99.955055,99.955956,99.953268,0.002141985060640614,99.9477,99.9517,99.9536,99.9551,99.956
18,99.98,0.04082482904638544,99.9,100.0,100.0,100.0,100.0,99.95477075999999,0.0021802952261865006,99.95005,99.953153,99.954755,99.95615600000001,99.958458,99.95479600000003,0.0021757144420463726,99.9501,99.9532,99.9548,99.9562,99.9584
19,99.98,0.04082482904638544,99.9,100.0,100.0,100.0,100.0,99.95477075999999,0.0021802952261865006,99.95005,99.953153,99.954755,99.95615600000001,99.958458,99.95479600000003,0.0021757144420463726,99.9501,99.9532,99.9548,99.9562,99.9584
20,99.98,0.04082482904638544,99.9,100.0,100.0,100.0,100.0,99.95477075999999,0.0021802952261865006,99.95005,99.953153,99.954755,99.95615600000001,99.958458,99.95479600000003,0.0021757144420463726,99.9501,99.9532,99.9548,99.9562,99.9584
21,99.98,0.04082482904638544,99.9,100.0,100.0,100.0,100.0,99.95477075999999,0.0021802952261865006,99.95005,99.953153,99.954755,99.95615600000001,99.958458,99.95479600000003,0.0021757144420463726,99.9501,99.9532,99.9548,99.9562,99.9584
22,99.98,0.04082482904638544,99.9,100.0,100.0,100.0,100.0,99.95477075999999,0.0021802952261865006,99.95005,99.953153,99.954755,99.95615600000001,99.958458,99.95479600000003,0.0021757144420463726,99.9501,99.9532,99.9548,99.9562,99.9584
23,99.98,0.04082482904638544,99.9,100.0,100.0,100.0,100.0,99.95477075999999,0.0021802952261865006,99.95005,99.953153,99.954755,99.95615600000001,99.958458,99.95479600000003,0.0021757144420463726,99.9501,99.9532,99.9548,99.9562,99.9584
24,99.98,0.04082482904638544,99.9,100.0,100.0,100.0,100.0,99.95477075999999,0.0021802952261865006,99.95005,99.953153,99.954755,99.95615600000001,99.958458,99.95479600000003,0.0021757144420463726,99.9501,99.9532,99.9548,99.9562,99.9584
25,99.98,0.04082482904638544,99.9,100.0,100.0,100.0,100.0,99.95477075999999,0.0021802952261865006,99.95005,99.953153,99.954755,99.95615600000001,99.958458,99.95479600000003,0.0021757144420463726,99.9501,99.9532,99.9548,99.9562,99.9584
