gossips,p2p mean,p2p std,p2p min,p2p q1,p2p q2,p2p q3,p2p max,p2s mean,p2s std,p2s min,p2s q1,p2s q2,p2s q3,p2s max,s2s mean,s2s std,s2s min,s2s q1,s2s q2,s2s q3,s2s max
1,49.86399999999999,1.4818007063479666,46.1,49.1,49.8,51.1,52.2,48.716,1.5118090708375407,46.0,47.6,48.6,49.8,52.3,32.109221240000004,1.1949629539111344,29.159259000000002,31.280379999999997,32.183483,32.967067,34.172371999999996
2,22.104,1.0963880091767995,20.3,21.0,22.1,23.0,24.2,15.092,1.8497567407634983,12.1,14.0,15.2,15.9,19.7,1.2735656,0.06707232364582283,1.137437,1.25045,1.2706709999999999,1.317818,1.410911
3,2.012,0.44936992927134484,1.3,1.5,2.0,2.3,2.8,0.1,0.0,0.1,0.1,0.1,0.1,0.1,0.007631759999999999,0.0011785571432900489,0.0045049999999999995,0.007006999999999999,0.007608,0.008509000000000001,0.010611
4,0.10000000000000002,0.0,0.1,0.1,0.1,0.1,0.1,,,,,,,,,,,,,,
5,,,,,,,,,,,,,,,,,,,,,
