gossips,p2p mean,p2p std,p2p min,p2p q1,p2p q2,p2p q3,p2p max,p2s mean,p2s std,p2s min,p2s q1,p2s q2,p2s q3,p2s max,s2s mean,s2s std,s2s min,s2s q1,s2s q2,s2s q3,s2s max
1,,,,,,,,0.02800000000000001,0.006103277807866852,0.018,0.022,0.027,0.033,0.038,39.309439999999995,0.28791457734152515,38.916111,39.168,39.244889,39.359444,40.436221999999994
2,,,,,,,,,,,,,,,0.03600436,0.002328993056380089,0.031111,0.035222,0.036,0.037,0.041333
3,,,,,,,,,,,,,,,,,,,,,
4,,,,,,,,,,,,,,,,,,,,,
5,,,,,,,,,,,,,,,,,,,,,
