gossips,p2p mean,p2p std,p2p min,p2p q1,p2p q2,p2p q3,p2p max,p2s mean,p2s std,p2s min,p2s q1,p2s q2,p2s q3,p2s max,s2s mean,s2s std,s2s min,s2s q1,s2s q2,s2s q3,s2s max
1,49.196000000000005,1.332754040824237,47.1,48.2,49.1,50.6,51.1,59.352,1.3874797295816605,55.9,58.6,59.3,60.2,62.3,0.33950344,0.016321453885096555,0.303904,0.328228,0.33823800000000004,0.351852,0.377277
2,21.988000000000003,1.1787422675603576,18.7,21.5,21.8,22.7,24.5,19.56,1.1912878185672293,17.3,18.8,19.6,20.1,22.1,0.00032524999999999996,0.000148683780778761,0.0001,0.0002,0.0003,0.00042525,0.000601
3,2.12,0.42720018726587655,1.4,1.8,2.2,2.5,2.7,0.16000000000000003,0.06324555320336758,0.1,0.1,0.2,0.2,0.3,,,,,,,
4,0.10000000000000002,0.0,0.1,0.1,0.1,0.1,0.1,,,,,,,,,,,,,,
5,,,,,,,,,,,,,,,,,,,,,
6,,,,,,,,,,,,,,,,,,,,,
