gossips,p2p mean,p2p std,p2p min,p2p q1,p2p q2,p2p q3,p2p max,p2s mean,p2s std,p2s min,p2s q1,p2s q2,p2s q3,p2s max,s2s mean,s2s std,s2s min,s2s q1,s2s q2,s2s q3,s2s max
1,,,,,,,,,,,,,,,53.32477284000001,0.2575051359230011,52.745746,53.212112,53.327127000000004,53.493694,53.89099100000001
2,,,,,,,,,,,,,,,20.250654640000004,0.5394699584077015,19.282082,19.886286,20.213914000000003,20.612513,21.354054
3,,,,,,,,,,,,,,,0.52114512,0.04610142717993302,0.43933900000000004,0.493393,0.512312,0.554855,0.623023
