round,P mean,P std,P min,P q1,P q2,P q3,P max,S mean,S std,S min,S q1,S q2,S q3,S max,P+S mean,P+S std,P+S min,P+S q1,P+S q2,P+S q3,P+S max
0,100.0,0.0,100.0,100.0,100.0,100.0,100.0,100.0,0.0,100.0,100.0,100.0,100.0,100.0,100.0,0.0,100.0,100.0,100.0,100.0,100.0
1,100.0,0.0,100.0,100.0,100.0,100.0,100.0,100.0,0.0,100.0,100.0,100.0,100.0,100.0,100.0,0.0,100.0,100.0,100.0,100.0,100.0
2,100.0,0.0,100.0,100.0,100.0,100.0,100.0,100.0,0.0,100.0,100.0,100.0,100.0,100.0,100.0,0.0,100.0,100.0,100.0,100.0,100.0
3,99.99319999999996,0.00802080627701329,99.97,99.99,99.99,100.0,100.0,100.0,0.0,100.0,100.0,100.0,100.0,100.0,99.99993199999997,8.020806277144246e-05,99.9997,99.9999,99.9999,100.0,100.0
4,99.3496,0.04886034520276251,99.27,99.32,99.35,99.37,99.49,100.0,0.0,100.0,100.0,100.0,100.0,100.0,99.993496,0.0004886034520308616,99.9927,99.9932,99.9935,99.9937,99.9949
5,95.49759999999998,0.18093000488218305,95.1,95.35,95.52,95.62,95.84,99.99995152,7.77984147234233e-05,99.999697,99.999899,100.0,100.0,100.0,99.954928,0.0017763539437103404,99.951,99.9534,99.9551,99.9561,99.9584
6,95.40400000000004,0.18656991540260087,94.94,95.32,95.43,95.52,95.72,99.97245664,0.0042448781772885255,99.965859,99.969091,99.972121,99.975859,99.980808,99.92677199999997,0.0053212247963515084,99.9177,99.9228,99.9268,99.931,99.9372
7,95.47919999999998,0.15104966070799553,95.23,95.38,95.44,95.56,95.87,97.94859804,0.05038523965282575,97.855859,97.905556,97.945758,97.99929300000001,98.017576,97.92390400000002,0.0496564571162016,97.831,97.8804,97.9216,97.9732,97.9935
8,95.45999999999997,0.13808210118138742,95.17,95.35,95.49,95.56,95.67,97.05609284,0.057859997561408194,96.934848,97.027677,97.07050500000001,97.08202,97.144545,97.040132,0.056950949070231356,96.9215,97.0109,97.0533,97.067,97.1289
9,95.38240000000002,0.1530054465261476,95.04,95.28,95.39,95.46,95.77,97.07506664000002,0.047927424865522004,96.971717,97.047273,97.07798000000001,97.093737,97.155152,97.05814000000002,0.04839847621568389,96.9537,97.0299,97.0621,97.076,97.1413
10,95.46240000000002,0.1582002949849747,94.98,95.38,95.49,95.55,95.82,97.07703439999999,0.05490079630721743,96.96777800000001,97.053636,97.06798,97.091414,97.236869,97.06088799999998,0.054663450006990875,96.9532,97.0371,97.0512,97.0749,97.2203
11,95.434,0.1980530232033834,94.94,95.33,95.51,95.58,95.71,97.05551111999999,0.07097755234598235,96.895051,97.012626,97.034848,97.11798,97.22697,97.039296,0.0707436421171535,96.8786,96.9976,97.0216,97.1019,97.21
12,95.56960000000001,0.15557634781675317,95.29,95.45,95.57,95.67,95.88,97.01859796000001,0.05756544629049149,96.88909100000001,96.994949,97.021919,97.04050500000001,97.132626,97.00410799999997,0.05728089355681035,96.874,96.9817,97.0073,97.0283,97.117
13,96.2472,0.11443775600736246,96.05,96.17,96.25,96.32,96.47,97.08071516,0.06131024271596176,96.96333299999999,97.046162,97.078788,97.116869,97.233131,97.07238,0.06124220358543806,96.9542,97.0382,97.0702,97.1089,97.2242
14,99.90000000000002,0.041533119314588515,99.78,99.89,99.91,99.92,99.97,97.07705048,0.07723152338969842,96.894848,97.031616,97.074646,97.142121,97.18899,97.10528000000001,0.07658508884458874,96.9237,97.0596,97.1033,97.1698,97.2163
15,100.0,0.0,100.0,100.0,100.0,100.0,100.0,97.12853339999998,0.06513971162816312,97.007879,97.087071,97.13717199999999,97.167778,97.23606099999999,97.157248,0.06448819090861957,97.0378,97.1162,97.1658,97.1961,97.2637
16,100.0,0.0,100.0,100.0,100.0,100.0,100.0,99.12275955999999,0.03510538763148086,99.064949,99.100202,99.11818199999999,99.143535,99.21202,99.131532,0.03475437286635027,99.0743,99.1092,99.127,99.1521,99.2199
17,100.0,0.0,100.0,100.0,100.0,100.0,100.0,99.99882839999998,0.0003324316972494271,99.998081,99.998687,99.998788,99.999091,99.999394,99.99884,0.00032914029430048205,99.9981,99.9987,99.9988,99.9991,99.9994
18,100.0,0.0,100.0,100.0,100.0,100.0,100.0,100.0,0.0,100.0,100.0,100.0,100.0,100.0,100.0,0.0,100.0,100.0,100.0,100.0,100.0
19,100.0,0.0,100.0,100.0,100.0,100.0,100.0,100.0,0.0,100.0,100.0,100.0,100.0,100.0,100.0,0.0,100.0,100.0,100.0,100.0,100.0
20,100.0,0.0,100.0,100.0,100.0,100.0,100.0,100.0,0.0,100.0,100.0,100.0,100.0,100.0,100.0,0.0,100.0,100.0,100.0,100.0,100.0
21,100.0,0.0,100.0,100.0,100.0,100.0,100.0,100.0,0.0,100.0,100.0,100.0,100.0,100.0,100.0,0.0,100.0,100.0,100.0,100.0,100.0
22,100.0,0.0,100.0,100.0,100.0,100.0,100.0,100.0,0.0,100.0,100.0,100.0,100.0,100.0,100.0,0.0,100.0,100.0,100.0,100.0,100.0
23,100.0,0.0,100.0,100.0,100.0,100.0,100.0,100.0,0.0,100.0,100.0,100.0,100.0,100.0,100.0,0.0,100.0,100.0,100.0,100.0,100.0
24,100.0,0.0,100.0,100.0,100.0,100.0,100.0,100.0,0.0,100.0,100.0,100.0,100.0,100.0,100.0,0.0,100.0,100.0,100.0,100.0,100.0
25,100.0,0.0,100.0,100.0,100.0,100.0,100.0,100.0,0.0,100.0,100.0,100.0,100.0,100.0,100.0,0.0,100.0,100.0,100.0,100.0,100.0
