gossips,p2p mean,p2p std,p2p min,p2p q1,p2p q2,p2p q3,p2p max,p2s mean,p2s std,p2s min,p2s q1,p2s q2,p2s q3,p2s max,s2s mean,s2s std,s2s min,s2s q1,s2s q2,s2s q3,s2s max
1,4923.16,44.846664684604306,4828.0,4892.0,4926.0,4954.0,4992.0,5821.28,50.940749896325585,5727.0,5787.0,5819.0,5849.0,5921.0,521679.04,1730.77979727828,518380,520588.0,521356,522629.0,526767
2,2235.52,43.53171257830322,2149.0,2202.0,2239.0,2261.0,2339.0,2043.08,41.216825043502126,1958.0,2024.0,2047.0,2065.0,2107.0,215352.68,2988.842428098212,209990,213571.0,215737,216495.0,224867
3,202.88,13.134940679982785,178.0,193.0,205.0,213.0,224.0,33.12,5.230678732248808,25.0,28.0,33.0,37.0,42.0,11861.36,401.2676662777604,11065,11673.0,11876,12119.0,12628
4,2.4285714285714284,1.164964745021435,1.0,1.0,2.0,3.0,4.0,1.0,0.0,1.0,1.0,1.0,1.0,1.0,165.84,20.917855211915654,121,151.0,171,180.0,206
5,,,,,,,,,,,,,,,1.0,0.0,1,1.0,1,1.0,1
