gossips,p2p mean,p2p std,p2p min,p2p q1,p2p q2,p2p q3,p2p max,p2s mean,p2s std,p2s min,p2s q1,p2s q2,p2s q3,p2s max,s2s mean,s2s std,s2s min,s2s q1,s2s q2,s2s q3,s2s max
1,498.24,16.101966753578072,471.0,489.0,496.0,511.0,528.0,578.48,17.771981694041134,547.0,567.0,576.0,591.0,611.0,524846.24,2946.63305429547,519570,522706,525194.0,526368.0,530686
2,217.96,11.107354920652051,198.0,209.0,218.0,225.0,243.0,206.4,17.67295485574875,168.0,197.0,206.0,216.0,241.0,216150.2,4560.509355689717,207554,212908,216254.0,219005.0,224926
3,19.72,4.335127833563081,11.0,15.0,20.0,23.0,26.0,3.75,1.750776225365294,1.0,3.0,3.5,5.0,7.0,13557.48,481.88364086502594,12901,13172,13499.0,13898.0,14457
4,1.2,0.4472135954999579,1.0,1.0,1.0,1.0,2.0,,,,,,,,264.6,18.209429791548477,237,252,263.0,275.0,323
5,,,,,,,,,,,,,,,2.142857142857143,1.314751470267833,1,1,2.0,3.0,6
