gossips,p2p mean,p2p std,p2p min,p2p q1,p2p q2,p2p q3,p2p max,p2s mean,p2s std,p2s min,p2s q1,p2s q2,p2s q3,p2s max,s2s mean,s2s std,s2s min,s2s q1,s2s q2,s2s q3,s2s max
1,49.0588,0.6552818731914787,47.68,48.63,49.02,49.54,50.26,58.2288,0.4365806531062357,57.36,57.94,58.14,58.51,59.35,53.48931316,0.15490021478511265,53.104443999999994,53.44201999999999,53.497172,53.595253,53.745152000000004
2,22.406799999999997,0.45420002935564274,21.69,22.12,22.45,22.63,23.45,20.4908,0.36395878887588357,19.72,20.31,20.56,20.71,21.13,20.93707868,0.19950225649052225,20.562525,20.841212,20.90404,21.014242000000003,21.424747
3,2.0519999999999996,0.1410968934219791,1.78,1.97,2.07,2.11,2.47,0.3363999999999999,0.06177108277071616,0.17,0.31,0.34,0.38,0.46,0.7085170399999999,0.014187637081511054,0.687071,0.695354,0.7048479999999999,0.719899,0.736263
4,0.020000000000000004,0.011547005383792516,0.01,0.01,0.02,0.03,0.05,0.01,0.0,0.01,0.01,0.01,0.01,0.01,0.0007878000000000001,0.00027965633671824187,0.000303,0.000505,0.000808,0.000909,0.0013130000000000001
5,,,,,,,,,,,,,,,,,,,,,
