,mean,std,sem,cistd,cisem,min,05th,25th,50th,75th,95th,max
Uniform,,,,,,,,,,,,
P,5.384948374760994,2.2368127734721344,0.003912365723333201,0.0039123597388303856,6.843032336492296e-06,1.0,2.0,4.0,5.0,7.0,9.0,19.0
S,10.785486597722818,3.270908738960849,0.0006873422193013327,0.0006873422041255115,1.4443671582020057e-07,2.0,6.0,8.0,11.0,13.0,17.0,32.0
P+S,10.708643641796138,3.3206764949711984,0.000692818113438516,0.000692818098359446,1.4454793431047996e-07,1.0,6.0,8.0,10.0,13.0,17.0,32.0
