gossips,p2p mean,p2p std,p2p min,p2p q1,p2p q2,p2p q3,p2p max,p2s mean,p2s std,p2s min,p2s q1,p2s q2,p2s q3,p2s max,s2s mean,s2s std,s2s min,s2s q1,s2s q2,s2s q3,s2s max
1,,,,,,,,0.01,0.0,0.01,0.01,0.01,0.01,0.01,0.67578588,0.5376892216640514,0.160909,0.409495,0.5626260000000001,0.809293,2.910202
2,,,,,,,,,,,,,,,0.0009811904761904762,0.0012507946121984865,0.000303,0.000404,0.0007070000000000001,0.00101,0.006263
3,,,,,,,,,,,,,,,,,,,,,
4,,,,,,,,,,,,,,,,,,,,,
5,,,,,,,,,,,,,,,,,,,,,
6,,,,,,,,,,,,,,,,,,,,,
7,,,,,,,,,,,,,,,,,,,,,
