round,P mean,P std,P min,P 05th,P 25th,P 50th,P 75th,P 95th,P max,S mean,S std,S min,S 05th,S 25th,S 50th,S 75th,S 95th,S max,P+S mean,P+S std,P+S min,P+S 05th,P+S 25th,P+S 50th,P+S 75th,P+S 95th,P+S max
0,0.0,0.0,0.0,0.0,0.0,0.0,0.0,0.0,0.0,0.0,0.0,0.0,0.0,0.0,0.0,0.0,0.0,0.0,0.0,0.0,0.0,0.0,0.0,0.0,0.0,0.0,0.0
1,0.0,0.0,0.0,0.0,0.0,0.0,0.0,0.0,0.0,0.0,0.0,0.0,0.0,0.0,0.0,0.0,0.0,0.0,0.0,0.0,0.0,0.0,0.0,0.0,0.0,0.0,0.0
2,0.0,0.0,0.0,0.0,0.0,0.0,0.0,0.0,0.0,0.0,0.0,0.0,0.0,0.0,0.0,0.0,0.0,0.0,0.0,0.0,0.0,0.0,0.0,0.0,0.0,0.0,0.0
3,0.009200000000001296,0.007440430095094166,0.0,0.0,0.0,0.010000000000005116,0.010000000000005116,0.01999999999999602,0.01999999999999602,0.0,0.0,0.0,0.0,0.0,0.0,0.0,0.0,0.0,9.200000000305409e-05,7.440430095342307e-05,0.0,0.0,0.0,0.00010000000000331966,0.00010000000000331966,0.0002000000000066393,0.0002000000000066393
4,0.6748000000000007,0.04817634274205626,0.6099999999999994,0.6099999999999994,0.6299999999999955,0.6800000000000068,0.7000000000000028,0.7560000000000031,0.7800000000000011,4.040000000031796e-06,1.9791877121843846e-05,0.0,0.0,0.0,0.0,0.0,0.0,0.0001010000000007949,0.006752000000000749,0.00047843076824122656,0.006100000000003547,0.006100000000003547,0.0062999999999959755,0.006799999999998363,0.007000000000005002,0.007559999999998012,0.007800000000003138
5,4.4908,0.16552752037048174,4.079999999999998,4.119999999999999,4.420000000000002,4.519999999999996,4.6200000000000045,4.657999999999999,4.780000000000001,6.0600000000476936e-05,9.474639834917894e-05,0.0,0.0,0.0,0.0,0.0001010000000007949,0.0002828000000022254,0.0003030000000023847,0.04496800000000121,0.0016631824914893365,0.04080000000000439,0.041200000000003456,0.04430000000000689,0.045199999999994134,0.04619999999999891,0.04665999999999997,0.04779999999999518
6,4.570799999999999,0.16119354825798665,4.25,4.29,4.489999999999995,4.569999999999993,4.670000000000002,4.805999999999994,4.900000000000006,0.02944643999999812,0.004617845299098421,0.021515000000007944,0.022181599999996138,0.026161999999999352,0.030807999999993285,0.03292900000000998,0.035636800000000336,0.03939400000000148,0.07485999999999876,0.005190375708946379,0.06499999999999773,0.06587999999999568,0.0712999999999937,0.07529999999999859,0.07880000000000109,0.08117999999999768,0.08450000000000557
7,4.5776,0.19659664290114598,4.209999999999994,4.234000000000001,4.459999999999994,4.569999999999993,4.700000000000003,4.888000000000005,4.980000000000004,2.071155519999999,0.06196440942032489,1.9631310000000042,1.9929089999999945,2.0274749999999955,2.066868999999997,2.0909089999999964,2.1794947999999974,2.1976769999999988,2.09622,0.06178619910627263,1.9873000000000047,2.0178,2.0527000000000015,2.090900000000005,2.114699999999999,2.2038999999999986,2.2214000000000027
8,4.579199999999999,0.1912886823625502,4.209999999999994,4.239999999999998,4.489999999999995,4.560000000000002,4.659999999999997,4.910000000000005,5.010000000000005,2.9256645599999995,0.06060581522664627,2.8205050000000114,2.8215351999999996,2.8923230000000046,2.9248479999999972,2.9639389999999963,3.0030097999999983,3.055455000000009,2.9421999999999997,0.06012583471354041,2.8371999999999957,2.8393599999999966,2.9091999999999985,2.9398000000000053,2.9843999999999937,3.0190600000000014,3.0708999999999946
9,4.557600000000001,0.16697975925243036,4.180000000000007,4.3539999999999965,4.430000000000007,4.560000000000002,4.719999999999999,4.7580000000000044,4.909999999999997,2.906509159999999,0.0708466612219268,2.769595999999993,2.7989289999999984,2.860606000000004,2.9009089999999986,2.960302999999996,3.0197579999999986,3.027171999999993,2.923020000000002,0.0700127302710018,2.786199999999994,2.8159399999999977,2.878600000000006,2.9176999999999964,2.976600000000005,3.0332200000000027,3.044300000000007
10,4.602,0.1848025973843441,4.219999999999999,4.3120000000000065,4.530000000000001,4.579999999999998,4.709999999999994,4.884000000000003,5.109999999999999,2.9254867999999994,0.06174866510297803,2.841616000000002,2.8470104000000074,2.862020000000001,2.9229290000000105,2.9748479999999944,3.027373800000001,3.033332999999999,2.942252000000002,0.061968483086163824,2.855400000000003,2.8629200000000026,2.879499999999993,2.9448000000000008,2.990700000000004,3.044460000000001,3.0490000000000066
11,4.588800000000001,0.1955979549995346,4.319999999999993,4.331999999999999,4.450000000000003,4.549999999999997,4.689999999999998,4.9519999999999955,4.969999999999999,2.9357898400000004,0.058082851798223485,2.8093939999999975,2.839899199999996,2.9114140000000077,2.937172000000004,2.9642419999999987,3.0123434000000033,3.099293000000003,2.952319999999999,0.05742061650661684,2.8260999999999967,2.8579199999999987,2.9261999999999944,2.9569999999999936,2.9805999999999955,3.029379999999995,3.112099999999998
12,4.5436,0.21114696303759453,4.1200000000000045,4.190000000000007,4.400000000000006,4.549999999999997,4.689999999999998,4.8960000000000035,4.959999999999994,2.9900929200000017,0.07599933482757207,2.847879000000006,2.891495000000003,2.936060999999995,2.9729290000000077,3.0475760000000065,3.1250304000000027,3.138384000000002,3.0056279999999993,0.0757986201457521,2.8648000000000025,2.9080600000000003,2.9482,2.988200000000006,3.0666999999999973,3.1406800000000032,3.1518999999999977
13,3.7428,0.1698827831182433,3.3499999999999943,3.4679999999999978,3.6200000000000045,3.75,3.8700000000000045,3.962,4.099999999999994,2.9188565999999985,0.05711591636873397,2.7760609999999986,2.8201819999999884,2.883131000000006,2.9287879999999973,2.9569699999999983,2.9937167999999956,3.0103030000000075,2.9270959999999997,0.05630529268194863,2.786900000000003,2.828779999999998,2.8924999999999983,2.937100000000001,2.965199999999996,3.00094,3.0164000000000044
14,0.08999999999999829,0.03187475490101925,0.01999999999999602,0.04200000000000444,0.06999999999999318,0.09000000000000341,0.10999999999999943,0.1379999999999995,0.14000000000000057,2.9180485199999997,0.06131936768957647,2.7731310000000065,2.792586,2.8942420000000055,2.9286869999999965,2.9525249999999943,3.0066465999999963,3.0326260000000076,2.889768,0.06067619447526339,2.7464999999999975,2.765440000000004,2.8662999999999954,2.900099999999995,2.923400000000001,2.977760000000001,3.003399999999999
15,0.0,0.0,0.0,0.0,0.0,0.0,0.0,0.0,0.0,2.8678263200000016,0.03813455124238013,2.785960000000003,2.808666199999993,2.84656600000001,2.865050999999994,2.8891920000000084,2.9327876,2.9369700000000023,2.8391480000000007,0.03775317862114462,2.758099999999999,2.780579999999998,2.818100000000001,2.8363999999999976,2.860299999999995,2.9034600000000044,2.907600000000002
16,0.0,0.0,0.0,0.0,0.0,0.0,0.0,0.0,0.0,0.8704767200000003,0.033593518020615776,0.790101000000007,0.8097170000000035,0.8541409999999985,0.8624240000000043,0.8990909999999985,0.9172123999999968,0.922625999999994,0.8617719999999998,0.03325755877992154,0.7822000000000031,0.8016200000000027,0.8456000000000046,0.8538000000000068,0.8901000000000039,0.9080399999999997,0.9133999999999958
17,0.0,0.0,0.0,0.0,0.0,0.0,0.0,0.0,0.0,0.0010948399999966797,0.00042437310753619016,0.0002020000000015898,0.0005050000000039745,0.0008079999999921483,0.0010099999999937381,0.0014139999999969177,0.001797799999999938,0.0018180000000000973,0.0010840000000001738,0.000420171393599199,0.0002000000000066393,0.0005000000000023874,0.0007999999999981355,0.0010000000000047748,0.0014000000000038426,0.0017800000000022461,0.0018000000000029104
18,0.0,0.0,0.0,0.0,0.0,0.0,0.0,0.0,0.0,0.0,0.0,0.0,0.0,0.0,0.0,0.0,0.0,0.0,0.0,0.0,0.0,0.0,0.0,0.0,0.0,0.0,0.0
19,0.0,0.0,0.0,0.0,0.0,0.0,0.0,0.0,0.0,0.0,0.0,0.0,0.0,0.0,0.0,0.0,0.0,0.0,0.0,0.0,0.0,0.0,0.0,0.0,0.0,0.0,0.0
20,0.0,0.0,0.0,0.0,0.0,0.0,0.0,0.0,0.0,0.0,0.0,0.0,0.0,0.0,0.0,0.0,0.0,0.0,0.0,0.0,0.0,0.0,0.0,0.0,0.0,0.0,0.0
21,0.0,0.0,0.0,0.0,0.0,0.0,0.0,0.0,0.0,0.0,0.0,0.0,0.0,0.0,0.0,0.0,0.0,0.0,0.0,0.0,0.0,0.0,0.0,0.0,0.0,0.0,0.0
22,0.0,0.0,0.0,0.0,0.0,0.0,0.0,0.0,0.0,0.0,0.0,0.0,0.0,0.0,0.0,0.0,0.0,0.0,0.0,0.0,0.0,0.0,0.0,0.0,0.0,0.0,0.0
23,0.0,0.0,0.0,0.0,0.0,0.0,0.0,0.0,0.0,0.0,0.0,0.0,0.0,0.0,0.0,0.0,0.0,0.0,0.0,0.0,0.0,0.0,0.0,0.0,0.0,0.0,0.0
24,0.0,0.0,0.0,0.0,0.0,0.0,0.0,0.0,0.0,0.0,0.0,0.0,0.0,0.0,0.0,0.0,0.0,0.0,0.0,0.0,0.0,0.0,0.0,0.0,0.0,0.0,0.0
25,0.0,0.0,0.0,0.0,0.0,0.0,0.0,0.0,0.0,0.0,0.0,0.0,0.0,0.0,0.0,0.0,0.0,0.0,0.0,0.0,0.0,0.0,0.0,0.0,0.0,0.0,0.0
