gossips,p2p mean,p2p std,p2p min,p2p q1,p2p q2,p2p q3,p2p max,p2s mean,p2s std,p2s min,p2s q1,p2s q2,p2s q3,p2s max,s2s mean,s2s std,s2s min,s2s q1,s2s q2,s2s q3,s2s max
1,,,,,,,,,,,,,,,61.270946919999986,1.0596895695551958,59.282782999999995,60.420821,61.396395999999996,61.891191000000006,63.168868999999994
2,,,,,,,,,,,,,,,2.18311112,0.31094232082270507,1.718418,1.969069,2.0936939999999997,2.3310310000000003,2.857257
3,,,,,,,,,,,,,,,0.00014000000000000001,6.99205898780101e-05,0.0001,0.0001,0.0001,0.00017500000000000003,0.0003
4,,,,,,,,,,,,,,,,,,,,,
5,,,,,,,,,,,,,,,,,,,,,
