round,Simple mean,Simple std,Simple min,Simple q1,Simple q2,Simple q3,Simple max
0,100.0,0.0,100.0,100.0,100.0,100.0,100.0
1,99.99989999999998,0.0,99.9999,99.9999,99.9999,99.9999,99.9999
2,99.99879999999999,0.0,99.9988,99.9988,99.9988,99.9988,99.9988
3,99.98770399999998,1.9999999997427014e-05,99.9877,99.9877,99.9877,99.9877,99.9878
4,99.875164,0.0008046117075929494,99.8735,99.8747,99.8752,99.8756,99.8768
5,98.85782800000001,0.004225371778514485,98.8486,98.8543,98.8589,98.86,98.8646
6,95.22916000000001,0.018350113532802,95.1972,95.221,95.2285,95.2406,95.2651
7,95.13379199999997,0.01849835398082857,95.0995,95.1244,95.1316,95.1463,95.1695
8,95.14155999999998,0.02235561077970149,95.1059,95.1227,95.1369,95.156,95.1956
9,95.12988800000001,0.024184435766280706,95.088,95.1148,95.1223,95.1422,95.1742
10,95.134848,0.02782961731680705,95.0777,95.1152,95.133,95.1423,95.2085
11,95.115916,0.03274155972664228,95.074,95.0995,95.1112,95.1154,95.2173
12,95.14332399999999,0.029333304166651954,95.1038,95.1237,95.1387,95.1543,95.2169
13,95.24674399999999,0.02667072489953549,95.2036,95.2325,95.2431,95.2536,95.3062
14,96.250556,0.022286357560924393,96.2127,96.2303,96.2489,96.262,96.2924
15,99.87189999999998,0.0039021361671094414,99.8659,99.8692,99.8722,99.8747,99.8801
16,99.959196,0.0018072723461977777,99.9563,99.9574,99.9594,99.9604,99.9627
17,99.95925199999998,0.0018127143551418324,99.9564,99.9575,99.9594,99.9605,99.9627
18,99.95925199999998,0.0018127143551418324,99.9564,99.9575,99.9594,99.9605,99.9627
19,99.95925199999998,0.0018127143551418324,99.9564,99.9575,99.9594,99.9605,99.9627
20,99.95925199999998,0.0018127143551418324,99.9564,99.9575,99.9594,99.9605,99.9627
21,99.95925199999998,0.0018127143551418324,99.9564,99.9575,99.9594,99.9605,99.9627
22,99.95925199999998,0.0018127143551418324,99.9564,99.9575,99.9594,99.9605,99.9627
23,99.95925199999998,0.0018127143551418324,99.9564,99.9575,99.9594,99.9605,99.9627
24,99.95925199999998,0.0018127143551418324,99.9564,99.9575,99.9594,99.9605,99.9627
