round,P mean,P std,P min,P q1,P q2,P q3,P max,S mean,S std,S min,S q1,S q2,S q3,S max,P+S mean,P+S std,P+S min,P+S q1,P+S q2,P+S q3,P+S max
0,0.0,0.0,0,0,0,0,0,1.0,0.0,1,1,1,1,1,0.0,0.0,0,0,0,0,0
1,0.92,0.2768874620972691,0,1,1,1,1,1.0,0.0,1,1,1,1,1,0.92,0.2768874620972691,0,1,1,1,1
2,1.0,0.0,1,1,1,1,1,1.0,0.0,1,1,1,1,1,1.0,0.0,1,1,1,1,1
3,1.0,0.0,1,1,1,1,1,1.0,0.0,1,1,1,1,1,1.0,0.0,1,1,1,1,1
4,1.0,0.0,1,1,1,1,1,1.0,0.0,1,1,1,1,1,1.0,0.0,1,1,1,1,1
5,1.0,0.0,1,1,1,1,1,1.0,0.0,1,1,1,1,1,1.0,0.0,1,1,1,1,1
6,1.0,0.0,1,1,1,1,1,1.0,0.0,1,1,1,1,1,1.0,0.0,1,1,1,1,1
7,1.0,0.0,1,1,1,1,1,1.0,0.0,1,1,1,1,1,1.0,0.0,1,1,1,1,1
8,1.0,0.0,1,1,1,1,1,1.0,0.0,1,1,1,1,1,1.0,0.0,1,1,1,1,1
9,1.0,0.0,1,1,1,1,1,1.0,0.0,1,1,1,1,1,1.0,0.0,1,1,1,1,1
10,1.0,0.0,1,1,1,1,1,1.0,0.0,1,1,1,1,1,1.0,0.0,1,1,1,1,1
11,1.0,0.0,1,1,1,1,1,1.0,0.0,1,1,1,1,1,1.0,0.0,1,1,1,1,1
12,1.0,0.0,1,1,1,1,1,1.0,0.0,1,1,1,1,1,1.0,0.0,1,1,1,1,1
13,1.0,0.0,1,1,1,1,1,1.0,0.0,1,1,1,1,1,1.0,0.0,1,1,1,1,1
14,1.12,0.33166247903553997,1,1,1,1,2,1.0,0.0,1,1,1,1,1,1.0,0.0,1,1,1,1,1
15,1.48,0.5859465277082315,1,1,1,2,3,1.0,0.0,1,1,1,1,1,1.0,0.0,1,1,1,1,1
16,2.2,0.9574271077563381,1,1,2,3,4,1.0,0.0,1,1,1,1,1,1.0,0.0,1,1,1,1,1
17,2.48,1.1590225767142472,1,2,2,4,4,1.0,0.0,1,1,1,1,1,1.0,0.0,1,1,1,1,1
18,2.88,1.5088627063675035,1,2,2,4,5,1.0,0.0,1,1,1,1,1,1.0,0.0,1,1,1,1,1
19,3.16,1.8184242262647807,1,2,3,4,6,1.0,0.0,1,1,1,1,1,1.0,0.0,1,1,1,1,1
20,3.32,2.055885859347903,1,2,3,5,7,1.0,0.0,1,1,1,1,1,1.0,0.0,1,1,1,1,1
21,3.32,2.055885859347903,1,2,3,5,7,1.0,0.0,1,1,1,1,1,1.0,0.0,1,1,1,1,1
22,3.4,2.23606797749979,1,2,3,5,9,1.0,0.0,1,1,1,1,1,1.0,0.0,1,1,1,1,1
23,3.4,2.23606797749979,1,2,3,5,9,1.0,0.0,1,1,1,1,1,1.0,0.0,1,1,1,1,1
24,3.4,2.23606797749979,1,2,3,5,9,1.0,0.0,1,1,1,1,1,1.0,0.0,1,1,1,1,1
25,3.4,2.23606797749979,1,2,3,5,9,1.0,0.0,1,1,1,1,1,1.0,0.0,1,1,1,1,1
26,3.4,2.23606797749979,1,2,3,5,9,1.0,0.0,1,1,1,1,1,1.0,0.0,1,1,1,1,1
27,3.4,2.23606797749979,1,2,3,5,9,1.0,0.0,1,1,1,1,1,1.0,0.0,1,1,1,1,1
28,3.4,2.23606797749979,1,2,3,5,9,1.0,0.0,1,1,1,1,1,1.0,0.0,1,1,1,1,1
29,3.4,2.23606797749979,1,2,3,5,9,1.0,0.0,1,1,1,1,1,1.0,0.0,1,1,1,1,1
30,3.4,2.23606797749979,1,2,3,5,9,1.0,0.0,1,1,1,1,1,1.0,0.0,1,1,1,1,1
31,3.4,2.23606797749979,1,2,3,5,9,1.0,0.0,1,1,1,1,1,1.0,0.0,1,1,1,1,1
32,3.4,2.23606797749979,1,2,3,5,9,1.0,0.0,1,1,1,1,1,1.0,0.0,1,1,1,1,1
33,3.4,2.23606797749979,1,2,3,5,9,1.0,0.0,1,1,1,1,1,1.0,0.0,1,1,1,1,1
34,3.4,2.23606797749979,1,2,3,5,9,1.0,0.0,1,1,1,1,1,1.0,0.0,1,1,1,1,1
35,3.4,2.23606797749979,1,2,3,5,9,1.0,0.0,1,1,1,1,1,1.0,0.0,1,1,1,1,1
36,3.4,2.23606797749979,1,2,3,5,9,1.0,0.0,1,1,1,1,1,1.0,0.0,1,1,1,1,1
37,3.4,2.23606797749979,1,2,3,5,9,1.0,0.0,1,1,1,1,1,1.0,0.0,1,1,1,1,1
38,3.4,2.23606797749979,1,2,3,5,9,1.0,0.0,1,1,1,1,1,1.0,0.0,1,1,1,1,1
39,3.4,2.23606797749979,1,2,3,5,9,1.0,0.0,1,1,1,1,1,1.0,0.0,1,1,1,1,1
40,3.4,2.23606797749979,1,2,3,5,9,1.0,0.0,1,1,1,1,1,1.0,0.0,1,1,1,1,1
41,3.4,2.23606797749979,1,2,3,5,9,1.0,0.0,1,1,1,1,1,1.0,0.0,1,1,1,1,1
42,3.4,2.23606797749979,1,2,3,5,9,1.0,0.0,1,1,1,1,1,1.0,0.0,1,1,1,1,1
43,3.4,2.23606797749979,1,2,3,5,9,1.0,0.0,1,1,1,1,1,1.0,0.0,1,1,1,1,1
44,3.4,2.23606797749979,1,2,3,5,9,1.0,0.0,1,1,1,1,1,1.0,0.0,1,1,1,1,1
45,3.4,2.23606797749979,1,2,3,5,9,1.0,0.0,1,1,1,1,1,1.0,0.0,1,1,1,1,1
46,3.4,2.23606797749979,1,2,3,5,9,1.0,0.0,1,1,1,1,1,1.0,0.0,1,1,1,1,1
47,3.4,2.23606797749979,1,2,3,5,9,1.0,0.0,1,1,1,1,1,1.0,0.0,1,1,1,1,1
48,3.4,2.23606797749979,1,2,3,5,9,1.0,0.0,1,1,1,1,1,1.0,0.0,1,1,1,1,1
49,3.4,2.23606797749979,1,2,3,5,9,1.0,0.0,1,1,1,1,1,1.0,0.0,1,1,1,1,1
50,3.4,2.23606797749979,1,2,3,5,9,1.0,0.0,1,1,1,1,1,1.0,0.0,1,1,1,1,1
