round,P mean,P std,P min,P q1,P q2,P q3,P max,S mean,S std,S min,S q1,S q2,S q3,S max,P+S mean,P+S std,P+S min,P+S q1,P+S q2,P+S q3,P+S max
0,0.0,0.0,0.0,0.0,0.0,0.0,0.0,0.0,0.0,0.0,0.0,0.0,0.0,0.0,0.0,0.0,0.0,0.0,0.0,0.0,0.0
1,0.0,0.0,0.0,0.0,0.0,0.0,0.0,0.0,0.0,0.0,0.0,0.0,0.0,0.0,0.0,0.0,0.0,0.0,0.0,0.0,0.0
2,0.0,0.0,0.0,0.0,0.0,0.0,0.0,0.0,0.0,0.0,0.0,0.0,0.0,0.0,0.0,0.0,0.0,0.0,0.0,0.0,0.0
3,0.0,0.0,0.0,0.0,0.0,0.0,0.0,0.0,0.0,0.0,0.0,0.0,0.0,0.0,0.0,0.0,0.0,0.0,0.0,0.0,0.0
4,0.0,0.0,0.0,0.0,0.0,0.0,0.0,0.0,0.0,0.0,0.0,0.0,0.0,0.0,0.0,0.0,0.0,0.0,0.0,0.0,0.0
5,0.0,0.0,0.0,0.0,0.0,0.0,0.0,0.0,0.0,0.0,0.0,0.0,0.0,0.0,0.0,0.0,0.0,0.0,0.0,0.0,0.0
6,0.0,0.0,0.0,0.0,0.0,0.0,0.0,0.0,0.0,0.0,0.0,0.0,0.0,0.0,0.0,0.0,0.0,0.0,0.0,0.0,0.0
7,0.0,0.0,0.0,0.0,0.0,0.0,0.0,0.0,0.0,0.0,0.0,0.0,0.0,0.0,0.0,0.0,0.0,0.0,0.0,0.0,0.0
8,0.0,0.0,0.0,0.0,0.0,0.0,0.0,0.0,0.0,0.0,0.0,0.0,0.0,0.0,0.0,0.0,0.0,0.0,0.0,0.0,0.0
9,0.0,0.0,0.0,0.0,0.0,0.0,0.0,0.0,0.0,0.0,0.0,0.0,0.0,0.0,0.0,0.0,0.0,0.0,0.0,0.0,0.0
10,0.068,0.08020806277010642,0.0,0.0,0.1,0.1,0.3,0.0,0.0,0.0,0.0,0.0,0.0,0.0,6.800000000000001e-05,8.020806277010643e-05,0.0,0.0,0.0001,0.0001,0.0003
11,7.372000000000001,0.5256107558513874,6.3,7.0,7.3,7.8,8.4,0.0,0.0,0.0,0.0,0.0,0.0,0.0,0.007372,0.0005256107558513875,0.0063,0.007,0.0073,0.0078,0.0084
12,66.04799999999999,1.038075141788878,63.5,65.2,66.2,66.8,67.7,0.0,0.0,0.0,0.0,0.0,0.0,0.0,0.066048,0.001038075141788879,0.0635,0.0652,0.0662,0.0668,0.0677
13,99.82800000000002,0.14294521094927692,99.3,99.8,99.9,99.9,100.0,0.0,0.0,0.0,0.0,0.0,0.0,0.0,0.09982799999999999,0.00014294521094928032,0.0993,0.0998,0.0999,0.0999,0.1
14,99.94400000000002,0.07118052168020801,99.8,99.9,100.0,100.0,100.0,0.0018579199999999997,0.0005266099853465245,0.000901,0.0015019999999999999,0.002002,0.002202,0.0026030000000000003,0.10180000000000003,0.0005291502622129171,0.1009,0.1014,0.1019,0.1022,0.1026
15,99.94400000000002,0.07118052168020801,99.8,99.9,100.0,100.0,100.0,0.2973253599999999,0.03138710317269393,0.228629,0.27607600000000004,0.289389,0.32032,0.360861,0.39697199999999994,0.03136220549217376,0.3283,0.3758,0.389,0.4199,0.4605
16,99.94400000000002,0.07118052168020801,99.8,99.9,100.0,100.0,100.0,14.27381396,1.06273153634853,11.834434,13.633734,14.301601999999999,15.113714000000002,15.83954,14.359484000000002,1.0616709003107632,11.9225,13.7201,14.3873,15.1985,15.9235
17,99.94400000000002,0.07118052168020801,99.8,99.9,100.0,100.0,100.0,81.86982576,2.029892886863786,76.921622,81.142042,82.233233,83.44494499999999,84.578579,81.8879,2.0278662686018847,76.9447,81.1607,82.251,83.4615,84.5938
18,99.94400000000002,0.07118052168020801,99.8,99.9,100.0,100.0,100.0,99.93035848,0.006510552838277925,99.91491500000001,99.925826,99.93193199999999,99.934535,99.942142,99.93037200000002,0.006510857598401235,99.915,99.9258,99.9319,99.9346,99.9421
19,99.94400000000002,0.07118052168020801,99.8,99.9,100.0,100.0,100.0,99.95502315999998,0.002027913165463073,99.951552,99.954054,99.955055,99.95655699999999,99.958559,99.95501200000001,0.002042123078235689,99.9514,99.954,99.9551,99.9566,99.9586
20,99.94400000000002,0.07118052168020801,99.8,99.9,100.0,100.0,100.0,99.95503916,0.0020272891933117423,99.951552,99.954054,99.955055,99.95655699999999,99.958659,99.955028,0.00204195984289391,99.9514,99.954,99.9551,99.9566,99.9587
21,99.94400000000002,0.07118052168020801,99.8,99.9,100.0,100.0,100.0,99.95503916,0.0020272891933117423,99.951552,99.954054,99.955055,99.95655699999999,99.958659,99.955028,0.00204195984289391,99.9514,99.954,99.9551,99.9566,99.9587
22,99.94400000000002,0.07118052168020801,99.8,99.9,100.0,100.0,100.0,99.95503916,0.0020272891933117423,99.951552,99.954054,99.955055,99.95655699999999,99.958659,99.955028,0.00204195984289391,99.9514,99.954,99.9551,99.9566,99.9587
23,99.94400000000002,0.07118052168020801,99.8,99.9,100.0,100.0,100.0,99.95503916,0.0020272891933117423,99.951552,99.954054,99.955055,99.95655699999999,99.958659,99.955028,0.00204195984289391,99.9514,99.954,99.9551,99.9566,99.9587
24,99.94400000000002,0.07118052168020801,99.8,99.9,100.0,100.0,100.0,99.95503916,0.0020272891933117423,99.951552,99.954054,99.955055,99.95655699999999,99.958659,99.955028,0.00204195984289391,99.9514,99.954,99.9551,99.9566,99.9587
25,99.94400000000002,0.07118052168020801,99.8,99.9,100.0,100.0,100.0,99.95503916,0.0020272891933117423,99.951552,99.954054,99.955055,99.95655699999999,99.958659,99.955028,0.00204195984289391,99.9514,99.954,99.9551,99.9566,99.9587
