round,nodes,nodesP,nodesS,nodesSent,nodesSentP,nodesSentS,nodesRecv,nodesRecvP,nodesRecvS,msgSent,msgSentP,msgSentS,msgRecv,msgRecvP,msgRecvS,msgInfect,msgInfectP,msgInfectS
00,1000.000000,100.000000,900.000000,0.000000,0.000000,0.000000,0.000000,0.000000,0.000000,0.000000,0.000000,0.000000,0.000000,0.000000,0.000000,0.000000,0.000000,0.000000
01,1000.000000,100.000000,900.000000,0.100000,1.000000,0.000000,0.100000,1.000000,0.000000,10.000000,10.000000,0.000000,1.000000,1.000000,0.000000,0.100000,1.000000,0.000000
02,1000.000000,100.000000,900.000000,1.140000,11.400000,0.000000,1.140000,11.400000,0.000000,115.000000,115.000000,0.000000,11.500000,11.500000,0.000000,0.100000,1.000000,0.000000
03,1000.000000,100.000000,900.000000,7.120000,68.700000,0.277778,7.120000,68.700000,0.277778,1027.000000,1002.000000,25.000000,114.600000,112.100000,2.500000,0.910000,1.000000,0.900000
04,1000.000000,100.000000,900.000000,38.260000,100.000000,31.400000,38.260000,100.000000,31.400000,4817.000000,1991.000000,2826.000000,1022.600000,685.500000,337.100000,1.520000,6.200000,1.000000
05,1000.000000,100.000000,900.000000,98.500000,100.000000,98.333333,98.500000,100.000000,98.333333,10850.000000,2000.000000,8850.000000,4699.700000,1001.000000,3698.700000,4.510000,10.000000,3.900000
06,1000.000000,100.000000,900.000000,100.000000,100.000000,100.000000,100.000000,100.000000,100.000000,11000.000000,2000.000000,9000.000000,10845.000000,1001.000000,9844.000000,10.270000,10.000000,10.300000
07,1000.000000,100.000000,900.000000,100.000000,100.000000,100.000000,100.000000,100.000000,100.000000,11000.000000,2000.000000,9000.000000,11001.000000,1001.000000,10000.000000,10.900000,10.000000,11.000000
08,1000.000000,100.000000,900.000000,100.000000,100.000000,100.000000,100.000000,100.000000,100.000000,11000.000000,2000.000000,9000.000000,11001.000000,1001.000000,10000.000000,10.900000,10.000000,11.000000
09,1000.000000,100.000000,900.000000,100.000000,100.000000,100.000000,100.000000,100.000000,100.000000,11000.000000,2000.000000,9000.000000,11001.000000,1001.000000,10000.000000,10.900000,10.000000,11.000000
10,1000.000000,100.000000,900.000000,100.000000,100.000000,100.000000,100.000000,100.000000,100.000000,11000.000000,2000.000000,9000.000000,11001.000000,1001.000000,10000.000000,10.900000,10.000000,11.000000
11,1000.000000,100.000000,900.000000,100.000000,100.000000,100.000000,100.000000,100.000000,100.000000,11000.000000,2000.000000,9000.000000,11001.000000,1001.000000,10000.000000,10.900000,10.000000,11.000000
12,1000.000000,100.000000,900.000000,100.000000,100.000000,100.000000,100.000000,100.000000,100.000000,11000.000000,2000.000000,9000.000000,11001.000000,1001.000000,10000.000000,10.900000,10.000000,11.000000
13,1000.000000,100.000000,900.000000,100.000000,100.000000,100.000000,100.000000,100.000000,100.000000,11000.000000,2000.000000,9000.000000,11001.000000,1001.000000,10000.000000,10.900000,10.000000,11.000000
14,1000.000000,100.000000,900.000000,100.000000,100.000000,100.000000,100.000000,100.000000,100.000000,11000.000000,2000.000000,9000.000000,11001.000000,1001.000000,10000.000000,10.900000,10.000000,11.000000
15,1000.000000,100.000000,900.000000,100.000000,100.000000,100.000000,100.000000,100.000000,100.000000,11000.000000,2000.000000,9000.000000,11001.000000,1001.000000,10000.000000,10.900000,10.000000,11.000000
16,1000.000000,100.000000,900.000000,100.000000,100.000000,100.000000,100.000000,100.000000,100.000000,11000.000000,2000.000000,9000.000000,11001.000000,1001.000000,10000.000000,10.900000,10.000000,11.000000
17,1000.000000,100.000000,900.000000,100.000000,100.000000,100.000000,100.000000,100.000000,100.000000,11000.000000,2000.000000,9000.000000,11001.000000,1001.000000,10000.000000,10.900000,10.000000,11.000000
18,1000.000000,100.000000,900.000000,100.000000,100.000000,100.000000,100.000000,100.000000,100.000000,11000.000000,2000.000000,9000.000000,11001.000000,1001.000000,10000.000000,10.900000,10.000000,11.000000
19,1000.000000,100.000000,900.000000,100.000000,100.000000,100.000000,100.000000,100.000000,100.000000,11000.000000,2000.000000,9000.000000,11001.000000,1001.000000,10000.000000,10.900000,10.000000,11.000000
