gossips,p2p mean,p2p std,p2p min,p2p q1,p2p q2,p2p q3,p2p max,p2s mean,p2s std,p2s min,p2s q1,p2s q2,p2s q3,p2s max,s2s mean,s2s std,s2s min,s2s q1,s2s q2,s2s q3,s2s max
1,,,,,,,,,,,,,,,604313.6,5139.160785900114,595027.0,600386.0,603385.0,606743.0,615138.0
2,,,,,,,,,,,,,,,17185.76,1450.8214994730859,14734.0,16258.0,17102.0,17871.0,21746.0
3,,,,,,,,,,,,,,,1.5555555555555556,0.7264831572567788,1.0,1.0,1.0,2.0,3.0
4,,,,,,,,,,,,,,,,,,,,,
5,,,,,,,,,,,,,,,,,,,,,
