gossips,p2p mean,p2p std,p2p min,p2p q1,p2p q2,p2p q3,p2p max,p2s mean,p2s std,p2s min,p2s q1,p2s q2,p2s q3,p2s max,s2s mean,s2s std,s2s min,s2s q1,s2s q2,s2s q3,s2s max
1,49.012399999999985,0.14005237115688962,48.728,48.91,48.992,49.116,49.279,49.012399999999985,0.14005237115688962,48.728,48.91,48.992,49.116,49.279,51.94997336,0.05502338576451026,51.837,51.921,51.966556,51.989889,52.038111
2,22.343840000000004,0.15198099661909428,22.0,22.217,22.326,22.476,22.598,22.343840000000004,0.15198099661909428,22.0,22.217,22.326,22.476,22.598,22.474222200000003,0.04919457343718718,22.383556,22.431222,22.479444,22.502333,22.561222
3,2.08668,0.03991315572590069,1.986,2.068,2.092,2.109,2.152,2.08668,0.03991315572590069,1.986,2.068,2.092,2.109,2.152,1.0262978,0.01028149265671084,1.007889,1.019889,1.0264440000000001,1.032778,1.047444
4,0.025200000000000014,0.0041733280085163044,0.015,0.024,0.025,0.026,0.034,0.025200000000000014,0.0041733280085163044,0.015,0.024,0.025,0.026,0.034,0.011000040000000003,0.0011147570168725857,0.009222,0.009889,0.010889,0.011889,0.013
5,,,,,,,,,,,,,,,0.00012685714285714286,4.195405650402422e-05,0.00011100000000000001,0.00011100000000000001,0.00011100000000000001,0.00011100000000000001,0.00022200000000000003
