round,nodes,nodesP,nodesS,recvOne,recvOneP,recvOneS,recvAll,recvAllP,recvAllS,msgSent,msgSentP,msgSentS,msgRecv,msgRecvP,msgRecvS,consist,consistP,consistS,Unnamed: 19
0,1000000.0,1000000.0,0.0,8e-06,8e-06,0.0,0.00010799999999999997,0.00010799999999999997,0.0,10.8,10.8,0.0,0.08,0.08,0.0,0.00010799999999999997,0.00010799999999999997,0.0,
1,1000000.0,1000000.0,0.0,0.0010640000000000003,0.0010640000000000003,0.0,0.001164,0.001164,0.0,116.4,116.4,0.0,10.64,10.64,0.0,0.001164,0.001164,0.0,
2,1000000.0,1000000.0,0.0,0.011672,0.011672,0.0,0.011771999999999998,0.011771999999999998,0.0,1177.2,1177.2,0.0,116.72,116.72,0.0,0.011771999999999998,0.011771999999999998,0.0,
3,1000000.0,1000000.0,0.0,0.11690000000000002,0.11690000000000002,0.0,0.11699999999999998,0.11699999999999998,0.0,11700.0,11700.0,0.0,1169.84,1169.84,0.0,0.11699999999999998,0.11699999999999998,0.0,
4,1000000.0,1000000.0,0.0,1.1655919999999997,1.1655919999999997,0.0,1.1656919999999997,1.1656919999999997,0.0,116569.2,116569.2,0.0,11722.92,11722.92,0.0,1.1656919999999997,1.1656919999999997,0.0,
5,1000000.0,1000000.0,0.0,11.071216000000002,11.071216000000002,0.0,11.0713,11.0713,0.0,1107130.0,1107130.0,0.0,117334.16,117334.16,0.0,11.0713,11.0713,0.0,
6,1000000.0,1000000.0,0.0,66.227676,66.227676,0.0,66.22772000000002,66.22772000000002,0.0,6622772.0,6622772.0,0.0,1085566.2,1085566.2,0.0,66.22772000000002,66.22772000000002,0.0,
7,1000000.0,1000000.0,0.0,99.85240800000001,99.85240800000001,0.0,99.85240800000001,99.85240800000001,0.0,9985240.8,9985240.8,0.0,6510487.6,6510487.6,0.0,99.85240800000001,99.85240800000001,0.0,
8,1000000.0,1000000.0,0.0,99.99524399999999,99.99524399999999,0.0,99.99524399999999,99.99524399999999,0.0,9999524.4,9999524.4,0.0,9984958.4,9984958.4,0.0,99.99524399999999,99.99524399999999,0.0,
9,1000000.0,1000000.0,0.0,99.995344,99.995344,0.0,99.995344,99.995344,0.0,9999534.4,9999534.4,0.0,9999524.48,9999524.48,0.0,99.995344,99.995344,0.0,
10,1000000.0,1000000.0,0.0,99.995344,99.995344,0.0,99.995344,99.995344,0.0,9999534.4,9999534.4,0.0,9999534.4,9999534.4,0.0,99.995344,99.995344,0.0,
11,1000000.0,1000000.0,0.0,99.995344,99.995344,0.0,99.995344,99.995344,0.0,9999534.4,9999534.4,0.0,9999534.4,9999534.4,0.0,99.995344,99.995344,0.0,
12,1000000.0,1000000.0,0.0,99.995344,99.995344,0.0,99.995344,99.995344,0.0,9999534.4,9999534.4,0.0,9999534.4,9999534.4,0.0,99.995344,99.995344,0.0,
13,1000000.0,1000000.0,0.0,99.995344,99.995344,0.0,99.995344,99.995344,0.0,9999534.4,9999534.4,0.0,9999534.4,9999534.4,0.0,99.995344,99.995344,0.0,
14,1000000.0,1000000.0,0.0,99.995344,99.995344,0.0,99.995344,99.995344,0.0,9999534.4,9999534.4,0.0,9999534.4,9999534.4,0.0,99.995344,99.995344,0.0,
15,1000000.0,1000000.0,0.0,99.995344,99.995344,0.0,99.995344,99.995344,0.0,9999534.4,9999534.4,0.0,9999534.4,9999534.4,0.0,99.995344,99.995344,0.0,
16,1000000.0,1000000.0,0.0,99.995344,99.995344,0.0,99.995344,99.995344,0.0,9999534.4,9999534.4,0.0,9999534.4,9999534.4,0.0,99.995344,99.995344,0.0,
17,1000000.0,1000000.0,0.0,99.995344,99.995344,0.0,99.995344,99.995344,0.0,9999534.4,9999534.4,0.0,9999534.4,9999534.4,0.0,99.995344,99.995344,0.0,
18,1000000.0,1000000.0,0.0,99.995344,99.995344,0.0,99.995344,99.995344,0.0,9999534.4,9999534.4,0.0,9999534.4,9999534.4,0.0,99.995344,99.995344,0.0,
19,1000000.0,1000000.0,0.0,99.995344,99.995344,0.0,99.995344,99.995344,0.0,9999534.4,9999534.4,0.0,9999534.4,9999534.4,0.0,99.995344,99.995344,0.0,
20,1000000.0,1000000.0,0.0,99.995344,99.995344,0.0,99.995344,99.995344,0.0,9999534.4,9999534.4,0.0,9999534.4,9999534.4,0.0,99.995344,99.995344,0.0,
21,1000000.0,1000000.0,0.0,99.995344,99.995344,0.0,99.995344,99.995344,0.0,9999534.4,9999534.4,0.0,9999534.4,9999534.4,0.0,99.995344,99.995344,0.0,
22,1000000.0,1000000.0,0.0,99.995344,99.995344,0.0,99.995344,99.995344,0.0,9999534.4,9999534.4,0.0,9999534.4,9999534.4,0.0,99.995344,99.995344,0.0,
23,1000000.0,1000000.0,0.0,99.995344,99.995344,0.0,99.995344,99.995344,0.0,9999534.4,9999534.4,0.0,9999534.4,9999534.4,0.0,99.995344,99.995344,0.0,
24,1000000.0,1000000.0,0.0,99.995344,99.995344,0.0,99.995344,99.995344,0.0,9999534.4,9999534.4,0.0,9999534.4,9999534.4,0.0,99.995344,99.995344,0.0,
