gossips,p2p mean,p2p std,p2p min,p2p q1,p2p q2,p2p q3,p2p max,p2s mean,p2s std,p2s min,p2s q1,p2s q2,p2s q3,p2s max,s2s mean,s2s std,s2s min,s2s q1,s2s q2,s2s q3,s2s max
1,34.360119999999995,0.1729205790722057,34.003,34.251,34.309,34.49,34.719,69.57048,0.19955891360698402,69.027,69.492,69.563,69.658,69.955,56.014840000000014,0.13334228091925776,55.841889,55.924222,55.981778000000006,56.035332999999994,56.395
2,0.05272000000000002,0.009020901654860598,0.039,0.045,0.052,0.057,0.071,0.78152,0.03694265826926913,0.698,0.76,0.773,0.808,0.856,21.15832444,0.17771089659474112,20.772667000000002,21.085333,21.188778,21.262778,21.488
3,,,,,,,,,,,,,,,0.2689422,0.007558972637424566,0.255556,0.265,0.271111,0.273111,0.282111
