gossips,p2p mean,p2p std,p2p min,p2p q1,p2p q2,p2p q3,p2p max,p2s mean,p2s std,p2s min,p2s q1,p2s q2,p2s q3,p2s max,s2s mean,s2s std,s2s min,s2s q1,s2s q2,s2s q3,s2s max
1,49.255999999999986,1.493898702500719,45.0,48.5,49.3,50.4,51.7,77.3,0.9962429422585612,75.5,76.6,77.1,78.0,79.5,59.781249200000005,0.25333722482937815,59.179479,59.59509499999999,59.799099,59.999099,60.263964
2,22.507999999999996,1.2552954499505935,20.2,21.6,22.1,23.4,25.0,10.988,0.9052255704150941,9.3,10.4,10.9,11.7,13.2,11.542078079999996,0.33855054440978205,10.888088,11.362663000000001,11.525325,11.699499000000001,12.263664
3,1.972,0.3646002377033418,1.4,1.6,2.0,2.2,2.6,0.28260869565217395,0.15855074872402405,0.1,0.1,0.3,0.4,0.5,0.19343355999999998,0.00881169853130863,0.177878,0.18798800000000002,0.193193,0.19869900000000001,0.216917
4,0.12499999999999999,0.04629100498862758,0.1,0.1,0.1,0.125,0.2,,,,,,,,0.00087696,0.00033722859210531564,0.0003,0.000701,0.000801,0.001101,0.001702
5,,,,,,,,,,,,,,,,,,,,,
