gossips,p2p mean,p2p std,p2p min,p2p q1,p2p q2,p2p q3,p2p max,p2s mean,p2s std,p2s min,p2s q1,p2s q2,p2s q3,p2s max,s2s mean,s2s std,s2s min,s2s q1,s2s q2,s2s q3,s2s max
1,49.526399999999995,0.4424447234777849,48.66,49.29,49.44,49.89,50.58,49.526399999999995,0.4424447234777849,48.66,49.29,49.44,49.89,50.58,54.02949084000001,0.15280136494991448,53.849899,53.946263,54.00070699999999,54.06202,54.496768
2,21.987199999999994,0.270732340144284,21.42,21.85,22.0,22.17,22.54,21.987199999999994,0.270732340144284,21.42,21.85,22.0,22.17,22.54,20.96608084,0.09293159937452146,20.670101000000003,20.917071,20.983939000000003,21.024545,21.118182
3,1.8008000000000002,0.15321335886055545,1.39,1.68,1.83,1.9,2.08,1.8008000000000002,0.15321335886055545,1.39,1.68,1.83,1.9,2.08,1.3156525200000002,0.01515016314576633,1.276263,1.3121209999999999,1.3170709999999999,1.3260610000000002,1.346162
4,0.012,0.004472135954999579,0.01,0.01,0.01,0.01,0.02,0.012,0.004472135954999579,0.01,0.01,0.01,0.01,0.02,0.02394328,0.0017398220100535186,0.020404,0.022626,0.024141,0.024848,0.027777999999999997
5,,,,,,,,,,,,,,,0.000113625,3.570889244992065e-05,0.000101,0.000101,0.000101,0.000101,0.000202
