gossips,p2p mean,p2p std,p2p min,p2p 05th,p2p 25th,p2p 50th,p2p 75th,p2p 95th,p2p max,p2s mean,p2s std,p2s min,p2s 05th,p2s 25th,p2s 50th,p2s 75th,p2s 95th,p2s max,s2s mean,s2s std,s2s min,s2s 05th,s2s 25th,s2s 50th,s2s 75th,s2s 95th,s2s max
1,53.78103999999999,0.1346617926510714,53.528,53.572799999999994,53.711,53.764,53.874,54.0158,54.06,28.570960000000003,0.17820740276430733,28.196,28.282399999999996,28.488,28.551,28.694,28.796000000000003,28.928,0.8352978000000002,0.04246164730671668,0.763,0.7870222000000001,0.8058890000000001,0.827111,0.855778,0.9042000000000001,0.939333
2,5.888920000000001,0.06253441932248195,5.785,5.7972,5.847,5.876,5.928,5.9978,6.035,0.17352,0.012218412335487781,0.154,0.159,0.164,0.171,0.182,0.193,0.198,0.00019828571428571427,0.00018395590642924215,0.00011100000000000001,0.00011100000000000001,0.00011100000000000001,0.00011100000000000001,0.00019425000000000003,0.0005608999999999999,0.000778
3,0.06192,0.00656,0.047,0.0492,0.059,0.063,0.065,0.0708,0.074,,,,,,,,,,,,,,,,,,
4,0.001,0.0,0.001,0.001,0.001,0.001,0.001,0.001,0.001,,,,,,,,,,,,,,,,,,
5,,,,,,,,,,,,,,,,,,,,,,,,,,,
