round,P mean,P std,P min,P q1,P q2,P q3,P max,S mean,S std,S min,S q1,S q2,S q3,S max,P+S mean,P+S std,P+S min,P+S q1,P+S q2,P+S q3,P+S max
0,0.0,0.0,0.0,0.0,0.0,0.0,0.0,0.0,0.0,0.0,0.0,0.0,0.0,0.0,0.0,0.0,0.0,0.0,0.0,0.0,0.0
1,0.0,0.0,0.0,0.0,0.0,0.0,0.0,0.0,0.0,0.0,0.0,0.0,0.0,0.0,0.0,0.0,0.0,0.0,0.0,0.0,0.0
2,0.0,0.0,0.0,0.0,0.0,0.0,0.0,0.0,0.0,0.0,0.0,0.0,0.0,0.0,0.0,0.0,0.0,0.0,0.0,0.0,0.0
3,0.0,0.0,0.0,0.0,0.0,0.0,0.0,0.0,0.0,0.0,0.0,0.0,0.0,0.0,0.0,0.0,0.0,0.0,0.0,0.0,0.0
4,0.0,0.0,0.0,0.0,0.0,0.0,0.0,0.0,0.0,0.0,0.0,0.0,0.0,0.0,0.0,0.0,0.0,0.0,0.0,0.0,0.0
5,0.0,0.0,0.0,0.0,0.0,0.0,0.0,0.0,0.0,0.0,0.0,0.0,0.0,0.0,0.0,0.0,0.0,0.0,0.0,0.0,0.0
6,0.0,0.0,0.0,0.0,0.0,0.0,0.0,0.0,0.0,0.0,0.0,0.0,0.0,0.0,0.0,0.0,0.0,0.0,0.0,0.0,0.0
7,0.0,0.0,0.0,0.0,0.0,0.0,0.0,0.0,0.0,0.0,0.0,0.0,0.0,0.0,0.0,0.0,0.0,0.0,0.0,0.0,0.0
8,0.0,0.0,0.0,0.0,0.0,0.0,0.0,0.0,0.0,0.0,0.0,0.0,0.0,0.0,0.0,0.0,0.0,0.0,0.0,0.0,0.0
9,0.0,0.0,0.0,0.0,0.0,0.0,0.0,0.0,0.0,0.0,0.0,0.0,0.0,0.0,0.0,0.0,0.0,0.0,0.0,0.0,0.0
10,0.0,0.0,0.0,0.0,0.0,0.0,0.0,0.0,0.0,0.0,0.0,0.0,0.0,0.0,0.0,0.0,0.0,0.0,0.0,0.0,0.0
11,0.0,0.0,0.0,0.0,0.0,0.0,0.0,0.0,0.0,0.0,0.0,0.0,0.0,0.0,0.0,0.0,0.0,0.0,0.0,0.0,0.0
12,0.0,0.0,0.0,0.0,0.0,0.0,0.0,0.0,0.0,0.0,0.0,0.0,0.0,0.0,0.0,0.0,0.0,0.0,0.0,0.0,0.0
13,0.0,0.0,0.0,0.0,0.0,0.0,0.0,0.0,0.0,0.0,0.0,0.0,0.0,0.0,0.0,0.0,0.0,0.0,0.0,0.0,0.0
14,0.0108,0.01255653880122491,0.0,0.0,0.01,0.01,0.04,0.0,0.0,0.0,0.0,0.0,0.0,0.0,0.00010800000000000001,0.0001255653880122491,0.0,0.0,0.0001,0.0001,0.0004
15,0.42840000000000006,0.26852498331936764,0.05,0.25,0.33,0.65,1.04,0.0,0.0,0.0,0.0,0.0,0.0,0.0,0.004283999999999999,0.0026852498331936766,0.0005,0.0025,0.0033,0.0065,0.0104
16,6.0708,3.1152821167057514,1.59,4.2,5.3,7.7,14.23,0.0,0.0,0.0,0.0,0.0,0.0,0.0,0.060708000000000005,0.031152821167057514,0.0159,0.042,0.053,0.077,0.1423
17,31.3076,10.209843403957445,11.41,25.7,28.41,35.7,54.42,0.0,0.0,0.0,0.0,0.0,0.0,0.0,0.313076,0.10209843403957443,0.1141,0.257,0.2841,0.357,0.5442
18,69.78960000000001,10.649873035236931,40.39,64.16,68.89,75.92,88.59,0.00016159999999999997,0.00021024826594607943,0.0,0.0,0.000101,0.000202,0.0007070000000000001,0.6980560000000001,0.1066428505182915,0.4039,0.6417,0.689,0.7592,0.8866
19,92.5264,4.499586906965274,76.02,90.98,93.21,94.82,98.0,0.02191524,0.016888856126846874,0.0013130000000000001,0.011515000000000001,0.017071,0.029394,0.07171699999999999,0.94696,0.05625170367790354,0.7616,0.9207,0.9438,0.9735,1.051
20,98.68719999999999,0.9740059890301828,94.78,98.49,98.89,99.14,99.68,0.7641656,0.4747013403472756,0.11424200000000001,0.488788,0.633333,1.000808,1.9838380000000002,1.743396,0.47536187923868417,1.0609,1.4665,1.6118,1.982,2.96
21,99.76359999999998,0.15364678107052424,99.16,99.72,99.77,99.84,99.95,9.022735399999997,4.368626747756211,2.301919,6.252929,7.54404,10.772121,19.857475,9.930144000000002,4.325880040627571,3.2705,7.1878,8.4663,11.6628,20.6576
22,99.92800000000001,0.03403429642777037,99.86,99.91,99.93,99.95,99.99,39.171802,11.04349320057087,15.403433999999999,31.561716999999998,36.149495,43.022626,63.926162,39.77936400000001,10.933247848759306,16.248,32.2448,36.7874,43.5916,64.2861
23,99.95640000000002,0.01933907960581483,99.93,99.94,99.96,99.97,99.99,76.8202628,9.378301748033861,47.731313,72.026768,77.30535400000001,82.461313,92.05535400000001,77.051624,9.284522036804047,48.2537,72.3063,77.5322,82.6362,92.1342
24,99.95800000000001,0.019148542155124994,99.93,99.94,99.96,99.97,99.99,94.94595959999998,3.3610976190996364,81.889495,93.799495,95.500404,96.759697,98.72818199999999,94.99608000000002,3.327469633720699,82.0703,93.8614,95.5451,96.7916,98.7403
25,99.95880000000001,0.018779421361336354,99.93,99.94,99.96,99.97,99.99,99.16101012000001,0.6312150636735827,96.538081,99.00444399999999,99.291717,99.46717199999999,99.76798000000001,99.16898799999997,0.6248818937207232,96.5724,99.0143,99.2984,99.472,99.7697
26,99.95880000000001,0.018779421361336354,99.93,99.94,99.96,99.97,99.99,99.83700196,0.09303144525754029,99.451616,99.81434300000001,99.855253,99.883333,99.928788,99.83821999999998,0.09208034082618466,99.4568,99.816,99.8562,99.8841,99.9289
27,99.95880000000001,0.018779421361336354,99.93,99.94,99.96,99.97,99.99,99.93900199999999,0.014361293633695328,99.880505,99.936768,99.94080799999999,99.946263,99.952727,99.93920000000001,0.014196038179719522,99.8814,99.9369,99.9409,99.9462,99.9526
28,99.95880000000001,0.018779421361336354,99.93,99.94,99.96,99.97,99.99,99.95542628000001,0.0032434841158867317,99.94525300000001,99.954141,99.95596,99.957677,99.960303,99.95546,0.0031794915736135924,99.9455,99.9541,99.9557,99.9579,99.96
29,99.95880000000001,0.018779421361336354,99.93,99.94,99.96,99.97,99.99,99.95826679999999,0.002190416684095953,99.95434300000001,99.95656600000001,99.958081,99.95979799999999,99.96303,99.95827200000002,0.0021390262582199004,99.9544,99.9566,99.958,99.9598,99.9627
30,99.95880000000001,0.018779421361336354,99.93,99.94,99.96,99.97,99.99,99.9587072,0.0020925532848597456,99.955455,99.956869,99.958283,99.960101,99.96333299999999,99.958708,0.0020436731636942307,99.9555,99.9572,99.9584,99.9601,99.963
31,99.95880000000001,0.018779421361336354,99.93,99.94,99.96,99.97,99.99,99.958788,0.0020921470032816275,99.955455,99.95697,99.958384,99.960101,99.96333299999999,99.95878799999997,0.0020423271040644108,99.9555,99.9572,99.9586,99.9601,99.963
32,99.95880000000001,0.018779421361336354,99.93,99.94,99.96,99.97,99.99,99.95880012000002,0.002107595180137657,99.955455,99.95697,99.958485,99.960101,99.96343399999999,99.9588,0.002057304061145688,99.9555,99.9572,99.9586,99.9601,99.9631
33,99.95880000000001,0.018779421361336354,99.93,99.94,99.96,99.97,99.99,99.95880012000002,0.002107595180137657,99.955455,99.95697,99.958485,99.960101,99.96343399999999,99.9588,0.002057304061145688,99.9555,99.9572,99.9586,99.9601,99.9631
34,99.95880000000001,0.018779421361336354,99.93,99.94,99.96,99.97,99.99,99.95880012000002,0.002107595180137657,99.955455,99.95697,99.958485,99.960101,99.96343399999999,99.9588,0.002057304061145688,99.9555,99.9572,99.9586,99.9601,99.9631
35,99.95880000000001,0.018779421361336354,99.93,99.94,99.96,99.97,99.99,99.95880012000002,0.002107595180137657,99.955455,99.95697,99.958485,99.960101,99.96343399999999,99.9588,0.002057304061145688,99.9555,99.9572,99.9586,99.9601,99.9631
36,99.95880000000001,0.018779421361336354,99.93,99.94,99.96,99.97,99.99,99.95880012000002,0.002107595180137657,99.955455,99.95697,99.958485,99.960101,99.96343399999999,99.9588,0.002057304061145688,99.9555,99.9572,99.9586,99.9601,99.9631
37,99.95880000000001,0.018779421361336354,99.93,99.94,99.96,99.97,99.99,99.95880012000002,0.002107595180137657,99.955455,99.95697,99.958485,99.960101,99.96343399999999,99.9588,0.002057304061145688,99.9555,99.9572,99.9586,99.9601,99.9631
38,99.95880000000001,0.018779421361336354,99.93,99.94,99.96,99.97,99.99,99.95880012000002,0.002107595180137657,99.955455,99.95697,99.958485,99.960101,99.96343399999999,99.9588,0.002057304061145688,99.9555,99.9572,99.9586,99.9601,99.9631
39,99.95880000000001,0.018779421361336354,99.93,99.94,99.96,99.97,99.99,99.95880012000002,0.002107595180137657,99.955455,99.95697,99.958485,99.960101,99.96343399999999,99.9588,0.002057304061145688,99.9555,99.9572,99.9586,99.9601,99.9631
40,99.95880000000001,0.018779421361336354,99.93,99.94,99.96,99.97,99.99,99.95880012000002,0.002107595180137657,99.955455,99.95697,99.958485,99.960101,99.96343399999999,99.9588,0.002057304061145688,99.9555,99.9572,99.9586,99.9601,99.9631
41,99.95880000000001,0.018779421361336354,99.93,99.94,99.96,99.97,99.99,99.95880012000002,0.002107595180137657,99.955455,99.95697,99.958485,99.960101,99.96343399999999,99.9588,0.002057304061145688,99.9555,99.9572,99.9586,99.9601,99.9631
42,99.95880000000001,0.018779421361336354,99.93,99.94,99.96,99.97,99.99,99.95880012000002,0.002107595180137657,99.955455,99.95697,99.958485,99.960101,99.96343399999999,99.9588,0.002057304061145688,99.9555,99.9572,99.9586,99.9601,99.9631
43,99.95880000000001,0.018779421361336354,99.93,99.94,99.96,99.97,99.99,99.95880012000002,0.002107595180137657,99.955455,99.95697,99.958485,99.960101,99.96343399999999,99.9588,0.002057304061145688,99.9555,99.9572,99.9586,99.9601,99.9631
44,99.95880000000001,0.018779421361336354,99.93,99.94,99.96,99.97,99.99,99.95880012000002,0.002107595180137657,99.955455,99.95697,99.958485,99.960101,99.96343399999999,99.9588,0.002057304061145688,99.9555,99.9572,99.9586,99.9601,99.9631
45,99.95880000000001,0.018779421361336354,99.93,99.94,99.96,99.97,99.99,99.95880012000002,0.002107595180137657,99.955455,99.95697,99.958485,99.960101,99.96343399999999,99.9588,0.002057304061145688,99.9555,99.9572,99.9586,99.9601,99.9631
46,99.95880000000001,0.018779421361336354,99.93,99.94,99.96,99.97,99.99,99.95880012000002,0.002107595180137657,99.955455,99.95697,99.958485,99.960101,99.96343399999999,99.9588,0.002057304061145688,99.9555,99.9572,99.9586,99.9601,99.9631
47,99.95880000000001,0.018779421361336354,99.93,99.94,99.96,99.97,99.99,99.95880012000002,0.002107595180137657,99.955455,99.95697,99.958485,99.960101,99.96343399999999,99.9588,0.002057304061145688,99.9555,99.9572,99.9586,99.9601,99.9631
48,99.95880000000001,0.018779421361336354,99.93,99.94,99.96,99.97,99.99,99.95880012000002,0.002107595180137657,99.955455,99.95697,99.958485,99.960101,99.96343399999999,99.9588,0.002057304061145688,99.9555,99.9572,99.9586,99.9601,99.9631
49,99.95880000000001,0.018779421361336354,99.93,99.94,99.96,99.97,99.99,99.95880012000002,0.002107595180137657,99.955455,99.95697,99.958485,99.960101,99.96343399999999,99.9588,0.002057304061145688,99.9555,99.9572,99.9586,99.9601,99.9631
50,99.95880000000001,0.018779421361336354,99.93,99.94,99.96,99.97,99.99,99.95880012000002,0.002107595180137657,99.955455,99.95697,99.958485,99.960101,99.96343399999999,99.9588,0.002057304061145688,99.9555,99.9572,99.9586,99.9601,99.9631
