gossips,p2p mean,p2p std,p2p min,p2p q1,p2p q2,p2p q3,p2p max,p2s mean,p2s std,p2s min,p2s q1,p2s q2,p2s q3,p2s max,s2s mean,s2s std,s2s min,s2s q1,s2s q2,s2s q3,s2s max
1,17.162400000000005,4.439815386552313,6.48,15.02,16.26,19.5,27.85,2.4776000000000002,1.8549489660545022,0.17,1.45,1.71,2.89,8.1,0.010529120000000001,0.009015008307076963,0.000505,0.004141,0.006364,0.014747,0.031212
2,0.8427999999999999,0.432700050073181,0.07,0.62,0.76,0.99,2.27,0.02,0.008944271909999158,0.01,0.0125,0.02,0.0275,0.03,,,,,,,
3,0.02428571428571429,0.019499225118444586,0.01,0.01,0.02,0.0275,0.07,,,,,,,,,,,,,,
4,,,,,,,,,,,,,,,,,,,,,
5,,,,,,,,,,,,,,,,,,,,,
6,,,,,,,,,,,,,,,,,,,,,
7,,,,,,,,,,,,,,,,,,,,,
