gossips,p2p mean,p2p std,p2p min,p2p q1,p2p q2,p2p q3,p2p max,p2s mean,p2s std,p2s min,p2s q1,p2s q2,p2s q3,p2s max,s2s mean,s2s std,s2s min,s2s q1,s2s q2,s2s q3,s2s max
1,5179.64,59.295081302471246,5016.0,5144.0,5167.0,5217.0,5291.0,5843.88,51.925684075096086,5753.0,5805.0,5839.0,5871.0,5954.0,522168.64,1779.5558874805456,518204,521688.0,522209,522773.0,526874
2,1865.4,36.058979464205585,1796.0,1841.0,1859.0,1888.0,1935.0,2025.12,55.008575089101626,1913.0,1996.0,2039.0,2061.0,2134.0,215456.2,2030.4731591429565,211947,214436.0,215007,216876.0,220484
3,3.3043478260869565,1.579262849004262,1.0,2.0,3.0,4.0,7.0,20.92,5.05733790315287,11.0,16.0,21.0,24.0,31.0,11881.24,319.38721013841507,11250,11654.0,11866,12087.0,12515
4,,,,,,,,,,,,,,,166.88,15.666631205633628,139,155.0,166,180.0,199
5,,,,,,,,,,,,,,,1.0,0.0,1,1.0,1,1.0,1
