gossips,p2p mean,p2p std,p2p min,p2p q1,p2p q2,p2p q3,p2p max,p2s mean,p2s std,p2s min,p2s q1,p2s q2,p2s q3,p2s max,s2s mean,s2s std,s2s min,s2s q1,s2s q2,s2s q3,s2s max
1,49.996,1.6377016415289647,46.6,49.0,50.2,51.2,53.4,58.084,1.4544987681901518,55.7,56.9,57.9,59.0,61.5,52.20389587999999,0.2692772993917107,51.365365000000004,52.121321,52.182783,52.345345,52.657256999999994
2,21.887999999999998,1.1358990565480143,19.9,21.2,21.9,22.7,24.1,20.612,1.1486658928223352,17.1,20.3,20.7,21.4,22.1,21.6841682,0.40074735159314157,20.997598,21.435935999999998,21.674775,22.0004,22.338639
3,2.028,0.4046809442840948,1.2,1.7,2.1,2.2,2.9,0.30833333333333335,0.17916877315917054,0.1,0.2,0.3,0.4,0.8,1.3692772400000004,0.0654106463265474,1.24955,1.3202200000000002,1.369069,1.423123,1.520821
4,0.15000000000000002,0.07071067811865475,0.1,0.125,0.15000000000000002,0.17500000000000002,0.2,,,,,,,,0.026910960000000005,0.0030468124529306573,0.021822,0.024825,0.026726999999999997,0.028929000000000003,0.032933
5,,,,,,,,,,,,,,,0.00016874999999999998,9.464847243000456e-05,0.0001,0.0001,0.0001,0.0002,0.0004
6,,,,,,,,,,,,,,,,,,,,,
