gossips,p2p mean,p2p std,p2p min,p2p q1,p2p q2,p2p q3,p2p max,p2s mean,p2s std,p2s min,p2s q1,p2s q2,p2s q3,p2s max,s2s mean,s2s std,s2s min,s2s q1,s2s q2,s2s q3,s2s max
1,49.127999999999986,1.541514406895591,46.1,48.5,49.1,50.3,51.6,57.87600000000002,1.3587003594121356,54.6,57.1,58.0,58.9,60.6,51.93814611999999,0.31371359373642965,51.319720000000004,51.741642,51.845445,52.173473,52.491091000000004
2,22.372,1.108497481578856,20.6,21.7,22.0,23.0,24.4,20.652,1.3016399911906007,17.6,19.6,20.9,21.7,22.7,21.849525560000004,0.52302128360677,20.730631,21.593894,21.991792,22.233734,22.458257999999997
3,1.9120000000000001,0.37674040576149165,1.1,1.7,2.0,2.1,2.6,0.3416666666666666,0.17424786610050552,0.1,0.2,0.3,0.5,0.7,1.45564764,0.06471316374901376,1.3227229999999999,1.401602,1.4519520000000001,1.494194,1.606406
4,,,,,,,,,,,,,,,0.03133536,0.0031071352813591274,0.024525,0.029129000000000002,0.031731999999999996,0.032632999999999995,0.041241
5,,,,,,,,,,,,,,,0.00025015,0.0001734939025168502,0.0001,0.0001,0.0002,0.000325,0.000701
6,,,,,,,,,,,,,,,,,,,,,
