round,Norm mean,Norm std
0,0.0,0.0
1,0.000104,1.95959179423e-05
2,0.001184,9.66643677888e-05
3,0.011756,0.000302099321416
4,0.117108,0.00196914600779
5,1.165372,0.00275456276022
6,11.019576,0.129329103546
7,66.130388,0.23610283407
8,99.851088,0.00344387223921
9,99.995316,0.000987392525798
10,99.995352,0.000988380493535
11,99.995352,0.000988380493535
12,99.995352,0.000988380493535
13,99.995352,0.000988380493535
14,99.995352,0.000988380493535
15,99.995352,0.000988380493535
16,99.995352,0.000988380493535
17,99.995352,0.000988380493535
18,99.995352,0.000988380493535
19,99.995352,0.000988380493535
