gossips,p2p mean,p2p std,p2p min,p2p q1,p2p q2,p2p q3,p2p max,p2s mean,p2s std,p2s min,p2s q1,p2s q2,p2s q3,p2s max,s2s mean,s2s std,s2s min,s2s q1,s2s q2,s2s q3,s2s max
1,49.51208,0.1441734834611882,49.21,49.41,49.528,49.591,49.792,58.417,0.33537242979509624,57.808,58.235,58.397,58.529,59.054,55.77602224,0.2838870876823616,55.38933299999999,55.607556,55.688556000000005,55.805443999999994,56.45844399999999
2,21.93152,0.15266715429325403,21.651,21.78,21.961,22.04,22.143,20.237880000000004,0.2277171710697289,19.742,20.038,20.26,20.425,20.579,21.4290756,0.18141057582984765,20.999556,21.343778,21.457,21.571889000000002,21.724110999999997
3,1.8223199999999997,0.04575816866964849,1.712,1.803,1.826,1.858,1.889,0.31768,0.019056320036495336,0.272,0.306,0.315,0.333,0.353,0.4464666799999999,0.01856480099255937,0.40155599999999997,0.44277799999999995,0.44888900000000004,0.45677799999999996,0.484889
4,0.0023913043478260877,0.0013395769493246945,0.001,0.0015,0.002,0.003,0.006,0.002142857142857143,0.001167320591199077,0.001,0.001,0.002,0.003,0.005,0.002137760000000001,0.0005960207826354157,0.001333,0.001667,0.002,0.002333,0.003556
5,,,,,,,,,,,,,,,,,,,,,
