gossips,p2p mean,p2p std,p2p min,p2p q1,p2p q2,p2p q3,p2p max,p2s mean,p2s std,p2s min,p2s q1,p2s q2,p2s q3,p2s max,s2s mean,s2s std,s2s min,s2s q1,s2s q2,s2s q3,s2s max
1,51.62948,0.2056356243455891,51.301,51.478,51.575,51.753,52.09,50.24636,0.17421798605961022,49.872,50.114,50.274,50.357,50.561,52.83726228,0.1768376959452079,52.566,52.719556000000004,52.751667000000005,52.911111,53.237556000000005
2,18.801400000000005,0.1655558818043025,18.518,18.7,18.813,18.917,19.076,18.312120000000004,0.17086698530338423,17.937,18.208,18.3,18.405,18.809,23.3066532,0.1824792859925023,22.615111,23.263222,23.322556,23.360332999999997,23.584889
3,0.028320000000000012,0.005320714237769211,0.017,0.026,0.029,0.031,0.039,0.01876000000000001,0.004692902442341342,0.012,0.015,0.019,0.021,0.031,0.17797332000000002,0.020893024102396792,0.13933299999999998,0.151889,0.187111,0.192444,0.197778
4,,,,,,,,,,,,,,,0.00020894117647058823,8.671466902162178e-05,0.00011100000000000001,0.00011100000000000001,0.00022200000000000003,0.00022200000000000003,0.000333
5,,,,,,,,,,,,,,,,,,,,,
