round,P mean,P std,P min,P q1,P q2,P q3,P max,S mean,S std,S min,S q1,S q2,S q3,S max,P+S mean,P+S std,P+S min,P+S q1,P+S q2,P+S q3,P+S max
0,0.0,0.0,0.0,0.0,0.0,0.0,0.0,0.0,0.0,0.0,0.0,0.0,0.0,0.0,0.0,0.0,0.0,0.0,0.0,0.0,0.0
1,0.0,0.0,0.0,0.0,0.0,0.0,0.0,0.0,0.0,0.0,0.0,0.0,0.0,0.0,0.0,0.0,0.0,0.0,0.0,0.0,0.0
2,0.0,0.0,0.0,0.0,0.0,0.0,0.0,0.0,0.0,0.0,0.0,0.0,0.0,0.0,0.0,0.0,0.0,0.0,0.0,0.0,0.0
3,0.0,0.0,0.0,0.0,0.0,0.0,0.0,0.0,0.0,0.0,0.0,0.0,0.0,0.0,0.0,0.0,0.0,0.0,0.0,0.0,0.0
4,0.0,0.0,0.0,0.0,0.0,0.0,0.0,0.0,0.0,0.0,0.0,0.0,0.0,0.0,0.0,0.0,0.0,0.0,0.0,0.0,0.0
5,0.0,0.0,0.0,0.0,0.0,0.0,0.0,0.0,0.0,0.0,0.0,0.0,0.0,0.0,0.0,0.0,0.0,0.0,0.0,0.0,0.0
6,0.0,0.0,0.0,0.0,0.0,0.0,0.0,0.0,0.0,0.0,0.0,0.0,0.0,0.0,0.0,0.0,0.0,0.0,0.0,0.0,0.0
7,0.0,0.0,0.0,0.0,0.0,0.0,0.0,0.0,0.0,0.0,0.0,0.0,0.0,0.0,0.0,0.0,0.0,0.0,0.0,0.0,0.0
8,0.0,0.0,0.0,0.0,0.0,0.0,0.0,0.0,0.0,0.0,0.0,0.0,0.0,0.0,0.0,0.0,0.0,0.0,0.0,0.0,0.0
9,0.0,0.0,0.0,0.0,0.0,0.0,0.0,0.0,0.0,0.0,0.0,0.0,0.0,0.0,0.0,0.0,0.0,0.0,0.0,0.0,0.0
10,0.0,0.0,0.0,0.0,0.0,0.0,0.0,0.0,0.0,0.0,0.0,0.0,0.0,0.0,0.0,0.0,0.0,0.0,0.0,0.0,0.0
11,0.0,0.0,0.0,0.0,0.0,0.0,0.0,0.0,0.0,0.0,0.0,0.0,0.0,0.0,0.0,0.0,0.0,0.0,0.0,0.0,0.0
12,0.0,0.0,0.0,0.0,0.0,0.0,0.0,0.0,0.0,0.0,0.0,0.0,0.0,0.0,0.0,0.0,0.0,0.0,0.0,0.0,0.0
13,0.0,0.0,0.0,0.0,0.0,0.0,0.0,0.0,0.0,0.0,0.0,0.0,0.0,0.0,0.0,0.0,0.0,0.0,0.0,0.0,0.0
14,0.0,0.0,0.0,0.0,0.0,0.0,0.0,0.0,0.0,0.0,0.0,0.0,0.0,0.0,0.0,0.0,0.0,0.0,0.0,0.0,0.0
15,0.0,0.0,0.0,0.0,0.0,0.0,0.0,0.0,0.0,0.0,0.0,0.0,0.0,0.0,0.0,0.0,0.0,0.0,0.0,0.0,0.0
16,0.0,0.0,0.0,0.0,0.0,0.0,0.0,0.0,0.0,0.0,0.0,0.0,0.0,0.0,0.0,0.0,0.0,0.0,0.0,0.0,0.0
17,0.0,0.0,0.0,0.0,0.0,0.0,0.0,0.0,0.0,0.0,0.0,0.0,0.0,0.0,0.0,0.0,0.0,0.0,0.0,0.0,0.0
18,0.032400000000000005,0.01854723699099141,0.0,0.02,0.03,0.04,0.07,0.0,0.0,0.0,0.0,0.0,0.0,0.0,0.00032399999999999996,0.0001854723699099141,0.0,0.0002,0.0003,0.0004,0.0007
19,0.32239999999999996,0.0549454274712646,0.23,0.27,0.33,0.37,0.42,0.0,0.0,0.0,0.0,0.0,0.0,0.0,0.0032239999999999994,0.0005494542747126462,0.0023,0.0027,0.0033,0.0037,0.0042
20,2.9652000000000003,0.14843966226495317,2.73,2.85,2.95,3.03,3.27,0.0,0.0,0.0,0.0,0.0,0.0,0.0,0.029651999999999998,0.0014843966226495307,0.0273,0.0285,0.0295,0.0303,0.0327
21,27.663600000000006,0.4612472222138575,26.91,27.31,27.7,27.96,28.59,0.0,0.0,0.0,0.0,0.0,0.0,0.0,0.27663600000000005,0.004612472222138575,0.2691,0.2731,0.277,0.2796,0.2859
22,42.156000000000006,0.5439362707768866,41.39,41.6,42.14,42.61,43.25,0.0,0.0,0.0,0.0,0.0,0.0,0.0,0.42156,0.005439362707768862,0.4139,0.416,0.4214,0.4261,0.4325
23,65.0428,0.5879662688737618,63.43,64.76,65.01,65.32,66.16,4.04e-06,2.02e-05,0.0,0.0,0.0,0.0,0.000101,0.650432,0.005877337832726637,0.6343,0.6476,0.6501,0.6532,0.6616
24,99.51479999999998,0.07130451131122865,99.36,99.47,99.51,99.58,99.63,0.0005292399999999999,0.00021677778176433732,0.000202,0.000404,0.000505,0.000606,0.001212,0.9956720000000001,0.0007971407236701322,0.9939,0.9952,0.9956,0.9962,0.9971
25,99.65200000000003,0.05937171043518844,99.5,99.63,99.66,99.69,99.75,0.013660400000000001,0.0012063944559443781,0.011717,0.012828,0.013434,0.014444,0.016263,1.0100440000000002,0.0012513592609638784,1.0079,1.0092,1.0095,1.0113,1.0125
26,99.79639999999999,0.05655970296951651,99.66,99.77,99.8,99.83,99.88,0.21761616,0.005743992214189251,0.20494899999999996,0.213333,0.217677,0.222121,0.22899,1.213404,0.005652321057170492,1.2007,1.2088,1.2133,1.2174,1.2252
27,99.9572,0.021702534414210037,99.9,99.95,99.96,99.97,100.0,4.67665852,0.08563388882481057,4.513737,4.6431309999999995,4.673030000000001,4.7347470000000005,4.87596,5.629464000000001,0.08480811124729365,5.4681,5.5963,5.626,5.6871,5.8267
28,99.9572,0.021702534414210037,99.9,99.95,99.96,99.97,100.0,12.482876799999996,0.18483353534554672,12.153535,12.345657000000001,12.457272999999999,12.651817999999999,12.771717,13.357620000000002,0.18299965391588438,13.0312,13.2215,13.3324,13.5246,13.643
29,99.9572,0.021702534414210037,99.9,99.95,99.96,99.97,100.0,33.271070720000004,0.3999944383138881,32.58303,32.894746999999995,33.252323,33.618081,34.036263,33.937932,0.39601638825516605,33.2567,33.5653,33.9195,34.2814,34.6957
30,99.9572,0.021702534414210037,99.9,99.95,99.96,99.97,100.0,92.51044440000001,0.1599838323724719,92.21202,92.38919200000001,92.499394,92.622626,92.80151500000001,92.58491199999999,0.1584147991824003,92.2894,92.4646,92.5742,92.6961,92.873
31,99.9572,0.021702534414210037,99.9,99.95,99.96,99.97,100.0,94.90694552000001,0.13851178442047135,94.705455,94.78303000000001,94.87899,95.05404,95.120303,94.957448,0.13713073178540283,94.7576,94.8347,94.9299,95.1032,95.1681
32,99.9572,0.021702534414210037,99.9,99.95,99.96,99.97,100.0,97.3887234,0.11004546988252766,97.175556,97.30202,97.37697,97.465253,97.602323,97.41440800000001,0.10896514320338159,97.2033,97.3285,97.4029,97.4901,97.6261
33,99.9572,0.021702534414210037,99.9,99.95,99.96,99.97,100.0,99.95611724,0.0020136412143186492,99.95201999999999,99.954747,99.95636400000001,99.957374,99.96,99.95612799999999,0.0020075939164390447,99.9522,99.9547,99.9563,99.9575,99.9601
34,99.9572,0.021702534414210037,99.9,99.95,99.96,99.97,100.0,99.95734564,0.0018981121296326089,99.953232,99.95596,99.957576,99.958586,99.960909,99.95734399999999,0.0018938672955972607,99.9534,99.9559,99.9577,99.9587,99.961
35,99.9572,0.021702534414210037,99.9,99.95,99.96,99.97,100.0,99.95846879999999,0.0018084087849063468,99.95434300000001,99.957273,99.958788,99.960101,99.961515,99.95845600000001,0.0018193588614306517,99.9545,99.9572,99.9584,99.9595,99.9616
36,99.9572,0.021702534414210037,99.9,99.95,99.96,99.97,100.0,99.95963640000002,0.0017727825820821434,99.95565699999999,99.958485,99.95979799999999,99.960707,99.962424,99.95961199999998,0.0017914891384869724,99.9558,99.9586,99.9599,99.9608,99.9625
37,99.9572,0.021702534414210037,99.9,99.95,99.96,99.97,100.0,99.95963640000002,0.0017727825820821434,99.95565699999999,99.958485,99.95979799999999,99.960707,99.962424,99.95961199999998,0.0017914891384869724,99.9558,99.9586,99.9599,99.9608,99.9625
38,99.9572,0.021702534414210037,99.9,99.95,99.96,99.97,100.0,99.95963640000002,0.0017727825820821434,99.95565699999999,99.958485,99.95979799999999,99.960707,99.962424,99.95961199999998,0.0017914891384869724,99.9558,99.9586,99.9599,99.9608,99.9625
39,99.9572,0.021702534414210037,99.9,99.95,99.96,99.97,100.0,99.95963640000002,0.0017727825820821434,99.95565699999999,99.958485,99.95979799999999,99.960707,99.962424,99.95961199999998,0.0017914891384869724,99.9558,99.9586,99.9599,99.9608,99.9625
40,99.9572,0.021702534414210037,99.9,99.95,99.96,99.97,100.0,99.95963640000002,0.0017727825820821434,99.95565699999999,99.958485,99.95979799999999,99.960707,99.962424,99.95961199999998,0.0017914891384869724,99.9558,99.9586,99.9599,99.9608,99.9625
41,99.9572,0.021702534414210037,99.9,99.95,99.96,99.97,100.0,99.95963640000002,0.0017727825820821434,99.95565699999999,99.958485,99.95979799999999,99.960707,99.962424,99.95961199999998,0.0017914891384869724,99.9558,99.9586,99.9599,99.9608,99.9625
42,99.9572,0.021702534414210037,99.9,99.95,99.96,99.97,100.0,99.95963640000002,0.0017727825820821434,99.95565699999999,99.958485,99.95979799999999,99.960707,99.962424,99.95961199999998,0.0017914891384869724,99.9558,99.9586,99.9599,99.9608,99.9625
43,99.9572,0.021702534414210037,99.9,99.95,99.96,99.97,100.0,99.95963640000002,0.0017727825820821434,99.95565699999999,99.958485,99.95979799999999,99.960707,99.962424,99.95961199999998,0.0017914891384869724,99.9558,99.9586,99.9599,99.9608,99.9625
44,99.9572,0.021702534414210037,99.9,99.95,99.96,99.97,100.0,99.95963640000002,0.0017727825820821434,99.95565699999999,99.958485,99.95979799999999,99.960707,99.962424,99.95961199999998,0.0017914891384869724,99.9558,99.9586,99.9599,99.9608,99.9625
45,99.9572,0.021702534414210037,99.9,99.95,99.96,99.97,100.0,99.95963640000002,0.0017727825820821434,99.95565699999999,99.958485,99.95979799999999,99.960707,99.962424,99.95961199999998,0.0017914891384869724,99.9558,99.9586,99.9599,99.9608,99.9625
46,99.9572,0.021702534414210037,99.9,99.95,99.96,99.97,100.0,99.95963640000002,0.0017727825820821434,99.95565699999999,99.958485,99.95979799999999,99.960707,99.962424,99.95961199999998,0.0017914891384869724,99.9558,99.9586,99.9599,99.9608,99.9625
47,99.9572,0.021702534414210037,99.9,99.95,99.96,99.97,100.0,99.95963640000002,0.0017727825820821434,99.95565699999999,99.958485,99.95979799999999,99.960707,99.962424,99.95961199999998,0.0017914891384869724,99.9558,99.9586,99.9599,99.9608,99.9625
48,99.9572,0.021702534414210037,99.9,99.95,99.96,99.97,100.0,99.95963640000002,0.0017727825820821434,99.95565699999999,99.958485,99.95979799999999,99.960707,99.962424,99.95961199999998,0.0017914891384869724,99.9558,99.9586,99.9599,99.9608,99.9625
49,99.9572,0.021702534414210037,99.9,99.95,99.96,99.97,100.0,99.95963640000002,0.0017727825820821434,99.95565699999999,99.958485,99.95979799999999,99.960707,99.962424,99.95961199999998,0.0017914891384869724,99.9558,99.9586,99.9599,99.9608,99.9625
50,99.9572,0.021702534414210037,99.9,99.95,99.96,99.97,100.0,99.95963640000002,0.0017727825820821434,99.95565699999999,99.958485,99.95979799999999,99.960707,99.962424,99.95961199999998,0.0017914891384869724,99.9558,99.9586,99.9599,99.9608,99.9625
