round,P mean,P std,P min,P q1,P q2,P q3,P max,S mean,S std,S min,S q1,S q2,S q3,S max,P+S mean,P+S std,P+S min,P+S q1,P+S q2,P+S q3,P+S max
0,0.04,0.2,0,0,0,0,1,0.96,0.2,0,1,1,1,1,0.0,0.0,0,0,0,0,0
1,1.0,0.0,1,1,1,1,1,0.96,0.2,0,1,1,1,1,0.96,0.2,0,1,1,1,1
2,1.0,0.0,1,1,1,1,1,1.0,0.0,1,1,1,1,1,1.0,0.0,1,1,1,1,1
3,1.0,0.0,1,1,1,1,1,1.0,0.0,1,1,1,1,1,1.0,0.0,1,1,1,1,1
4,1.0,0.0,1,1,1,1,1,1.0,0.0,1,1,1,1,1,1.0,0.0,1,1,1,1,1
5,1.0,0.0,1,1,1,1,1,1.0,0.0,1,1,1,1,1,1.0,0.0,1,1,1,1,1
6,1.0,0.0,1,1,1,1,1,1.0,0.0,1,1,1,1,1,1.0,0.0,1,1,1,1,1
7,1.68,0.4760952285695233,1,1,2,2,2,1.0,0.0,1,1,1,1,1,1.0,0.0,1,1,1,1,1
8,2.0,0.816496580927726,1,1,2,3,3,1.0,0.0,1,1,1,1,1,1.0,0.0,1,1,1,1,1
9,2.2,1.1180339887498947,1,1,2,3,4,1.0,0.0,1,1,1,1,1,1.0,0.0,1,1,1,1,1
10,2.28,1.2754084313139329,1,1,2,3,5,1.0,0.0,1,1,1,1,1,1.0,0.0,1,1,1,1,1
11,2.32,1.3759844960366863,1,1,2,3,6,1.0,0.0,1,1,1,1,1,1.0,0.0,1,1,1,1,1
12,2.36,1.4966629547095764,1,1,2,3,7,1.0,0.0,1,1,1,1,1,1.0,0.0,1,1,1,1,1
13,2.4,1.6329931618554523,1,1,2,3,8,1.0,0.0,1,1,1,1,1,1.0,0.0,1,1,1,1,1
14,2.4,1.6329931618554523,1,1,2,3,8,1.0,0.0,1,1,1,1,1,1.0,0.0,1,1,1,1,1
15,2.4,1.6329931618554523,1,1,2,3,8,1.0,0.0,1,1,1,1,1,1.0,0.0,1,1,1,1,1
16,2.4,1.6329931618554523,1,1,2,3,8,1.0,0.0,1,1,1,1,1,1.0,0.0,1,1,1,1,1
17,2.4,1.6329931618554523,1,1,2,3,8,1.0,0.0,1,1,1,1,1,1.0,0.0,1,1,1,1,1
18,2.4,1.6329931618554523,1,1,2,3,8,1.0,0.0,1,1,1,1,1,1.0,0.0,1,1,1,1,1
19,2.4,1.6329931618554523,1,1,2,3,8,1.0,0.0,1,1,1,1,1,1.0,0.0,1,1,1,1,1
20,2.4,1.6329931618554523,1,1,2,3,8,1.0,0.0,1,1,1,1,1,1.0,0.0,1,1,1,1,1
21,2.4,1.6329931618554523,1,1,2,3,8,1.0,0.0,1,1,1,1,1,1.0,0.0,1,1,1,1,1
22,2.4,1.6329931618554523,1,1,2,3,8,1.0,0.0,1,1,1,1,1,1.0,0.0,1,1,1,1,1
23,2.4,1.6329931618554523,1,1,2,3,8,1.0,0.0,1,1,1,1,1,1.0,0.0,1,1,1,1,1
24,2.4,1.6329931618554523,1,1,2,3,8,1.0,0.0,1,1,1,1,1,1.0,0.0,1,1,1,1,1
25,2.4,1.6329931618554523,1,1,2,3,8,1.0,0.0,1,1,1,1,1,1.0,0.0,1,1,1,1,1
