gossips,p2p mean,p2p std,p2p min,p2p q1,p2p q2,p2p q3,p2p max,p2s mean,p2s std,p2s min,p2s q1,p2s q2,p2s q3,p2s max,s2s mean,s2s std,s2s min,s2s q1,s2s q2,s2s q3,s2s max
1,34.2708,0.5249279315614034,33.33,33.86,34.26,34.57,35.36,69.4668,0.45945366106568974,68.69,69.12,69.56,69.75,70.37,52.79223428000001,0.17898723557014826,52.383333,52.672929,52.783737,52.930101,53.092626
2,0.054800000000000015,0.022568414506414343,0.01,0.05,0.05,0.06,0.12,0.7644000000000001,0.07900843836789417,0.55,0.71,0.77,0.81,0.9,21.725276799999996,0.20936474494169305,21.250909,21.608283,21.681515,21.835051,22.213737
3,,,,,,,,,,,,,,,1.18607672,0.03454106855435521,1.115253,1.164141,1.183838,1.2013129999999999,1.2598989999999999
4,,,,,,,,,,,,,,,0.015519360000000003,0.0012017321484701431,0.013535,0.014747,0.015253000000000001,0.016465,0.01798
5,,,,,,,,,,,,,,,,,,,,,
