round,P mean,P std,P min,P q1,P q2,P q3,P max,S mean,S std,S min,S q1,S q2,S q3,S max,P+S mean,P+S std,P+S min,P+S q1,P+S q2,P+S q3,P+S max
0,100.0,0.0,100.0,100.0,100.0,100.0,100.0,100.0,0.0,100.0,100.0,100.0,100.0,100.0,100.0,0.0,100.0,100.0,100.0,100.0,100.0
1,100.0,0.0,100.0,100.0,100.0,100.0,100.0,99.99989899999997,0.0,99.999899,99.999899,99.999899,99.999899,99.999899,99.99989999999998,0.0,99.9999,99.9999,99.9999,99.9999,99.9999
2,99.90080000000003,0.0027688746209700776,99.9,99.9,99.9,99.9,99.91,99.999798,0.0,99.999798,99.999798,99.999798,99.999798,99.999798,99.998808,2.768874620948303e-05,99.9988,99.9988,99.9988,99.9988,99.9989
3,98.91320000000002,0.025774664562962984,98.87,98.89,98.91,98.93,98.97,99.99969700000001,0.0,99.999697,99.999697,99.999697,99.999697,99.999697,99.988832,0.000257746645629399,99.9884,99.9886,99.9888,99.989,99.9894
4,95.28960000000001,0.15350027144384376,94.91,95.17,95.31,95.4,95.55,99.99882840000002,0.0008359237405451627,99.996263,99.998384,99.99919200000001,99.999495,99.999596,99.95173600000003,0.0018454629048887256,99.9476,99.9506,99.9517,99.9534,99.9546
5,95.13560000000001,0.18394020767629965,94.87,94.97,95.15,95.24,95.49,99.92980211999999,0.008518396290380117,99.912626,99.926364,99.929192,99.935354,99.947475,99.88186000000002,0.009063893571013205,99.8643,99.8766,99.8816,99.8876,99.9017
6,95.0848,0.15039171076448132,94.71,94.99,95.09,95.21,95.35,97.85181815999997,0.04252261033524619,97.746768,97.82707099999999,97.85919200000001,97.88202,97.910101,97.82414799999998,0.04222728304465502,97.7191,97.8009,97.8327,97.8528,97.8823
7,95.1436,0.15649494134529193,94.85,95.07,95.17,95.22,95.4,96.96257363999999,0.04744631668430062,96.898081,96.921616,96.95939399999999,96.988788,97.05151500000001,96.94438400000001,0.04664718355199203,96.8798,96.9056,96.9417,96.9709,97.0322
8,95.09440000000001,0.14756580453027335,94.84,94.99,95.11,95.16,95.45,96.97875956,0.051363893226081314,96.898586,96.95191899999999,96.97292900000001,97.001616,97.100909,96.959916,0.05094363453857548,96.8808,96.9308,96.9542,96.9834,97.0796
9,95.1116,0.17242582946492274,94.64,95.01,95.13,95.2,95.4,96.96957968000002,0.06793689752613628,96.824848,96.923535,96.970606,97.02798,97.07767700000001,96.95099999999998,0.06704083332815355,96.8083,96.9043,96.9525,97.0085,97.0582
10,95.14919999999998,0.16217069196785255,94.84,95.05,95.1,95.23,95.56,96.95759192000001,0.04921359073460106,96.866566,96.916768,96.96181800000001,96.990606,97.05929300000001,96.93950799999999,0.04883344926038896,96.8502,96.8984,96.9436,96.9739,97.04
11,95.2136,0.15236688179085286,94.95,95.11,95.2,95.28,95.5,96.88240000000002,0.06568259144869801,96.711111,96.856768,96.90030300000001,96.927273,96.962222,96.86571199999999,0.06480231040119863,96.6953,96.8402,96.8835,96.9091,96.9446
12,96.1968,0.14114767680223142,95.94,96.09,96.19,96.32,96.47,96.94494136000002,0.05906682917811455,96.848283,96.909798,96.923838,96.992727,97.07181800000001,96.93745999999999,0.05873448021959808,96.8405,96.9011,96.9177,96.9837,97.0633
13,99.85959999999997,0.037469987990391716,99.76,99.84,99.86,99.88,99.93,96.95947071999997,0.05627118521759857,96.842323,96.926162,96.971717,97.003737,97.058384,96.988472,0.05568269120651407,96.8732,96.9557,97.0004,97.0322,97.0862
14,99.95759999999999,0.019209372712297088,99.92,99.94,99.96,99.97,99.99,96.99137375999999,0.07408520941978464,96.829192,96.94,97.00676800000001,97.048485,97.12798000000001,97.02103600000001,0.07330935524656396,96.8605,96.9704,97.0362,97.0773,97.1563
15,99.95759999999999,0.019209372712297088,99.92,99.94,99.96,99.97,99.99,99.08130904000001,0.0357745875325372,99.027475,99.052222,99.076667,99.113939,99.162828,99.09007199999998,0.03540536117595726,99.0366,99.0613,99.0854,99.1224,99.1705
16,99.95759999999999,0.019209372712297088,99.92,99.94,99.96,99.97,99.99,99.96222608,0.0017310028143658043,99.95899,99.961313,99.962121,99.963636,99.965455,99.96218000000003,0.001715857414431522,99.9592,99.961,99.9622,99.9635,99.9652
17,99.95759999999999,0.019209372712297088,99.92,99.94,99.96,99.97,99.99,99.96319172,0.0016608242060324105,99.959899,99.962121,99.962929,99.964242,99.966364,99.96313600000002,0.001645924259088598,99.9601,99.962,99.9628,99.9644,99.9661
18,99.95759999999999,0.019209372712297088,99.92,99.94,99.96,99.97,99.99,99.96319172,0.0016608242060324105,99.959899,99.962121,99.962929,99.964242,99.966364,99.96313600000002,0.001645924259088598,99.9601,99.962,99.9628,99.9644,99.9661
19,99.95759999999999,0.019209372712297088,99.92,99.94,99.96,99.97,99.99,99.96319172,0.0016608242060324105,99.959899,99.962121,99.962929,99.964242,99.966364,99.96313600000002,0.001645924259088598,99.9601,99.962,99.9628,99.9644,99.9661
20,99.95759999999999,0.019209372712297088,99.92,99.94,99.96,99.97,99.99,99.96319172,0.0016608242060324105,99.959899,99.962121,99.962929,99.964242,99.966364,99.96313600000002,0.001645924259088598,99.9601,99.962,99.9628,99.9644,99.9661
21,99.95759999999999,0.019209372712297088,99.92,99.94,99.96,99.97,99.99,99.96319172,0.0016608242060324105,99.959899,99.962121,99.962929,99.964242,99.966364,99.96313600000002,0.001645924259088598,99.9601,99.962,99.9628,99.9644,99.9661
22,99.95759999999999,0.019209372712297088,99.92,99.94,99.96,99.97,99.99,99.96319172,0.0016608242060324105,99.959899,99.962121,99.962929,99.964242,99.966364,99.96313600000002,0.001645924259088598,99.9601,99.962,99.9628,99.9644,99.9661
23,99.95759999999999,0.019209372712297088,99.92,99.94,99.96,99.97,99.99,99.96319172,0.0016608242060324105,99.959899,99.962121,99.962929,99.964242,99.966364,99.96313600000002,0.001645924259088598,99.9601,99.962,99.9628,99.9644,99.9661
24,99.95759999999999,0.019209372712297088,99.92,99.94,99.96,99.97,99.99,99.96319172,0.0016608242060324105,99.959899,99.962121,99.962929,99.964242,99.966364,99.96313600000002,0.001645924259088598,99.9601,99.962,99.9628,99.9644,99.9661
25,99.95759999999999,0.019209372712297088,99.92,99.94,99.96,99.97,99.99,99.96319172,0.0016608242060324105,99.959899,99.962121,99.962929,99.964242,99.966364,99.96313600000002,0.001645924259088598,99.9601,99.962,99.9628,99.9644,99.9661
