gossips,p2p mean,p2p std,p2p min,p2p q1,p2p q2,p2p q3,p2p max,p2s mean,p2s std,p2s min,p2s q1,p2s q2,p2s q3,p2s max,s2s mean,s2s std,s2s min,s2s q1,s2s q2,s2s q3,s2s max
1,49.36044000000001,0.11921272303463723,49.187,49.275,49.337,49.427,49.594,58.71947999999998,0.14956050057863934,58.481,58.618,58.727,58.756,59.026,32.175595599999994,0.11410357910651522,31.958667,32.105556,32.140778000000005,32.300667,32.376333
2,22.157919999999994,0.13853547078877135,21.9,22.068,22.167,22.238,22.419,19.89144,0.16775952034584088,19.526,19.828,19.936,19.999,20.146,0.28295560000000003,0.01725776482002618,0.258889,0.268556,0.281,0.289111,0.32211100000000004
3,2.0177199999999997,0.03173919763741146,1.964,1.992,2.023,2.041,2.079,0.11868000000000001,0.010040418317978592,0.098,0.113,0.118,0.125,0.146,0.00012950000000000003,4.5315560241488796e-05,0.00011100000000000001,0.00011100000000000001,0.00011100000000000001,0.00011100000000000001,0.00022200000000000003
4,0.01868000000000001,0.004515897843544884,0.011,0.017,0.019,0.022,0.027,,,,,,,,,,,,,,
5,,,,,,,,,,,,,,,,,,,,,
