gossips,p2p mean,p2p std,p2p min,p2p q1,p2p q2,p2p q3,p2p max,p2s mean,p2s std,p2s min,p2s q1,p2s q2,p2s q3,p2s max,s2s mean,s2s std,s2s min,s2s q1,s2s q2,s2s q3,s2s max
1,,,,,,,,,,,,,,,1.27831836,0.18416793941103493,1.028929,1.142242,1.2348350000000001,1.370671,1.773073
2,,,,,,,,,,,,,,,0.00013333333333333334,5.773502691896258e-05,0.0001,0.0001,0.0001,0.00015000000000000001,0.0002
3,,,,,,,,,,,,,,,,,,,,,
4,,,,,,,,,,,,,,,,,,,,,
5,,,,,,,,,,,,,,,,,,,,,
