gossips,p2p mean,p2p std,p2p min,p2p q1,p2p q2,p2p q3,p2p max,p2s mean,p2s std,p2s min,p2s q1,p2s q2,p2s q3,p2s max,s2s mean,s2s std,s2s min,s2s q1,s2s q2,s2s q3,s2s max
1,49.27559999999998,0.35257481475567737,48.84,48.95,49.22,49.49,50.06,49.27559999999998,0.35257481475567737,48.84,48.95,49.22,49.49,50.06,55.28851308,0.0614732572261569,55.151515,55.246869,55.28434300000001,55.33,55.424746999999996
2,22.184,0.35954832776693624,21.45,22.03,22.21,22.38,22.91,22.184,0.35954832776693624,21.45,22.03,22.21,22.38,22.91,19.57101,0.08250913157241054,19.424646,19.520303,19.583029999999997,19.616464999999998,19.717273000000002
3,2.0507999999999997,0.1336637572418193,1.68,1.99,2.08,2.12,2.38,2.0507999999999997,0.1336637572418193,1.68,1.99,2.08,2.12,2.38,0.6061737599999999,0.009154212324025149,0.587374,0.600707,0.605758,0.612323,0.622222
4,0.021250000000000005,0.013290238326779873,0.01,0.01,0.02,0.03,0.06,0.021250000000000005,0.013290238326779873,0.01,0.01,0.02,0.03,0.06,0.0016079200000000005,0.0004497241673144403,0.00101,0.001212,0.001515,0.001818,0.0029289999999999997
5,0.01,,0.01,0.01,0.01,0.01,0.01,0.01,,0.01,0.01,0.01,0.01,0.01,,,,,,,
