gossips,p2p mean,p2p std,p2p min,p2p q1,p2p q2,p2p q3,p2p max,p2s mean,p2s std,p2s min,p2s q1,p2s q2,p2s q3,p2s max,s2s mean,s2s std,s2s min,s2s q1,s2s q2,s2s q3,s2s max
1,49.18720000000001,0.5867106044152702,48.2,48.77,49.17,49.5,50.8,49.18720000000001,0.5867106044152702,48.2,48.77,49.17,49.5,50.8,54.07819396,0.07440314383729524,53.962626,54.036061,54.072120999999996,54.085859,54.332221999999994
2,22.2524,0.4199035603564232,21.49,22.03,22.18,22.33,23.22,22.2524,0.4199035603564232,21.49,22.03,22.18,22.33,23.22,20.9223556,0.11039715587293626,20.488687,20.889192,20.942525,20.980605999999998,21.041616
3,2.0516,0.1364331338055386,1.8,1.96,2.02,2.17,2.36,2.0516,0.1364331338055386,1.8,1.96,2.02,2.17,2.36,1.3123958800000002,0.01600450211742511,1.2818180000000001,1.303636,1.3147469999999999,1.321212,1.3431309999999999
4,0.02086956521739131,0.009001536978993628,0.01,0.01,0.02,0.03,0.04,0.02086956521739131,0.009001536978993628,0.01,0.01,0.02,0.03,0.04,0.02271092,0.0015653172181169326,0.020101,0.021515,0.022626,0.023232,0.026869
5,0.01,,0.01,0.01,0.01,0.01,0.01,0.01,,0.01,0.01,0.01,0.01,0.01,0.00012625,5.05e-05,0.000101,0.000101,0.000101,0.00012625,0.000202
