gossips,p2p mean,p2p std,p2p min,p2p q1,p2p q2,p2p q3,p2p max,p2s mean,p2s std,p2s min,p2s q1,p2s q2,p2s q3,p2s max,s2s mean,s2s std,s2s min,s2s q1,s2s q2,s2s q3,s2s max
1,1102.04,4.325120422215625,1090.0,1099.0,1103.0,1105.0,1108.0,5.84,2.2487033300697243,2.0,4.0,6.0,7.0,11.0,10.0,,10.0,10.0,10.0,10.0,10.0
2,1.7692307692307692,1.0127393670836669,1.0,1.0,1.0,2.0,4.0,,,,,,,,,,,,,,
3,,,,,,,,,,,,,,,,,,,,,
4,,,,,,,,,,,,,,,,,,,,,
5,,,,,,,,,,,,,,,,,,,,,
