gossips,p2p mean,p2p std,p2p min,p2p q1,p2p q2,p2p q3,p2p max,p2s mean,p2s std,p2s min,p2s q1,p2s q2,p2s q3,p2s max,s2s mean,s2s std,s2s min,s2s q1,s2s q2,s2s q3,s2s max
1,49.815999999999995,1.9093367085631265,46.9,48.6,49.7,51.8,52.6,68.01599999999999,1.4957383906730952,65.1,67.0,68.0,68.9,70.4,50.5394794,0.6107965700075603,49.422723,50.145946,50.675375,50.892392,51.580681
2,21.928,1.22287911640249,19.4,21.1,22.1,22.5,24.3,14.4,1.47365758121304,12.0,13.3,14.3,15.9,17.1,4.518730719999999,0.13527966312775913,4.258358,4.4126129999999995,4.552352,4.603604,4.764464
3,1.9479999999999995,0.44639295095987636,1.1,1.6,1.9,2.3,2.8,0.13571428571428573,0.0633323693776651,0.1,0.1,0.1,0.17500000000000002,0.3,0.03757756,0.0023501314161836397,0.033833999999999996,0.035636,0.037137,0.039238999999999996,0.043744
4,0.1,0.0,0.1,0.1,0.1,0.1,0.1,,,,,,,,0.000125,5e-05,0.0001,0.0001,0.0001,0.000125,0.0002
5,,,,,,,,,,,,,,,,,,,,,
