gossips,p2p mean,p2p std,p2p min,p2p q1,p2p q2,p2p q3,p2p max,p2s mean,p2s std,p2s min,p2s q1,p2s q2,p2s q3,p2s max,s2s mean,s2s std,s2s min,s2s q1,s2s q2,s2s q3,s2s max
1,0.16000000000000003,0.09403246919632546,0.1,0.1,0.1,0.2,0.4,0.9520000000000002,0.29737742572921255,0.3,0.8,1.0,1.1,1.5,52.301261239999995,0.33597756558775316,51.764064000000005,52.093393,52.234635,52.564264,53.00790799999999
2,,,,,,,,,,,,,,,21.81790188,0.49053552194271316,20.748048,21.416817,21.922022,22.104404000000002,22.733432999999998
3,,,,,,,,,,,,,,,1.3259339600000002,0.07565486638372974,1.1760760000000001,1.270571,1.319019,1.37037,1.465566
4,,,,,,,,,,,,,,,0.0204926,0.0032374880437359655,0.014615000000000001,0.018218,0.01992,0.022622999999999997,0.026626999999999998
5,,,,,,,,,,,,,,,,,,,,,
