gossips,p2p mean,p2p std,p2p min,p2p q1,p2p q2,p2p q3,p2p max,p2s mean,p2s std,p2s min,p2s q1,p2s q2,p2s q3,p2s max,s2s mean,s2s std,s2s min,s2s q1,s2s q2,s2s q3,s2s max
1,0.10996,0.0006110100926607799,0.108,0.11,0.11,0.11,0.111,0.001,0.0,0.001,0.001,0.001,0.001,0.001,,,,,,,
2,0.001,,0.001,0.001,0.001,0.001,0.001,,,,,,,,,,,,,,
3,,,,,,,,,,,,,,,,,,,,,
4,,,,,,,,,,,,,,,,,,,,,
5,,,,,,,,,,,,,,,,,,,,,
