gossips,p2p mean,p2p std,p2p min,p2p q1,p2p q2,p2p q3,p2p max,p2s mean,p2s std,p2s min,p2s q1,p2s q2,p2s q3,p2s max,s2s mean,s2s std,s2s min,s2s q1,s2s q2,s2s q3,s2s max
1,,,,,,,,,,,,,,,63.740232320000004,0.13771256740360616,63.47867900000001,63.636737,63.734233999999994,63.808609,64.13473499999999
2,,,,,,,,,,,,,,,5.754222160000001,0.13206382071233602,5.567467,5.661261,5.703704,5.8557559999999995,6.070469999999999
3,,,,,,,,,,,,,,,0.00040439999999999996,0.00016991738188504042,0.0001,0.0003,0.0004,0.0005009999999999999,0.000701
4,,,,,,,,,,,,,,,,,,,,,
5,,,,,,,,,,,,,,,,,,,,,
