gossips,p2p mean,p2p std,p2p min,p2p q1,p2p q2,p2p q3,p2p max,p2s mean,p2s std,p2s min,p2s q1,p2s q2,p2s q3,p2s max,s2s mean,s2s std,s2s min,s2s q1,s2s q2,s2s q3,s2s max
1,34.004,1.14217628528466,32.5,33.1,33.8,34.6,36.9,69.42399999999999,1.0288666904252823,67.2,68.8,69.2,69.9,71.2,52.19497903999999,0.30598499724176287,51.6001,51.990891,52.205205,52.375576,52.852553
2,0.13571428571428573,0.04972451580988469,0.1,0.1,0.1,0.2,0.2,0.8439999999999999,0.2501332977967281,0.4,0.7,0.9,1.0,1.4,21.6152472,0.4708786790768584,20.495495000000002,21.555656,21.655355,21.852352,22.534935
3,,,,,,,,,,,,,,,1.3886965999999998,0.07084242348103759,1.227427,1.363664,1.391491,1.417417,1.541942
4,,,,,,,,,,,,,,,0.027963999999999992,0.0024878868710882605,0.022522999999999998,0.026726999999999997,0.028027999999999997,0.03003,0.032632999999999995
5,,,,,,,,,,,,,,,0.00020721428571428575,0.00010737151790462335,0.0001,0.000125,0.0002,0.0002,0.0005009999999999999
