round,P mean,P std,P min,P q1,P q2,P q3,P max,S mean,S std,S min,S q1,S q2,S q3,S max,P+S mean,P+S std,P+S min,P+S q1,P+S q2,P+S q3,P+S max
0,0.0,0.0,0.0,0.0,0.0,0.0,0.0,0.0,0.0,0.0,0.0,0.0,0.0,0.0,0.0,0.0,0.0,0.0,0.0,0.0,0.0
1,0.0,0.0,0.0,0.0,0.0,0.0,0.0,0.0,0.0,0.0,0.0,0.0,0.0,0.0,0.0,0.0,0.0,0.0,0.0,0.0,0.0
2,0.0,0.0,0.0,0.0,0.0,0.0,0.0,0.0,0.0,0.0,0.0,0.0,0.0,0.0,0.0,0.0,0.0,0.0,0.0,0.0,0.0
3,0.0,0.0,0.0,0.0,0.0,0.0,0.0,0.0,0.0,0.0,0.0,0.0,0.0,0.0,0.0,0.0,0.0,0.0,0.0,0.0,0.0
4,0.0,0.0,0.0,0.0,0.0,0.0,0.0,0.0,0.0,0.0,0.0,0.0,0.0,0.0,0.0,0.0,0.0,0.0,0.0,0.0,0.0
5,0.0,0.0,0.0,0.0,0.0,0.0,0.0,0.0,0.0,0.0,0.0,0.0,0.0,0.0,0.0,0.0,0.0,0.0,0.0,0.0,0.0
6,0.0,0.0,0.0,0.0,0.0,0.0,0.0,0.0,0.0,0.0,0.0,0.0,0.0,0.0,0.0,0.0,0.0,0.0,0.0,0.0,0.0
7,0.0,0.0,0.0,0.0,0.0,0.0,0.0,0.0,0.0,0.0,0.0,0.0,0.0,0.0,0.0,0.0,0.0,0.0,0.0,0.0,0.0
8,0.0,0.0,0.0,0.0,0.0,0.0,0.0,0.0,0.0,0.0,0.0,0.0,0.0,0.0,0.0,0.0,0.0,0.0,0.0,0.0,0.0
9,0.0,0.0,0.0,0.0,0.0,0.0,0.0,0.0,0.0,0.0,0.0,0.0,0.0,0.0,0.0,0.0,0.0,0.0,0.0,0.0,0.0
10,0.0,0.0,0.0,0.0,0.0,0.0,0.0,0.0,0.0,0.0,0.0,0.0,0.0,0.0,0.0,0.0,0.0,0.0,0.0,0.0,0.0
11,0.0,0.0,0.0,0.0,0.0,0.0,0.0,0.0,0.0,0.0,0.0,0.0,0.0,0.0,0.0,0.0,0.0,0.0,0.0,0.0,0.0
12,0.0,0.0,0.0,0.0,0.0,0.0,0.0,0.0,0.0,0.0,0.0,0.0,0.0,0.0,0.0,0.0,0.0,0.0,0.0,0.0,0.0
13,0.0,0.0,0.0,0.0,0.0,0.0,0.0,0.0,0.0,0.0,0.0,0.0,0.0,0.0,0.0,0.0,0.0,0.0,0.0,0.0,0.0
14,0.0,0.0,0.0,0.0,0.0,0.0,0.0,0.0,0.0,0.0,0.0,0.0,0.0,0.0,0.0,0.0,0.0,0.0,0.0,0.0,0.0
15,0.0,0.0,0.0,0.0,0.0,0.0,0.0,0.0,0.0,0.0,0.0,0.0,0.0,0.0,0.0,0.0,0.0,0.0,0.0,0.0,0.0
16,0.0,0.0,0.0,0.0,0.0,0.0,0.0,0.0,0.0,0.0,0.0,0.0,0.0,0.0,0.0,0.0,0.0,0.0,0.0,0.0,0.0
17,0.0,0.0,0.0,0.0,0.0,0.0,0.0,0.0,0.0,0.0,0.0,0.0,0.0,0.0,0.0,0.0,0.0,0.0,0.0,0.0,0.0
18,0.0,0.0,0.0,0.0,0.0,0.0,0.0,0.0,0.0,0.0,0.0,0.0,0.0,0.0,0.0,0.0,0.0,0.0,0.0,0.0,0.0
19,0.0,0.0,0.0,0.0,0.0,0.0,0.0,0.0,0.0,0.0,0.0,0.0,0.0,0.0,0.0,0.0,0.0,0.0,0.0,0.0,0.0
20,0.0004400000000000001,0.00058309518948453,0.0,0.0,0.0,0.001,0.002,0.0,0.0,0.0,0.0,0.0,0.0,0.0,4.4000000000000006e-05,5.830951894845301e-05,0.0,0.0,0.0,0.0001,0.0002
21,0.037640000000000014,0.005685361319505854,0.026,0.034,0.038,0.042,0.048,0.0,0.0,0.0,0.0,0.0,0.0,0.0,0.003764000000000001,0.0005685361319505852,0.0026,0.0034,0.0038,0.0042,0.0048
22,0.32164000000000004,0.01886328002584207,0.285,0.314,0.321,0.33,0.369,0.0,0.0,0.0,0.0,0.0,0.0,0.0,0.032164000000000005,0.0018863280025842094,0.0285,0.0314,0.0321,0.033,0.0369
23,2.9856799999999994,0.0568893077241526,2.868,2.954,2.984,3.011,3.112,0.0,0.0,0.0,0.0,0.0,0.0,0.0,0.298568,0.005688930772415275,0.2868,0.2954,0.2984,0.3011,0.3112
24,27.52692,0.17397291934857737,27.108,27.462,27.595,27.646,27.785,0.0,0.0,0.0,0.0,0.0,0.0,0.0,2.752692,0.0173972919348578,2.7108,2.7462,2.7595,2.7646,2.7785
25,42.48808,0.2152560335972036,41.943,42.348,42.494,42.673,42.798,0.00025764,0.00014611208026717022,0.0,0.00011100000000000001,0.00022200000000000003,0.000333,0.000556,4.249039999999999,0.02153700304127758,4.1944,4.235,4.2495,4.2675,4.2803
26,65.32404000000001,0.1964086895565777,64.992,65.149,65.361,65.49,65.676,0.03415120000000001,0.0031783229068173668,0.027556,0.032556,0.033777999999999996,0.036556,0.039777999999999994,6.563140000000001,0.018185823233130352,6.5332,6.5495,6.566,6.5761,6.5948
27,99.5138,0.0207344319108742,99.475,99.498,99.514,99.53,99.552,3.5742177600000002,0.044347842572741485,3.463222,3.54,3.573667,3.596,3.695556,13.168176,0.040312428604587794,13.0667,13.1383,13.1677,13.1859,13.2779
28,99.66120000000001,0.01732291353477536,99.634,99.65,99.659,99.67,99.701,10.3777244,0.12791248498126853,10.202444,10.287444,10.341222,10.458,10.796111,19.306071999999993,0.11524798812416091,19.1465,19.2274,19.2741,19.3775,19.6825
29,99.81100000000002,0.013967223537029524,99.791,99.803,99.808,99.816,99.846,31.355488920000013,0.2500314656376467,30.976667,31.175333000000002,31.323,31.571666999999998,31.917222,38.20103999999999,0.22515903453633168,37.8597,38.0394,38.1698,38.3947,38.7071
30,99.95532000000001,0.007104693284489468,99.941,99.952,99.956,99.961,99.966,95.9087778,0.05446266498865464,95.773667,95.886222,95.895556,95.944778,96.060333,96.31343199999999,0.04892605577126873,96.1926,96.2932,96.3022,96.3449,96.4503
31,99.95532000000001,0.007104693284489468,99.941,99.952,99.956,99.961,99.966,97.23425780000004,0.05497210827092402,97.13833299999999,97.197333,97.221,97.264556,97.39366700000001,97.50636400000002,0.049430598485826406,97.4208,97.4738,97.4949,97.5322,97.6503
32,99.95544,0.007136058669416243,99.941,99.952,99.956,99.961,99.966,98.61074664,0.03866933582728306,98.53133299999999,98.584111,98.605222,98.634111,98.67944399999999,98.74521599999999,0.03474864122043487,98.6744,98.7219,98.74,98.7653,98.8069
33,99.95544,0.007136058669416243,99.941,99.952,99.956,99.961,99.966,99.98432444000002,0.0011930780248298031,99.981778,99.98366700000001,99.984222,99.985,99.98644399999999,99.98143600000003,0.0012957880485128623,99.9777,99.9807,99.9815,99.982,99.9837
34,99.95544,0.007136058669416243,99.941,99.952,99.956,99.961,99.966,99.98454664000002,0.0011389487799445255,99.982222,99.98366700000001,99.98455600000001,99.985333,99.986889,99.981636,0.001287400481589477,99.9781,99.9809,99.9817,99.9823,99.9839
35,99.95544,0.007136058669416243,99.941,99.952,99.956,99.961,99.966,99.98480887999999,0.0011076109921795945,99.982556,99.984111,99.984889,99.985444,99.987,99.98187199999998,0.001255494590457274,99.9784,99.9811,99.982,99.9825,99.984
36,99.95544,0.007136058669416243,99.941,99.952,99.956,99.961,99.966,99.98501775999999,0.0011100442663837206,99.982778,99.984111,99.985222,99.985667,99.987,99.98206,0.0012093386622425433,99.9786,99.9813,99.9823,99.9827,99.9841
37,99.95544,0.007136058669416243,99.941,99.952,99.956,99.961,99.966,99.98501775999999,0.0011100442663837206,99.982778,99.984111,99.985222,99.985667,99.987,99.98206,0.0012093386622425433,99.9786,99.9813,99.9823,99.9827,99.9841
38,99.95544,0.007136058669416243,99.941,99.952,99.956,99.961,99.966,99.98501775999999,0.0011100442663837206,99.982778,99.984111,99.985222,99.985667,99.987,99.98206,0.0012093386622425433,99.9786,99.9813,99.9823,99.9827,99.9841
39,99.95544,0.007136058669416243,99.941,99.952,99.956,99.961,99.966,99.98501775999999,0.0011100442663837206,99.982778,99.984111,99.985222,99.985667,99.987,99.98206,0.0012093386622425433,99.9786,99.9813,99.9823,99.9827,99.9841
40,99.95544,0.007136058669416243,99.941,99.952,99.956,99.961,99.966,99.98501775999999,0.0011100442663837206,99.982778,99.984111,99.985222,99.985667,99.987,99.98206,0.0012093386622425433,99.9786,99.9813,99.9823,99.9827,99.9841
41,99.95544,0.007136058669416243,99.941,99.952,99.956,99.961,99.966,99.98501775999999,0.0011100442663837206,99.982778,99.984111,99.985222,99.985667,99.987,99.98206,0.0012093386622425433,99.9786,99.9813,99.9823,99.9827,99.9841
42,99.95544,0.007136058669416243,99.941,99.952,99.956,99.961,99.966,99.98501775999999,0.0011100442663837206,99.982778,99.984111,99.985222,99.985667,99.987,99.98206,0.0012093386622425433,99.9786,99.9813,99.9823,99.9827,99.9841
43,99.95544,0.007136058669416243,99.941,99.952,99.956,99.961,99.966,99.98501775999999,0.0011100442663837206,99.982778,99.984111,99.985222,99.985667,99.987,99.98206,0.0012093386622425433,99.9786,99.9813,99.9823,99.9827,99.9841
44,99.95544,0.007136058669416243,99.941,99.952,99.956,99.961,99.966,99.98501775999999,0.0011100442663837206,99.982778,99.984111,99.985222,99.985667,99.987,99.98206,0.0012093386622425433,99.9786,99.9813,99.9823,99.9827,99.9841
45,99.95544,0.007136058669416243,99.941,99.952,99.956,99.961,99.966,99.98501775999999,0.0011100442663837206,99.982778,99.984111,99.985222,99.985667,99.987,99.98206,0.0012093386622425433,99.9786,99.9813,99.9823,99.9827,99.9841
46,99.95544,0.007136058669416243,99.941,99.952,99.956,99.961,99.966,99.98501775999999,0.0011100442663837206,99.982778,99.984111,99.985222,99.985667,99.987,99.98206,0.0012093386622425433,99.9786,99.9813,99.9823,99.9827,99.9841
47,99.95544,0.007136058669416243,99.941,99.952,99.956,99.961,99.966,99.98501775999999,0.0011100442663837206,99.982778,99.984111,99.985222,99.985667,99.987,99.98206,0.0012093386622425433,99.9786,99.9813,99.9823,99.9827,99.9841
48,99.95544,0.007136058669416243,99.941,99.952,99.956,99.961,99.966,99.98501775999999,0.0011100442663837206,99.982778,99.984111,99.985222,99.985667,99.987,99.98206,0.0012093386622425433,99.9786,99.9813,99.9823,99.9827,99.9841
49,99.95544,0.007136058669416243,99.941,99.952,99.956,99.961,99.966,99.98501775999999,0.0011100442663837206,99.982778,99.984111,99.985222,99.985667,99.987,99.98206,0.0012093386622425433,99.9786,99.9813,99.9823,99.9827,99.9841
50,99.95544,0.007136058669416243,99.941,99.952,99.956,99.961,99.966,99.98501775999999,0.0011100442663837206,99.982778,99.984111,99.985222,99.985667,99.987,99.98206,0.0012093386622425433,99.9786,99.9813,99.9823,99.9827,99.9841
