round,P mean,P std,P min,P q1,P q2,P q3,P max,S mean,S std,S min,S q1,S q2,S q3,S max,P+S mean,P+S std,P+S min,P+S q1,P+S q2,P+S q3,P+S max
0,0.0,0.0,0,0,0,0,0,1.0,0.0,1,1,1,1,1,0.0,0.0,0,0,0,0,0
1,1.0,0.0,1,1,1,1,1,1.0,0.0,1,1,1,1,1,1.0,0.0,1,1,1,1,1
2,1.0,0.0,1,1,1,1,1,1.0,0.0,1,1,1,1,1,1.0,0.0,1,1,1,1,1
3,1.0,0.0,1,1,1,1,1,1.0,0.0,1,1,1,1,1,1.0,0.0,1,1,1,1,1
4,1.0,0.0,1,1,1,1,1,1.0,0.0,1,1,1,1,1,1.0,0.0,1,1,1,1,1
5,1.36,0.4898979485566356,1,1,1,2,2,1.0,0.0,1,1,1,1,1,1.0,0.0,1,1,1,1,1
6,2.12,0.33166247903554,2,2,2,2,3,1.0,0.0,1,1,1,1,1,1.0,0.0,1,1,1,1,1
7,3.24,0.6633249580710799,2,3,3,4,4,1.0,0.0,1,1,1,1,1,1.0,0.0,1,1,1,1,1
8,3.96,0.9780933834080806,2,4,4,5,5,1.0,0.0,1,1,1,1,1,1.0,0.0,1,1,1,1,1
9,4.64,1.3190905958272918,2,5,5,5,6,1.0,0.0,1,1,1,1,1,1.0,0.0,1,1,1,1,1
10,5.32,1.7009801096230768,2,5,6,6,7,1.0,0.0,1,1,1,1,1,1.0,0.0,1,1,1,1,1
11,5.88,2.0273134932713295,2,5,7,7,8,1.0,0.0,1,1,1,1,1,1.0,0.0,1,1,1,1,1
12,6.68,2.577466456296441,2,5,8,8,9,1.0,0.0,1,1,1,1,1,1.0,0.0,1,1,1,1,1
13,7.2,2.9297326385411577,2,5,9,9,10,1.0,0.0,1,1,1,1,1,1.0,0.0,1,1,1,1,1
14,7.88,3.4195516275285756,2,5,10,10,11,1.0,0.0,1,1,1,1,1,1.0,0.0,1,1,1,1,1
15,8.48,3.8635044540762036,2,5,11,11,12,1.0,0.0,1,1,1,1,1,1.0,0.0,1,1,1,1,1
16,9.08,4.329357150124408,2,5,12,12,13,1.0,0.0,1,1,1,1,1,1.0,0.0,1,1,1,1,1
17,9.44,4.6104952734675555,2,5,13,13,14,1.0,0.0,1,1,1,1,1,1.0,0.0,1,1,1,1,1
18,9.92,5.024274408641842,2,5,13,14,15,1.0,0.0,1,1,1,1,1,1.0,0.0,1,1,1,1,1
19,10.32,5.390732788777423,2,5,13,15,16,1.0,0.0,1,1,1,1,1,1.0,0.0,1,1,1,1,1
20,10.8,5.859465277082316,2,5,13,16,17,1.0,0.0,1,1,1,1,1,1.0,0.0,1,1,1,1,1
21,11.12,6.180075511944278,2,5,13,17,18,1.0,0.0,1,1,1,1,1,1.0,0.0,1,1,1,1,1
22,11.44,6.5197136951454135,2,5,13,18,19,1.0,0.0,1,1,1,1,1,1.0,0.0,1,1,1,1,1
23,11.72,6.834471449936709,2,5,13,19,20,1.0,0.0,1,1,1,1,1,1.0,0.0,1,1,1,1,1
24,11.92,7.064700984472024,2,5,13,20,20,1.0,0.0,1,1,1,1,1,1.0,0.0,1,1,1,1,1
25,11.92,7.064700984472024,2,5,13,20,20,1.0,0.0,1,1,1,1,1,1.0,0.0,1,1,1,1,1
26,11.92,7.064700984472024,2,5,13,20,20,1.0,0.0,1,1,1,1,1,1.0,0.0,1,1,1,1,1
27,11.92,7.064700984472024,2,5,13,20,20,1.0,0.0,1,1,1,1,1,1.0,0.0,1,1,1,1,1
28,11.92,7.064700984472024,2,5,13,20,20,1.0,0.0,1,1,1,1,1,1.0,0.0,1,1,1,1,1
29,11.92,7.064700984472024,2,5,13,20,20,1.0,0.0,1,1,1,1,1,1.0,0.0,1,1,1,1,1
30,11.92,7.064700984472024,2,5,13,20,20,1.0,0.0,1,1,1,1,1,1.0,0.0,1,1,1,1,1
31,11.92,7.064700984472024,2,5,13,20,20,1.0,0.0,1,1,1,1,1,1.0,0.0,1,1,1,1,1
32,11.92,7.064700984472024,2,5,13,20,20,1.0,0.0,1,1,1,1,1,1.0,0.0,1,1,1,1,1
33,11.92,7.064700984472024,2,5,13,20,20,1.0,0.0,1,1,1,1,1,1.0,0.0,1,1,1,1,1
34,11.92,7.064700984472024,2,5,13,20,20,1.0,0.0,1,1,1,1,1,1.0,0.0,1,1,1,1,1
35,11.92,7.064700984472024,2,5,13,20,20,1.0,0.0,1,1,1,1,1,1.0,0.0,1,1,1,1,1
36,11.92,7.064700984472024,2,5,13,20,20,1.0,0.0,1,1,1,1,1,1.0,0.0,1,1,1,1,1
37,11.92,7.064700984472024,2,5,13,20,20,1.0,0.0,1,1,1,1,1,1.0,0.0,1,1,1,1,1
38,11.92,7.064700984472024,2,5,13,20,20,1.0,0.0,1,1,1,1,1,1.0,0.0,1,1,1,1,1
39,11.92,7.064700984472024,2,5,13,20,20,1.0,0.0,1,1,1,1,1,1.0,0.0,1,1,1,1,1
40,11.92,7.064700984472024,2,5,13,20,20,1.0,0.0,1,1,1,1,1,1.0,0.0,1,1,1,1,1
