gossips,p2p mean,p2p std,p2p min,p2p q1,p2p q2,p2p q3,p2p max,p2s mean,p2s std,p2s min,p2s q1,p2s q2,p2s q3,p2s max,s2s mean,s2s std,s2s min,s2s q1,s2s q2,s2s q3,s2s max
1,,,,,,,,0.21875,0.14244882121894398,0.1,0.1,0.2,0.3,0.6,55.59008592,0.5051526531485253,53.852953,55.358258,55.702503,55.938939000000005,56.204004000000005
2,,,,,,,,,,,,,,,19.583123200000003,0.686806419413372,18.733133,19.045745999999998,19.447247,19.954755,21.701701999999997
3,,,,,,,,,,,,,,,1.6207366799999994,0.18467064973187625,1.375375,1.498699,1.6058059999999998,1.671371,2.285285
4,,,,,,,,,,,,,,,0.029613680000000003,0.005619367214672247,0.022823,0.025925999999999998,0.028529000000000002,0.033734,0.047848
5,,,,,,,,,,,,,,,,,,,,,
