gossips,p2p mean,p2p std,p2p min,p2p q1,p2p q2,p2p q3,p2p max,p2s mean,p2s std,p2s min,p2s q1,p2s q2,p2s q3,p2s max,s2s mean,s2s std,s2s min,s2s q1,s2s q2,s2s q3,s2s max
1,49.267599999999995,0.12846497577160704,48.983,49.219,49.261,49.304,49.562,47.047959999999996,0.17294109787246387,46.738,46.934,47.045,47.147,47.543,61.009497800000005,0.10775252059774142,60.802443999999994,60.927556,61.01433299999999,61.073556,61.253111
2,22.26088,0.13560307272821473,21.923,22.176,22.264,22.342,22.486,9.833079999999999,0.1356312156793807,9.495,9.763,9.86,9.906,10.108,18.18032896,0.12594009229572853,17.946,18.103778,18.175889,18.285889,18.447
3,2.03776,0.04066968568028697,1.954,2.015,2.039,2.066,2.119,0.014840000000000006,0.004307744963048145,0.008,0.012,0.014,0.018,0.024,0.86883568,0.017597237306179615,0.840111,0.855667,0.8652219999999999,0.883222,0.906222
4,0.02496000000000001,0.005239910940719,0.018,0.021,0.024,0.028,0.038,,,,,,,,0.0007777500000000001,0.00032597695970861126,0.000333,0.0005279999999999999,0.000778,0.001111,0.001444
5,,,,,,,,,,,,,,,,,,,,,
