class2class, mean, std, sem, cistd, cisem, min, 05th, 25th, 50th, 75th, 95th, max
p2p,2709.15243701,991.9776410749894,99.19776410749894,99.19776410749894,9.919776410749893,998.7804819999999,999.3902369000002,2707.749999,3279.0,3280.0,3280.0,3280.0
p2s,2701.58865659,989.1598180804519,98.91598180804519,98.91598180804519,9.891598180804518,993.9024290000006,996.3109664499993,2693.19512025,3268.5,3272.0,3276.0,3277.0
s2s,170095.19308072,98119.18512503366,9811.918512503365,9811.918512503365,981.1918512503365,999.5762259999999,999.6245500000001,170073.1815795,226455.0,226464.25,226478.05,226490.0
