gossips,p2p mean,p2p std,p2p min,p2p q1,p2p q2,p2p q3,p2p max,p2s mean,p2s std,p2s min,p2s q1,p2s q2,p2s q3,p2s max,s2s mean,s2s std,s2s min,s2s q1,s2s q2,s2s q3,s2s max
1,10.2368,0.10691585476438925,10.02,10.18,10.26,10.29,10.54,0.5711999999999999,0.08671408958948558,0.36,0.53,0.55,0.62,0.76,0.0012854545454545458,0.0004717703601618829,0.00101,0.00101,0.00101,0.001515,0.00202
2,0.11080000000000002,0.029569128044860123,0.04,0.09,0.11,0.14,0.16,,,,,,,,,,,,,,
3,,,,,,,,,,,,,,,,,,,,,
4,,,,,,,,,,,,,,,,,,,,,
5,,,,,,,,,,,,,,,,,,,,,
