gossips,p2p mean,p2p std,p2p min,p2p q1,p2p q2,p2p q3,p2p max,p2s mean,p2s std,p2s min,p2s q1,p2s q2,p2s q3,p2s max,s2s mean,s2s std,s2s min,s2s q1,s2s q2,s2s q3,s2s max
1,49.30279999999999,0.5030533437585589,48.46,48.97,49.23,49.54,50.34,48.4352,0.5473886492551094,47.25,48.13,48.41,48.66,49.7,53.52267071999999,0.18301398149584105,53.223231999999996,53.396364,53.487171999999994,53.656364,53.951111
2,22.3296,0.30220688278065416,21.68,22.13,22.37,22.49,22.96,14.664800000000003,0.4252364048385324,13.54,14.38,14.81,14.92,15.24,21.312601920000002,0.2459620276365378,20.898989999999998,21.067778,21.366869,21.532929,21.649091000000002
3,2.0264,0.11898459284013767,1.73,1.94,2.05,2.11,2.21,0.03388888888888889,0.025927248643506744,0.01,0.01,0.025,0.04750000000000001,0.09,1.2456685999999997,0.027952029738464404,1.194747,1.2279799999999998,1.243434,1.258889,1.3037370000000001
4,0.023478260869565223,0.012652235035099497,0.01,0.015,0.02,0.03,0.05,,,,,,,,0.01853752,0.0014610480005804048,0.015253000000000001,0.017575999999999998,0.018484999999999998,0.019495,0.021515
5,,,,,,,,,,,,,,,,,,,,,
