gossips,p2p mean,p2p std,p2p min,p2p q1,p2p q2,p2p q3,p2p max,p2s mean,p2s std,p2s min,p2s q1,p2s q2,p2s q3,p2s max,s2s mean,s2s std,s2s min,s2s q1,s2s q2,s2s q3,s2s max
1,49.111999999999995,0.5215122242095577,48.09,48.76,49.16,49.43,50.2,58.72680000000002,0.6123365087923461,57.92,58.2,58.59,58.98,60.33,3.4137211599999997,0.07289975874598859,3.3041410000000004,3.374646,3.4002019999999997,3.433333,3.603737
2,21.884400000000007,0.4378077964891281,21.01,21.58,21.84,22.08,22.79,19.695200000000003,0.46152934179024124,18.56,19.49,19.69,19.98,20.55,0.00408848,0.0005721748800264944,0.002525,0.0038380000000000003,0.004141,0.004444,0.004949
3,1.9484000000000004,0.12167853823360417,1.8,1.85,1.95,1.99,2.28,0.26039999999999996,0.052795201802184014,0.15,0.22,0.27,0.3,0.34,,,,,,,
4,0.021578947368421055,0.011672930649220892,0.01,0.01,0.02,0.03,0.04,0.01,0.0,0.01,0.01,0.01,0.01,0.01,,,,,,,
5,,,,,,,,,,,,,,,,,,,,,
