gossips,p2p mean,p2p std,p2p min,p2p q1,p2p q2,p2p q3,p2p max,p2s mean,p2s std,p2s min,p2s q1,p2s q2,p2s q3,p2s max,s2s mean,s2s std,s2s min,s2s q1,s2s q2,s2s q3,s2s max
1,49.250200000000014,0.1833414392147429,48.847,49.161,49.215,49.383,49.58,46.94904,0.2050750838107831,46.563,46.825,46.974,47.081,47.365,21.29127996,0.21103618221399034,20.941111,21.086333,21.306667,21.418332999999997,21.726778
2,22.33324,0.1436388062699871,22.057,22.226,22.323,22.449,22.57,9.76552,0.14619083418600484,9.444,9.655,9.774,9.858,10.008,0.01714664,0.0011752099060735222,0.014556,0.016666999999999998,0.017,0.017556,0.019444
3,2.0580800000000004,0.037189738728131354,1.997,2.031,2.051,2.08,2.125,0.001,,0.001,0.001,0.001,0.001,0.001,,,,,,,
4,0.02504000000000001,0.005697075273038497,0.015,0.022,0.024,0.028,0.039,,,,,,,,,,,,,,
5,0.001,,0.001,0.001,0.001,0.001,0.001,,,,,,,,,,,,,,
