round,nodes,nodesP,nodesS,nodesSent,nodesSentP,nodesSentS,nodesRecv,nodesRecvP,nodesRecvS,msgSent,msgSentP,msgSentS,msgRecv,msgRecvP,msgRecvS,msgInfect,msgInfectP,msgInfectS
00,10000.000000,5000.000000,5000.000000,0.000000,0.000000,0.000000,0.000000,0.000000,0.000000,0.000000,0.000000,0.000000,0.000000,0.000000,0.000000,0.000000,0.000000,0.000000
01,10000.000000,5000.000000,5000.000000,0.011000,0.022000,0.000000,0.011000,0.022000,0.000000,11.000000,11.000000,0.000000,1.100000,1.100000,0.000000,0.500000,1.000000,0.000000
02,10000.000000,5000.000000,5000.000000,0.114000,0.228000,0.000000,0.114000,0.228000,0.000000,114.000000,114.000000,0.000000,11.400000,11.400000,0.000000,0.500000,1.000000,0.000000
03,10000.000000,5000.000000,5000.000000,1.145000,2.290000,0.000000,1.145000,2.290000,0.000000,1145.000000,1145.000000,0.000000,115.400000,115.400000,0.000000,0.500000,1.000000,0.000000
04,10000.000000,5000.000000,5000.000000,10.261000,20.522000,0.000000,10.261000,20.522000,0.000000,10261.000000,10261.000000,0.000000,1151.800000,1151.800000,0.000000,0.500000,1.000000,0.000000
05,10000.000000,5000.000000,5000.000000,44.313000,86.512000,2.114000,44.313000,86.512000,2.114000,44313.000000,43256.000000,1057.000000,10089.400000,9982.700000,106.700000,1.500000,2.000000,1.000000
06,10000.000000,5000.000000,5000.000000,98.164000,99.570000,96.758000,98.164000,99.570000,96.758000,98164.000000,49785.000000,48379.000000,43451.500000,26495.500000,16956.000000,4.000000,5.000000,3.000000
07,10000.000000,5000.000000,5000.000000,99.785000,99.570000,100.000000,99.785000,99.570000,100.000000,99785.000000,49785.000000,50000.000000,98064.900000,26495.500000,71569.400000,9.500000,5.000000,14.000000
08,10000.000000,5000.000000,5000.000000,99.785000,99.570000,100.000000,99.785000,99.570000,100.000000,99785.000000,49785.000000,50000.000000,99786.000000,26495.500000,73290.500000,9.500000,5.000000,14.000000
09,10000.000000,5000.000000,5000.000000,99.785000,99.570000,100.000000,99.785000,99.570000,100.000000,99785.000000,49785.000000,50000.000000,99786.000000,26495.500000,73290.500000,9.500000,5.000000,14.000000
10,10000.000000,5000.000000,5000.000000,99.785000,99.570000,100.000000,99.785000,99.570000,100.000000,99785.000000,49785.000000,50000.000000,99786.000000,26495.500000,73290.500000,9.500000,5.000000,14.000000
11,10000.000000,5000.000000,5000.000000,99.785000,99.570000,100.000000,99.785000,99.570000,100.000000,99785.000000,49785.000000,50000.000000,99786.000000,26495.500000,73290.500000,9.500000,5.000000,14.000000
12,10000.000000,5000.000000,5000.000000,99.785000,99.570000,100.000000,99.785000,99.570000,100.000000,99785.000000,49785.000000,50000.000000,99786.000000,26495.500000,73290.500000,9.500000,5.000000,14.000000
13,10000.000000,5000.000000,5000.000000,99.785000,99.570000,100.000000,99.785000,99.570000,100.000000,99785.000000,49785.000000,50000.000000,99786.000000,26495.500000,73290.500000,9.500000,5.000000,14.000000
14,10000.000000,5000.000000,5000.000000,99.785000,99.570000,100.000000,99.785000,99.570000,100.000000,99785.000000,49785.000000,50000.000000,99786.000000,26495.500000,73290.500000,9.500000,5.000000,14.000000
15,10000.000000,5000.000000,5000.000000,99.785000,99.570000,100.000000,99.785000,99.570000,100.000000,99785.000000,49785.000000,50000.000000,99786.000000,26495.500000,73290.500000,9.500000,5.000000,14.000000
16,10000.000000,5000.000000,5000.000000,99.785000,99.570000,100.000000,99.785000,99.570000,100.000000,99785.000000,49785.000000,50000.000000,99786.000000,26495.500000,73290.500000,9.500000,5.000000,14.000000
17,10000.000000,5000.000000,5000.000000,99.785000,99.570000,100.000000,99.785000,99.570000,100.000000,99785.000000,49785.000000,50000.000000,99786.000000,26495.500000,73290.500000,9.500000,5.000000,14.000000
18,10000.000000,5000.000000,5000.000000,99.785000,99.570000,100.000000,99.785000,99.570000,100.000000,99785.000000,49785.000000,50000.000000,99786.000000,26495.500000,73290.500000,9.500000,5.000000,14.000000
19,10000.000000,5000.000000,5000.000000,99.785000,99.570000,100.000000,99.785000,99.570000,100.000000,99785.000000,49785.000000,50000.000000,99786.000000,26495.500000,73290.500000,9.500000,5.000000,14.000000
