gossips,p2p mean,p2p std,p2p min,p2p q1,p2p q2,p2p q3,p2p max,p2s mean,p2s std,p2s min,p2s q1,p2s q2,p2s q3,p2s max,s2s mean,s2s std,s2s min,s2s q1,s2s q2,s2s q3,s2s max
1,,,,,,,,,,,,,,,53.292920839999994,0.3055835011577136,52.832331999999994,53.08098100000001,53.282481999999995,53.39539499999999,53.971771999999994
2,,,,,,,,,,,,,,,20.031939960000003,0.5498147143617628,18.603403,19.829629999999998,20.041742000000003,20.262062,21.483884
3,,,,,,,,,,,,,,,0.64074472,0.049316710185730445,0.548348,0.598298,0.637437,0.6863859999999999,0.728028
4,,,,,,,,,,,,,,,0.0032953200000000005,0.0006600611537324905,0.002102,0.002703,0.003303,0.004004,0.004304
5,,,,,,,,,,,,,,,,,,,,,
