gossips,p2p mean,p2p std,p2p min,p2p q1,p2p q2,p2p q3,p2p max,p2s mean,p2s std,p2s min,p2s q1,p2s q2,p2s q3,p2s max,s2s mean,s2s std,s2s min,s2s q1,s2s q2,s2s q3,s2s max
1,26.10919999999999,0.4746746254014419,24.92,25.82,26.22,26.43,26.95,24.4548,0.3845031425966068,23.97,24.14,24.41,24.62,25.42,25.675995920000002,0.17871485474700544,25.422222,25.564949,25.641919,25.832121,26.02202
2,35.91000000000001,0.45873921422379704,35.07,35.52,35.87,36.27,36.75,42.254000000000005,0.5674724662924174,41.06,41.99,42.27,42.62,43.33,37.42852124,0.09467145363892163,37.260101,37.369293,37.428889,37.471717,37.672928999999996
3,22.890800000000002,0.426906703312717,21.87,22.68,22.82,23.19,23.77,23.805600000000005,0.46500967731865545,22.82,23.59,23.75,24.12,24.75,23.354294999999997,0.16864112729180183,23.052929000000002,23.235859,23.349596,23.482929000000002,23.698081
4,6.991999999999999,0.22768765154629422,6.52,6.93,7.04,7.18,7.32,4.724,0.2192031021678299,4.34,4.51,4.72,4.89,5.18,6.401967759999999,0.08769020077108587,6.201313,6.357576,6.40404,6.466263,6.566667
5,0.9532,0.11216505694733986,0.76,0.89,0.94,1.01,1.21,0.14160000000000003,0.04904759593157106,0.04,0.12,0.15,0.16,0.29,0.6722787199999999,0.01271247927077956,0.6510100000000001,0.661717,0.673838,0.678687,0.694646
6,0.058400000000000014,0.023216373532487802,0.02,0.04,0.06,0.07,0.1,0.01,0.0,0.01,0.01,0.01,0.01,0.01,0.035818359999999994,0.0017745825302494848,0.032525,0.035051,0.03596,0.037071,0.038586
7,0.01,0.0,0.01,0.01,0.01,0.01,0.01,,,,,,,,0.0009534400000000002,0.0003194964892869195,0.000202,0.000808,0.00101,0.001111,0.0017170000000000002
8,,,,,,,,,,,,,,,0.000101,0.0,0.000101,0.000101,0.000101,0.000101,0.000101
