gossips,p2p mean,p2p std,p2p min,p2p q1,p2p q2,p2p q3,p2p max,p2s mean,p2s std,p2s min,p2s q1,p2s q2,p2s q3,p2s max,s2s mean,s2s std,s2s min,s2s q1,s2s q2,s2s q3,s2s max
1,49.2224,0.4422506830595824,48.23,49.0,49.25,49.48,50.1,56.16399999999999,0.5173409578475963,55.28,55.8,56.2,56.57,57.42,48.70437172,0.06277820024400779,48.594343,48.653737,48.698687,48.743534999999994,48.813131
2,22.223599999999998,0.32825142802431184,21.66,21.97,22.25,22.41,22.93,18.5912,0.6180703843414599,17.61,18.16,18.51,19.12,20.1,23.614759640000003,0.3276737282450178,22.890202,23.37697,23.660909,23.903232,24.098788
3,2.0756,0.12134935791616971,1.79,1.99,2.1,2.16,2.29,0.03160000000000001,0.014047538337136985,0.01,0.02,0.03,0.04,0.06,1.34260204,0.029818988785783172,1.276869,1.331515,1.346263,1.364848,1.394747
4,0.02636363636363637,0.01497472618255253,0.01,0.02,0.02,0.03,0.06,,,,,,,,0.006703359999999999,0.0007392574472626796,0.005354,0.0060609999999999995,0.0069700000000000005,0.007273000000000001,0.007677
5,,,,,,,,,,,,,,,,,,,,,
