gossips,p2p mean,p2p std,p2p min,p2p q1,p2p q2,p2p q3,p2p max,p2s mean,p2s std,p2s min,p2s q1,p2s q2,p2s q3,p2s max,s2s mean,s2s std,s2s min,s2s q1,s2s q2,s2s q3,s2s max
1,49.70399999999999,1.5514724189190936,46.0,48.7,49.8,50.8,52.8,50.496,1.8189923950729794,47.0,49.7,50.4,51.5,55.9,49.991102999999995,0.21231732978747317,49.637938,49.88028,49.926326,50.11992,50.485586
2,21.748,1.0809409481249812,19.9,21.1,21.6,22.7,23.5,18.815999999999995,1.4769563297538626,15.7,17.9,18.9,19.5,22.1,22.501353400000003,0.6598522699510097,21.477678,22.001101000000002,22.394995,23.143243,23.677778
3,1.9679999999999997,0.39970822691891966,1.1,1.8,1.9,2.2,2.7,0.10000000000000002,0.0,0.1,0.1,0.1,0.1,0.1,1.14939356,0.05450143433210421,1.033634,1.118819,1.135936,1.17998,1.284985
4,0.10000000000000002,0.0,0.1,0.1,0.1,0.1,0.1,,,,,,,,0.0071472,0.0007479308680174482,0.005906000000000001,0.006706999999999999,0.007206999999999999,0.007708,0.008609
5,,,,,,,,,,,,,,,,,,,,,
