round,nodes,nodesP,nodesS,nodesSent,nodesSentP,nodesSentS,nodesRecv,nodesRecvP,nodesRecvS,msgSent,msgSentP,msgSentS,msgRecv,msgRecvP,msgRecvS,msgInfect,msgInfectP,msgInfectS
00,1000000.000000,100000.000000,900000.000000,0.000000,0.000000,0.000000,0.000000,0.000000,0.000000,0.000000,0.000000,0.000000,0.000000,0.000000,0.000000,0.000000,0.000000,0.000000
01,1000000.000000,100000.000000,900000.000000,0.000110,0.001100,0.000000,0.000110,0.001100,0.000000,11.000000,11.000000,0.000000,1.100000,1.100000,0.000000,0.100000,1.000000,0.000000
02,1000000.000000,100000.000000,900000.000000,0.001120,0.011200,0.000000,0.001120,0.011200,0.000000,112.000000,112.000000,0.000000,11.200000,11.200000,0.000000,0.100000,1.000000,0.000000
03,1000000.000000,100000.000000,900000.000000,0.011810,0.118100,0.000000,0.011810,0.118100,0.000000,1181.000000,1181.000000,0.000000,118.100000,118.100000,0.000000,0.100000,1.000000,0.000000
04,1000000.000000,100000.000000,900000.000000,0.116980,1.169600,0.000022,0.116980,1.169600,0.000022,11775.000000,11773.000000,2.000000,1177.500000,1177.300000,0.200000,0.280000,1.000000,0.200000
05,1000000.000000,100000.000000,900000.000000,1.109030,10.980400,0.012211,1.109030,10.980400,0.012211,117163.000000,116064.000000,1099.000000,11742.600000,11632.700000,109.900000,1.000000,1.000000,1.000000
06,1000000.000000,100000.000000,900000.000000,7.485070,66.176400,0.963811,7.485070,66.176400,0.963811,1043700.000000,956957.000000,86743.000000,117137.100000,108419.900000,8717.200000,1.000000,1.000000,1.000000
07,1000000.000000,100000.000000,900000.000000,40.242490,99.846400,33.619833,40.242490,99.846400,33.619833,5013168.000000,1987383.000000,3025785.000000,1019720.300000,650910.000000,368810.300000,1.500000,6.000000,1.000000
08,1000000.000000,100000.000000,900000.000000,98.802940,99.995400,98.670444,98.802940,99.995400,98.670444,10879779.000000,1999439.000000,8880340.000000,4887757.900000,998440.700000,3889317.200000,4.500000,9.000000,4.000000
09,1000000.000000,100000.000000,900000.000000,99.998270,99.995500,99.998578,99.998270,99.995500,99.998578,10999315.000000,1999443.000000,8999872.000000,10874980.300000,999955.000000,9875025.300000,9.990000,9.900000,10.000000
10,1000000.000000,100000.000000,900000.000000,99.998380,99.995500,99.998700,99.998380,99.995500,99.998700,10999326.000000,1999443.000000,8999883.000000,10999316.200000,999956.000000,9999360.200000,10.900000,10.000000,11.000000
11,1000000.000000,100000.000000,900000.000000,99.998380,99.995500,99.998700,99.998380,99.995500,99.998700,10999326.000000,1999443.000000,8999883.000000,10999327.000000,999956.000000,9999371.000000,10.900000,10.000000,11.000000
12,1000000.000000,100000.000000,900000.000000,99.998380,99.995500,99.998700,99.998380,99.995500,99.998700,10999326.000000,1999443.000000,8999883.000000,10999327.000000,999956.000000,9999371.000000,10.900000,10.000000,11.000000
13,1000000.000000,100000.000000,900000.000000,99.998380,99.995500,99.998700,99.998380,99.995500,99.998700,10999326.000000,1999443.000000,8999883.000000,10999327.000000,999956.000000,9999371.000000,10.900000,10.000000,11.000000
14,1000000.000000,100000.000000,900000.000000,99.998380,99.995500,99.998700,99.998380,99.995500,99.998700,10999326.000000,1999443.000000,8999883.000000,10999327.000000,999956.000000,9999371.000000,10.900000,10.000000,11.000000
15,1000000.000000,100000.000000,900000.000000,99.998380,99.995500,99.998700,99.998380,99.995500,99.998700,10999326.000000,1999443.000000,8999883.000000,10999327.000000,999956.000000,9999371.000000,10.900000,10.000000,11.000000
16,1000000.000000,100000.000000,900000.000000,99.998380,99.995500,99.998700,99.998380,99.995500,99.998700,10999326.000000,1999443.000000,8999883.000000,10999327.000000,999956.000000,9999371.000000,10.900000,10.000000,11.000000
17,1000000.000000,100000.000000,900000.000000,99.998380,99.995500,99.998700,99.998380,99.995500,99.998700,10999326.000000,1999443.000000,8999883.000000,10999327.000000,999956.000000,9999371.000000,10.900000,10.000000,11.000000
18,1000000.000000,100000.000000,900000.000000,99.998380,99.995500,99.998700,99.998380,99.995500,99.998700,10999326.000000,1999443.000000,8999883.000000,10999327.000000,999956.000000,9999371.000000,10.900000,10.000000,11.000000
19,1000000.000000,100000.000000,900000.000000,99.998380,99.995500,99.998700,99.998380,99.995500,99.998700,10999326.000000,1999443.000000,8999883.000000,10999327.000000,999956.000000,9999371.000000,10.900000,10.000000,11.000000
