,mean,std,min,q1,q2,q3,max
Simple,,,,,,,
P,5.236236168698937,0.6662871710360503,1.0,5.0,5.0,6.0,8.0
S,6.689159104011999,0.5063613680287319,3.0,6.0,7.0,7.0,9.0
P+S,6.543870667581298,0.6820111325086194,1.0,6.0,7.0,7.0,9.0
