gossips,p2p mean,p2p std,p2p min,p2p q1,p2p q2,p2p q3,p2p max,p2s mean,p2s std,p2s min,p2s q1,p2s q2,p2s q3,p2s max,s2s mean,s2s std,s2s min,s2s q1,s2s q2,s2s q3,s2s max
1,8.80532,5.885103551340452,3.379,4.768,7.154,9.32,25.138,24.560599999999994,7.963904460125071,14.732,18.106,23.513,26.882,41.493,43.174199959999996,2.159314589233111,37.275222,42.411221999999995,43.947444,44.515111,46.327
2,0.10524000000000001,0.12513801713841136,0.019,0.041,0.051,0.084,0.548,1.4038,1.043367584634805,0.466,0.781,0.968,1.411,4.41,15.70080904,4.582122941189765,8.797333,12.982556,15.998555999999999,17.797667,27.210778
3,0.002,0.001,0.001,0.0015,0.002,0.0025,0.003,0.02432000000000001,0.029865978414688958,0.003,0.012,0.014,0.02,0.136,2.0348577199999998,1.5955932775054633,0.594222,0.9342219999999999,1.6893330000000002,2.184333,7.458111
4,,,,,,,,0.0013333333333333333,0.0005773502691896257,0.001,0.001,0.001,0.0015,0.002,0.08942667999999998,0.1689159213641805,0.006444,0.018,0.026222000000000002,0.06855599999999999,0.739444
5,,,,,,,,,,,,,,,0.0003462941176470588,0.0002632987288010242,0.00011100000000000001,0.00011100000000000001,0.000333,0.00044400000000000006,0.000889
6,,,,,,,,,,,,,,,,,,,,,
7,,,,,,,,,,,,,,,,,,,,,
