gossips,p2p mean,p2p std,p2p min,p2p q1,p2p q2,p2p q3,p2p max,p2s mean,p2s std,p2s min,p2s q1,p2s q2,p2s q3,p2s max,s2s mean,s2s std,s2s min,s2s q1,s2s q2,s2s q3,s2s max
1,49.2068,0.6068821961468319,48.17,48.72,49.12,49.7,50.3,49.2068,0.6068821961468319,48.17,48.72,49.12,49.7,50.3,54.08440008,0.08948277968456672,53.968687,54.029697,54.07181800000001,54.105455000000006,54.418485
2,22.2656,0.30918009854020884,21.64,22.0,22.31,22.51,22.72,22.266,0.3092329219213247,21.64,22.0,22.31,22.51,22.72,20.94461412,0.08606581076242319,20.772525,20.88798,20.92899,21.02,21.091717000000003
3,2.0836000000000006,0.13447056679189454,1.88,1.99,2.03,2.19,2.31,2.0832,0.13499135774806734,1.88,1.99,2.03,2.19,2.31,1.31273528,0.013399851561740077,1.290909,1.302424,1.312525,1.319495,1.338586
4,0.027200000000000012,0.01429452109492771,0.01,0.01,0.03,0.04,0.05,0.027200000000000012,0.01429452109492771,0.01,0.01,0.03,0.04,0.05,0.022723,0.001516064972222497,0.02,0.021919,0.022828,0.023333,0.025960000000000004
5,,,,,,,,,,,,,,,0.00010099999999999999,0.0,0.000101,0.000101,0.000101,0.000101,0.000101
