round,nodes,nodesP,nodesS,nodesSent,nodesSentP,nodesSentS,nodesRecv,nodesRecvP,nodesRecvS,msgSent,msgSentP,msgSentS,msgRecv,msgRecvP,msgRecvS,msgInfect,msgInfectP,msgInfectS
00,10000.000000,10000.000000,0.000000,0.000000,0.000000,0.000000,0.000000,0.000000,0.000000,0.000000,0.000000,0.000000,0.000000,0.000000,0.000000,0.000000,0.000000,0.000000
01,10000.000000,10000.000000,0.000000,0.010000,0.010000,0.000000,0.010000,0.010000,0.000000,10.000000,10.000000,0.000000,1.000000,1.000000,0.000000,1.000000,1.000000,0.000000
02,10000.000000,10000.000000,0.000000,0.114000,0.114000,0.000000,0.114000,0.114000,0.000000,114.000000,114.000000,0.000000,11.400000,11.400000,0.000000,1.000000,1.000000,0.000000
03,10000.000000,10000.000000,0.000000,1.157000,1.157000,0.000000,1.157000,1.157000,0.000000,1157.000000,1157.000000,0.000000,116.100000,116.100000,0.000000,1.000000,1.000000,0.000000
04,10000.000000,10000.000000,0.000000,10.930000,10.930000,0.000000,10.930000,10.930000,0.000000,10930.000000,10930.000000,0.000000,1159.100000,1159.100000,0.000000,1.000000,1.000000,0.000000
05,10000.000000,10000.000000,0.000000,65.994000,65.994000,0.000000,65.994000,65.994000,0.000000,65994.000000,65994.000000,0.000000,10773.000000,10773.000000,0.000000,1.000000,1.000000,0.000000
06,10000.000000,10000.000000,0.000000,99.866000,99.866000,0.000000,99.866000,99.866000,0.000000,99866.000000,99866.000000,0.000000,65142.200000,65142.200000,0.000000,6.000000,6.000000,0.000000
07,10000.000000,10000.000000,0.000000,99.995000,99.995000,0.000000,99.995000,99.995000,0.000000,99995.000000,99995.000000,0.000000,99866.200000,99866.200000,0.000000,9.000000,9.000000,0.000000
08,10000.000000,10000.000000,0.000000,99.995000,99.995000,0.000000,99.995000,99.995000,0.000000,99995.000000,99995.000000,0.000000,99996.000000,99996.000000,0.000000,10.000000,10.000000,0.000000
09,10000.000000,10000.000000,0.000000,99.995000,99.995000,0.000000,99.995000,99.995000,0.000000,99995.000000,99995.000000,0.000000,99996.000000,99996.000000,0.000000,10.000000,10.000000,0.000000
10,10000.000000,10000.000000,0.000000,99.995000,99.995000,0.000000,99.995000,99.995000,0.000000,99995.000000,99995.000000,0.000000,99996.000000,99996.000000,0.000000,10.000000,10.000000,0.000000
11,10000.000000,10000.000000,0.000000,99.995000,99.995000,0.000000,99.995000,99.995000,0.000000,99995.000000,99995.000000,0.000000,99996.000000,99996.000000,0.000000,10.000000,10.000000,0.000000
12,10000.000000,10000.000000,0.000000,99.995000,99.995000,0.000000,99.995000,99.995000,0.000000,99995.000000,99995.000000,0.000000,99996.000000,99996.000000,0.000000,10.000000,10.000000,0.000000
13,10000.000000,10000.000000,0.000000,99.995000,99.995000,0.000000,99.995000,99.995000,0.000000,99995.000000,99995.000000,0.000000,99996.000000,99996.000000,0.000000,10.000000,10.000000,0.000000
14,10000.000000,10000.000000,0.000000,99.995000,99.995000,0.000000,99.995000,99.995000,0.000000,99995.000000,99995.000000,0.000000,99996.000000,99996.000000,0.000000,10.000000,10.000000,0.000000
15,10000.000000,10000.000000,0.000000,99.995000,99.995000,0.000000,99.995000,99.995000,0.000000,99995.000000,99995.000000,0.000000,99996.000000,99996.000000,0.000000,10.000000,10.000000,0.000000
16,10000.000000,10000.000000,0.000000,99.995000,99.995000,0.000000,99.995000,99.995000,0.000000,99995.000000,99995.000000,0.000000,99996.000000,99996.000000,0.000000,10.000000,10.000000,0.000000
17,10000.000000,10000.000000,0.000000,99.995000,99.995000,0.000000,99.995000,99.995000,0.000000,99995.000000,99995.000000,0.000000,99996.000000,99996.000000,0.000000,10.000000,10.000000,0.000000
18,10000.000000,10000.000000,0.000000,99.995000,99.995000,0.000000,99.995000,99.995000,0.000000,99995.000000,99995.000000,0.000000,99996.000000,99996.000000,0.000000,10.000000,10.000000,0.000000
19,10000.000000,10000.000000,0.000000,99.995000,99.995000,0.000000,99.995000,99.995000,0.000000,99995.000000,99995.000000,0.000000,99996.000000,99996.000000,0.000000,10.000000,10.000000,0.000000
