gossips,p2p mean,p2p std,p2p min,p2p q1,p2p q2,p2p q3,p2p max,p2s mean,p2s std,p2s min,p2s q1,p2s q2,p2s q3,p2s max,s2s mean,s2s std,s2s min,s2s q1,s2s q2,s2s q3,s2s max
1,34.4728,0.5878103435632955,33.03,34.25,34.42,34.87,35.44,69.71600000000001,0.533565053828175,68.34,69.43,69.7,70.03,70.97,52.88422619999999,0.23266861734216998,52.545758,52.734545,52.844646,53.004645999999994,53.409192000000004
2,0.05720000000000002,0.02150968773986891,0.02,0.04,0.06,0.07,0.1,0.7856000000000002,0.10087450949901404,0.61,0.73,0.77,0.85,1.01,21.730941440000002,0.23553337701216928,21.001313,21.60899,21.69899,21.894343,22.227778
3,,,,,,,,,,,,,,,1.17496572,0.03251467137375579,1.10899,1.157475,1.173535,1.193232,1.2498989999999999
4,,,,,,,,,,,,,,,0.015543479999999998,0.0014544949902514852,0.012929,0.014747,0.015556,0.016061000000000002,0.01798
5,,,,,,,,,,,,,,,0.000101,,0.000101,0.000101,0.000101,0.000101,0.000101
