gossips,p2p mean,p2p std,p2p min,p2p q1,p2p q2,p2p q3,p2p max,p2s mean,p2s std,p2s min,p2s q1,p2s q2,p2s q3,p2s max,s2s mean,s2s std,s2s min,s2s q1,s2s q2,s2s q3,s2s max
1,2.1736,0.04526588119102502,2.1,2.14,2.16,2.2,2.28,0.019285714285714285,0.012066664642907567,0.01,0.01,0.02,0.02,0.05,,,,,,,
2,0.018947368421052633,0.008752610304046612,0.01,0.01,0.02,0.02,0.04,,,,,,,,,,,,,,
3,,,,,,,,,,,,,,,,,,,,,
4,,,,,,,,,,,,,,,,,,,,,
5,,,,,,,,,,,,,,,,,,,,,
6,,,,,,,,,,,,,,,,,,,,,
7,,,,,,,,,,,,,,,,,,,,,
8,,,,,,,,,,,,,,,,,,,,,
