round,P+S mean,P+S std,P+S min,P+S q1,P+S median,P+S q3,P+S max,P mean,P std,P min,P q1,P median,P q3,P max,S mean,S std,S min,S q1,S median,S q3,S max
0,100.0,0.0,100.0,100.0,100.0,100.0,100.0,100.0,0.0,100.0,100.0,100.0,100.0,100.0,100.0,0.0,100.0,100.0,100.0,100.0,100.0
1,100.0,0.0,100.0,100.0,100.0,100.0,100.0,100.0,0.0,100.0,100.0,100.0,100.0,100.0,100.0,0.0,100.0,100.0,100.0,100.0,100.0
2,100.0,0.0,100.0,100.0,100.0,100.0,100.0,100.0,0.0,100.0,100.0,100.0,100.0,100.0,100.0,0.0,100.0,100.0,100.0,100.0,100.0
3,100.0,0.0,100.0,100.0,100.0,100.0,100.0,100.0,0.0,100.0,100.0,100.0,100.0,100.0,100.0,0.0,100.0,100.0,100.0,100.0,100.0
4,100.0,0.0,100.0,100.0,100.0,100.0,100.0,100.0,0.0,100.0,100.0,100.0,100.0,100.0,100.0,0.0,100.0,100.0,100.0,100.0,100.0
5,99.99991599999997,3.6660605560863726e-05,99.9999,99.9999,99.9999,99.9999,100.0,100.0,0.0,100.0,100.0,100.0,100.0,100.0,99.99991515999996,3.70272116155346e-05,99.999899,99.999899,99.999899,99.999899,100.0
6,99.999948,4.9959983988845686e-05,99.9999,99.9999,99.9999,100.0,100.0,100.0,0.0,100.0,100.0,100.0,100.0,100.0,99.99994747999999,5.045958382745619e-05,99.999899,99.999899,99.999899,100.0,100.0
7,100.0,0.0,100.0,100.0,100.0,100.0,100.0,100.0,0.0,100.0,100.0,100.0,100.0,100.0,100.0,0.0,100.0,100.0,100.0,100.0,100.0
8,99.999996,1.9595917942915945e-05,99.9999,100.0,100.0,100.0,100.0,99.99959999999999,0.001959591794227545,99.99,100.0,100.0,100.0,100.0,100.0,0.0,100.0,100.0,100.0,100.0,100.0
9,99.999968,5.4552726789754385e-05,99.9998,99.9999,100.0,100.0,100.0,99.99719999999999,0.005306599664569512,99.98,100.0,100.0,100.0,100.0,99.99999595999999,1.979187712184385e-05,99.999899,100.0,100.0,100.0,100.0
10,99.999748,0.00011356055653049038,99.9995,99.9997,99.9998,99.9998,99.9999,99.99599999999998,0.006324555320337119,99.98,99.99,100.0,100.0,100.0,99.99978587999998,0.00011540548340616072,99.999495,99.999798,99.999798,99.999899,99.999899
11,99.998372,0.0003883503572818037,99.9977,99.9981,99.9984,99.9987,99.999,99.99599999999998,0.006324555320337119,99.98,99.99,100.0,100.0,100.0,99.99839611999998,0.0003867864858062583,99.997677,99.998081,99.998485,99.998687,99.99899
12,99.996164,0.00041940910814948967,99.9955,99.9957,99.9962,99.9964,99.9969,99.99599999999998,0.006324555320337119,99.98,99.99,100.0,100.0,100.0,99.99616604000002,0.0004084997410048373,99.99555600000001,99.995859,99.996162,99.996364,99.99696999999999
13,99.99606799999998,0.00044963985588451663,99.9952,99.9957,99.9961,99.9964,99.9968,99.99519999999998,0.006997142273814236,99.98,99.99,100.0,100.0,100.0,99.99607716,0.0004459398775603933,99.995354,99.995657,99.996162,99.996364,99.99686899999999
14,99.99604799999997,0.00045176985291095413,99.9952,99.9957,99.9961,99.9964,99.9968,99.99359999999999,0.007418894796396189,99.98,99.99,100.0,100.0,100.0,99.99607312,0.00044652510074866464,99.995354,99.995657,99.996162,99.996364,99.99686899999999
15,99.99577200000002,0.0004837520025803355,99.9947,99.9954,99.9959,99.9961,99.9966,99.99279999999999,0.007222188034106781,99.98,99.99,99.99,100.0,100.0,99.99580239999997,0.00048410387314901034,99.994848,99.995354,99.99596,99.996061,99.996667
16,99.99455199999998,0.0007178412080687498,99.993,99.9941,99.9947,99.9952,99.9955,99.99279999999999,0.007222188034106781,99.98,99.99,99.99,100.0,100.0,99.99456952000003,0.0007135022421853452,99.99303,99.994242,99.994646,99.995253,99.99555600000001
17,99.991924,0.0007548668756816257,99.9905,99.9915,99.9919,99.9925,99.993,99.99279999999999,0.007222188034106781,99.98,99.99,99.99,100.0,100.0,99.99191496000002,0.000756073884220234,99.990505,99.991515,99.99181800000001,99.992525,99.99303
18,99.99179199999998,0.0007688536921959532,99.9904,99.9913,99.9918,99.9924,99.9928,99.99239999999998,0.007088018058667388,99.98,99.99,99.99,100.0,100.0,99.99178568,0.0007695749330636763,99.990303,99.991212,99.99181800000001,99.992424,99.992929
19,99.99176,0.0007621023553316924,99.9904,99.9912,99.9918,99.9923,99.9928,99.99,0.007483314773546394,99.98,99.98,99.99,100.0,100.0,99.9917776,0.0007622656754701174,99.990303,99.991212,99.99181800000001,99.992424,99.992929
20,99.99149200000002,0.0007662480016287517,99.9902,99.9909,99.9915,99.9921,99.9926,99.988,0.010198039027185102,99.96,99.98,99.99,100.0,100.0,99.99152711999999,0.00075814343339496,99.990101,99.990909,99.991515,99.992121,99.992727
21,99.99022000000001,0.0008380930735894783,99.9884,99.9895,99.9906,99.9908,99.9916,99.988,0.010198039027185102,99.96,99.98,99.99,100.0,100.0,99.9902424,0.0008304141135637653,99.988283,99.98969699999999,99.990505,99.990909,99.99161600000001
22,99.98784400000001,0.0010998472621237712,99.9849,99.9872,99.988,99.9886,99.9897,99.988,0.010198039027185102,99.96,99.98,99.99,100.0,100.0,99.98784260000001,0.0010994307618029146,99.984949,99.987172,99.98798000000001,99.988586,99.989798
23,99.98772400000003,0.0011186706396438299,99.9846,99.987,99.9879,99.9886,99.9896,99.98719999999999,0.01000799680255677,99.96,99.98,99.99,99.99,100.0,99.98772947999998,0.0011150042195440062,99.984646,99.987071,99.987879,99.988586,99.98969699999999
24,99.98769600000003,0.001108324862123738,99.9846,99.987,99.9879,99.9886,99.9895,99.98519999999999,0.009846826900072063,99.96,99.98,99.99,99.99,100.0,99.98772140000001,0.0011131579941773308,99.984646,99.987071,99.987879,99.988586,99.98969699999999
25,99.98744799999997,0.0011203999285957997,99.9843,99.9868,99.9876,99.9883,99.9892,99.98279999999998,0.009599999999999298,99.96,99.98,99.98,99.99,100.0,99.98749516000002,0.0011273334087111416,99.984444,99.98676800000001,99.987576,99.988283,99.98939399999999
26,99.986308,0.0012184974353675437,99.9834,99.9856,99.9863,99.9875,99.9881,99.98279999999998,0.009599999999999298,99.96,99.98,99.98,99.99,100.0,99.98634367999998,0.0012302801866267597,99.983535,99.98575799999999,99.986263,99.987475,99.98808100000001
27,99.98397200000001,0.0012514056097039437,99.981,99.9833,99.9839,99.9851,99.9857,99.98279999999998,0.009599999999999298,99.96,99.98,99.98,99.99,100.0,99.98398376000002,0.0012621990423059314,99.981111,99.983333,99.983838,99.985152,99.98575799999999
28,99.98376799999998,0.0013355807725493696,99.9806,99.983,99.9838,99.9851,99.9856,99.98159999999999,0.010461357464497688,99.96,99.98,99.98,99.99,100.0,99.98378984000001,0.0013409200328141223,99.980808,99.98303,99.983737,99.985051,99.98565699999999
29,99.983736,0.001328722694923147,99.9806,99.9829,99.9838,99.985,99.9856,99.97839999999997,0.012224565431949908,99.96,99.97,99.98,99.99,100.0,99.98378984000001,0.0013409200328141223,99.980808,99.98303,99.983737,99.985051,99.98565699999999
30,99.98350800000001,0.0013272286916742955,99.9803,99.9826,99.9837,99.9848,99.9852,99.97559999999997,0.014444376068215466,99.94,99.96,99.98,99.99,100.0,99.98358775999999,0.0013408478296963637,99.98050500000001,99.982828,99.983636,99.984949,99.985354
31,99.98209999999999,0.0014609585894192144,99.9785,99.9809,99.9823,99.9832,99.9842,99.97519999999999,0.014455448799675275,99.94,99.96,99.98,99.99,100.0,99.98216948000001,0.00147227932458677,99.978687,99.981111,99.982525,99.983434,99.98424200000001
32,99.979844,0.001542226961250528,99.9765,99.9788,99.9802,99.9809,99.9822,99.97519999999999,0.014455448799675275,99.94,99.96,99.98,99.99,100.0,99.97989092,0.001559178320013929,99.976667,99.978788,99.98040400000001,99.981212,99.982222
33,99.97975199999999,0.001563872117534368,99.9764,99.9786,99.9801,99.9809,99.9821,99.97479999999997,0.013891004283349192,99.94,99.96,99.98,99.99,100.0,99.97980204,0.0015757243027886203,99.976566,99.978687,99.980303,99.98101,99.98212099999999
34,99.97971600000001,0.0015617118812387284,99.9764,99.9786,99.9801,99.9809,99.982,99.9716,0.014051334456201145,99.94,99.96,99.97,99.98,100.0,99.97979799999999,0.0015787046335520817,99.976566,99.97858599999999,99.980303,99.98101,99.98212099999999
35,99.97948000000001,0.0015564061166692313,99.9763,99.9784,99.98,99.9805,99.9818,99.97,0.01442220510185703,99.94,99.96,99.97,99.98,100.0,99.9795758,0.0015701521200189113,99.976465,99.97828299999999,99.98,99.980909,99.98201999999999
36,99.978276,0.0016697975925240908,99.9748,99.977,99.9785,99.9796,99.9811,99.97,0.01442220510185703,99.94,99.96,99.97,99.98,100.0,99.97835972000001,0.0016763844313282786,99.974949,99.97697,99.97858599999999,99.979495,99.981111
37,99.975656,0.0018413212647434083,99.9721,99.9739,99.9757,99.9769,99.979,99.97,0.01442220510185703,99.94,99.96,99.97,99.98,100.0,99.97571320000002,0.0018610115313962017,99.972222,99.974141,99.975859,99.977071,99.97899
38,99.97551200000002,0.0018476623068084147,99.9721,99.9736,99.9756,99.9768,99.9788,99.96959999999999,0.014554724318929383,99.94,99.96,99.97,99.98,100.0,99.97557175999998,0.0018668531871552853,99.972222,99.973737,99.975758,99.976869,99.978788
39,99.975476,0.001852626244011,99.972,99.9736,99.9755,99.9768,99.9787,99.96600000000001,0.016733200530680423,99.93,99.95,99.97,99.98,100.0,99.97557175999998,0.0018668531871552853,99.972222,99.973737,99.975758,99.976869,99.978788
40,99.97526400000001,0.001875287711258472,99.9719,99.9735,99.9754,99.9766,99.9785,99.96519999999998,0.015778466338651136,99.93,99.95,99.97,99.97,99.99,99.97536571999999,0.0018947692317513958,99.972121,99.973636,99.97555600000001,99.976768,99.97858599999999
41,99.97398400000002,0.001996532994966759,99.971,99.972,99.974,99.9752,99.9776,99.96519999999998,0.015778466338651136,99.93,99.95,99.97,99.97,99.99,99.97407267999999,0.002019923735592071,99.97090899999999,99.972121,99.97404,99.97535400000001,99.977677
42,99.97169999999998,0.001793766985983183,99.9692,99.97,99.9719,99.9727,99.975,99.96519999999998,0.015778466338651136,99.93,99.95,99.97,99.97,99.99,99.97176551999999,0.0018252669091404093,99.969192,99.970202,99.97202,99.972727,99.97505100000001
43,99.971572,0.0018228592924325606,99.969,99.97,99.9718,99.9727,99.975,99.96519999999998,0.015778466338651136,99.93,99.95,99.97,99.97,99.99,99.97163624,0.0018547372704507436,99.968788,99.970202,99.971919,99.972727,99.97505100000001
44,99.97155199999999,0.0018046872305228715,99.969,99.97,99.9718,99.9727,99.9749,99.964,0.016492422502469226,99.92,99.95,99.96,99.97,99.99,99.97162816,0.0018475338953315463,99.968788,99.970202,99.971919,99.972727,99.97505100000001
45,99.971288,0.001832445360713879,99.9687,99.9699,99.9714,99.9726,99.9746,99.96199999999999,0.017204650534083682,99.92,99.95,99.96,99.97,99.99,99.97138168,0.0018662263896950292,99.968687,99.97,99.971616,99.972626,99.974747
46,99.970124,0.0018166518653839037,99.9676,99.9687,99.9702,99.9709,99.9741,99.96199999999999,0.017204650534083682,99.92,99.95,99.96,99.97,99.99,99.97020604000001,0.0018556490073279577,99.967576,99.968687,99.970303,99.97090899999999,99.974242
47,99.96768,0.0020307634032558034,99.9644,99.9657,99.9679,99.969,99.9717,99.96199999999999,0.017204650534083682,99.92,99.95,99.96,99.97,99.99,99.96773748000001,0.0020625553688567782,99.964242,99.965758,99.967677,99.96899,99.971818
48,99.96755600000002,0.0020256515001355834,99.9643,99.9657,99.9678,99.9688,99.9714,99.9616,0.01665653025092448,99.92,99.95,99.96,99.97,99.99,99.96761624000001,0.002052491915306721,99.964141,99.965758,99.967677,99.968889,99.971717
49,99.967528,0.0020110733452554396,99.9643,99.9657,99.9678,99.9688,99.9714,99.9588,0.017278888853163178,99.92,99.95,99.96,99.97,99.99,99.96761624000001,0.002052491915306721,99.964141,99.965758,99.967677,99.968889,99.971717
50,99.967396,0.0019842338571841108,99.9642,99.9655,99.9677,99.9687,99.9713,99.9568,0.01737124060048655,99.92,99.95,99.96,99.97,99.98,99.96750312,0.0020340206551556082,99.96404,99.965657,99.967677,99.968687,99.971616
51,99.966084,0.00185853275462087,99.9629,99.9645,99.9661,99.9672,99.97,99.9568,0.01737124060048655,99.92,99.95,99.96,99.97,99.98,99.96617784,0.0019100263596089628,99.962727,99.964545,99.966162,99.96727299999999,99.970505
52,99.96371200000003,0.0018866520611922786,99.9606,99.9619,99.9637,99.965,99.9675,99.9568,0.01737124060048655,99.92,99.95,99.96,99.97,99.98,99.96378164,0.0019295905654818288,99.960404,99.96202,99.963939,99.964949,99.96787900000001
53,99.963624,0.0018806977428590956,99.9606,99.9619,99.9637,99.9649,99.9674,99.9568,0.01737124060048655,99.92,99.95,99.96,99.97,99.98,99.96369276000001,0.0019213244864926683,99.960404,99.961919,99.963737,99.964848,99.96777800000001
54,99.963624,0.0018806977428590956,99.9606,99.9619,99.9637,99.9649,99.9674,99.9568,0.01737124060048655,99.92,99.95,99.96,99.97,99.98,99.96369276000001,0.0019213244864926683,99.960404,99.961919,99.963737,99.964848,99.96777800000001
55,99.963624,0.0018806977428590956,99.9606,99.9619,99.9637,99.9649,99.9674,99.9568,0.01737124060048655,99.92,99.95,99.96,99.97,99.98,99.96369276000001,0.0019213244864926683,99.960404,99.961919,99.963737,99.964848,99.96777800000001
56,99.963624,0.0018806977428590956,99.9606,99.9619,99.9637,99.9649,99.9674,99.9568,0.01737124060048655,99.92,99.95,99.96,99.97,99.98,99.96369276000001,0.0019213244864926683,99.960404,99.961919,99.963737,99.964848,99.96777800000001
57,99.963624,0.0018806977428590956,99.9606,99.9619,99.9637,99.9649,99.9674,99.9568,0.01737124060048655,99.92,99.95,99.96,99.97,99.98,99.96369276000001,0.0019213244864926683,99.960404,99.961919,99.963737,99.964848,99.96777800000001
58,99.963624,0.0018806977428590956,99.9606,99.9619,99.9637,99.9649,99.9674,99.9568,0.01737124060048655,99.92,99.95,99.96,99.97,99.98,99.96369276000001,0.0019213244864926683,99.960404,99.961919,99.963737,99.964848,99.96777800000001
59,99.963624,0.0018806977428590956,99.9606,99.9619,99.9637,99.9649,99.9674,99.9568,0.01737124060048655,99.92,99.95,99.96,99.97,99.98,99.96369276000001,0.0019213244864926683,99.960404,99.961919,99.963737,99.964848,99.96777800000001
60,99.963624,0.0018806977428590956,99.9606,99.9619,99.9637,99.9649,99.9674,99.9568,0.01737124060048655,99.92,99.95,99.96,99.97,99.98,99.96369276000001,0.0019213244864926683,99.960404,99.961919,99.963737,99.964848,99.96777800000001
61,99.963624,0.0018806977428590956,99.9606,99.9619,99.9637,99.9649,99.9674,99.9568,0.01737124060048655,99.92,99.95,99.96,99.97,99.98,99.96369276000001,0.0019213244864926683,99.960404,99.961919,99.963737,99.964848,99.96777800000001
62,99.963624,0.0018806977428590956,99.9606,99.9619,99.9637,99.9649,99.9674,99.9568,0.01737124060048655,99.92,99.95,99.96,99.97,99.98,99.96369276000001,0.0019213244864926683,99.960404,99.961919,99.963737,99.964848,99.96777800000001
63,99.963624,0.0018806977428590956,99.9606,99.9619,99.9637,99.9649,99.9674,99.9568,0.01737124060048655,99.92,99.95,99.96,99.97,99.98,99.96369276000001,0.0019213244864926683,99.960404,99.961919,99.963737,99.964848,99.96777800000001
64,99.963624,0.0018806977428590956,99.9606,99.9619,99.9637,99.9649,99.9674,99.9568,0.01737124060048655,99.92,99.95,99.96,99.97,99.98,99.96369276000001,0.0019213244864926683,99.960404,99.961919,99.963737,99.964848,99.96777800000001
65,99.963624,0.0018806977428590956,99.9606,99.9619,99.9637,99.9649,99.9674,99.9568,0.01737124060048655,99.92,99.95,99.96,99.97,99.98,99.96369276000001,0.0019213244864926683,99.960404,99.961919,99.963737,99.964848,99.96777800000001
66,99.963624,0.0018806977428590956,99.9606,99.9619,99.9637,99.9649,99.9674,99.9568,0.01737124060048655,99.92,99.95,99.96,99.97,99.98,99.96369276000001,0.0019213244864926683,99.960404,99.961919,99.963737,99.964848,99.96777800000001
67,99.963624,0.0018806977428590956,99.9606,99.9619,99.9637,99.9649,99.9674,99.9568,0.01737124060048655,99.92,99.95,99.96,99.97,99.98,99.96369276000001,0.0019213244864926683,99.960404,99.961919,99.963737,99.964848,99.96777800000001
68,99.963624,0.0018806977428590956,99.9606,99.9619,99.9637,99.9649,99.9674,99.9568,0.01737124060048655,99.92,99.95,99.96,99.97,99.98,99.96369276000001,0.0019213244864926683,99.960404,99.961919,99.963737,99.964848,99.96777800000001
69,99.963624,0.0018806977428590956,99.9606,99.9619,99.9637,99.9649,99.9674,99.9568,0.01737124060048655,99.92,99.95,99.96,99.97,99.98,99.96369276000001,0.0019213244864926683,99.960404,99.961919,99.963737,99.964848,99.96777800000001
70,99.963624,0.0018806977428590956,99.9606,99.9619,99.9637,99.9649,99.9674,99.9568,0.01737124060048655,99.92,99.95,99.96,99.97,99.98,99.96369276000001,0.0019213244864926683,99.960404,99.961919,99.963737,99.964848,99.96777800000001
71,99.963624,0.0018806977428590956,99.9606,99.9619,99.9637,99.9649,99.9674,99.9568,0.01737124060048655,99.92,99.95,99.96,99.97,99.98,99.96369276000001,0.0019213244864926683,99.960404,99.961919,99.963737,99.964848,99.96777800000001
72,99.963624,0.0018806977428590956,99.9606,99.9619,99.9637,99.9649,99.9674,99.9568,0.01737124060048655,99.92,99.95,99.96,99.97,99.98,99.96369276000001,0.0019213244864926683,99.960404,99.961919,99.963737,99.964848,99.96777800000001
73,99.963624,0.0018806977428590956,99.9606,99.9619,99.9637,99.9649,99.9674,99.9568,0.01737124060048655,99.92,99.95,99.96,99.97,99.98,99.96369276000001,0.0019213244864926683,99.960404,99.961919,99.963737,99.964848,99.96777800000001
