gossips,p2p mean,p2p std,p2p min,p2p q1,p2p q2,p2p q3,p2p max,p2s mean,p2s std,p2s min,p2s q1,p2s q2,p2s q3,p2s max,s2s mean,s2s std,s2s min,s2s q1,s2s q2,s2s q3,s2s max
1,0.001,,0.001,0.001,0.001,0.001,0.001,0.0037083333333333347,0.0018761469921708916,0.001,0.003,0.003,0.005,0.007,12.820515479999997,0.13470122063853038,12.605444,12.720333,12.802222,12.883,13.136667000000001
2,,,,,,,,,,,,,,,0.0006,0.0002684702031883613,0.00011100000000000001,0.00044400000000000006,0.000556,0.000778,0.001222
3,,,,,,,,,,,,,,,,,,,,,
4,,,,,,,,,,,,,,,,,,,,,
5,,,,,,,,,,,,,,,,,,,,,
