gossips,p2p mean,p2p std,p2p min,p2p q1,p2p q2,p2p q3,p2p max,p2s mean,p2s std,p2s min,p2s q1,p2s q2,p2s q3,p2s max,s2s mean,s2s std,s2s min,s2s q1,s2s q2,s2s q3,s2s max
1,48.824,1.4072076368941908,45.9,47.9,49.1,49.5,51.4,56.848,1.7652006495957713,54.1,55.5,56.7,57.9,61.7,0.65945952,0.02556053489613759,0.6073069999999999,0.643544,0.662763,0.6782779999999999,0.701401
2,22.956,0.9682802624584813,21.5,22.1,23.0,23.4,25.8,18.468000000000004,1.3855564465826244,15.7,17.6,18.4,19.3,21.3,0.00016666666666666666,7.302967433402216e-05,0.0001,0.0001,0.0002,0.0002,0.0003
3,1.8000000000000003,0.32532035493238565,1.2,1.6,1.8,2.1,2.4,0.1,0.0,0.1,0.1,0.1,0.1,0.1,,,,,,,
4,0.11249999999999999,0.03535533905932739,0.1,0.1,0.1,0.1,0.2,,,,,,,,,,,,,,
5,,,,,,,,,,,,,,,,,,,,,
6,,,,,,,,,,,,,,,,,,,,,
