gossips,p2p mean,p2p std,p2p min,p2p q1,p2p q2,p2p q3,p2p max,p2s mean,p2s std,p2s min,p2s q1,p2s q2,p2s q3,p2s max,s2s mean,s2s std,s2s min,s2s q1,s2s q2,s2s q3,s2s max
1,49.218,0.40717522845412224,48.07,49.04,49.25,49.44,49.97,58.4472,0.5137810817848395,57.56,58.01,58.42,58.84,59.34,53.46813336,0.16714881192390926,53.165656999999996,53.359393999999995,53.442525,53.556566000000004,53.913030000000006
2,22.298799999999996,0.3188170844439388,21.36,22.15,22.33,22.52,22.7,20.250799999999998,0.4473060100945063,19.57,19.86,20.19,20.63,21.07,20.971171679999998,0.2245838807850567,20.574545,20.891616,20.972323,21.071818,21.446869
3,2.0823999999999994,0.10377379245262265,1.89,2.01,2.07,2.17,2.26,0.33240000000000003,0.06430914916764693,0.2,0.28,0.34,0.37,0.45,0.7068484799999999,0.018633105144965315,0.66697,0.6923229999999999,0.7060609999999999,0.718889,0.739495
4,0.023333333333333345,0.010494995356656042,0.01,0.02,0.02,0.03,0.05,0.01,0.0,0.01,0.01,0.01,0.01,0.01,0.0008160799999999998,0.00035580108206693256,0.000202,0.000606,0.000808,0.00101,0.001515
5,,,,,,,,,,,,,,,,,,,,,
