round,P mean,P std,P min,P q1,P q2,P q3,P max,S mean,S std,S min,S q1,S q2,S q3,S max,P+S mean,P+S std,P+S min,P+S q1,P+S q2,P+S q3,P+S max
0,0.0,0.0,0.0,0.0,0.0,0.0,0.0,0.0,0.0,0.0,0.0,0.0,0.0,0.0,0.0,0.0,0.0,0.0,0.0,0.0,0.0
1,0.0,0.0,0.0,0.0,0.0,0.0,0.0,0.0,0.0,0.0,0.0,0.0,0.0,0.0,0.0,0.0,0.0,0.0,0.0,0.0,0.0
2,0.0,0.0,0.0,0.0,0.0,0.0,0.0,0.0,0.0,0.0,0.0,0.0,0.0,0.0,0.0,0.0,0.0,0.0,0.0,0.0,0.0
3,0.0,0.0,0.0,0.0,0.0,0.0,0.0,0.0,0.0,0.0,0.0,0.0,0.0,0.0,0.0,0.0,0.0,0.0,0.0,0.0,0.0
4,0.0,0.0,0.0,0.0,0.0,0.0,0.0,0.0,0.0,0.0,0.0,0.0,0.0,0.0,0.0,0.0,0.0,0.0,0.0,0.0,0.0
5,0.0,0.0,0.0,0.0,0.0,0.0,0.0,0.0,0.0,0.0,0.0,0.0,0.0,0.0,0.0,0.0,0.0,0.0,0.0,0.0,0.0
6,0.0,0.0,0.0,0.0,0.0,0.0,0.0,0.0,0.0,0.0,0.0,0.0,0.0,0.0,0.0,0.0,0.0,0.0,0.0,0.0,0.0
7,0.0,0.0,0.0,0.0,0.0,0.0,0.0,0.0,0.0,0.0,0.0,0.0,0.0,0.0,0.0,0.0,0.0,0.0,0.0,0.0,0.0
8,0.0,0.0,0.0,0.0,0.0,0.0,0.0,0.0,0.0,0.0,0.0,0.0,0.0,0.0,0.0,0.0,0.0,0.0,0.0,0.0,0.0
9,0.0,0.0,0.0,0.0,0.0,0.0,0.0,0.0,0.0,0.0,0.0,0.0,0.0,0.0,0.0,0.0,0.0,0.0,0.0,0.0,0.0
10,0.0,0.0,0.0,0.0,0.0,0.0,0.0,0.0,0.0,0.0,0.0,0.0,0.0,0.0,0.0,0.0,0.0,0.0,0.0,0.0,0.0
11,0.00016,0.0003741657386773942,0.0,0.0,0.0,0.0,0.001,0.0,0.0,0.0,0.0,0.0,0.0,0.0,1.6e-05,3.7416573867739416e-05,0.0,0.0,0.0,0.0,0.0001
12,0.08200000000000002,0.00837655458208604,0.066,0.076,0.085,0.087,0.098,0.0,0.0,0.0,0.0,0.0,0.0,0.0,0.008200000000000002,0.0008376554582086044,0.0066,0.0076,0.0085,0.0087,0.0098
13,7.062040000000001,0.11120606997821664,6.76,7.053,7.1,7.13,7.206,1.3320000000000003e-05,4.8806352045609807e-05,0.0,0.0,0.0,0.0,0.00022200000000000003,0.706216,0.011120951697883893,0.676,0.7053,0.7101,0.713,0.7206
14,65.33736,0.2847238252529391,64.625,65.299,65.416,65.492,65.743,0.2790933199999999,0.026382201210791094,0.206333,0.275889,0.285889,0.29377800000000004,0.313889,6.784919999999999,0.04794554202425911,6.6617,6.7875,6.8028,6.8143,6.8258
15,99.80852,0.012024696808373767,99.777,99.801,99.809,99.816,99.832,32.245079960000005,0.4081994000676932,31.185556,32.252444,32.35,32.469556,32.744333000000005,39.00142399999999,0.36773671546365727,38.0486,39.0073,39.0948,39.2049,39.4514
16,99.95248,0.0064815121692409355,99.941,99.948,99.953,99.957,99.967,98.62746227999997,0.028110629643604824,98.56277800000001,98.607889,98.63,98.647778,98.694222,98.759964,0.025629278179456517,98.7017,98.7424,98.7617,98.7784,98.8215
17,99.95251999999999,0.006519969325083842,99.941,99.948,99.953,99.957,99.967,99.98508008,0.001326997736745932,99.981667,99.984111,99.985444,99.985889,99.987111,99.981824,0.0013799999999994847,99.9777,99.9811,99.9819,99.9826,99.9844
18,99.95251999999999,0.006519969325083842,99.941,99.948,99.953,99.957,99.967,99.98526231999999,0.0012615781360370082,99.982,99.984444,99.985556,99.986111,99.987111,99.98198800000002,0.0013267504161184494,99.978,99.9813,99.982,99.9827,99.9844
19,99.95251999999999,0.006519969325083842,99.941,99.948,99.953,99.957,99.967,99.98526231999999,0.0012615781360370082,99.982,99.984444,99.985556,99.986111,99.987111,99.98198800000002,0.0013267504161184494,99.978,99.9813,99.982,99.9827,99.9844
20,99.95251999999999,0.006519969325083842,99.941,99.948,99.953,99.957,99.967,99.98526231999999,0.0012615781360370082,99.982,99.984444,99.985556,99.986111,99.987111,99.98198800000002,0.0013267504161184494,99.978,99.9813,99.982,99.9827,99.9844
21,99.95251999999999,0.006519969325083842,99.941,99.948,99.953,99.957,99.967,99.98526231999999,0.0012615781360370082,99.982,99.984444,99.985556,99.986111,99.987111,99.98198800000002,0.0013267504161184494,99.978,99.9813,99.982,99.9827,99.9844
22,99.95251999999999,0.006519969325083842,99.941,99.948,99.953,99.957,99.967,99.98526231999999,0.0012615781360370082,99.982,99.984444,99.985556,99.986111,99.987111,99.98198800000002,0.0013267504161184494,99.978,99.9813,99.982,99.9827,99.9844
23,99.95251999999999,0.006519969325083842,99.941,99.948,99.953,99.957,99.967,99.98526231999999,0.0012615781360370082,99.982,99.984444,99.985556,99.986111,99.987111,99.98198800000002,0.0013267504161184494,99.978,99.9813,99.982,99.9827,99.9844
24,99.95251999999999,0.006519969325083842,99.941,99.948,99.953,99.957,99.967,99.98526231999999,0.0012615781360370082,99.982,99.984444,99.985556,99.986111,99.987111,99.98198800000002,0.0013267504161184494,99.978,99.9813,99.982,99.9827,99.9844
25,99.95251999999999,0.006519969325083842,99.941,99.948,99.953,99.957,99.967,99.98526231999999,0.0012615781360370082,99.982,99.984444,99.985556,99.986111,99.987111,99.98198800000002,0.0013267504161184494,99.978,99.9813,99.982,99.9827,99.9844
