gossips,p2p mean,p2p std,p2p min,p2p q1,p2p q2,p2p q3,p2p max,p2s mean,p2s std,p2s min,p2s q1,p2s q2,p2s q3,p2s max,s2s mean,s2s std,s2s min,s2s q1,s2s q2,s2s q3,s2s max
1,34.432840000000006,0.2827520527482213,34.036,34.278,34.35,34.471,35.123,69.58760000000001,0.2996955399512425,69.201,69.38,69.469,69.741,70.35,56.053777839999995,0.25780213517002176,55.792,55.893111,55.984667,56.050332999999995,56.786778000000005
2,0.05460000000000001,0.007297259759663214,0.039,0.05,0.055,0.059,0.069,0.7751199999999998,0.03273036306958216,0.713,0.752,0.774,0.806,0.83,21.141591079999998,0.14291657532424376,20.833222,21.068778,21.167889000000002,21.221556,21.394222
3,,,,,,,,,,,,,,,0.26875116,0.009826279313147971,0.245667,0.262778,0.267,0.27422199999999997,0.28644400000000003
4,,,,,,,,,,,,,,,,,,,,,
5,,,,,,,,,,,,,,,,,,,,,
