round,P mean,P std,P min,P q1,P q2,P q3,P max,S mean,S std,S min,S q1,S q2,S q3,S max,P+S mean,P+S std,P+S min,P+S q1,P+S q2,P+S q3,P+S max
0,0.0,0.0,0,0,0,0,0,1.0,0.0,1,1,1,1,1,0.0,0.0,0,0,0,0,0
1,1.0,0.0,1,1,1,1,1,1.0,0.0,1,1,1,1,1,1.0,0.0,1,1,1,1,1
2,1.0,0.0,1,1,1,1,1,1.0,0.0,1,1,1,1,1,1.0,0.0,1,1,1,1,1
3,1.0,0.0,1,1,1,1,1,1.0,0.0,1,1,1,1,1,1.0,0.0,1,1,1,1,1
4,1.0,0.0,1,1,1,1,1,1.0,0.0,1,1,1,1,1,1.0,0.0,1,1,1,1,1
5,1.52,0.5099019513592784,1,1,2,2,2,1.0,0.0,1,1,1,1,1,1.0,0.0,1,1,1,1,1
6,2.28,0.6137317546507323,1,2,2,3,3,1.0,0.0,1,1,1,1,1,1.0,0.0,1,1,1,1,1
7,3.0,0.7071067811865475,1,3,3,3,4,1.0,0.0,1,1,1,1,1,1.0,0.0,1,1,1,1,1
8,3.8,0.9128709291752769,1,4,4,4,5,1.0,0.0,1,1,1,1,1,1.0,0.0,1,1,1,1,1
9,4.68,1.2819256348686274,1,5,5,5,6,1.0,0.0,1,1,1,1,1,1.0,0.0,1,1,1,1,1
10,5.52,1.686218649325565,1,6,6,6,7,1.0,0.0,1,1,1,1,1,1.0,0.0,1,1,1,1,1
11,6.2,2.041241452319315,1,6,7,7,8,1.0,0.0,1,1,1,1,1,1.0,0.0,1,1,1,1,1
12,6.88,2.420743687382041,1,6,8,8,9,1.0,0.0,1,1,1,1,1,1.0,0.0,1,1,1,1,1
13,7.4,2.753785273643051,1,6,9,9,10,1.0,0.0,1,1,1,1,1,1.0,0.0,1,1,1,1,1
14,7.84,3.050682983639347,1,6,10,10,10,1.0,0.0,1,1,1,1,1,1.0,0.0,1,1,1,1,1
15,7.84,3.050682983639347,1,6,10,10,10,1.0,0.0,1,1,1,1,1,1.0,0.0,1,1,1,1,1
16,7.84,3.050682983639347,1,6,10,10,10,1.0,0.0,1,1,1,1,1,1.0,0.0,1,1,1,1,1
17,7.84,3.050682983639347,1,6,10,10,10,1.0,0.0,1,1,1,1,1,1.0,0.0,1,1,1,1,1
18,7.84,3.050682983639347,1,6,10,10,10,1.0,0.0,1,1,1,1,1,1.0,0.0,1,1,1,1,1
19,7.84,3.050682983639347,1,6,10,10,10,1.0,0.0,1,1,1,1,1,1.0,0.0,1,1,1,1,1
20,7.84,3.050682983639347,1,6,10,10,10,1.0,0.0,1,1,1,1,1,1.0,0.0,1,1,1,1,1
21,7.84,3.050682983639347,1,6,10,10,10,1.0,0.0,1,1,1,1,1,1.0,0.0,1,1,1,1,1
22,7.84,3.050682983639347,1,6,10,10,10,1.0,0.0,1,1,1,1,1,1.0,0.0,1,1,1,1,1
23,7.84,3.050682983639347,1,6,10,10,10,1.0,0.0,1,1,1,1,1,1.0,0.0,1,1,1,1,1
24,7.84,3.050682983639347,1,6,10,10,10,1.0,0.0,1,1,1,1,1,1.0,0.0,1,1,1,1,1
25,7.84,3.050682983639347,1,6,10,10,10,1.0,0.0,1,1,1,1,1,1.0,0.0,1,1,1,1,1
