gossips,p2p mean,p2p std,p2p min,p2p q1,p2p q2,p2p q3,p2p max,p2s mean,p2s std,p2s min,p2s q1,p2s q2,p2s q3,p2s max,s2s mean,s2s std,s2s min,s2s q1,s2s q2,s2s q3,s2s max
1,,,,,,,,0.01,0.0,0.01,0.01,0.01,0.01,0.01,60.36246867999999,0.2154362452586448,59.962929,60.23303000000001,60.31202,60.528586,60.800303
2,,,,,,,,,,,,,,,1.75824248,0.0775845643159342,1.593434,1.691111,1.7784849999999999,1.821616,1.867172
3,,,,,,,,,,,,,,,0.0058467200000000006,0.0008183444934744778,0.004242,0.005152,0.0058590000000000005,0.006465,0.0071719999999999996
4,,,,,,,,,,,,,,,,,,,,,
5,,,,,,,,,,,,,,,,,,,,,
