gossips,p2p mean,p2p std,p2p min,p2p q1,p2p q2,p2p q3,p2p max,p2s mean,p2s std,p2s min,p2s q1,p2s q2,p2s q3,p2s max,s2s mean,s2s std,s2s min,s2s q1,s2s q2,s2s q3,s2s max
1,49.163999999999994,1.7075518537758494,46.2,48.1,49.4,50.2,52.7,56.5,1.522607412740831,54.1,55.4,56.2,57.6,59.8,48.28936144,0.0758573488799212,48.086987,48.268569,48.298297999999996,48.323924,48.426627
2,22.268,1.437509420258988,20.0,21.3,22.5,23.0,25.8,18.655999999999995,1.6171167758287173,15.1,18.0,18.8,19.7,22.0,23.256200200000002,0.4243476638970883,21.931231,23.024324,23.316617,23.537938,24.007707999999997
3,2.0280000000000005,0.4541659021400293,1.1,1.7,2.0,2.3,3.0,0.11249999999999999,0.03535533905932738,0.1,0.1,0.1,0.1,0.2,1.6152232399999995,0.06515168084700491,1.45035,1.56977,1.631632,1.647748,1.731632
4,0.15000000000000002,0.07071067811865477,0.1,0.125,0.15000000000000002,0.17500000000000002,0.2,,,,,,,,0.017765799999999998,0.00147628946461503,0.015415,0.016717,0.017818,0.018619,0.021622
5,0.1,,0.1,0.1,0.1,0.1,0.1,,,,,,,,0.00012500000000000003,4.629100498862758e-05,0.0001,0.0001,0.0001,0.000125,0.0002
6,,,,,,,,,,,,,,,,,,,,,
