gossips,p2p mean,p2p std,p2p min,p2p q1,p2p q2,p2p q3,p2p max,p2s mean,p2s std,p2s min,p2s q1,p2s q2,p2s q3,p2s max,s2s mean,s2s std,s2s min,s2s q1,s2s q2,s2s q3,s2s max
1,0.14808,0.012365678307314967,0.132,0.139,0.143,0.154,0.183,1.09384,0.043867869790998514,1.031,1.073,1.095,1.108,1.252,65.10041771999998,0.1163818224185374,64.75944399999999,65.026333,65.088444,65.143333,65.369333
2,,,,,,,,0.001,,0.001,0.001,0.001,0.001,0.001,1.4324799999999995,0.029701106225189625,1.345444,1.423111,1.4342219999999999,1.448222,1.494
3,,,,,,,,,,,,,,,0.007551120000000003,0.0008003279702721878,0.005333,0.007222,0.007556,0.008111,0.008889
4,,,,,,,,,,,,,,,0.00011100000000000001,,0.00011100000000000001,0.00011100000000000001,0.00011100000000000001,0.00011100000000000001,0.00011100000000000001
5,,,,,,,,,,,,,,,,,,,,,
