gossips,p2p mean,p2p std,p2p min,p2p q1,p2p q2,p2p q3,p2p max,p2s mean,p2s std,p2s min,p2s q1,p2s q2,p2s q3,p2s max,s2s mean,s2s std,s2s min,s2s q1,s2s q2,s2s q3,s2s max
1,49.10799999999999,1.570806586863364,45.1,48.4,49.2,50.3,51.9,49.10799999999999,1.570806586863364,45.1,48.4,49.2,50.3,51.9,58.50656655999998,0.0813498947044391,58.355856,58.474074,58.499299,58.554855,58.664665
2,22.140000000000004,1.3484559070779185,19.1,21.2,22.0,23.1,24.7,22.140000000000004,1.3484559070779185,19.1,21.2,22.0,23.1,24.7,15.7964324,0.12366271669545353,15.565766,15.697097,15.807607999999998,15.877476999999999,16.008909
3,2.088,0.6036831398451784,1.2,1.7,2.1,2.4,3.8,2.088,0.6036831398451784,1.2,1.7,2.1,2.4,3.8,0.4067948800000001,0.007981447969719106,0.393594,0.400801,0.406507,0.411812,0.422523
4,0.1,0.0,0.1,0.1,0.1,0.1,0.1,0.1,0.0,0.1,0.1,0.1,0.1,0.1,0.00159768,0.00038069801242804867,0.000701,0.001301,0.001602,0.001802,0.0026030000000000003
5,,,,,,,,,,,,,,,0.0001,,0.0001,0.0001,0.0001,0.0001,0.0001
