round,nodes,nodesP,nodesS,nodesSent,nodesSentP,nodesSentS,nodesRecv,nodesRecvP,nodesRecvS,msgSent,msgSentP,msgSentS,msgRecv,msgRecvP,msgRecvS,msgInfect,msgInfectP,msgInfectS
00,10000.000000,1000.000000,9000.000000,0.000000,0.000000,0.000000,0.000000,0.000000,0.000000,0.000000,0.000000,0.000000,0.000000,0.000000,0.000000,0.000000,0.000000,0.000000
01,10000.000000,1000.000000,9000.000000,0.011000,0.110000,0.000000,0.011000,0.110000,0.000000,11.000000,11.000000,0.000000,1.100000,1.100000,0.000000,0.100000,1.000000,0.000000
02,10000.000000,1000.000000,9000.000000,0.116000,1.160000,0.000000,0.116000,1.160000,0.000000,116.000000,116.000000,0.000000,11.600000,11.600000,0.000000,0.100000,1.000000,0.000000
03,10000.000000,1000.000000,9000.000000,1.091000,10.910000,0.000000,1.091000,10.910000,0.000000,1091.000000,1091.000000,0.000000,114.400000,114.400000,0.000000,0.100000,1.000000,0.000000
04,10000.000000,1000.000000,9000.000000,6.575000,65.750000,0.000000,6.575000,65.750000,0.000000,6575.000000,6575.000000,0.000000,1087.100000,1087.100000,0.000000,0.100000,1.000000,0.000000
05,10000.000000,1000.000000,9000.000000,10.068000,99.820000,0.095556,10.068000,99.820000,0.095556,10068.000000,9982.000000,86.000000,6508.600000,6500.000000,8.600000,1.500000,6.000000,1.000000
06,10000.000000,1000.000000,9000.000000,26.740000,99.990000,18.601111,26.740000,99.990000,18.601111,26740.000000,9999.000000,16741.000000,10083.000000,8236.500000,1846.500000,1.700000,8.000000,1.000000
07,10000.000000,1000.000000,9000.000000,87.871000,99.990000,86.524444,87.871000,99.990000,86.524444,87871.000000,9999.000000,77872.000000,26266.100000,8236.500000,18029.600000,2.600000,8.000000,2.000000
08,10000.000000,1000.000000,9000.000000,99.986000,99.990000,99.985556,99.986000,99.990000,99.985556,99986.000000,9999.000000,89987.000000,87438.700000,8236.500000,79202.200000,8.000000,8.000000,8.000000
09,10000.000000,1000.000000,9000.000000,99.996000,99.990000,99.996667,99.996000,99.990000,99.996667,99996.000000,9999.000000,89997.000000,99986.100000,8236.500000,91749.600000,9.800000,8.000000,10.000000
10,10000.000000,1000.000000,9000.000000,99.996000,99.990000,99.996667,99.996000,99.990000,99.996667,99996.000000,9999.000000,89997.000000,99997.000000,8236.500000,91760.500000,9.800000,8.000000,10.000000
11,10000.000000,1000.000000,9000.000000,99.996000,99.990000,99.996667,99.996000,99.990000,99.996667,99996.000000,9999.000000,89997.000000,99997.000000,8236.500000,91760.500000,9.800000,8.000000,10.000000
12,10000.000000,1000.000000,9000.000000,99.996000,99.990000,99.996667,99.996000,99.990000,99.996667,99996.000000,9999.000000,89997.000000,99997.000000,8236.500000,91760.500000,9.800000,8.000000,10.000000
13,10000.000000,1000.000000,9000.000000,99.996000,99.990000,99.996667,99.996000,99.990000,99.996667,99996.000000,9999.000000,89997.000000,99997.000000,8236.500000,91760.500000,9.800000,8.000000,10.000000
14,10000.000000,1000.000000,9000.000000,99.996000,99.990000,99.996667,99.996000,99.990000,99.996667,99996.000000,9999.000000,89997.000000,99997.000000,8236.500000,91760.500000,9.800000,8.000000,10.000000
15,10000.000000,1000.000000,9000.000000,99.996000,99.990000,99.996667,99.996000,99.990000,99.996667,99996.000000,9999.000000,89997.000000,99997.000000,8236.500000,91760.500000,9.800000,8.000000,10.000000
16,10000.000000,1000.000000,9000.000000,99.996000,99.990000,99.996667,99.996000,99.990000,99.996667,99996.000000,9999.000000,89997.000000,99997.000000,8236.500000,91760.500000,9.800000,8.000000,10.000000
17,10000.000000,1000.000000,9000.000000,99.996000,99.990000,99.996667,99.996000,99.990000,99.996667,99996.000000,9999.000000,89997.000000,99997.000000,8236.500000,91760.500000,9.800000,8.000000,10.000000
18,10000.000000,1000.000000,9000.000000,99.996000,99.990000,99.996667,99.996000,99.990000,99.996667,99996.000000,9999.000000,89997.000000,99997.000000,8236.500000,91760.500000,9.800000,8.000000,10.000000
19,10000.000000,1000.000000,9000.000000,99.996000,99.990000,99.996667,99.996000,99.990000,99.996667,99996.000000,9999.000000,89997.000000,99997.000000,8236.500000,91760.500000,9.800000,8.000000,10.000000
