round,nodes,nodesP,nodesS,recvOne,recvOneP,recvOneS,recvAll,recvAllP,recvAllS,msgSent,msgSentP,msgSentS,msgRecv,msgRecvP,msgRecvS,consist,consistP,consistS,Unnamed: 19
0,1000000.0,10000.0,990000.0,1.6e-05,0.0016,0.0,0.0,0.0,0.0,11.6,1.6,10.0,0.16,0.16,0.0,100.0,100.0,100.0,
1,1000000.0,10000.0,990000.0,0.0010760000000000004,0.10760000000000006,0.0,0.0,0.0,0.0,117.6,107.6,10.0,10.76,10.76,0.0,100.0,100.0,100.0,
2,1000000.0,10000.0,990000.0,0.011612,1.1608,4.04e-06,0.0,0.0,0.0,1178.4,1168.0,10.4,116.84,116.8,0.04,100.0,100.0,100.0,
3,1000000.0,10000.0,990000.0,0.111308,11.0172,0.0011473599999999998,0.0,0.0,0.0,11756.4,11632.8,123.6,1176.88,1165.52,11.36,100.0,100.0,100.0,
4,1000000.0,10000.0,990000.0,0.7433239999999998,65.92200000000001,0.08495351999999999,0.0,0.0,0.0,103628.8,95208.4,8420.4,11627.96,10786.52,841.44,100.0,100.0,100.0,
5,1000000.0,10000.0,990000.0,4.665044,99.8572,3.70350704,0.0,0.0,0.0,565409.2,198742.4,366666.8,102456.96,65095.6,37361.36,99.99991599999997,100.0,99.99991515999996,
6,1000000.0,10000.0,990000.0,37.7433,99.99599999999998,37.114484880000006,0.0,0.0,0.0,3874402.4,200052.0,3674350.4,559185.32,99874.4,459310.92,99.999948,100.0,99.99994747999999,
7,1000000.0,10000.0,990000.0,97.5785,99.99599999999998,97.55408072000002,0.0,0.0,0.0,9858979.2,201115.2,9657864.0,3774236.92,100122.88,3674114.04,100.0,100.0,100.0,
8,1000000.0,10000.0,990000.0,99.99496000000003,99.9964,99.99494539999999,0.0,0.0,0.0,10111086.4,211500.0,9899586.4,9849101.08,101163.88,9747937.2,99.999996,99.99959999999999,100.0,
9,1000000.0,10000.0,990000.0,99.99610799999999,99.99880000000002,99.99608119999999,0.0,0.0,0.0,10203215.2,295471.6,9907743.6,10111079.8,110827.0,10000252.8,99.999968,99.99719999999999,99.99999595999999,
10,1000000.0,10000.0,990000.0,99.996232,100.0,99.99619432000003,0.0,0.0,0.0,10659345.6,398707.6,10260638.0,10201567.92,165244.48,10036323.44,99.999748,99.99599999999998,99.99978587999998,
11,1000000.0,10000.0,990000.0,99.997644,100.0,99.99762043999999,0.0,0.0,0.0,13929821.6,400001.2,13529820.4,10651678.36,199891.64,10451786.72,99.998372,99.99599999999998,99.99839611999998,
12,1000000.0,10000.0,990000.0,99.99990799999999,100.0,99.99990707999997,0.0,0.0,0.0,19953153.6,401049.2,19552104.4,13852282.88,200128.04,13652154.84,99.996164,99.99599999999998,99.99616604000002,
13,1000000.0,10000.0,990000.0,100.0,100.0,100.0,0.0,0.0,0.0,20210585.2,411442.8,19799142.4,19946051.16,201169.64,19744881.52,99.99606799999998,99.99519999999998,99.99607716,
14,1000000.0,10000.0,990000.0,100.0,100.0,100.0,0.0,0.0,0.0,20302693.6,495724.0,19806969.6,20210594.8,210867.04,19999727.76,99.99604799999997,99.99359999999999,99.99607312,
15,1000000.0,10000.0,990000.0,100.0,100.0,100.0,0.0,0.0,0.0,20758036.8,598715.6,20159321.2,20301038.4,265283.64,20035754.76,99.99577200000002,99.99279999999999,99.99580239999997,
16,1000000.0,10000.0,990000.0,100.0,100.0,100.0,0.0,0.0,0.0,24022640.8,599949.6,23422691.2,20750158.52,299896.68,20450261.84,99.99455199999998,99.99279999999999,99.99456952000003,
17,1000000.0,10000.0,990000.0,100.0,100.0,100.0,0.0,0.0,0.0,30051546.0,600995.6,29450550.4,23946919.68,300133.16,23646786.52,99.991924,99.99279999999999,99.99191496000002,
18,1000000.0,10000.0,990000.0,100.0,100.0,100.0,0.0,0.0,0.0,30310189.2,611442.4,29698746.8,30044942.96,301180.84,29743762.12,99.99179199999998,99.99239999999998,99.99178568,
19,1000000.0,10000.0,990000.0,100.0,100.0,100.0,0.0,0.0,0.0,30402602.8,695520.0,29707082.8,30310173.56,310851.52,29999322.04,99.99176,99.99,99.9917776,
20,1000000.0,10000.0,990000.0,100.0,100.0,100.0,0.0,0.0,0.0,30860794.0,798609.6,30062184.4,30400852.84,365221.6,30035631.24,99.99149200000002,99.988,99.99152711999999,
21,1000000.0,10000.0,990000.0,100.0,100.0,100.0,0.0,0.0,0.0,34144278.8,799889.6,33344389.2,30853170.88,399898.36,30453272.52,99.99022000000001,99.988,99.9902424,
22,1000000.0,10000.0,990000.0,100.0,100.0,100.0,0.0,0.0,0.0,40154032.0,800932.4,39353099.6,34059673.6,400137.08,33659536.52,99.98784400000001,99.988,99.98784260000001,
23,1000000.0,10000.0,990000.0,100.0,100.0,100.0,0.0,0.0,0.0,40409735.6,811384.0,39598351.6,40146294.92,401185.04,39745109.88,99.98772400000003,99.98719999999999,99.98772947999998,
24,1000000.0,10000.0,990000.0,100.0,100.0,100.0,0.0,0.0,0.0,40501887.6,895410.8,39606476.8,40409671.68,410849.2,39998822.48,99.98769600000003,99.98519999999999,99.98772140000001,
25,1000000.0,10000.0,990000.0,100.0,100.0,100.0,0.0,0.0,0.0,40956920.0,998501.6,39958418.4,40500072.2,465242.88,40034829.32,99.98744799999997,99.98279999999998,99.98749516000002,
26,1000000.0,10000.0,990000.0,100.0,100.0,100.0,0.0,0.0,0.0,44228680.4,999823.6,43228856.8,40950365.0,499878.6,40450486.4,99.986308,99.98279999999998,99.98634367999998,
27,1000000.0,10000.0,990000.0,100.0,100.0,100.0,0.0,0.0,0.0,50251883.6,1000869.6,49251014.0,44151379.92,500138.88,43651241.04,99.98397200000001,99.98279999999998,99.98398376000002,
28,1000000.0,10000.0,990000.0,100.0,100.0,100.0,0.0,0.0,0.0,50509289.2,1011312.0,49497977.2,50244893.2,501185.84,49743707.36,99.98376799999998,99.98159999999999,99.98378984000001,
29,1000000.0,10000.0,990000.0,100.0,100.0,100.0,0.0,0.0,0.0,50601732.4,1095268.8,49506463.6,50509259.8,510839.48,49998420.32,99.983736,99.97839999999997,99.98378984000001,
30,1000000.0,10000.0,990000.0,100.0,100.0,100.0,0.0,0.0,0.0,51060518.0,1198498.8,49862019.2,50599949.92,565167.96,50034781.96,99.98350800000001,99.97559999999997,99.98358775999999,
31,1000000.0,10000.0,990000.0,100.0,100.0,100.0,0.0,0.0,0.0,54345380.4,1199774.4,53145606.0,51052567.64,599885.64,50452682.0,99.98209999999999,99.97519999999999,99.98216948000001,
32,1000000.0,10000.0,990000.0,100.0,100.0,100.0,0.0,0.0,0.0,60354550.4,1200824.4,59153726.0,54264456.12,600143.92,53664312.2,99.979844,99.97519999999999,99.97989092,
33,1000000.0,10000.0,990000.0,100.0,100.0,100.0,0.0,0.0,0.0,60608813.2,1211261.2,59397552.0,60347179.0,601190.24,59745988.76,99.97975199999999,99.97479999999997,99.97980204,
34,1000000.0,10000.0,990000.0,100.0,100.0,100.0,0.0,0.0,0.0,60701052.0,1295161.6,59405890.4,60608770.64,610834.84,59997935.8,99.97971600000001,99.9716,99.97979799999999,
35,1000000.0,10000.0,990000.0,100.0,100.0,100.0,0.0,0.0,0.0,61159607.2,1398432.8,59761174.4,60699444.16,665179.92,60034264.24,99.97948000000001,99.97,99.9795758,
36,1000000.0,10000.0,990000.0,100.0,100.0,100.0,0.0,0.0,0.0,64441667.2,1399720.8,63041946.4,61151595.68,699899.96,60451695.72,99.978276,99.97,99.97835972000001,
37,1000000.0,10000.0,990000.0,100.0,100.0,100.0,0.0,0.0,0.0,70454009.2,1400771.2,69053238.0,64363308.64,700148.96,63663159.68,99.975656,99.97,99.97571320000002,
38,1000000.0,10000.0,990000.0,100.0,100.0,100.0,0.0,0.0,0.0,70708343.2,1411187.2,69297156.0,70447022.16,701192.68,69745829.48,99.97551200000002,99.96959999999999,99.97557175999998,
39,1000000.0,10000.0,990000.0,100.0,100.0,100.0,0.0,0.0,0.0,70800575.2,1495366.4,69305208.8,70708343.48,710875.16,69997468.32,99.975476,99.96600000000001,99.97557175999998,
40,1000000.0,10000.0,990000.0,100.0,100.0,100.0,0.0,0.0,0.0,71257126.8,1598420.0,69658706.8,70798934.68,765341.2,70033593.48,99.97526400000001,99.96519999999998,99.97536571999999,
41,1000000.0,10000.0,990000.0,100.0,100.0,100.0,0.0,0.0,0.0,74528632.4,1599668.8,72928963.6,71249167.68,799910.48,70449257.2,99.97398400000002,99.96519999999998,99.97407267999999,
42,1000000.0,10000.0,990000.0,100.0,100.0,100.0,0.0,0.0,0.0,80550237.2,1600714.8,78949522.4,74448805.64,800155.08,73648650.56,99.97169999999998,99.96519999999998,99.97176551999999,
43,1000000.0,10000.0,990000.0,100.0,100.0,100.0,0.0,0.0,0.0,80807963.6,1611203.2,79196760.4,80543298.16,801206.24,79742091.92,99.971572,99.96519999999998,99.97163624,
44,1000000.0,10000.0,990000.0,100.0,100.0,100.0,0.0,0.0,0.0,80900415.6,1695373.6,79205042.0,80807927.6,810896.32,79997031.28,99.97155199999999,99.964,99.97162816,
45,1000000.0,10000.0,990000.0,100.0,100.0,100.0,1.6e-05,0.0008,8.08e-06,81359566.4,1798301.2,79561265.2,80898715.68,865262.92,80033452.76,99.971288,99.96199999999999,99.97138168,
46,1000000.0,10000.0,990000.0,100.0,100.0,100.0,0.0011120000000000001,0.10680000000000002,4.4439999999999995e-05,84638899.6,1799625.2,82839274.4,81350437.04,899904.04,80450533.0,99.970124,99.96199999999999,99.97020604000001,
47,1000000.0,10000.0,990000.0,100.0,100.0,100.0,0.011627999999999996,1.1528,0.00010099999999999997,90651312.0,1800677.2,88850634.8,84554887.44,900160.6,83654726.84,99.96768,99.96199999999999,99.96773748000001,
48,1000000.0,10000.0,990000.0,100.0,100.0,100.0,0.110492,10.963600000000001,0.0008645599999999999,90907487.2,1811113.6,89096373.6,90643531.2,901206.72,89742324.48,99.96755600000002,99.9616,99.96761624000001,
49,1000000.0,10000.0,990000.0,100.0,100.0,100.0,0.7437240000000002,66.07039999999999,0.08385859999999999,90999798.8,1895089.2,89104709.6,90907472.2,910881.6,89996590.6,99.967528,99.9588,99.96761624000001,
50,1000000.0,10000.0,990000.0,100.0,100.0,100.0,4.627292000000001,99.80879999999998,3.665862680000001,91457700.8,1998242.0,89459458.8,90998029.28,965161.28,90032868.0,99.967396,99.9568,99.96750312,
51,1000000.0,10000.0,990000.0,100.0,100.0,100.0,37.38304,99.95,36.751050600000006,94735552.4,1999445.2,92736107.2,91449550.04,999904.6,90449645.44,99.966084,99.9568,99.96617784,
52,1000000.0,10000.0,990000.0,100.0,100.0,100.0,97.50549199999999,99.95,97.48080003999998,100749954.0,1999446.8,98750507.2,94655407.48,1000048.0,93655359.48,99.96371200000003,99.9568,99.96378164,
53,1000000.0,10000.0,990000.0,100.0,100.0,100.0,99.958288,99.95,99.95837184,100995324.4,1999446.8,98995877.6,100742664.88,1000048.0,99742616.88,99.963624,99.9568,99.96369276000001,
54,1000000.0,10000.0,990000.0,100.0,100.0,100.0,99.95956399999999,99.95,99.95966064,100995452.4,1999446.8,98996005.6,100995324.28,1000048.0,99995276.28,99.963624,99.9568,99.96369276000001,
55,1000000.0,10000.0,990000.0,100.0,100.0,100.0,99.95956399999999,99.95,99.95966064,100995452.4,1999446.8,98996005.6,100995452.4,1000048.0,99995404.4,99.963624,99.9568,99.96369276000001,
56,1000000.0,10000.0,990000.0,100.0,100.0,100.0,99.95956399999999,99.95,99.95966064,100995452.4,1999446.8,98996005.6,100995452.4,1000048.0,99995404.4,99.963624,99.9568,99.96369276000001,
57,1000000.0,10000.0,990000.0,100.0,100.0,100.0,99.95956399999999,99.95,99.95966064,100995452.4,1999446.8,98996005.6,100995452.4,1000048.0,99995404.4,99.963624,99.9568,99.96369276000001,
58,1000000.0,10000.0,990000.0,100.0,100.0,100.0,99.95956399999999,99.95,99.95966064,100995452.4,1999446.8,98996005.6,100995452.4,1000048.0,99995404.4,99.963624,99.9568,99.96369276000001,
59,1000000.0,10000.0,990000.0,100.0,100.0,100.0,99.95956399999999,99.95,99.95966064,100995452.4,1999446.8,98996005.6,100995452.4,1000048.0,99995404.4,99.963624,99.9568,99.96369276000001,
60,1000000.0,10000.0,990000.0,100.0,100.0,100.0,99.95956399999999,99.95,99.95966064,100995452.4,1999446.8,98996005.6,100995452.4,1000048.0,99995404.4,99.963624,99.9568,99.96369276000001,
61,1000000.0,10000.0,990000.0,100.0,100.0,100.0,99.95956399999999,99.95,99.95966064,100995452.4,1999446.8,98996005.6,100995452.4,1000048.0,99995404.4,99.963624,99.9568,99.96369276000001,
62,1000000.0,10000.0,990000.0,100.0,100.0,100.0,99.95956399999999,99.95,99.95966064,100995452.4,1999446.8,98996005.6,100995452.4,1000048.0,99995404.4,99.963624,99.9568,99.96369276000001,
63,1000000.0,10000.0,990000.0,100.0,100.0,100.0,99.95956399999999,99.95,99.95966064,100995452.4,1999446.8,98996005.6,100995452.4,1000048.0,99995404.4,99.963624,99.9568,99.96369276000001,
64,1000000.0,10000.0,990000.0,100.0,100.0,100.0,99.95956399999999,99.95,99.95966064,100995452.4,1999446.8,98996005.6,100995452.4,1000048.0,99995404.4,99.963624,99.9568,99.96369276000001,
65,1000000.0,10000.0,990000.0,100.0,100.0,100.0,99.95956399999999,99.95,99.95966064,100995452.4,1999446.8,98996005.6,100995452.4,1000048.0,99995404.4,99.963624,99.9568,99.96369276000001,
66,1000000.0,10000.0,990000.0,100.0,100.0,100.0,99.95956399999999,99.95,99.95966064,100995452.4,1999446.8,98996005.6,100995452.4,1000048.0,99995404.4,99.963624,99.9568,99.96369276000001,
67,1000000.0,10000.0,990000.0,100.0,100.0,100.0,99.95956399999999,99.95,99.95966064,100995452.4,1999446.8,98996005.6,100995452.4,1000048.0,99995404.4,99.963624,99.9568,99.96369276000001,
68,1000000.0,10000.0,990000.0,100.0,100.0,100.0,99.95956399999999,99.95,99.95966064,100995452.4,1999446.8,98996005.6,100995452.4,1000048.0,99995404.4,99.963624,99.9568,99.96369276000001,
69,1000000.0,10000.0,990000.0,100.0,100.0,100.0,99.95956399999999,99.95,99.95966064,100995452.4,1999446.8,98996005.6,100995452.4,1000048.0,99995404.4,99.963624,99.9568,99.96369276000001,
70,1000000.0,10000.0,990000.0,100.0,100.0,100.0,99.95956399999999,99.95,99.95966064,100995452.4,1999446.8,98996005.6,100995452.4,1000048.0,99995404.4,99.963624,99.9568,99.96369276000001,
71,1000000.0,10000.0,990000.0,100.0,100.0,100.0,99.95956399999999,99.95,99.95966064,100995452.4,1999446.8,98996005.6,100995452.4,1000048.0,99995404.4,99.963624,99.9568,99.96369276000001,
72,1000000.0,10000.0,990000.0,100.0,100.0,100.0,99.95956399999999,99.95,99.95966064,100995452.4,1999446.8,98996005.6,100995452.4,1000048.0,99995404.4,99.963624,99.9568,99.96369276000001,
73,1000000.0,10000.0,990000.0,100.0,100.0,100.0,99.95956399999999,99.95,99.95966064,100995452.4,1999446.8,98996005.6,100995452.4,1000048.0,99995404.4,99.963624,99.9568,99.96369276000001,
