gossips,p2p mean,p2p std,p2p min,p2p q1,p2p q2,p2p q3,p2p max,p2s mean,p2s std,p2s min,p2s q1,p2s q2,p2s q3,p2s max,s2s mean,s2s std,s2s min,s2s q1,s2s q2,s2s q3,s2s max
1,49.275999999999996,1.728265025972579,44.8,48.4,49.4,50.5,52.6,56.244,1.3564905700618288,53.9,55.3,56.0,57.2,58.6,48.39722932000001,0.09554780670111361,48.214915000000005,48.32993,48.393694,48.458158000000005,48.545245
2,22.4,1.5416441439796233,19.6,21.3,22.2,23.7,24.8,18.419999999999998,1.8159019797334877,15.7,17.0,18.4,19.8,21.2,23.28540948000001,0.5690337100055474,22.386286,22.827227,23.296697,23.712813,24.444545
3,2.012,0.39403891516786343,1.2,1.7,2.1,2.3,2.7,0.1,,0.1,0.1,0.1,0.1,0.1,1.5062862399999997,0.0615949157826629,1.418018,1.46046,1.506106,1.530931,1.6512509999999998
4,0.09999999999999999,0.0,0.1,0.1,0.1,0.1,0.1,,,,,,,,0.010222279999999999,0.0010048104099779226,0.007808,0.009609999999999999,0.01011,0.010711,0.012112000000000001
5,,,,,,,,,,,,,,,0.0001,0.0,0.0001,0.0001,0.0001,0.0001,0.0001
6,,,,,,,,,,,,,,,,,,,,,
