gossips,p2p mean,p2p std,p2p min,p2p q1,p2p q2,p2p q3,p2p max,p2s mean,p2s std,p2s min,p2s q1,p2s q2,p2s q3,p2s max,s2s mean,s2s std,s2s min,s2s q1,s2s q2,s2s q3,s2s max
1,53.988,1.4970303938130303,51.1,52.9,54.4,54.9,56.8,27.94,1.2379418403139952,25.4,26.8,28.2,28.9,29.9,0.005645639999999999,0.0019994959339793617,0.002002,0.004004,0.006006,0.007006999999999999,0.009009
2,5.775999999999999,0.4832873541348531,4.8,5.4,5.8,6.2,6.8,0.18947368421052635,0.08752610304046612,0.1,0.1,0.2,0.2,0.4,,,,,,,
3,0.10833333333333334,0.0288675134594813,0.1,0.1,0.1,0.1,0.2,,,,,,,,,,,,,,
4,,,,,,,,,,,,,,,,,,,,,
5,,,,,,,,,,,,,,,,,,,,,
