gossips,p2p mean,p2p std,p2p min,p2p q1,p2p q2,p2p q3,p2p max,p2s mean,p2s std,p2s min,p2s q1,p2s q2,p2s q3,p2s max,s2s mean,s2s std,s2s min,s2s q1,s2s q2,s2s q3,s2s max
1,0.18095238095238098,0.120909253653505,0.1,0.1,0.1,0.2,0.6,45.51200000000001,2.219106426770319,40.1,44.6,45.6,46.4,49.0,55.5112512,0.4322977880406453,54.636435999999996,55.230230000000006,55.41972,55.787187,56.316216000000004
2,,,,,,,,0.16666666666666666,0.08876253645985946,0.1,0.1,0.15000000000000002,0.2,0.4,19.557985960000003,0.5953553367924816,18.442442,19.273473000000003,19.582482000000002,20.082282,20.503904000000002
3,,,,,,,,,,,,,,,1.6932452399999998,0.1394294301717659,1.442342,1.61952,1.694895,1.772873,1.9220220000000001
4,,,,,,,,,,,,,,,0.035839960000000004,0.0047907469014062225,0.027527999999999997,0.032432,0.034835000000000005,0.039639999999999995,0.044144
5,,,,,,,,,,,,,,,0.00016671428571428566,0.00012400288015088312,0.0001,0.0001,0.0001,0.0002,0.000601
