round,P mean,P std,P min,P q1,P q2,P q3,P max,S mean,S std,S min,S q1,S q2,S q3,S max,P+S mean,P+S std,P+S min,P+S q1,P+S q2,P+S q3,P+S max
0,0.0,0.0,0.0,0.0,0.0,0.0,0.0,0.0,0.0,0.0,0.0,0.0,0.0,0.0,0.0,0.0,0.0,0.0,0.0,0.0,0.0
1,0.0,0.0,0.0,0.0,0.0,0.0,0.0,0.0,0.0,0.0,0.0,0.0,0.0,0.0,0.0,0.0,0.0,0.0,0.0,0.0,0.0
2,0.0,0.0,0.0,0.0,0.0,0.0,0.0,0.0,0.0,0.0,0.0,0.0,0.0,0.0,0.0,0.0,0.0,0.0,0.0,0.0,0.0
3,0.0,0.0,0.0,0.0,0.0,0.0,0.0,0.0,0.0,0.0,0.0,0.0,0.0,0.0,0.0,0.0,0.0,0.0,0.0,0.0,0.0
4,0.0,0.0,0.0,0.0,0.0,0.0,0.0,0.0,0.0,0.0,0.0,0.0,0.0,0.0,0.0,0.0,0.0,0.0,0.0,0.0,0.0
5,0.0,0.0,0.0,0.0,0.0,0.0,0.0,0.0,0.0,0.0,0.0,0.0,0.0,0.0,0.0,0.0,0.0,0.0,0.0,0.0,0.0
6,0.0,0.0,0.0,0.0,0.0,0.0,0.0,0.0,0.0,0.0,0.0,0.0,0.0,0.0,0.0,0.0,0.0,0.0,0.0,0.0,0.0
7,0.0,0.0,0.0,0.0,0.0,0.0,0.0,0.0,0.0,0.0,0.0,0.0,0.0,0.0,0.0,0.0,0.0,0.0,0.0,0.0,0.0
8,0.0,0.0,0.0,0.0,0.0,0.0,0.0,0.0,0.0,0.0,0.0,0.0,0.0,0.0,0.0,0.0,0.0,0.0,0.0,0.0,0.0
9,0.0,0.0,0.0,0.0,0.0,0.0,0.0,0.0,0.0,0.0,0.0,0.0,0.0,0.0,0.0,0.0,0.0,0.0,0.0,0.0,0.0
10,0.08800000000000002,0.10535653752852739,0.0,0.0,0.1,0.2,0.4,0.0,0.0,0.0,0.0,0.0,0.0,0.0,8.800000000000002e-05,0.0001053565375285274,0.0,0.0,0.0001,0.0002,0.0004
11,7.176,0.6159545437773798,6.1,6.7,7.3,7.6,8.4,0.0,0.0,0.0,0.0,0.0,0.0,0.0,0.007175999999999999,0.0006159545437773796,0.0061,0.0067,0.0073,0.0076,0.0084
12,66.084,1.2280336586049532,64.0,65.3,66.0,66.6,68.6,3.2000000000000005e-05,4.760952285695233e-05,0.0,0.0,0.0,0.0001,0.0001,0.06611600000000001,0.0012147290507214647,0.064,0.0653,0.066,0.0666,0.0686
13,99.816,0.13747727084867783,99.5,99.7,99.9,99.9,100.0,0.034046080000000006,0.0023660682210508354,0.029830000000000002,0.032132,0.034434,0.035235,0.039238999999999996,0.133828,0.0023559357659608086,0.1297,0.132,0.1341,0.1349,0.1392
14,99.96400000000003,0.05686240703077023,99.8,99.9,100.0,100.0,100.0,1.7590710400000003,0.07976665869766635,1.608208,1.694895,1.7570569999999999,1.807307,1.920721,1.857276,0.07968185845389571,1.7065,1.7932,1.8553,1.9055,2.0186
15,99.96400000000003,0.05686240703077023,99.8,99.9,100.0,100.0,100.0,35.05970376,1.0866138009737063,33.261261,34.346246,35.022523,35.734134000000005,37.072072,35.12460800000001,1.0855225780394127,33.328,34.4119,35.0875,35.7984,37.1348
16,99.96400000000003,0.05686240703077023,99.8,99.9,100.0,100.0,100.0,97.10536528,0.3118465485721729,96.501201,96.915616,97.139139,97.316316,97.613313,97.10822399999998,0.31152933152433715,96.5047,96.9187,97.142,97.319,97.6155
17,99.96400000000003,0.05686240703077023,99.8,99.9,100.0,100.0,100.0,99.95415411999998,0.0025024201838739686,99.949049,99.95255300000001,99.954755,99.95615600000001,99.957858,99.954164,0.002495976762711216,99.949,99.9526,99.9548,99.9561,99.9579
18,99.96400000000003,0.05686240703077023,99.8,99.9,100.0,100.0,100.0,99.95577175999999,0.0024286599576700024,99.950751,99.95435400000001,99.956456,99.957257,99.95956,99.95578000000002,0.002424183711411066,99.9508,99.9544,99.9565,99.9573,99.9596
19,99.96400000000003,0.05686240703077023,99.8,99.9,100.0,100.0,100.0,99.95577175999999,0.0024286599576700024,99.950751,99.95435400000001,99.956456,99.957257,99.95956,99.95578000000002,0.002424183711411066,99.9508,99.9544,99.9565,99.9573,99.9596
20,99.96400000000003,0.05686240703077023,99.8,99.9,100.0,100.0,100.0,99.95577175999999,0.0024286599576700024,99.950751,99.95435400000001,99.956456,99.957257,99.95956,99.95578000000002,0.002424183711411066,99.9508,99.9544,99.9565,99.9573,99.9596
21,99.96400000000003,0.05686240703077023,99.8,99.9,100.0,100.0,100.0,99.95577175999999,0.0024286599576700024,99.950751,99.95435400000001,99.956456,99.957257,99.95956,99.95578000000002,0.002424183711411066,99.9508,99.9544,99.9565,99.9573,99.9596
22,99.96400000000003,0.05686240703077023,99.8,99.9,100.0,100.0,100.0,99.95577175999999,0.0024286599576700024,99.950751,99.95435400000001,99.956456,99.957257,99.95956,99.95578000000002,0.002424183711411066,99.9508,99.9544,99.9565,99.9573,99.9596
23,99.96400000000003,0.05686240703077023,99.8,99.9,100.0,100.0,100.0,99.95577175999999,0.0024286599576700024,99.950751,99.95435400000001,99.956456,99.957257,99.95956,99.95578000000002,0.002424183711411066,99.9508,99.9544,99.9565,99.9573,99.9596
24,99.96400000000003,0.05686240703077023,99.8,99.9,100.0,100.0,100.0,99.95577175999999,0.0024286599576700024,99.950751,99.95435400000001,99.956456,99.957257,99.95956,99.95578000000002,0.002424183711411066,99.9508,99.9544,99.9565,99.9573,99.9596
