round,nodes,nodesP,nodesS,nodesSent,nodesSentP,nodesSentS,nodesRecv,nodesRecvP,nodesRecvS,msgSent,msgSentP,msgSentS,msgRecv,msgRecvP,msgRecvS,msgInfect,msgInfectP,msgInfectS
0,100000.0,10000.0,90000.0,0.0,0.0,0.0,8e-05,0.0008,0.0,0.0,0.0,0.0,0.08,0.08,0.0,0.008,0.08,0.0
1,100000.0,10000.0,90000.0,0.00096,0.0096,0.0,0.00104,0.0104,0.0,10.56,10.56,0.0,1.04,1.04,0.0,0.1,1.0,0.0
2,100000.0,10000.0,90000.0,0.01168,0.1168,0.0,0.01176,0.1176,0.0,128.48,128.48,0.0,11.76,11.76,0.0,0.1,1.0,0.0
3,100000.0,10000.0,90000.0,0.12936,1.2936,0.0,0.12944,1.2944,0.0,1422.96,1422.96,0.0,130.2,130.2,0.0,0.1,1.0,0.0
4,100000.0,10000.0,90000.0,1.3044,13.044,0.0,1.30448,13.0448,0.0,14348.4,14348.4,0.0,1406.6,1406.6,0.0,0.1,1.0,0.0
5,100000.0,10000.0,90000.0,7.37332,71.8324,0.21120004,7.3734,71.8332,0.21120004,81106.52,79015.64,2090.88,14141.36,13951.08,190.28,0.928,1.0,0.92
6,100000.0,10000.0,90000.0,35.29636,91.572,29.04351108,35.29644,91.5728,29.04351108,388259.96,100729.2,287530.76,80453.72,49035.56,31418.16,1.296,4.68,0.92
7,100000.0,10000.0,90000.0,90.39148,91.572,90.26031108,90.39156,91.5728,90.26031108,994306.28,100729.2,893577.08,377237.28,49035.56,328201.72,3.78,4.68,3.68
8,100000.0,10000.0,90000.0,91.95668,91.572,91.99942228,91.95676,91.5728,91.99942228,1011523.48,100729.2,910794.28,993539.2,49035.56,944503.64,9.576,4.68,10.12
9,100000.0,10000.0,90000.0,91.95672,91.572,91.99946672,91.9568,91.5728,91.99946672,1011523.92,100729.2,910794.72,1011524.52,49035.56,962488.96,9.576,4.68,10.12
10,100000.0,10000.0,90000.0,91.95672,91.572,91.99946672,91.9568,91.5728,91.99946672,1011523.92,100729.2,910794.72,1011524.92,49035.56,962489.36,9.576,4.68,10.12
11,100000.0,10000.0,90000.0,91.95672,91.572,91.99946672,91.9568,91.5728,91.99946672,1011523.92,100729.2,910794.72,1011524.92,49035.56,962489.36,9.576,4.68,10.12
12,100000.0,10000.0,90000.0,91.95672,91.572,91.99946672,91.9568,91.5728,91.99946672,1011523.92,100729.2,910794.72,1011524.92,49035.56,962489.36,9.576,4.68,10.12
13,100000.0,10000.0,90000.0,91.95672,91.572,91.99946672,91.9568,91.5728,91.99946672,1011523.92,100729.2,910794.72,1011524.92,49035.56,962489.36,9.576,4.68,10.12
14,100000.0,10000.0,90000.0,91.95672,91.572,91.99946672,91.9568,91.5728,91.99946672,1011523.92,100729.2,910794.72,1011524.92,49035.56,962489.36,9.576,4.68,10.12
15,100000.0,10000.0,90000.0,91.95672,91.572,91.99946672,91.9568,91.5728,91.99946672,1011523.92,100729.2,910794.72,1011524.92,49035.56,962489.36,9.576,4.68,10.12
16,100000.0,10000.0,90000.0,91.95672,91.572,91.99946672,91.9568,91.5728,91.99946672,1011523.92,100729.2,910794.72,1011524.92,49035.56,962489.36,9.576,4.68,10.12
17,100000.0,10000.0,90000.0,91.95672,91.572,91.99946672,91.9568,91.5728,91.99946672,1011523.92,100729.2,910794.72,1011524.92,49035.56,962489.36,9.576,4.68,10.12
18,100000.0,10000.0,90000.0,91.95672,91.572,91.99946672,91.9568,91.5728,91.99946672,1011523.92,100729.2,910794.72,1011524.92,49035.56,962489.36,9.576,4.68,10.12
19,100000.0,10000.0,90000.0,91.95672,91.572,91.99946672,91.9568,91.5728,91.99946672,1011523.92,100729.2,910794.72,1011524.92,49035.56,962489.36,9.576,4.68,10.12
