gossips,p2p mean,p2p std,p2p min,p2p 05th,p2p 25th,p2p 50th,p2p 75th,p2p 95th,p2p max,p2s mean,p2s std,p2s min,p2s 05th,p2s 25th,p2s 50th,p2s 75th,p2s 95th,p2s max,s2s mean,s2s std,s2s min,s2s 05th,s2s 25th,s2s 50th,s2s 75th,s2s 95th,s2s max
1,49.59440000000001,0.5456231666635866,48.33,48.816,49.24,49.61,49.9,50.440000000000005,50.66,58.047999999999995,0.5023305684506967,56.95,57.328,57.57,58.0,58.48,58.77199999999999,58.84,52.55473539999999,0.15009724332285423,52.222626,52.3481012,52.453030000000005,52.533232,52.66707099999999,52.814,52.886566
2,21.768800000000002,0.3734522191659865,21.15,21.186,21.53,21.74,21.93,22.312,22.9,20.469200000000004,0.47928212985672636,19.29,19.662000000000003,20.15,20.47,20.9,21.084,21.2,21.796541360000003,0.24637985947668348,21.248182,21.4673936,21.618384,21.809091,21.966566,22.1812324,22.322828
3,1.8263999999999998,0.1170599846232691,1.62,1.648,1.73,1.83,1.91,2.012,2.06,0.3079999999999999,0.04481071300481616,0.23,0.234,0.27,0.31,0.35,0.37,0.39,1.2171959599999997,0.03911737933806916,1.160101,1.1643028,1.183333,1.2230299999999998,1.239899,1.2741813999999998,1.291313
4,0.012,0.004,0.01,0.01,0.01,0.01,0.01,0.018,0.02,0.01,0.0,0.01,0.01,0.01,0.01,0.01,0.01,0.01,0.0184284,0.0018924372644819698,0.014747,0.0154146,0.017273,0.018384,0.020303,0.0209696,0.021717
5,,,,,,,,,,,,,,,,,,,0.00010099999999999999,1.3552527156068805e-20,0.000101,0.000101,0.000101,0.000101,0.000101,0.000101,0.000101
