round,nodes,nodesP,nodesS,nodesSent,nodesSentP,nodesSentS,nodesRecv,nodesRecvP,nodesRecvS,msgSent,msgSentP,msgSentS,msgRecv,msgRecvP,msgRecvS,msgInfect,msgInfectP,msgInfectS
00,1000.000000,100.000000,900.000000,0.000000,0.000000,0.000000,0.000000,0.000000,0.000000,0.000000,0.000000,0.000000,0.000000,0.000000,0.000000,0.000000,0.000000,0.000000
01,1000.000000,100.000000,900.000000,0.100000,1.000000,0.000000,0.100000,1.000000,0.000000,10.000000,10.000000,0.000000,1.000000,1.000000,0.000000,0.100000,1.000000,0.000000
02,1000.000000,100.000000,900.000000,1.160000,11.600000,0.000000,1.160000,11.600000,0.000000,116.000000,116.000000,0.000000,11.700000,11.700000,0.000000,0.100000,1.000000,0.000000
03,1000.000000,100.000000,900.000000,6.910000,67.900000,0.133333,6.910000,67.900000,0.133333,691.000000,679.000000,12.000000,112.700000,111.500000,1.200000,0.820000,1.000000,0.800000
04,1000.000000,100.000000,900.000000,34.970000,98.300000,27.933333,34.970000,98.300000,27.933333,3497.000000,983.000000,2514.000000,687.300000,392.500000,294.800000,1.260000,3.600000,1.000000
05,1000.000000,100.000000,900.000000,96.780000,98.300000,96.611111,96.780000,98.300000,96.611111,9678.000000,983.000000,8695.000000,3436.200000,392.500000,3043.700000,3.060000,3.600000,3.000000
06,1000.000000,100.000000,900.000000,99.830000,98.300000,100.000000,99.830000,98.300000,100.000000,9983.000000,983.000000,9000.000000,9671.000000,392.500000,9278.500000,9.360000,3.600000,10.000000
07,1000.000000,100.000000,900.000000,99.830000,98.300000,100.000000,99.830000,98.300000,100.000000,9983.000000,983.000000,9000.000000,9984.000000,392.500000,9591.500000,9.360000,3.600000,10.000000
08,1000.000000,100.000000,900.000000,99.830000,98.300000,100.000000,99.830000,98.300000,100.000000,9983.000000,983.000000,9000.000000,9984.000000,392.500000,9591.500000,9.360000,3.600000,10.000000
09,1000.000000,100.000000,900.000000,99.830000,98.300000,100.000000,99.830000,98.300000,100.000000,9983.000000,983.000000,9000.000000,9984.000000,392.500000,9591.500000,9.360000,3.600000,10.000000
10,1000.000000,100.000000,900.000000,99.830000,98.300000,100.000000,99.830000,98.300000,100.000000,9983.000000,983.000000,9000.000000,9984.000000,392.500000,9591.500000,9.360000,3.600000,10.000000
11,1000.000000,100.000000,900.000000,99.830000,98.300000,100.000000,99.830000,98.300000,100.000000,9983.000000,983.000000,9000.000000,9984.000000,392.500000,9591.500000,9.360000,3.600000,10.000000
12,1000.000000,100.000000,900.000000,99.830000,98.300000,100.000000,99.830000,98.300000,100.000000,9983.000000,983.000000,9000.000000,9984.000000,392.500000,9591.500000,9.360000,3.600000,10.000000
13,1000.000000,100.000000,900.000000,99.830000,98.300000,100.000000,99.830000,98.300000,100.000000,9983.000000,983.000000,9000.000000,9984.000000,392.500000,9591.500000,9.360000,3.600000,10.000000
14,1000.000000,100.000000,900.000000,99.830000,98.300000,100.000000,99.830000,98.300000,100.000000,9983.000000,983.000000,9000.000000,9984.000000,392.500000,9591.500000,9.360000,3.600000,10.000000
15,1000.000000,100.000000,900.000000,99.830000,98.300000,100.000000,99.830000,98.300000,100.000000,9983.000000,983.000000,9000.000000,9984.000000,392.500000,9591.500000,9.360000,3.600000,10.000000
16,1000.000000,100.000000,900.000000,99.830000,98.300000,100.000000,99.830000,98.300000,100.000000,9983.000000,983.000000,9000.000000,9984.000000,392.500000,9591.500000,9.360000,3.600000,10.000000
17,1000.000000,100.000000,900.000000,99.830000,98.300000,100.000000,99.830000,98.300000,100.000000,9983.000000,983.000000,9000.000000,9984.000000,392.500000,9591.500000,9.360000,3.600000,10.000000
18,1000.000000,100.000000,900.000000,99.830000,98.300000,100.000000,99.830000,98.300000,100.000000,9983.000000,983.000000,9000.000000,9984.000000,392.500000,9591.500000,9.360000,3.600000,10.000000
19,1000.000000,100.000000,900.000000,99.830000,98.300000,100.000000,99.830000,98.300000,100.000000,9983.000000,983.000000,9000.000000,9984.000000,392.500000,9591.500000,9.360000,3.600000,10.000000
