gossips,p2p mean,p2p std,p2p min,p2p q1,p2p q2,p2p q3,p2p max,p2s mean,p2s std,p2s min,p2s q1,p2s q2,p2s q3,p2s max,s2s mean,s2s std,s2s min,s2s q1,s2s q2,s2s q3,s2s max
1,51.63199999999998,1.3337665962728757,48.2,50.8,51.6,52.9,53.5,56.74799999999999,1.6790672013551637,53.9,55.5,56.6,57.5,60.9,48.23101911999999,0.07335741034955726,48.108609,48.177077000000004,48.243644,48.287688,48.344945
2,18.672,0.9825646713236408,16.8,18.2,18.8,19.2,21.0,18.203999999999997,1.690285971859989,15.3,16.8,18.6,19.5,21.1,23.43650052,0.577990864807071,22.201902,23.190991,23.558759,23.896897,24.374775
3,0.1,0.0,0.1,0.1,0.1,0.1,0.1,0.1,0.0,0.1,0.1,0.1,0.1,0.1,1.67096292,0.05872939868932762,1.565566,1.62042,1.685285,1.711111,1.763263
4,,,,,,,,,,,,,,,0.02116128,0.0015884412831452099,0.018519,0.019819999999999997,0.021121,0.022422,0.024525
5,,,,,,,,,,,,,,,0.00015000000000000001,6.183469424008422e-05,0.0001,0.0001,0.0001,0.0002,0.0003
6,,,,,,,,,,,,,,,0.0001,,0.0001,0.0001,0.0001,0.0001,0.0001
