gossips,p2p mean,p2p std,p2p min,p2p q1,p2p q2,p2p q3,p2p max,p2s mean,p2s std,p2s min,p2s q1,p2s q2,p2s q3,p2s max,s2s mean,s2s std,s2s min,s2s q1,s2s q2,s2s q3,s2s max
1,49.29964,0.10515143048638614,49.088,49.242,49.304,49.396,49.458,58.474399999999996,0.3345609062637176,57.969,58.219,58.405,58.704,59.133,55.85164884000001,0.28648684788597123,55.522,55.700778,55.769222,55.904332999999994,56.491111
2,22.24852,0.12818447643923048,21.989,22.169,22.28,22.345,22.46,20.24576,0.2041880832304698,19.846,20.081,20.249,20.413,20.627,21.38235556,0.18285160473114978,20.966667,21.252667000000002,21.427,21.486333,21.725889000000002
3,2.0161599999999997,0.0507630771328925,1.931,1.977,2.01,2.05,2.135,0.32304,0.027657850000798453,0.269,0.306,0.328,0.342,0.374,0.44173784000000005,0.018665385293103378,0.40455599999999997,0.430889,0.44455600000000006,0.45588900000000004,0.48011099999999995
4,0.02172000000000001,0.0042083250825001636,0.014,0.018,0.022,0.024,0.029,0.0016470588235294125,0.0009963167462326073,0.001,0.001,0.001,0.002,0.005,0.002275640000000001,0.0005932646177437744,0.001,0.001778,0.002222,0.002778,0.003556
5,,,,,,,,,,,,,,,,,,,,,
