gossips,p2p mean,p2p std,p2p min,p2p q1,p2p q2,p2p q3,p2p max,p2s mean,p2s std,p2s min,p2s q1,p2s q2,p2s q3,p2s max,s2s mean,s2s std,s2s min,s2s q1,s2s q2,s2s q3,s2s max
1,50.11200000000001,1.2204234237891927,47.3,49.6,50.4,50.7,52.0,58.36000000000001,1.4846436160461778,55.0,57.4,58.3,59.5,61.0,4.390414359999999,0.15429911846931157,4.184284,4.267568,4.383183,4.471471,4.722923000000001
2,22.600000000000005,1.1565033506220375,20.3,22.1,22.5,23.2,25.9,20.668000000000003,1.0217305580892313,18.1,20.2,20.6,21.4,22.6,0.034018,0.0025617275258439706,0.027527999999999997,0.033033,0.033634,0.035435,0.038238
3,2.0239999999999996,0.4186088070422472,1.1,1.8,2.0,2.3,2.8,0.32799999999999996,0.16713268182295568,0.1,0.2,0.3,0.4,0.6,0.0001,0.0,0.0001,0.0001,0.0001,0.0001,0.0001
4,0.125,0.05,0.1,0.1,0.1,0.125,0.2,,,,,,,,,,,,,,
5,,,,,,,,,,,,,,,,,,,,,
6,,,,,,,,,,,,,,,,,,,,,
