gossips,p2p mean,p2p std,p2p min,p2p q1,p2p q2,p2p q3,p2p max,p2s mean,p2s std,p2s min,p2s q1,p2s q2,p2s q3,p2s max,s2s mean,s2s std,s2s min,s2s q1,s2s q2,s2s q3,s2s max
1,51.31999999999999,1.454017423095978,47.3,50.6,51.5,52.0,54.1,42.72800000000001,1.7565401598976718,39.8,41.5,42.7,44.1,46.1,54.09725724,0.6159925510967583,53.024925,53.571470999999995,54.089089,54.48308299999999,55.306206
2,18.903999999999996,1.0694546897056159,16.9,18.2,18.7,19.3,22.2,5.652,0.7778817390837763,4.2,5.0,5.5,6.3,7.4,19.813045040000006,0.9887822734834616,18.058158,19.078478,19.685786,20.692593,21.786285999999997
3,0.1,0.0,0.1,0.1,0.1,0.1,0.1,0.10000000000000002,0.0,0.1,0.1,0.1,0.1,0.1,2.1225905600000003,0.22382652092842648,1.7097099999999998,1.940741,2.107407,2.304404,2.531331
4,,,,,,,,,,,,,,,0.034506480000000006,0.004957124789297386,0.028027999999999997,0.03013,0.034033999999999995,0.037137,0.045145
5,,,,,,,,,,,,,,,0.0002167222222222222,0.00012498649600259436,0.0001,0.0001,0.0002,0.0003,0.0005009999999999999
