gossips,p2p mean,p2p std,p2p min,p2p 05th,p2p 25th,p2p 50th,p2p 75th,p2p 95th,p2p max,p2s mean,p2s std,p2s min,p2s 05th,p2s 25th,p2s 50th,p2s 75th,p2s 95th,p2s max,s2s mean,s2s std,s2s min,s2s 05th,s2s 25th,s2s 50th,s2s 75th,s2s 95th,s2s max
1,34.48767999999999,0.36880734482924743,33.923,34.0584,34.216,34.367,34.79,35.1346,35.227,69.69171999999999,0.318726531057581,69.193,69.3192,69.467,69.65,69.917,70.3258,70.357,56.0536622,0.22964435869491745,55.829111,55.846378,55.904222,55.941556000000006,56.087667,56.5417552,56.695
2,0.05548,0.007990594471001516,0.041,0.045399999999999996,0.051,0.055,0.058,0.0664,0.082,0.77716,0.02692312017578943,0.728,0.738,0.757,0.776,0.788,0.8288,0.838,21.203542239999997,0.19366316644386064,20.924222,20.942222599999997,21.044,21.198778,21.308111,21.561133400000003,21.596889
3,,,,,,,,,,,,,,,,,,,0.27044448000000004,0.008145432959002235,0.245,0.25815580000000005,0.26822199999999996,0.27022199999999996,0.274333,0.2807112,0.286222
4,,,,,,,,,,,,,,,,,,,,,,,,,,,
5,,,,,,,,,,,,,,,,,,,,,,,,,,,
