round,nodes,nodesP,nodesS,nodesSent,nodesSentP,nodesSentS,nodesRecv,nodesRecvP,nodesRecvS,msgSent,msgSentP,msgSentS,msgRecv,msgRecvP,msgRecvS,msgInfect,msgInfectP,msgInfectS
00,100000.000000,50000.000000,50000.000000,0.000000,0.000000,0.000000,0.000000,0.000000,0.000000,0.000000,0.000000,0.000000,0.000000,0.000000,0.000000,0.000000,0.000000,0.000000
01,100000.000000,50000.000000,50000.000000,0.001000,0.002000,0.000000,0.001000,0.002000,0.000000,10.000000,10.000000,0.000000,1.000000,1.000000,0.000000,0.500000,1.000000,0.000000
02,100000.000000,50000.000000,50000.000000,0.011900,0.023800,0.000000,0.011900,0.023800,0.000000,119.000000,119.000000,0.000000,11.900000,11.900000,0.000000,0.500000,1.000000,0.000000
03,100000.000000,50000.000000,50000.000000,0.118400,0.236800,0.000000,0.118400,0.236800,0.000000,1184.000000,1184.000000,0.000000,118.700000,118.700000,0.000000,0.500000,1.000000,0.000000
04,100000.000000,50000.000000,50000.000000,1.151600,2.245200,0.058000,1.151600,2.245200,0.058000,11516.000000,11226.000000,290.000000,1166.000000,1137.000000,29.000000,1.000000,1.000000,1.000000
05,100000.000000,50000.000000,50000.000000,10.939300,11.922400,9.956200,10.939300,11.922400,9.956200,109393.000000,59612.000000,49781.000000,11589.900000,6350.600000,5239.300000,1.000000,1.000000,1.000000
06,100000.000000,50000.000000,50000.000000,65.856500,66.232400,65.480600,65.856500,66.232400,65.480600,658565.000000,331162.000000,327403.000000,107332.700000,54210.500000,53122.200000,1.000000,1.000000,1.000000
07,100000.000000,50000.000000,50000.000000,99.851700,99.852000,99.851400,99.851700,99.852000,99.851400,998517.000000,499260.000000,499257.000000,648706.200000,323665.000000,325041.200000,6.000000,6.000000,6.000000
08,100000.000000,50000.000000,50000.000000,99.926000,99.852000,100.000000,99.926000,99.852000,100.000000,999260.000000,499260.000000,500000.000000,998488.100000,323665.000000,674823.100000,9.500000,6.000000,13.000000
09,100000.000000,50000.000000,50000.000000,99.926000,99.852000,100.000000,99.926000,99.852000,100.000000,999260.000000,499260.000000,500000.000000,999261.000000,323665.000000,675596.000000,9.500000,6.000000,13.000000
10,100000.000000,50000.000000,50000.000000,99.926000,99.852000,100.000000,99.926000,99.852000,100.000000,999260.000000,499260.000000,500000.000000,999261.000000,323665.000000,675596.000000,9.500000,6.000000,13.000000
11,100000.000000,50000.000000,50000.000000,99.926000,99.852000,100.000000,99.926000,99.852000,100.000000,999260.000000,499260.000000,500000.000000,999261.000000,323665.000000,675596.000000,9.500000,6.000000,13.000000
12,100000.000000,50000.000000,50000.000000,99.926000,99.852000,100.000000,99.926000,99.852000,100.000000,999260.000000,499260.000000,500000.000000,999261.000000,323665.000000,675596.000000,9.500000,6.000000,13.000000
13,100000.000000,50000.000000,50000.000000,99.926000,99.852000,100.000000,99.926000,99.852000,100.000000,999260.000000,499260.000000,500000.000000,999261.000000,323665.000000,675596.000000,9.500000,6.000000,13.000000
14,100000.000000,50000.000000,50000.000000,99.926000,99.852000,100.000000,99.926000,99.852000,100.000000,999260.000000,499260.000000,500000.000000,999261.000000,323665.000000,675596.000000,9.500000,6.000000,13.000000
15,100000.000000,50000.000000,50000.000000,99.926000,99.852000,100.000000,99.926000,99.852000,100.000000,999260.000000,499260.000000,500000.000000,999261.000000,323665.000000,675596.000000,9.500000,6.000000,13.000000
16,100000.000000,50000.000000,50000.000000,99.926000,99.852000,100.000000,99.926000,99.852000,100.000000,999260.000000,499260.000000,500000.000000,999261.000000,323665.000000,675596.000000,9.500000,6.000000,13.000000
17,100000.000000,50000.000000,50000.000000,99.926000,99.852000,100.000000,99.926000,99.852000,100.000000,999260.000000,499260.000000,500000.000000,999261.000000,323665.000000,675596.000000,9.500000,6.000000,13.000000
18,100000.000000,50000.000000,50000.000000,99.926000,99.852000,100.000000,99.926000,99.852000,100.000000,999260.000000,499260.000000,500000.000000,999261.000000,323665.000000,675596.000000,9.500000,6.000000,13.000000
19,100000.000000,50000.000000,50000.000000,99.926000,99.852000,100.000000,99.926000,99.852000,100.000000,999260.000000,499260.000000,500000.000000,999261.000000,323665.000000,675596.000000,9.500000,6.000000,13.000000
