round,P mean,P std,P min,P q1,P q2,P q3,P max,S mean,S std,S min,S q1,S q2,S q3,S max,P+S mean,P+S std,P+S min,P+S q1,P+S q2,P+S q3,P+S max
0,0.0,0.0,0,0,0,0,0,1.0,0.0,1,1,1,1,1,0.0,0.0,0,0,0,0,0
1,1.0,0.0,1,1,1,1,1,1.0,0.0,1,1,1,1,1,1.0,0.0,1,1,1,1,1
2,1.0,0.0,1,1,1,1,1,1.0,0.0,1,1,1,1,1,1.0,0.0,1,1,1,1,1
3,1.0,0.0,1,1,1,1,1,1.0,0.0,1,1,1,1,1,1.0,0.0,1,1,1,1,1
4,1.0,0.0,1,1,1,1,1,1.0,0.0,1,1,1,1,1,1.0,0.0,1,1,1,1,1
5,1.12,0.33166247903553997,1,1,1,1,2,1.0,0.0,1,1,1,1,1,1.0,0.0,1,1,1,1,1
6,2.28,0.45825756949558394,2,2,2,3,3,1.0,0.0,1,1,1,1,1,1.0,0.0,1,1,1,1,1
7,3.2,0.5,2,3,3,3,4,1.0,0.0,1,1,1,1,1,1.0,0.0,1,1,1,1,1
8,4.12,0.7257180352359079,2,4,4,5,5,1.0,0.0,1,1,1,1,1,1.0,0.0,1,1,1,1,1
9,4.88,0.9273618495495703,2,5,5,5,6,1.0,0.0,1,1,1,1,1,1.0,0.0,1,1,1,1,1
10,5.76,1.267543556122103,2,6,6,6,7,1.0,0.0,1,1,1,1,1,1.0,0.0,1,1,1,1,1
11,6.52,1.584297951775486,2,7,7,7,8,1.0,0.0,1,1,1,1,1,1.0,0.0,1,1,1,1,1
12,7.4,2.0207259421636903,2,8,8,9,9,1.0,0.0,1,1,1,1,1,1.0,0.0,1,1,1,1,1
13,8.04,2.3359509127262643,2,9,9,9,10,1.0,0.0,1,1,1,1,1,1.0,0.0,1,1,1,1,1
14,8.6,2.614064523559687,2,9,10,10,10,1.0,0.0,1,1,1,1,1,1.0,0.0,1,1,1,1,1
15,8.6,2.614064523559687,2,9,10,10,10,1.0,0.0,1,1,1,1,1,1.0,0.0,1,1,1,1,1
16,8.6,2.614064523559687,2,9,10,10,10,1.0,0.0,1,1,1,1,1,1.0,0.0,1,1,1,1,1
17,8.6,2.614064523559687,2,9,10,10,10,1.0,0.0,1,1,1,1,1,1.0,0.0,1,1,1,1,1
18,8.6,2.614064523559687,2,9,10,10,10,1.0,0.0,1,1,1,1,1,1.0,0.0,1,1,1,1,1
19,8.6,2.614064523559687,2,9,10,10,10,1.0,0.0,1,1,1,1,1,1.0,0.0,1,1,1,1,1
20,8.6,2.614064523559687,2,9,10,10,10,1.0,0.0,1,1,1,1,1,1.0,0.0,1,1,1,1,1
21,8.6,2.614064523559687,2,9,10,10,10,1.0,0.0,1,1,1,1,1,1.0,0.0,1,1,1,1,1
22,8.6,2.614064523559687,2,9,10,10,10,1.0,0.0,1,1,1,1,1,1.0,0.0,1,1,1,1,1
23,8.6,2.614064523559687,2,9,10,10,10,1.0,0.0,1,1,1,1,1,1.0,0.0,1,1,1,1,1
24,8.6,2.614064523559687,2,9,10,10,10,1.0,0.0,1,1,1,1,1,1.0,0.0,1,1,1,1,1
25,8.6,2.614064523559687,2,9,10,10,10,1.0,0.0,1,1,1,1,1,1.0,0.0,1,1,1,1,1
