gossips,p2p mean,p2p std,p2p min,p2p 05th,p2p 25th,p2p 50th,p2p 75th,p2p 95th,p2p max,p2s mean,p2s std,p2s min,p2s 05th,p2s 25th,p2s 50th,p2s 75th,p2s 95th,p2s max,s2s mean,s2s std,s2s min,s2s 05th,s2s 25th,s2s 50th,s2s 75th,s2s 95th,s2s max
1,49.1308,0.583142658360713,48.07,48.2,48.7,49.2,49.44,49.928,50.68,58.0752,0.4812244382821814,57.22,57.42,57.66,58.03,58.39,58.812,58.85,51.91738187999999,0.1471772346845305,51.630101,51.6692522,51.821818,51.901111,52.006465000000006,52.123657,52.192929
2,22.322000000000003,0.42868170009926954,21.56,21.619999999999997,22.02,22.28,22.58,22.992000000000004,23.24,20.487199999999998,0.39415245781296304,19.87,19.892,20.3,20.46,20.7,21.224,21.23,22.014476679999998,0.21668104858869777,21.544646,21.663879,21.893939000000003,22.057576,22.164141,22.3047274,22.499292999999998
3,2.0252000000000003,0.15223981082489563,1.73,1.81,1.93,2.0,2.12,2.21,2.45,0.3372,0.05546314091358332,0.25,0.256,0.29,0.33,0.37,0.42999999999999994,0.47,1.3121939599999999,0.029125621122963203,1.263737,1.2671113999999999,1.292929,1.31697,1.331212,1.3556164,1.359394
4,0.026521739130434787,0.014628351166313674,0.01,0.01,0.015,0.02,0.04,0.05,0.06,0.01,0.0,0.01,0.01,0.01,0.01,0.01,0.01,0.01,0.021603920000000002,0.0017368893786306597,0.018283,0.0186264,0.020505000000000002,0.021515,0.022928999999999998,0.0247066,0.025253
5,,,,,,,,,,,,,,,,,,,0.00010099999999999999,1.3552527156068805e-20,0.000101,0.000101,0.000101,0.000101,0.000101,0.000101,0.000101
