gossips,p2p mean,p2p std,p2p min,p2p q1,p2p q2,p2p q3,p2p max,p2s mean,p2s std,p2s min,p2s q1,p2s q2,p2s q3,p2s max,s2s mean,s2s std,s2s min,s2s q1,s2s q2,s2s q3,s2s max
1,49427.84,136.49196557551198,49143.0,49359.0,49430.0,49493.0,49762.0,59000.96,195.85421448958607,58715.0,58859.0,58991.0,59119.0,59389.0,288855.16,1303.7609916442814,286881.0,287915.0,288522.0,289785.0,291567.0
2,22155.96,135.07358488369675,21849.0,22059.0,22139.0,22246.0,22411.0,19733.84,152.32248684944668,19322.0,19636.0,19772.0,19789.0,20029.0,2657.84,126.06898904964693,2437.0,2561.0,2648.0,2754.0,2960.0
3,1996.28,36.24743669098092,1947.0,1969.0,1987.0,2025.0,2073.0,122.6,9.699656351300977,98.0,117.0,125.0,129.0,138.0,1.125,0.3535533905932738,1.0,1.0,1.0,1.0,2.0
4,20.0,3.4278273002005224,13.0,17.0,21.0,22.0,28.0,,,,,,,,,,,,,,
5,,,,,,,,,,,,,,,,,,,,,
