round,Simple mean,Simple std,Simple min,Simple q1,Simple q2,Simple q3,Simple max
0,0.0,0.0,0.0,0.0,0.0,0.0,0.0
1,0.0,0.0,0.0,0.0,0.0,0.0,0.0
2,0.0,0.0,0.0,0.0,0.0,0.0,0.0
3,0.0,0.0,0.0,0.0,0.0,0.0,0.0
4,0.0,0.0,0.0,0.0,0.0,0.0,0.0
5,0.0,0.0,0.0,0.0,0.0,0.0,0.0
6,0.0,0.0,0.0,0.0,0.0,0.0,0.0
7,0.0,0.0,0.0,0.0,0.0,0.0,0.0
8,0.0,0.0,0.0,0.0,0.0,0.0,0.0
9,0.0,0.0,0.0,0.0,0.0,0.0,0.0
10,0.0,0.0,0.0,0.0,0.0,0.0,0.0
11,0.0,0.0,0.0,0.0,0.0,0.0,0.0
12,0.0,0.0,0.0,0.0,0.0,0.0,0.0
13,0.0,0.0,0.0,0.0,0.0,0.0,0.0
14,0.0,0.0,0.0,0.0,0.0,0.0,0.0
15,0.0,0.0,0.0,0.0,0.0,0.0,0.0
16,0.0,0.0,0.0,0.0,0.0,0.0,0.0
17,5.6000000000000006e-05,8.698658900466592e-05,0.0,0.0,0.0,0.0001,0.0003
18,0.005632000000000001,0.004703165600599948,0.0004,0.0015,0.0047,0.0092,0.0186
19,0.25840799999999997,0.1865082190324777,0.0114,0.0979,0.2294,0.4042,0.6919
20,4.085748000000001,2.410107857911481,0.3889,1.9627,3.8241,6.367,8.593
21,24.127244,9.846055201284083,4.8033,16.3148,23.9694,32.0021,40.2606
22,62.205368,12.993088952520106,26.5588,53.1833,63.609,70.6142,80.602
23,89.657956,6.271746021980906,67.9163,86.1105,90.6245,93.648,96.4878
24,98.143028,1.3759505482635142,92.9304,97.4839,98.4201,98.9483,99.4271
25,99.67510800000002,0.2169456285954331,98.8394,99.577,99.7185,99.8004,99.8717
26,99.91035599999998,0.0326409007228648,99.7837,99.8986,99.9175,99.9298,99.9435
27,99.947304,0.005419446466196727,99.9269,99.9462,99.9483,99.9496,99.954
28,99.95390000000002,0.0019237550086553354,99.95,99.9527,99.954,99.9554,99.9574
29,99.95501999999999,0.0016416455159383079,99.9517,99.9542,99.955,99.9561,99.9581
30,99.9552,0.001689181261243833,99.9518,99.9544,99.9554,99.9562,99.9586
31,99.95521600000001,0.0016831716093920627,99.9518,99.9544,99.9554,99.9563,99.9586
32,99.95521600000001,0.0016831716093920627,99.9518,99.9544,99.9554,99.9563,99.9586
33,99.95521600000001,0.0016831716093920627,99.9518,99.9544,99.9554,99.9563,99.9586
34,99.95521600000001,0.0016831716093920627,99.9518,99.9544,99.9554,99.9563,99.9586
35,99.95521600000001,0.0016831716093920627,99.9518,99.9544,99.9554,99.9563,99.9586
36,99.95521600000001,0.0016831716093920627,99.9518,99.9544,99.9554,99.9563,99.9586
37,99.95521600000001,0.0016831716093920627,99.9518,99.9544,99.9554,99.9563,99.9586
38,99.95521600000001,0.0016831716093920627,99.9518,99.9544,99.9554,99.9563,99.9586
39,99.95521600000001,0.0016831716093920627,99.9518,99.9544,99.9554,99.9563,99.9586
40,99.95521600000001,0.0016831716093920627,99.9518,99.9544,99.9554,99.9563,99.9586
41,99.95521600000001,0.0016831716093920627,99.9518,99.9544,99.9554,99.9563,99.9586
42,99.95521600000001,0.0016831716093920627,99.9518,99.9544,99.9554,99.9563,99.9586
43,99.95521600000001,0.0016831716093920627,99.9518,99.9544,99.9554,99.9563,99.9586
44,99.95521600000001,0.0016831716093920627,99.9518,99.9544,99.9554,99.9563,99.9586
45,99.95521600000001,0.0016831716093920627,99.9518,99.9544,99.9554,99.9563,99.9586
46,99.95521600000001,0.0016831716093920627,99.9518,99.9544,99.9554,99.9563,99.9586
47,99.95521600000001,0.0016831716093920627,99.9518,99.9544,99.9554,99.9563,99.9586
48,99.95521600000001,0.0016831716093920627,99.9518,99.9544,99.9554,99.9563,99.9586
49,99.95521600000001,0.0016831716093920627,99.9518,99.9544,99.9554,99.9563,99.9586
50,99.95521600000001,0.0016831716093920627,99.9518,99.9544,99.9554,99.9563,99.9586
