gossips,p2p mean,p2p std,p2p min,p2p q1,p2p q2,p2p q3,p2p max,p2s mean,p2s std,p2s min,p2s q1,p2s q2,p2s q3,p2s max,s2s mean,s2s std,s2s min,s2s q1,s2s q2,s2s q3,s2s max
1,44.903600000000004,0.43951564249751096,43.89,44.65,44.95,45.27,45.51,41.01880000000001,0.44139287110992914,40.14,40.77,41.07,41.32,41.72,25.507527279999994,0.18183351989285812,25.094949,25.389293,25.510202,25.613433999999998,25.818384
2,11.7996,0.31627361571904805,11.33,11.56,11.74,11.99,12.48,48.931999999999995,0.5655675615403232,48.24,48.44,48.88,49.28,50.48,38.52756764000001,0.10095557937936578,38.414343,38.470504999999996,38.523333,38.539899,38.843434
3,0.03640000000000001,0.024979991993593596,0.01,0.02,0.03,0.05,0.11,1.0832000000000002,0.11160645142642965,0.87,1.01,1.08,1.14,1.34,23.492541320000004,0.16254126563345958,23.21404,23.390707,23.502323,23.612424,23.874343
4,,,,,,,,0.014615384615384613,0.0066022529177352475,0.01,0.01,0.01,0.02,0.03,5.97718792,0.0818179823128346,5.826667,5.912323000000001,5.965555999999999,6.0376769999999995,6.1371720000000005
5,,,,,,,,,,,,,,,0.5377696000000001,0.013262318371360776,0.517374,0.529798,0.534141,0.54404,0.5727270000000001
6,,,,,,,,,,,,,,,0.02327656,0.001923225114228701,0.019697,0.022424,0.023030000000000002,0.024343,0.029091000000000002
7,,,,,,,,,,,,,,,0.0005049999999999999,0.0002142533546995239,0.000101,0.000404,0.000505,0.0007070000000000001,0.00101
8,,,,,,,,,,,,,,,,,,,,,
