gossips,p2p mean,p2p std,p2p min,p2p q1,p2p q2,p2p q3,p2p max,p2s mean,p2s std,p2s min,p2s q1,p2s q2,p2s q3,p2s max,s2s mean,s2s std,s2s min,s2s q1,s2s q2,s2s q3,s2s max
1,49.2456,0.4468042076793825,48.35,49.02,49.25,49.46,49.93,58.14120000000002,0.5744585856845279,56.89,57.82,58.17,58.44,59.3,33.824230279999995,0.2694545488181505,33.380707,33.604444,33.784040000000005,34.011616,34.337071
2,22.14,0.3419673473691109,21.26,21.98,22.23,22.37,22.77,20.349200000000003,0.49067062951298285,19.1,20.02,20.4,20.69,21.1,1.2629455200000002,0.022947609107704464,1.2076770000000001,1.25101,1.263636,1.279899,1.3020200000000002
3,2.0467999999999997,0.12448962473502247,1.82,1.99,2.04,2.14,2.27,0.33559999999999995,0.05354748671350816,0.25,0.29,0.34,0.38,0.42,0.0016725599999999996,0.00044703197872188074,0.000909,0.001212,0.0017170000000000002,0.00202,0.002424
4,0.024347826086956525,0.01342524316912724,0.01,0.01,0.02,0.04,0.05,0.01,,0.01,0.01,0.01,0.01,0.01,,,,,,,
5,,,,,,,,,,,,,,,,,,,,,
