gossips,p2p mean,p2p std,p2p min,p2p q1,p2p q2,p2p q3,p2p max,p2s mean,p2s std,p2s min,p2s q1,p2s q2,p2s q3,p2s max,s2s mean,s2s std,s2s min,s2s q1,s2s q2,s2s q3,s2s max
1,33.74,1.006644591369434,32.1,33.1,33.6,34.5,36.2,43.316,1.5664928981645603,39.9,42.2,43.8,44.4,45.7,54.24172168,0.5361824863619765,52.714414,53.986887,54.426627,54.598698999999996,54.888488
2,0.13636363636363635,0.050452497910951306,0.1,0.1,0.1,0.2,0.2,5.6320000000000014,0.8404958853756114,4.2,5.2,5.7,6.1,7.6,19.60720716,0.7917202182316196,18.481782,18.998398,19.486186,20.001401,21.606507
3,,,,,,,,0.10000000000000002,0.0,0.1,0.1,0.1,0.1,0.1,2.0708828800000005,0.1742868227896475,1.8173169999999998,1.9334330000000002,2.026727,2.146547,2.561061
4,,,,,,,,,,,,,,,0.03392592,0.003568701104977365,0.02953,0.031231000000000002,0.033433,0.036036,0.044244
5,,,,,,,,,,,,,,,0.00019504999999999994,0.0001192324024310241,0.0001,0.0001,0.00015000000000000001,0.0003,0.0005009999999999999
