gossips,p2p mean,p2p std,p2p min,p2p q1,p2p q2,p2p q3,p2p max,p2s mean,p2s std,p2s min,p2s q1,p2s q2,p2s q3,p2s max,s2s mean,s2s std,s2s min,s2s q1,s2s q2,s2s q3,s2s max
1,49.05516000000001,0.1803250953139912,48.776,48.932,49.008,49.205,49.468,77.51079999999999,0.1284876777490101,77.332,77.425,77.471,77.588,77.868,56.80998224000001,0.10051096930363664,56.631111,56.749,56.795889,56.862111,57.052333
2,22.299440000000004,0.14149442863001063,22.048,22.199,22.317,22.408,22.538,10.403599999999999,0.1088649775333343,10.254,10.302,10.386,10.483,10.624,20.695182120000005,0.12496556793583767,20.423,20.609667,20.670333,20.784333,20.941333
3,2.08464,0.042292513127818086,2.003,2.061,2.091,2.113,2.168,0.20603999999999995,0.018065805637538932,0.162,0.198,0.203,0.214,0.253,0.5826311199999998,0.012035972562558735,0.5618890000000001,0.573444,0.579667,0.591,0.613444
4,0.025280000000000014,0.0055416604009989635,0.014,0.021,0.026,0.03,0.033,0.001,,0.001,0.001,0.001,0.001,0.001,0.00021279166666666666,0.0001222292853141415,0.00011100000000000001,0.00011100000000000001,0.00022200000000000003,0.00024975,0.000556
5,,,,,,,,,,,,,,,,,,,,,
