gossips,p2p mean,p2p std,p2p min,p2p q1,p2p q2,p2p q3,p2p max,p2s mean,p2s std,p2s min,p2s q1,p2s q2,p2s q3,p2s max,s2s mean,s2s std,s2s min,s2s q1,s2s q2,s2s q3,s2s max
1,49.4424,0.5232055045581991,48.11,49.2,49.48,49.81,50.34,76.8788,0.34228789052491937,76.36,76.66,76.86,77.05,77.77,56.10263443999998,0.15132080468139206,55.775656999999995,56.019899,56.132323,56.210101,56.365556000000005
2,22.1972,0.3984817017965403,21.31,21.94,22.21,22.45,23.08,11.044400000000003,0.35045304012568235,10.31,10.84,11.04,11.32,11.75,19.19932932,0.18906730909844432,18.773232,19.08101,19.190504999999998,19.323838000000002,19.648585999999998
3,2.0128,0.15891612043255188,1.75,1.88,2.0,2.14,2.32,0.288,0.06164414002968976,0.16,0.24,0.29,0.33,0.39,1.7800363599999998,0.04424136720675946,1.6745450000000002,1.7520200000000001,1.784848,1.8059599999999998,1.876061
4,0.025217391304347834,0.011626601636447695,0.01,0.02,0.02,0.03,0.05,,,,,,,,0.01898192,0.001230764190790963,0.016566,0.018081,0.018889,0.019697,0.021212
5,,,,,,,,,,,,,,,0.000101,0.0,0.000101,0.000101,0.000101,0.000101,0.000101
