gossips,p2p mean,p2p std,p2p min,p2p q1,p2p q2,p2p q3,p2p max,p2s mean,p2s std,p2s min,p2s q1,p2s q2,p2s q3,p2s max,s2s mean,s2s std,s2s min,s2s q1,s2s q2,s2s q3,s2s max
1,,,,,,,,,,,,,,,2.46974548,0.13227406490380744,2.062323,2.410404,2.47697,2.556566,2.659293
2,,,,,,,,,,,,,,,0.00012854545454545454,4.7177036016188295e-05,0.000101,0.000101,0.000101,0.0001515,0.000202
3,,,,,,,,,,,,,,,,,,,,,
4,,,,,,,,,,,,,,,,,,,,,
5,,,,,,,,,,,,,,,,,,,,,
