round,P mean,P std,P min,P q1,P q2,P q3,P max,S mean,S std,S min,S q1,S q2,S q3,S max,P+S mean,P+S std,P+S min,P+S q1,P+S q2,P+S q3,P+S max
0,0.0,0.0,0,0,0,0,0,1.0,0.0,1,1,1,1,1,0.0,0.0,0,0,0,0,0
1,1.0,0.0,1,1,1,1,1,1.0,0.0,1,1,1,1,1,1.0,0.0,1,1,1,1,1
2,1.0,0.0,1,1,1,1,1,1.0,0.0,1,1,1,1,1,1.0,0.0,1,1,1,1,1
3,1.0,0.0,1,1,1,1,1,1.0,0.0,1,1,1,1,1,1.0,0.0,1,1,1,1,1
4,1.0,0.0,1,1,1,1,1,1.0,0.0,1,1,1,1,1,1.0,0.0,1,1,1,1,1
5,1.0,0.0,1,1,1,1,1,1.0,0.0,1,1,1,1,1,1.0,0.0,1,1,1,1,1
6,1.0,0.0,1,1,1,1,1,1.0,0.0,1,1,1,1,1,1.0,0.0,1,1,1,1,1
7,1.6,0.5,1,1,2,2,2,1.0,0.0,1,1,1,1,1,1.0,0.0,1,1,1,1,1
8,1.96,0.8888194417315589,1,1,2,3,3,1.0,0.0,1,1,1,1,1,1.0,0.0,1,1,1,1,1
9,2.16,1.1789826122551597,1,1,2,3,4,1.0,0.0,1,1,1,1,1,1.0,0.0,1,1,1,1,1
10,2.28,1.4,1,1,2,3,5,1.0,0.0,1,1,1,1,1,1.0,0.0,1,1,1,1,1
11,2.4,1.6583123951777,1,1,2,3,6,1.0,0.0,1,1,1,1,1,1.0,0.0,1,1,1,1,1
12,2.44,1.7578395831246945,1,1,2,3,7,1.0,0.0,1,1,1,1,1,1.0,0.0,1,1,1,1,1
13,2.48,1.8734993995195193,1,1,2,3,8,1.0,0.0,1,1,1,1,1,1.0,0.0,1,1,1,1,1
14,2.48,1.8734993995195193,1,1,2,3,8,1.0,0.0,1,1,1,1,1,1.0,0.0,1,1,1,1,1
15,2.48,1.8734993995195193,1,1,2,3,8,1.0,0.0,1,1,1,1,1,1.0,0.0,1,1,1,1,1
16,2.48,1.8734993995195193,1,1,2,3,8,1.0,0.0,1,1,1,1,1,1.0,0.0,1,1,1,1,1
17,2.48,1.8734993995195193,1,1,2,3,8,1.0,0.0,1,1,1,1,1,1.0,0.0,1,1,1,1,1
18,2.48,1.8734993995195193,1,1,2,3,8,1.0,0.0,1,1,1,1,1,1.0,0.0,1,1,1,1,1
19,2.48,1.8734993995195193,1,1,2,3,8,1.0,0.0,1,1,1,1,1,1.0,0.0,1,1,1,1,1
20,2.48,1.8734993995195193,1,1,2,3,8,1.0,0.0,1,1,1,1,1,1.0,0.0,1,1,1,1,1
21,2.48,1.8734993995195193,1,1,2,3,8,1.0,0.0,1,1,1,1,1,1.0,0.0,1,1,1,1,1
22,2.48,1.8734993995195193,1,1,2,3,8,1.0,0.0,1,1,1,1,1,1.0,0.0,1,1,1,1,1
23,2.48,1.8734993995195193,1,1,2,3,8,1.0,0.0,1,1,1,1,1,1.0,0.0,1,1,1,1,1
24,2.48,1.8734993995195193,1,1,2,3,8,1.0,0.0,1,1,1,1,1,1.0,0.0,1,1,1,1,1
25,2.48,1.8734993995195193,1,1,2,3,8,1.0,0.0,1,1,1,1,1,1.0,0.0,1,1,1,1,1
