round,nodes,nodesP,nodesS,recvOne,recvOneP,recvOneS,recvAll,recvAllP,recvAllS,msgSent,msgSentP,msgSentS,msgRecv,msgRecvP,msgRecvS,consist,consistP,consistS,Unnamed: 19
0,1000000.0,1000.0,999000.0,8e-06,0.008,0.0,0.00010799999999999997,0.008,9.999999999999999e-05,10.8,0.8,10.0,0.08,0.08,0.0,0.00010799999999999997,0.008,9.999999999999999e-05,
1,1000000.0,1000.0,999000.0,0.0010560000000000005,1.056,0.0,0.0011560000000000001,1.056,9.999999999999999e-05,115.6,105.6,10.0,10.56,10.56,0.0,0.0011560000000000001,1.056,9.999999999999999e-05,
2,1000000.0,1000.0,999000.0,0.011044,10.979999999999997,6.400000000000001e-05,0.011143999999999996,10.979999999999997,0.000164,1183.2,1166.8,16.4,117.68,117.04,0.64,0.011143999999999996,10.979999999999997,0.000164,
3,1000000.0,1000.0,999000.0,0.07503200000000002,66.58799999999998,0.008452479999999998,0.07513200000000002,66.58799999999998,0.00855252,10460.8,9606.4,854.4,1169.4,1084.96,84.44,0.07513200000000002,66.58799999999998,0.00855252,
4,1000000.0,1000.0,999000.0,0.45925600000000005,99.85199999999999,0.35976379999999997,0.4593560000000001,99.85199999999999,0.35986399999999996,55834.8,19884.4,35950.4,10154.16,6553.96,3600.2,0.4593560000000001,99.85199999999999,0.35986399999999996,
5,1000000.0,1000.0,999000.0,4.68898,100.0,4.593573559999999,4.6890719999999995,100.0,4.5936656,478903.6,19996.4,458907.2,56978.8,9995.0,46983.8,4.6890719999999995,100.0,4.5936656,
6,1000000.0,1000.0,999000.0,37.161787999999994,100.0,37.0988868,37.161848,100.0,37.09894688,3726181.6,19996.8,3706184.8,473316.88,10010.0,463306.88,37.161848,100.0,37.09894688,
7,1000000.0,1000.0,999000.0,97.31761999999999,100.0,97.31493492,97.31763199999999,100.0,97.31494692,9741760.0,19996.8,9721763.2,3625965.16,10010.0,3615955.16,97.31763199999999,100.0,97.31494692,
8,1000000.0,1000.0,999000.0,99.99405599999999,100.0,99.99404996,99.99405599999999,100.0,99.99404996,10009402.4,19996.8,9989405.6,9731106.76,10010.0,9721096.76,99.99405599999999,100.0,99.99404996,
9,1000000.0,1000.0,999000.0,99.99546400000001,100.0,99.99545943999999,99.99546400000001,100.0,99.99545943999999,10009543.2,19996.8,9989546.4,10009403.24,10010.0,9999393.24,99.99546400000001,100.0,99.99545943999999,
10,1000000.0,1000.0,999000.0,99.99546400000001,100.0,99.99545943999999,99.99546400000001,100.0,99.99545943999999,10009543.2,19996.8,9989546.4,10009543.2,10010.0,9999533.2,99.99546400000001,100.0,99.99545943999999,
11,1000000.0,1000.0,999000.0,99.99546400000001,100.0,99.99545943999999,99.99546400000001,100.0,99.99545943999999,10009543.2,19996.8,9989546.4,10009543.2,10010.0,9999533.2,99.99546400000001,100.0,99.99545943999999,
12,1000000.0,1000.0,999000.0,99.99546400000001,100.0,99.99545943999999,99.99546400000001,100.0,99.99545943999999,10009543.2,19996.8,9989546.4,10009543.2,10010.0,9999533.2,99.99546400000001,100.0,99.99545943999999,
13,1000000.0,1000.0,999000.0,99.99546400000001,100.0,99.99545943999999,99.99546400000001,100.0,99.99545943999999,10009543.2,19996.8,9989546.4,10009543.2,10010.0,9999533.2,99.99546400000001,100.0,99.99545943999999,
14,1000000.0,1000.0,999000.0,99.99546400000001,100.0,99.99545943999999,99.99546400000001,100.0,99.99545943999999,10009543.2,19996.8,9989546.4,10009543.2,10010.0,9999533.2,99.99546400000001,100.0,99.99545943999999,
15,1000000.0,1000.0,999000.0,99.99546400000001,100.0,99.99545943999999,99.99546400000001,100.0,99.99545943999999,10009543.2,19996.8,9989546.4,10009543.2,10010.0,9999533.2,99.99546400000001,100.0,99.99545943999999,
16,1000000.0,1000.0,999000.0,99.99546400000001,100.0,99.99545943999999,99.99546400000001,100.0,99.99545943999999,10009543.2,19996.8,9989546.4,10009543.2,10010.0,9999533.2,99.99546400000001,100.0,99.99545943999999,
17,1000000.0,1000.0,999000.0,99.99546400000001,100.0,99.99545943999999,99.99546400000001,100.0,99.99545943999999,10009543.2,19996.8,9989546.4,10009543.2,10010.0,9999533.2,99.99546400000001,100.0,99.99545943999999,
18,1000000.0,1000.0,999000.0,99.99546400000001,100.0,99.99545943999999,99.99546400000001,100.0,99.99545943999999,10009543.2,19996.8,9989546.4,10009543.2,10010.0,9999533.2,99.99546400000001,100.0,99.99545943999999,
19,1000000.0,1000.0,999000.0,99.99546400000001,100.0,99.99545943999999,99.99546400000001,100.0,99.99545943999999,10009543.2,19996.8,9989546.4,10009543.2,10010.0,9999533.2,99.99546400000001,100.0,99.99545943999999,
20,1000000.0,1000.0,999000.0,99.99546400000001,100.0,99.99545943999999,99.99546400000001,100.0,99.99545943999999,10009543.2,19996.8,9989546.4,10009543.2,10010.0,9999533.2,99.99546400000001,100.0,99.99545943999999,
21,1000000.0,1000.0,999000.0,99.99546400000001,100.0,99.99545943999999,99.99546400000001,100.0,99.99545943999999,10009543.2,19996.8,9989546.4,10009543.2,10010.0,9999533.2,99.99546400000001,100.0,99.99545943999999,
22,1000000.0,1000.0,999000.0,99.99546400000001,100.0,99.99545943999999,99.99546400000001,100.0,99.99545943999999,10009543.2,19996.8,9989546.4,10009543.2,10010.0,9999533.2,99.99546400000001,100.0,99.99545943999999,
23,1000000.0,1000.0,999000.0,99.99546400000001,100.0,99.99545943999999,99.99546400000001,100.0,99.99545943999999,10009543.2,19996.8,9989546.4,10009543.2,10010.0,9999533.2,99.99546400000001,100.0,99.99545943999999,
24,1000000.0,1000.0,999000.0,99.99546400000001,100.0,99.99545943999999,99.99546400000001,100.0,99.99545943999999,10009543.2,19996.8,9989546.4,10009543.2,10010.0,9999533.2,99.99546400000001,100.0,99.99545943999999,
