gossips,p2p mean,p2p std,p2p min,p2p q1,p2p q2,p2p q3,p2p max,p2s mean,p2s std,p2s min,p2s q1,p2s q2,p2s q3,p2s max,s2s mean,s2s std,s2s min,s2s q1,s2s q2,s2s q3,s2s max
1,53.78187999999998,0.14205876718222304,53.478,53.679,53.812,53.916,53.99,,,,,,,,,,,,,,
2,5.8783199999999995,0.05457389485825609,5.732,5.855,5.883,5.916,5.99,,,,,,,,,,,,,,
3,0.0622,0.009105858919765158,0.049,0.055,0.059,0.068,0.082,,,,,,,,,,,,,,
4,0.001,0.0,0.001,0.001,0.001,0.001,0.001,,,,,,,,,,,,,,
5,,,,,,,,,,,,,,,,,,,,,
