round,nodes,nodesP,nodesS,nodesSent,nodesSentP,nodesSentS,nodesRecv,nodesRecvP,nodesRecvS,msgSent,msgSentP,msgSentS,msgRecv,msgRecvP,msgRecvS,msgInfect,msgInfectP,msgInfectS
00,10000.000000,5000.000000,5000.000000,0.000000,0.000000,0.000000,0.000000,0.000000,0.000000,0.000000,0.000000,0.000000,0.000000,0.000000,0.000000,0.000000,0.000000,0.000000
01,10000.000000,5000.000000,5000.000000,0.010000,0.020000,0.000000,0.010000,0.020000,0.000000,10.000000,10.000000,0.000000,1.000000,1.000000,0.000000,0.500000,1.000000,0.000000
02,10000.000000,5000.000000,5000.000000,0.115000,0.230000,0.000000,0.115000,0.230000,0.000000,115.000000,115.000000,0.000000,11.500000,11.500000,0.000000,0.500000,1.000000,0.000000
03,10000.000000,5000.000000,5000.000000,1.149000,2.298000,0.000000,1.149000,2.298000,0.000000,1149.000000,1149.000000,0.000000,116.000000,116.000000,0.000000,0.500000,1.000000,0.000000
04,10000.000000,5000.000000,5000.000000,10.360000,20.720000,0.000000,10.360000,20.720000,0.000000,10360.000000,10360.000000,0.000000,1156.900000,1156.900000,0.000000,0.500000,1.000000,0.000000
05,10000.000000,5000.000000,5000.000000,43.461000,86.922000,0.000000,43.461000,86.922000,0.000000,43461.000000,43461.000000,0.000000,10156.400000,10156.400000,0.000000,1.000000,2.000000,0.000000
06,10000.000000,5000.000000,5000.000000,50.204000,99.986000,0.422000,50.204000,99.986000,0.422000,50204.000000,49993.000000,211.000000,43224.500000,43203.400000,21.100000,4.500000,8.000000,1.000000
07,10000.000000,5000.000000,5000.000000,75.092000,99.994000,50.190000,75.092000,99.994000,50.190000,75092.000000,49997.000000,25095.000000,50142.800000,46660.700000,3482.100000,5.000000,9.000000,1.000000
08,10000.000000,5000.000000,5000.000000,97.847000,100.000000,95.694000,97.847000,100.000000,95.694000,97847.000000,50000.000000,47847.000000,74866.100000,58946.500000,15919.600000,7.000000,11.000000,3.000000
09,10000.000000,5000.000000,5000.000000,99.984000,100.000000,99.968000,99.984000,100.000000,99.968000,99984.000000,50000.000000,49984.000000,97799.500000,58946.500000,38853.000000,9.000000,11.000000,7.000000
10,10000.000000,5000.000000,5000.000000,99.991000,100.000000,99.982000,99.991000,100.000000,99.982000,99991.000000,50000.000000,49991.000000,99985.000000,58946.500000,41038.500000,9.500000,11.000000,8.000000
11,10000.000000,5000.000000,5000.000000,99.991000,100.000000,99.982000,99.991000,100.000000,99.982000,99991.000000,50000.000000,49991.000000,99992.000000,58946.500000,41045.500000,9.500000,11.000000,8.000000
12,10000.000000,5000.000000,5000.000000,99.991000,100.000000,99.982000,99.991000,100.000000,99.982000,99991.000000,50000.000000,49991.000000,99992.000000,58946.500000,41045.500000,9.500000,11.000000,8.000000
13,10000.000000,5000.000000,5000.000000,99.991000,100.000000,99.982000,99.991000,100.000000,99.982000,99991.000000,50000.000000,49991.000000,99992.000000,58946.500000,41045.500000,9.500000,11.000000,8.000000
14,10000.000000,5000.000000,5000.000000,99.991000,100.000000,99.982000,99.991000,100.000000,99.982000,99991.000000,50000.000000,49991.000000,99992.000000,58946.500000,41045.500000,9.500000,11.000000,8.000000
15,10000.000000,5000.000000,5000.000000,99.991000,100.000000,99.982000,99.991000,100.000000,99.982000,99991.000000,50000.000000,49991.000000,99992.000000,58946.500000,41045.500000,9.500000,11.000000,8.000000
16,10000.000000,5000.000000,5000.000000,99.991000,100.000000,99.982000,99.991000,100.000000,99.982000,99991.000000,50000.000000,49991.000000,99992.000000,58946.500000,41045.500000,9.500000,11.000000,8.000000
17,10000.000000,5000.000000,5000.000000,99.991000,100.000000,99.982000,99.991000,100.000000,99.982000,99991.000000,50000.000000,49991.000000,99992.000000,58946.500000,41045.500000,9.500000,11.000000,8.000000
18,10000.000000,5000.000000,5000.000000,99.991000,100.000000,99.982000,99.991000,100.000000,99.982000,99991.000000,50000.000000,49991.000000,99992.000000,58946.500000,41045.500000,9.500000,11.000000,8.000000
19,10000.000000,5000.000000,5000.000000,99.991000,100.000000,99.982000,99.991000,100.000000,99.982000,99991.000000,50000.000000,49991.000000,99992.000000,58946.500000,41045.500000,9.500000,11.000000,8.000000
