round,nodes,nodesP,nodesS,nodesSent,nodesSentP,nodesSentS,nodesRecv,nodesRecvP,nodesRecvS,msgSent,msgSentP,msgSentS,msgRecv,msgRecvP,msgRecvS,msgInfect,msgInfectP,msgInfectS
00,1000.000000,100.000000,900.000000,0.000000,0.000000,0.000000,0.000000,0.000000,0.000000,0.000000,0.000000,0.000000,0.000000,0.000000,0.000000,0.000000,0.000000,0.000000
01,1000.000000,100.000000,900.000000,0.110000,1.100000,0.000000,0.110000,1.100000,0.000000,11.000000,11.000000,0.000000,1.100000,1.100000,0.000000,0.100000,1.000000,0.000000
02,1000.000000,100.000000,900.000000,1.150000,11.500000,0.000000,1.150000,11.500000,0.000000,115.000000,115.000000,0.000000,11.700000,11.700000,0.000000,0.100000,1.000000,0.000000
03,1000.000000,100.000000,900.000000,6.730000,66.500000,0.088889,6.730000,66.500000,0.088889,673.000000,665.000000,8.000000,112.300000,111.500000,0.800000,0.640000,1.000000,0.600000
04,1000.000000,100.000000,900.000000,34.700000,98.100000,27.655556,34.700000,98.100000,27.655556,3470.000000,981.000000,2489.000000,675.700000,385.000000,290.700000,1.220000,3.200000,1.000000
05,1000.000000,100.000000,900.000000,96.590000,98.100000,96.422222,96.590000,98.100000,96.422222,9659.000000,981.000000,8678.000000,3389.500000,385.000000,3004.500000,3.020000,3.200000,3.000000
06,1000.000000,100.000000,900.000000,99.790000,98.100000,99.977778,99.790000,98.100000,99.977778,9979.000000,981.000000,8998.000000,9648.200000,385.000000,9263.200000,9.320000,3.200000,10.000000
07,1000.000000,100.000000,900.000000,99.790000,98.100000,99.977778,99.790000,98.100000,99.977778,9979.000000,981.000000,8998.000000,9980.000000,385.000000,9595.000000,9.320000,3.200000,10.000000
08,1000.000000,100.000000,900.000000,99.790000,98.100000,99.977778,99.790000,98.100000,99.977778,9979.000000,981.000000,8998.000000,9980.000000,385.000000,9595.000000,9.320000,3.200000,10.000000
09,1000.000000,100.000000,900.000000,99.790000,98.100000,99.977778,99.790000,98.100000,99.977778,9979.000000,981.000000,8998.000000,9980.000000,385.000000,9595.000000,9.320000,3.200000,10.000000
10,1000.000000,100.000000,900.000000,99.790000,98.100000,99.977778,99.790000,98.100000,99.977778,9979.000000,981.000000,8998.000000,9980.000000,385.000000,9595.000000,9.320000,3.200000,10.000000
11,1000.000000,100.000000,900.000000,99.790000,98.100000,99.977778,99.790000,98.100000,99.977778,9979.000000,981.000000,8998.000000,9980.000000,385.000000,9595.000000,9.320000,3.200000,10.000000
12,1000.000000,100.000000,900.000000,99.790000,98.100000,99.977778,99.790000,98.100000,99.977778,9979.000000,981.000000,8998.000000,9980.000000,385.000000,9595.000000,9.320000,3.200000,10.000000
13,1000.000000,100.000000,900.000000,99.790000,98.100000,99.977778,99.790000,98.100000,99.977778,9979.000000,981.000000,8998.000000,9980.000000,385.000000,9595.000000,9.320000,3.200000,10.000000
14,1000.000000,100.000000,900.000000,99.790000,98.100000,99.977778,99.790000,98.100000,99.977778,9979.000000,981.000000,8998.000000,9980.000000,385.000000,9595.000000,9.320000,3.200000,10.000000
15,1000.000000,100.000000,900.000000,99.790000,98.100000,99.977778,99.790000,98.100000,99.977778,9979.000000,981.000000,8998.000000,9980.000000,385.000000,9595.000000,9.320000,3.200000,10.000000
16,1000.000000,100.000000,900.000000,99.790000,98.100000,99.977778,99.790000,98.100000,99.977778,9979.000000,981.000000,8998.000000,9980.000000,385.000000,9595.000000,9.320000,3.200000,10.000000
17,1000.000000,100.000000,900.000000,99.790000,98.100000,99.977778,99.790000,98.100000,99.977778,9979.000000,981.000000,8998.000000,9980.000000,385.000000,9595.000000,9.320000,3.200000,10.000000
18,1000.000000,100.000000,900.000000,99.790000,98.100000,99.977778,99.790000,98.100000,99.977778,9979.000000,981.000000,8998.000000,9980.000000,385.000000,9595.000000,9.320000,3.200000,10.000000
19,1000.000000,100.000000,900.000000,99.790000,98.100000,99.977778,99.790000,98.100000,99.977778,9979.000000,981.000000,8998.000000,9980.000000,385.000000,9595.000000,9.320000,3.200000,10.000000
