gossips,p2p mean,p2p std,p2p min,p2p q1,p2p q2,p2p q3,p2p max,p2s mean,p2s std,p2s min,p2s q1,p2s q2,p2s q3,p2s max,s2s mean,s2s std,s2s min,s2s q1,s2s q2,s2s q3,s2s max
1,49.06400000000001,1.5228482086756603,46.1,48.2,49.1,50.2,52.6,58.104,1.3179782496940773,55.4,57.5,58.2,58.7,61.1,33.365253319999994,0.7151951631389818,31.901502,32.845646,33.263864,33.618418,35.077578
2,22.080000000000005,1.045625809423875,20.5,21.2,21.8,22.8,24.5,20.38,1.0376254944182257,17.5,19.8,20.5,21.0,22.2,1.37445048,0.05484622850913874,1.289089,1.3461459999999998,1.366066,1.416316,1.4996
3,1.9920000000000002,0.44527145278657443,1.3,1.6,1.9,2.3,3.0,0.292,0.13820274961085255,0.1,0.2,0.3,0.4,0.5,0.009353399999999998,0.0009169591957479164,0.007608,0.008709,0.009309,0.01001,0.010911
4,0.15,0.08366600265340757,0.1,0.1,0.1,0.17500000000000002,0.3,0.1,0.0,0.1,0.1,0.1,0.1,0.1,0.0002,,0.0002,0.0002,0.0002,0.0002,0.0002
5,,,,,,,,,,,,,,,,,,,,,
