gossips,p2p mean,p2p std,p2p min,p2p q1,p2p q2,p2p q3,p2p max,p2s mean,p2s std,p2s min,p2s q1,p2s q2,p2s q3,p2s max,s2s mean,s2s std,s2s min,s2s q1,s2s q2,s2s q3,s2s max
1,49.02799999999999,0.5008991914547276,47.95,48.78,49.06,49.38,49.86,57.994800000000005,0.4706389274167621,57.05,57.7,57.97,58.19,59.08,51.95096552,0.162076420974573,51.663232,51.834747,51.951716999999995,52.069798,52.302525
2,22.2404,0.39227413883660534,21.24,22.04,22.19,22.43,23.06,20.489199999999997,0.37785491042638714,19.66,20.22,20.46,20.83,21.14,21.969862600000003,0.22000606403650208,21.66303,21.822929000000002,21.922525,22.106667,22.39404
3,2.1164,0.1427083272506082,1.79,2.01,2.13,2.21,2.39,0.3148,0.0575991898091168,0.17,0.28,0.31,0.35,0.44,1.3150423599999999,0.02617284151857927,1.253131,1.302525,1.316869,1.3337370000000002,1.3487879999999999
4,0.022916666666666672,0.012676293062133798,0.01,0.01,0.02,0.03,0.05,0.0125,0.005,0.01,0.01,0.01,0.0125,0.02,0.021248359999999997,0.0017657869794136178,0.01697,0.020101,0.021313,0.022525,0.024746999999999998
5,,,,,,,,,,,,,,,0.00014140000000000002,5.531997830802178e-05,0.000101,0.000101,0.000101,0.000202,0.000202
