round,Simple mean,Simple std,Simple min,Simple q1,Simple q2,Simple q3,Simple max
0,100.0,0.0,100.0,100.0,100.0,100.0,100.0
1,99.99989999999998,0.0,99.9999,99.9999,99.9999,99.9999,99.9999
2,99.99879999999999,0.0,99.9988,99.9988,99.9988,99.9988,99.9988
3,99.98780799999993,2.7688746210386478e-05,99.9878,99.9878,99.9878,99.9878,99.9879
4,99.87629999999999,0.0003741657386771249,99.8757,99.876,99.8763,99.8765,99.8771
5,98.86940799999998,0.0042262000268167114,98.8563,98.867,98.87,98.8718,98.8759
6,95.314836,0.01466628446471788,95.2867,95.304,95.3165,95.3237,95.344
7,96.23634,0.014450893859322524,96.2128,96.2248,96.2354,96.2496,96.26
8,99.90110800000002,0.0030982414366860843,99.895,99.8993,99.9011,99.9027,99.9063
9,99.990788,0.000997630526131534,99.9889,99.99,99.9907,99.9913,99.9929
10,99.99086399999999,0.001006180898247317,99.9889,99.9901,99.9909,99.9915,99.993
11,99.99086399999999,0.001006180898247317,99.9889,99.9901,99.9909,99.9915,99.993
12,99.99086399999999,0.001006180898247317,99.9889,99.9901,99.9909,99.9915,99.993
13,99.99086399999999,0.001006180898247317,99.9889,99.9901,99.9909,99.9915,99.993
14,99.99086399999999,0.001006180898247317,99.9889,99.9901,99.9909,99.9915,99.993
15,99.99086399999999,0.001006180898247317,99.9889,99.9901,99.9909,99.9915,99.993
