round,P mean,P std,P min,P q1,P q2,P q3,P max,S mean,S std,S min,S q1,S q2,S q3,S max,P+S mean,P+S std,P+S min,P+S q1,P+S q2,P+S q3,P+S max
0,100.0,0.0,100.0,100.0,100.0,100.0,100.0,100.0,0.0,100.0,100.0,100.0,100.0,100.0,100.0,0.0,100.0,100.0,100.0,100.0,100.0
1,99.99959999999999,0.0020000000000020383,99.99,100.0,100.0,100.0,100.0,99.99990303999998,2.02000000000449e-05,99.999899,99.999899,99.999899,99.999899,100.0,99.99989999999998,0.0,99.9999,99.9999,99.9999,99.9999,99.9999
2,99.99959999999999,0.0020000000000020383,99.99,100.0,100.0,100.0,100.0,99.99980203999999,2.02000000000449e-05,99.999798,99.999798,99.999798,99.999798,99.999899,99.99980000000004,0.0,99.9998,99.9998,99.9998,99.9998,99.9998
3,99.9992,0.0027688746209722555,99.99,100.0,100.0,100.0,100.0,99.99970104000002,2.02000000000449e-05,99.999697,99.999697,99.999697,99.999697,99.999798,99.999696,1.9999999996489162e-05,99.9996,99.9997,99.9997,99.9997,99.9997
4,99.89880000000005,0.0033166247903577595,99.89,99.9,99.9,99.9,99.9,99.99960004000005,2.02000000000449e-05,99.999596,99.999596,99.999596,99.999596,99.999697,99.99859199999996,2.7688746207256718e-05,99.9985,99.9986,99.9986,99.9986,99.9986
5,99.79879999999999,0.0033166247903529604,99.79,99.8,99.8,99.8,99.8,99.99950308000001,2.7965633672270496e-05,99.999495,99.999495,99.999495,99.999495,99.999596,99.99749599999997,2.0000000000885673e-05,99.9974,99.9975,99.9975,99.9975,99.9975
6,99.6972,0.007371114795831647,99.68,99.69,99.7,99.7,99.71,99.99940207999997,2.7965633672270496e-05,99.999394,99.999394,99.999394,99.999394,99.999495,99.99637999999999,7.07106781188483e-05,99.9962,99.9964,99.9964,99.9964,99.9965
7,98.61760000000002,0.014798648586948881,98.59,98.61,98.62,98.63,98.64,99.99930511999999,3.3497910378756655e-05,99.99929300000001,99.99929300000001,99.99929300000001,99.99929300000001,99.999394,99.98548799999998,0.00014236104335854126,99.9853,99.9854,99.9855,99.9856,99.9857
8,97.5384,0.018411952639521553,97.51,97.53,97.53,97.55,97.58,99.99920816000004,3.7790739606843843e-05,99.99919200000001,99.99919200000001,99.99919200000001,99.99919200000001,99.99929300000001,99.97459999999997,0.0001892969448575237,99.9743,99.9745,99.9745,99.9747,99.975
9,96.52879999999999,0.03395094500403151,96.46,96.51,96.53,96.55,96.59,99.99910716000001,3.7790739606843843e-05,99.999091,99.999091,99.999091,99.999091,99.99919200000001,99.96440399999997,0.00034093010036155574,99.9637,99.9642,99.9644,99.9646,99.965
10,87.38,0.12704985897932752,87.13,87.32,87.41,87.47,87.58,99.99837592000002,0.001073613055688226,99.996061,99.998081,99.999091,99.999091,99.99919200000001,99.872192,0.0012257378730119938,99.8701,99.8715,99.8719,99.8732,99.8744
11,78.40559999999999,0.15124703853849944,78.13,78.26,78.41,78.49,78.74,99.99777392,0.001325512319823636,99.994141,99.99707099999999,99.998081,99.999091,99.99919200000001,99.78185200000001,0.0016775776186702697,99.7786,99.7806,99.7823,99.783,99.7855
12,75.2152,0.28355070093371354,74.68,75.0,75.17,75.42,75.88,99.99711939999999,0.0015219288474404684,99.99303,99.996162,99.99707099999999,99.998081,99.99919200000001,99.74929999999999,0.00282842712474578,99.7442,99.7467,99.7494,99.7508,99.7569
13,57.39240000000001,0.4039005653210524,56.55,57.2,57.37,57.63,58.21,99.93391924000004,0.013534478047685946,99.896162,99.92949499999999,99.936465,99.942626,99.952626,99.50850399999999,0.012623670887135098,99.4746,99.5057,99.5108,99.5144,99.5257
14,40.566,0.4454959782833815,39.97,40.27,40.5,40.66,41.77,99.86804443999999,0.016475160745496178,99.831616,99.859798,99.866465,99.882626,99.888081,99.27502400000003,0.015299027202191253,99.2385,99.2678,99.2776,99.2882,99.2946
15,40.6368,0.5375152711008923,39.51,40.34,40.63,41.05,41.58,99.79966864000002,0.0179454664420676,99.76434300000001,99.78596,99.802323,99.814848,99.828182,99.20804000000003,0.018608577771196535,99.1673,99.1966,99.2066,99.2244,99.2369
16,41.1756,0.5850005698002922,39.81,40.85,41.21,41.67,41.9,96.57465464,0.08254819427808754,96.34646500000001,96.557778,96.58525300000001,96.622929,96.675152,96.02066399999998,0.0810061205506577,95.7995,96.0007,96.0343,96.0707,96.1179
17,41.4724,0.5217461068374171,40.26,41.27,41.42,41.9,42.3,93.36381012000001,0.09622438672027474,93.15414100000001,93.306061,93.382727,93.427172,93.515051,92.84489599999998,0.09486661460527887,92.6417,92.7885,92.863,92.8988,92.9935
18,41.753600000000006,0.5135568777328025,41.06,41.4,41.57,42.14,43.24,91.42410499999998,0.11345323217813912,91.227273,91.341212,91.424646,91.50202,91.713131,90.92739999999999,0.11187368248758638,90.7331,90.8488,90.9244,91.0008,91.2117
19,46.8124,0.5369612028194701,45.6,46.4,46.93,47.08,47.87,70.47641212,0.3969816829090192,69.512323,70.355859,70.490808,70.746768,71.101313,70.23977200000002,0.39528686684482656,69.2732,70.1219,70.2484,70.5071,70.8599
20,51.7688,0.47443229232420536,50.98,51.46,51.72,51.98,52.9,50.122129239999985,0.34265459789491176,49.490909,49.972424,50.120202,50.368687,50.798283000000005,50.13859600000001,0.34096621714377096,49.5062,49.9896,50.148,50.3899,50.8052
21,54.624399999999994,0.43729357034681715,53.66,54.39,54.62,54.88,55.38,49.6598262,0.3371276082576176,49.045253,49.501111,49.672525,49.875353999999994,50.254646,49.709472000000005,0.33492827281872406,49.0914,49.5476,49.7296,49.9301,50.2983
22,77.01240000000001,0.3712061421905584,76.14,76.77,77.01,77.23,77.79,48.34557983999999,0.23699433026545846,47.728384000000005,48.234140999999994,48.377576,48.513939,48.734140999999994,48.632248,0.23490862783927896,48.0204,48.5262,48.6637,48.8006,49.0192
23,99.59200000000001,0.06304760106459743,99.41,99.56,99.6,99.62,99.7,46.57722016,0.3415286580644555,45.886565999999995,46.339899,46.597576000000004,46.883232,47.038990000000005,47.10736800000001,0.3381331243263004,46.4241,46.8721,47.1273,47.4098,47.5652
24,99.68360000000001,0.05521775076911413,99.54,99.65,99.7,99.73,99.76,46.70806052000001,0.2327489351848386,46.264747,46.533333,46.756060999999995,46.887778000000004,47.121313,47.237815999999995,0.2304280268688409,46.7989,47.0646,47.2846,47.4152,47.6474
25,99.82079999999998,0.033030289129827264,99.76,99.79,99.82,99.84,99.9,48.52232324,0.2704553181313389,47.980202,48.366364000000004,48.522929,48.677071000000005,49.053333,49.03530800000001,0.26789309889083274,48.4981,48.8807,49.0356,49.1887,49.5618
26,99.96439999999998,0.019165942015288984,99.91,99.95,99.97,99.98,100.0,50.03781412,0.19126069376122978,49.724646,49.916263,50.040101,50.197272999999996,50.358484999999995,50.53708000000002,0.18939484329481435,50.2269,50.4165,50.5395,50.6947,50.8547
27,99.96439999999998,0.019165942015288984,99.91,99.95,99.97,99.98,100.0,51.81229504,0.30975249158232215,51.261515,51.505455,51.875455,52.0,52.246970000000005,52.29381599999998,0.3066842644588519,51.7484,51.9904,52.3562,52.4794,52.7243
28,99.96439999999998,0.019165942015288984,99.91,99.95,99.97,99.98,100.0,73.15778180000001,0.2551719977818914,72.609798,72.96717199999999,73.203535,73.309596,73.537172,73.425848,0.2526199453065144,72.8835,73.2369,73.4709,73.5763,73.8012
29,99.96439999999998,0.019165942015288984,99.91,99.95,99.97,99.98,100.0,94.15396768000001,0.13011649712684342,93.93565699999999,94.083939,94.163434,94.219192,94.514949,94.212072,0.12883335981026303,93.9957,94.1429,94.2218,94.2768,94.5694
30,99.96439999999998,0.019165942015288984,99.91,99.95,99.97,99.98,100.0,95.03174136000001,0.10335201939079736,94.808586,94.960606,95.039697,95.103434,95.24202,95.081068,0.10232302901432846,94.8601,95.0108,95.089,95.1521,95.2891
31,99.96439999999998,0.019165942015288984,99.91,99.95,99.97,99.98,100.0,97.50012532000001,0.06786261036137117,97.377374,97.449495,97.51303,97.555152,97.595455,97.52476800000001,0.06714749139022315,97.4034,97.4744,97.5376,97.5796,97.6192
32,99.96439999999998,0.019165942015288984,99.91,99.95,99.97,99.98,100.0,99.9600808,0.002109143447781825,99.956263,99.958788,99.95979799999999,99.96171700000001,99.963636,99.96012399999998,0.0021054057407857586,99.9564,99.959,99.9599,99.9614,99.9638
33,99.96439999999998,0.019165942015288984,99.91,99.95,99.97,99.98,100.0,99.96105044,0.00198805703053572,99.957273,99.95969699999999,99.96101,99.962323,99.965051,99.96108399999999,0.0019836162263211837,99.9573,99.9599,99.9611,99.9623,99.9652
34,99.96439999999998,0.019165942015288984,99.91,99.95,99.97,99.98,100.0,99.96228268,0.001893725686754658,99.958485,99.960909,99.962424,99.96323199999999,99.96596,99.962304,0.00189109315829045,99.9586,99.9611,99.9623,99.9633,99.9661
35,99.96439999999998,0.019165942015288984,99.91,99.95,99.97,99.98,100.0,99.96340192,0.001828273432326994,99.95959599999999,99.962424,99.96343399999999,99.964545,99.966566,99.963412,0.0018358286049299176,99.9597,99.9627,99.9634,99.9646,99.9667
36,99.96439999999998,0.019165942015288984,99.91,99.95,99.97,99.98,100.0,99.96340192,0.001828273432326994,99.95959599999999,99.962424,99.96343399999999,99.964545,99.966566,99.963412,0.0018358286049299176,99.9597,99.9627,99.9634,99.9646,99.9667
37,99.96439999999998,0.019165942015288984,99.91,99.95,99.97,99.98,100.0,99.96340192,0.001828273432326994,99.95959599999999,99.962424,99.96343399999999,99.964545,99.966566,99.963412,0.0018358286049299176,99.9597,99.9627,99.9634,99.9646,99.9667
38,99.96439999999998,0.019165942015288984,99.91,99.95,99.97,99.98,100.0,99.96340192,0.001828273432326994,99.95959599999999,99.962424,99.96343399999999,99.964545,99.966566,99.963412,0.0018358286049299176,99.9597,99.9627,99.9634,99.9646,99.9667
39,99.96439999999998,0.019165942015288984,99.91,99.95,99.97,99.98,100.0,99.96340192,0.001828273432326994,99.95959599999999,99.962424,99.96343399999999,99.964545,99.966566,99.963412,0.0018358286049299176,99.9597,99.9627,99.9634,99.9646,99.9667
40,99.96439999999998,0.019165942015288984,99.91,99.95,99.97,99.98,100.0,99.96340192,0.001828273432326994,99.95959599999999,99.962424,99.96343399999999,99.964545,99.966566,99.963412,0.0018358286049299176,99.9597,99.9627,99.9634,99.9646,99.9667
41,99.96439999999998,0.019165942015288984,99.91,99.95,99.97,99.98,100.0,99.96340192,0.001828273432326994,99.95959599999999,99.962424,99.96343399999999,99.964545,99.966566,99.963412,0.0018358286049299176,99.9597,99.9627,99.9634,99.9646,99.9667
42,99.96439999999998,0.019165942015288984,99.91,99.95,99.97,99.98,100.0,99.96340192,0.001828273432326994,99.95959599999999,99.962424,99.96343399999999,99.964545,99.966566,99.963412,0.0018358286049299176,99.9597,99.9627,99.9634,99.9646,99.9667
43,99.96439999999998,0.019165942015288984,99.91,99.95,99.97,99.98,100.0,99.96340192,0.001828273432326994,99.95959599999999,99.962424,99.96343399999999,99.964545,99.966566,99.963412,0.0018358286049299176,99.9597,99.9627,99.9634,99.9646,99.9667
44,99.96439999999998,0.019165942015288984,99.91,99.95,99.97,99.98,100.0,99.96340192,0.001828273432326994,99.95959599999999,99.962424,99.96343399999999,99.964545,99.966566,99.963412,0.0018358286049299176,99.9597,99.9627,99.9634,99.9646,99.9667
45,99.96439999999998,0.019165942015288984,99.91,99.95,99.97,99.98,100.0,99.96340192,0.001828273432326994,99.95959599999999,99.962424,99.96343399999999,99.964545,99.966566,99.963412,0.0018358286049299176,99.9597,99.9627,99.9634,99.9646,99.9667
46,99.96439999999998,0.019165942015288984,99.91,99.95,99.97,99.98,100.0,99.96340192,0.001828273432326994,99.95959599999999,99.962424,99.96343399999999,99.964545,99.966566,99.963412,0.0018358286049299176,99.9597,99.9627,99.9634,99.9646,99.9667
47,99.96439999999998,0.019165942015288984,99.91,99.95,99.97,99.98,100.0,99.96340192,0.001828273432326994,99.95959599999999,99.962424,99.96343399999999,99.964545,99.966566,99.963412,0.0018358286049299176,99.9597,99.9627,99.9634,99.9646,99.9667
48,99.96439999999998,0.019165942015288984,99.91,99.95,99.97,99.98,100.0,99.96340192,0.001828273432326994,99.95959599999999,99.962424,99.96343399999999,99.964545,99.966566,99.963412,0.0018358286049299176,99.9597,99.9627,99.9634,99.9646,99.9667
49,99.96439999999998,0.019165942015288984,99.91,99.95,99.97,99.98,100.0,99.96340192,0.001828273432326994,99.95959599999999,99.962424,99.96343399999999,99.964545,99.966566,99.963412,0.0018358286049299176,99.9597,99.9627,99.9634,99.9646,99.9667
50,99.96439999999998,0.019165942015288984,99.91,99.95,99.97,99.98,100.0,99.96340192,0.001828273432326994,99.95959599999999,99.962424,99.96343399999999,99.964545,99.966566,99.963412,0.0018358286049299176,99.9597,99.9627,99.9634,99.9646,99.9667
