,mean,std,min,q1,q2,q3,max
Simple,,,,,,,
P,5.2360301070933115,0.6663838064613611,1.0,5.0,5.0,6.0,8.0
S,6.6892175025563745,0.5061703596644823,3.0,6.0,7.0,7.0,9.0
P+S,6.5439031517211435,0.6819431666671062,1.0,6.0,7.0,7.0,9.0
