gossips,p2p mean,p2p std,p2p min,p2p q1,p2p q2,p2p q3,p2p max,p2s mean,p2s std,p2s min,p2s q1,p2s q2,p2s q3,p2s max,s2s mean,s2s std,s2s min,s2s q1,s2s q2,s2s q3,s2s max
1,49.30476000000001,0.15751303649751183,48.878,49.237,49.335,49.42,49.584,84.73844,0.15316959010630557,84.479,84.611,84.773,84.846,85.012,2.8628089599999997,0.06536276375256288,2.701667,2.8241110000000003,2.871778,2.8986669999999997,2.987
2,22.16384,0.14791570797811418,21.948,22.052,22.129,22.26,22.566,2.0364,0.05202723645681493,1.94,1.999,2.028,2.084,2.128,0.00038634782608695654,0.00018016422021328008,0.00011100000000000001,0.00022200000000000003,0.000333,0.0005,0.000889
3,2.0165199999999994,0.029526993299916888,1.953,2.004,2.016,2.035,2.074,0.001,,0.001,0.001,0.001,0.001,0.001,,,,,,,
4,0.02324000000000001,0.004675111406872211,0.013,0.021,0.023,0.027,0.031,,,,,,,,,,,,,,
5,,,,,,,,,,,,,,,,,,,,,
