gossips,p2p mean,p2p std,p2p min,p2p q1,p2p q2,p2p q3,p2p max,p2s mean,p2s std,p2s min,p2s q1,p2s q2,p2s q3,p2s max,s2s mean,s2s std,s2s min,s2s q1,s2s q2,s2s q3,s2s max
1,49.268999999999984,0.09312715321895342,49.104,49.186,49.29,49.324,49.434,49.269,0.09319737120756096,49.104,49.186,49.29,49.324,49.434,52.12252891999999,0.05124798682950104,52.035,52.096778,52.112,52.160556,52.228
2,22.23772,0.1053508107863114,21.98,22.172,22.241,22.287,22.432,22.237720000000003,0.10538798160448139,21.98,22.172,22.241,22.287,22.432,22.3844934,0.04507714366690473,22.268222,22.366778,22.395667,22.422667,22.438333
3,2.03392,0.03985695255117558,1.971,2.009,2.02,2.065,2.113,2.03388,0.03987618336802051,1.971,2.009,2.02,2.065,2.113,1.00485332,0.009911908451117455,0.9902219999999999,0.9971110000000001,1.002,1.011333,1.026556
4,0.023600000000000013,0.0045368858629387335,0.014,0.02,0.024,0.026,0.033,0.023600000000000013,0.0045368858629387335,0.014,0.02,0.024,0.026,0.033,0.009880000000000003,0.0008847333873357932,0.007889,0.009333,0.01,0.010333,0.011333
5,0.001,0.0,0.001,0.001,0.001,0.001,0.001,0.001,0.0,0.001,0.001,0.001,0.001,0.001,0.00014271428571428573,5.41624540486436e-05,0.00011100000000000001,0.00011100000000000001,0.00011100000000000001,0.00016650000000000004,0.00022200000000000003
