,mean,std,min,05th,25th,50th,75th,95th,max
Uniform,,,,,,,,,
P,3.232779724475592,0.6562235571245371,1.0,2.0,3.0,3.0,4.0,4.0,5.0
S,6.629076159717395,0.6247040535528607,3.0,6.0,6.0,7.0,7.0,7.0,10.0
P+S,6.625679762122229,0.633892078715337,1.0,6.0,6.0,7.0,7.0,7.0,10.0
