gossips,p2p mean,p2p std,p2p min,p2p q1,p2p q2,p2p q3,p2p max,p2s mean,p2s std,p2s min,p2s q1,p2s q2,p2s q3,p2s max,s2s mean,s2s std,s2s min,s2s q1,s2s q2,s2s q3,s2s max
1,49.04356,0.1741761751790407,48.695,48.904,49.06,49.169,49.341,58.15976,0.3438172091872858,57.776,57.905,58.014,58.359,58.924,55.0870622,0.34837867411493817,54.70544399999999,54.870111,54.947889,55.045221999999995,55.808443999999994
2,22.347199999999997,0.1511949624381261,22.011,22.274,22.338,22.467,22.664,20.37436,0.1924432557058483,19.966,20.288,20.433,20.494,20.694,21.75601332,0.14098100126811425,21.461889000000003,21.696333,21.774,21.853222,21.950889
3,2.07364,0.033013734515602196,2.011,2.044,2.075,2.092,2.134,0.33928000000000014,0.014678555787270078,0.312,0.329,0.34,0.347,0.368,0.47641779999999995,0.013875163191232505,0.447111,0.469778,0.475889,0.48522200000000004,0.503444
4,0.022120000000000008,0.005651843357112203,0.014,0.018,0.021,0.025,0.038,0.0012941176470588243,0.0004696682183138621,0.001,0.001,0.001,0.002,0.002,0.0028044400000000014,0.0006441868310772375,0.001778,0.002444,0.002667,0.002889,0.004778
5,0.001,,0.001,0.001,0.001,0.001,0.001,,,,,,,,,,,,,,
