gossips,p2p mean,p2p std,p2p min,p2p q1,p2p q2,p2p q3,p2p max,p2s mean,p2s std,p2s min,p2s q1,p2s q2,p2s q3,p2s max,s2s mean,s2s std,s2s min,s2s q1,s2s q2,s2s q3,s2s max
1,26.0256,0.3779889769115847,25.15,25.77,26.05,26.25,26.72,24.53,0.5189894025893024,23.42,24.28,24.54,24.81,25.53,25.448739279999998,0.2298999635527228,25.063838,25.270707,25.414747,25.530606,26.081919
2,36.11879999999999,0.3635624659761602,35.53,35.79,36.16,36.34,37.06,42.6884,0.39561850310621194,41.96,42.39,42.77,43.02,43.26,38.51010108,0.09487621428951384,38.387273,38.44303,38.498788,38.557879,38.790808
3,22.950000000000003,0.37282703764614405,22.22,22.64,22.98,23.16,23.83,23.666,0.43495210464295275,22.75,23.41,23.73,23.82,24.64,23.544218160000003,0.2337482541137439,22.867373999999998,23.383838,23.581414000000002,23.661919,24.001212
4,6.982,0.2870685167923037,6.57,6.77,6.95,7.14,7.59,4.582,0.2297825058615211,4.19,4.39,4.58,4.77,4.95,6.021244519999999,0.12755446628144146,5.6158589999999995,5.951111,6.04,6.09697,6.1879800000000005
5,0.9512,0.09756707094780151,0.73,0.89,0.96,1.02,1.11,0.13839999999999997,0.034117444218463966,0.09,0.11,0.14,0.15,0.23,0.5501454799999999,0.01953132850303156,0.492525,0.537172,0.55697,0.562121,0.576263
6,0.05760000000000001,0.022781571499789034,0.01,0.05,0.06,0.07,0.09,0.012857142857142859,0.004879500364742666,0.01,0.01,0.01,0.015,0.02,0.025082919999999995,0.0016189477014406611,0.022323,0.02404,0.025152,0.025960000000000004,0.028182
7,0.01,0.0,0.01,0.01,0.01,0.01,0.01,,,,,,,,0.00056156,0.00022972412440432403,0.000202,0.000404,0.000606,0.0007070000000000001,0.001111
8,,,,,,,,,,,,,,,0.000101,0.0,0.000101,0.000101,0.000101,0.000101,0.000101
