gossips,p2p mean,p2p std,p2p min,p2p q1,p2p q2,p2p q3,p2p max,p2s mean,p2s std,p2s min,p2s q1,p2s q2,p2s q3,p2s max,s2s mean,s2s std,s2s min,s2s q1,s2s q2,s2s q3,s2s max
1,53.236000000000004,0.4685705211954041,52.25,52.88,53.28,53.59,53.98,27.9556,0.5702856009638216,26.48,27.63,28.01,28.42,28.87,0.07797172000000002,0.011469879534822208,0.057273000000000004,0.071515,0.07787899999999999,0.082727,0.101313
2,6.0016,0.16082288394379704,5.67,5.91,6.02,6.06,6.32,0.3184,0.055428632793289544,0.23,0.27,0.33,0.36,0.41,0.000101,0.0,0.000101,0.000101,0.000101,0.000101,0.000101
3,0.1124,0.03357578492505176,0.05,0.09,0.11,0.13,0.19,0.01,,0.01,0.01,0.01,0.01,0.01,,,,,,,
4,0.01,0.0,0.01,0.01,0.01,0.01,0.01,,,,,,,,,,,,,,
5,,,,,,,,,,,,,,,,,,,,,
