gossips,p2p mean,p2p std,p2p min,p2p q1,p2p q2,p2p q3,p2p max,p2s mean,p2s std,p2s min,p2s q1,p2s q2,p2s q3,p2s max,s2s mean,s2s std,s2s min,s2s q1,s2s q2,s2s q3,s2s max
1,,,,,,,,,,,,,,,56.378098120000004,0.5378591476040544,55.298999,56.067367000000004,56.462663,56.688088,57.228729
2,,,,,,,,,,,,,,,18.474510480000003,0.7944838634344695,17.133232999999997,17.911812,18.427127,18.837938,19.838839
3,,,,,,,,,,,,,,,1.2083363999999999,0.14306396767704999,0.93984,1.095596,1.2374370000000001,1.295896,1.5115120000000002
4,,,,,,,,,,,,,,,0.000175,0.00012154310870109944,0.0001,0.0001,0.0001,0.000225,0.0004
5,,,,,,,,,,,,,,,,,,,,,
