gossips,p2p mean,p2p std,p2p min,p2p q1,p2p q2,p2p q3,p2p max,p2s mean,p2s std,p2s min,p2s q1,p2s q2,p2s q3,p2s max,s2s mean,s2s std,s2s min,s2s q1,s2s q2,s2s q3,s2s max
1,49.42720000000001,0.540698005667982,48.4,49.19,49.43,49.93,50.53,58.376,0.41633319989322826,57.72,58.21,58.25,58.47,59.56,53.42692120000001,0.10550907280971901,53.24818199999999,53.371616,53.422929,53.466768,53.664343
2,22.274800000000006,0.42360673586083003,21.28,21.99,22.29,22.51,22.94,20.3172,0.3077136114419809,19.59,20.19,20.38,20.49,20.72,20.95170492,0.2821495298183976,20.203737,20.794545,20.978282999999998,21.11,21.374444
3,2.0228,0.13550891729575093,1.7,1.95,2.04,2.12,2.31,0.32280000000000003,0.05954829972383763,0.19,0.29,0.33,0.36,0.41,0.7053576800000002,0.01611325666886332,0.670909,0.69899,0.705859,0.715859,0.745556
4,0.023157894736842113,0.01204280863279334,0.01,0.02,0.02,0.03,0.06,0.01,,0.01,0.01,0.01,0.01,0.01,0.0008807199999999999,0.00036242913330286614,0.000101,0.0007070000000000001,0.000909,0.001111,0.001616
5,,,,,,,,,,,,,,,,,,,,,
