class2class, mean, std, sem, cistd, cisem, min, 05th, 25th, 50th, 75th, 95th, max
p2p,2708.95853315,991.8512795862841,99.18512795862841,99.18512795862841,9.918512795862842,998.170719,999.3902268499999,2706.2499980000002,3278.0,3280.0,3280.0,3280.0
p2s,2701.2081672900003,989.0111409732006,98.90111409732006,98.90111409732006,9.890111409732006,993.2926709999999,995.7316898499998,2693.34755725,3268.0,3272.0,3277.0,3278.0
s2s,170095.05941372,98119.1159360635,9811.91159360635,9811.91159360635,981.191159360635,999.5541389999997,999.6068704499996,170077.687089,226456.0,226464.25,226476.1,226491.0
