gossips,p2p mean,p2p std,p2p min,p2p q1,p2p q2,p2p q3,p2p max,p2s mean,p2s std,p2s min,p2s q1,p2s q2,p2s q3,p2s max,s2s mean,s2s std,s2s min,s2s q1,s2s q2,s2s q3,s2s max
1,49028.6,187.20198538833276,48533,48933,49035.0,49178.0,49402,58163.6,366.10995616071347,57749.0,57876.0,58059.0,58299.0,58931.0,496478.84,2683.847652780112,492897.0,494516.0,495140.0,499648.0,500765.0
2,22298.56,154.40263382900352,22007,22166,22334.0,22388.0,22523,20402.76,216.59433664495188,20046.0,20213.0,20482.0,20585.0,20713.0,195271.2,1686.1489406336543,191062.0,194130.0,195160.0,196730.0,197731.0
3,2063.8,53.37212131191094,1935,2030,2077.0,2107.0,2135,339.44,16.75828153481139,302.0,330.0,338.0,351.0,375.0,4221.6,152.96922348411567,3935.0,4063.0,4263.0,4340.0,4517.0
4,22.68,5.735270990400831,13,18,23.0,26.0,34,1.3888888888888888,0.6076849889141858,1.0,1.0,1.0,2.0,3.0,22.52,5.017635565350144,15.0,20.0,22.0,25.0,35.0
5,1.0,0.0,1,1,1.0,1.0,1,,,,,,,,,,,,,,
