gossips,p2p mean,p2p std,p2p min,p2p q1,p2p q2,p2p q3,p2p max,p2s mean,p2s std,p2s min,p2s q1,p2s q2,p2s q3,p2s max,s2s mean,s2s std,s2s min,s2s q1,s2s q2,s2s q3,s2s max
1,49.263999999999996,0.5015476049190136,48.13,48.92,49.32,49.53,50.28,58.72359999999999,0.5065395673916637,57.8,58.46,58.68,59.07,59.91,3.57872724,0.05580261065523738,3.4738379999999998,3.5349489999999997,3.58101,3.608889,3.701919
2,22.522000000000002,0.486518242206806,21.65,22.3,22.42,22.85,23.65,20.100800000000003,0.4590472016398029,19.38,19.85,19.94,20.34,21.28,0.004767520000000001,0.0009347484117843332,0.0028280000000000002,0.004141,0.0047469999999999995,0.005354,0.006566
3,2.0124000000000004,0.11307372226413463,1.78,1.94,2.01,2.08,2.27,0.12120000000000003,0.029200456617434367,0.05,0.1,0.12,0.14,0.17,,,,,,,
4,0.02857142857142858,0.011526367287968178,0.01,0.02,0.03,0.03,0.05,,,,,,,,,,,,,,
5,,,,,,,,,,,,,,,,,,,,,
