gossips,p2p mean,p2p std,p2p min,p2p q1,p2p q2,p2p q3,p2p max,p2s mean,p2s std,p2s min,p2s q1,p2s q2,p2s q3,p2s max,s2s mean,s2s std,s2s min,s2s q1,s2s q2,s2s q3,s2s max
1,41.46816,0.9206188444012341,39.26,41.099,41.644,41.981,42.716,42.82168000000001,1.1832648942650161,39.978,42.238,42.686,43.7,44.969,43.29541332000001,1.1392199347535905,38.568889,43.112333,43.361778,43.832444,44.631221999999994
2,20.99308,3.2146622544211394,15.834,18.703,20.398,23.092,26.795,21.200480000000006,4.138755520684932,12.562,18.612,21.285,24.444,27.762,18.888311119999997,3.6406701774644046,11.352,16.704667,19.402333,20.94,24.830667000000002
3,5.231919999999999,1.8280708392546865,2.913,3.859,4.623,6.142,9.243,4.5838399999999995,1.8900745505579049,1.797,3.017,4.531,5.911,8.329,3.4042756,1.4459066047315263,1.3291110000000002,2.183667,3.347667,4.327222,6.155889
4,0.6799600000000001,0.39206116444588934,0.267,0.401,0.491,0.823,1.669,0.4408800000000001,0.28809522731208165,0.109,0.178,0.373,0.6,1.181,0.25871563999999997,0.17235662894076145,0.038111,0.113889,0.202,0.392333,0.662333
5,0.05096,0.04223099177933981,0.009,0.024,0.034,0.053,0.158,0.019240000000000004,0.016613949961804188,0.002,0.006,0.015,0.024,0.068,0.00695556,0.006287800298196499,0.00011100000000000001,0.0025559999999999997,0.003889,0.011222,0.024666999999999998
6,0.0027692307692307695,0.0019644272343292226,0.001,0.001,0.002,0.004,0.008,0.0015,0.0007071067811865475,0.001,0.00125,0.0015,0.00175,0.002,0.00011100000000000003,0.0,0.00011100000000000001,0.00011100000000000001,0.00011100000000000001,0.00011100000000000001,0.00011100000000000001
7,,,,,,,,,,,,,,,,,,,,,
