gossips,p2p mean,p2p std,p2p min,p2p q1,p2p q2,p2p q3,p2p max,p2s mean,p2s std,p2s min,p2s q1,p2s q2,p2s q3,p2s max,s2s mean,s2s std,s2s min,s2s q1,s2s q2,s2s q3,s2s max
1,49.708,1.547826432991332,45.8,48.7,49.5,51.0,52.5,57.852,1.645478653766135,54.4,56.9,58.0,59.0,60.7,52.27039440000001,0.2270343724998855,51.737538,52.12973,52.264464000000004,52.356757,52.816617
2,21.528000000000002,1.1204612145600286,20.0,20.7,21.5,21.9,23.9,20.64,1.304798835069989,18.7,19.5,20.6,21.5,23.9,21.627099079999997,0.4317722312687862,20.817217000000003,21.293393,21.713914000000003,21.965766000000002,22.435736
3,2.2159999999999993,0.39230090491866054,1.5,1.8,2.3,2.6,2.8,0.3625,0.1813296301838414,0.1,0.2,0.3,0.5,0.7,1.3652092800000002,0.05553043409137612,1.2358360000000002,1.3226229999999999,1.373874,1.404004,1.4959959999999999
4,0.1,0.0,0.1,0.1,0.1,0.1,0.1,,,,,,,,0.026306279999999998,0.0030154954059546063,0.021421,0.024024,0.026726999999999997,0.028227999999999996,0.034635
5,,,,,,,,,,,,,,,0.00014499999999999997,6.048053188292994e-05,0.0001,0.0001,0.0001,0.0002,0.0003
6,,,,,,,,,,,,,,,,,,,,,
