round,nodes,nodesP,nodesS,recvOne,recvOneP,recvOneS,recvAll,recvAllP,recvAllS,msgSent,msgSentP,msgSentS,msgRecv,msgRecvP,msgRecvS,consist,consistP,consistS,Unnamed: 19
0,1000000.0,100000.0,900000.0,4e-06,4e-05,0.0,0.0,0.0,0.0,10.4,2.4,8.0,0.04,0.04,0.0,100.0,100.0,100.0,
1,1000000.0,100000.0,900000.0,0.0010760000000000004,0.010760000000000002,0.0,0.0,0.0,0.0,117.6,109.6,8.0,10.76,10.76,0.0,100.0,100.0,100.0,
2,1000000.0,100000.0,900000.0,0.011683999999999996,0.11684000000000003,0.0,0.0,0.0,0.0,1178.8,1170.8,8.0,116.88,116.88,0.0,100.0,100.0,100.0,
3,1000000.0,100000.0,900000.0,0.11699599999999999,1.16912,9.332e-05,0.0,0.0,0.0,11780.0,11763.6,16.4,1177.0,1176.16,0.84,100.0,100.0,100.0,
4,1000000.0,100000.0,900000.0,1.108656,10.97948,0.011897840000000003,0.0,0.0,0.0,117107.6,116028.8,1078.8,11734.12,11627.04,107.08,100.0,100.0,100.0,
5,1000000.0,100000.0,900000.0,7.490596000000002,66.19512,0.96787116,0.0,0.0,0.0,1044531.6,957406.0,87125.6,117286.4,108534.52,8751.88,99.99989599999998,99.99988000000002,99.99989787999999,
6,1000000.0,100000.0,900000.0,40.24058,99.85003999999999,33.617306639999995,0.0,0.0,0.0,5013023.6,1987452.0,3025571.6,1019500.64,650805.96,368694.68,99.99994399999997,99.99995999999999,99.99994228000001,
7,1000000.0,100000.0,900000.0,98.79874000000001,99.99556000000001,98.66576004000001,0.0,0.0,0.0,10880539.2,2000611.6,8879927.6,4886749.72,998591.68,3888158.04,100.0,100.0,100.0,
8,1000000.0,100000.0,900000.0,99.99790000000002,99.99564000000001,99.99815115999999,0.0,0.0,0.0,11011003.2,2011146.8,8999856.4,10875638.92,1001132.2,9874506.72,100.0,100.0,100.0,
9,1000000.0,100000.0,900000.0,99.99814400000001,99.99592000000003,99.99839112,0.0,0.0,0.0,11116518.0,2115568.0,9000950.0,11011033.88,1011599.92,9999433.96,99.999968,99.99972,99.99999556,
10,1000000.0,100000.0,900000.0,99.99837600000001,99.99816000000003,99.99839999999999,0.0,0.0,0.0,12029090.8,2950081.2,9079009.6,11114790.96,1107495.76,10007295.2,99.99965999999999,99.99744000000001,99.99990675999999,
11,1000000.0,100000.0,900000.0,99.99907599999999,100.0,99.99897327999999,0.0,0.0,0.0,15973508.4,3986964.0,11986544.4,12012930.32,1650688.2,10362242.12,99.99898800000001,99.99564000000001,99.99935996,
12,1000000.0,100000.0,900000.0,99.999984,100.0,99.99998224,0.0,0.0,0.0,21878277.2,4000060.4,17878216.8,15872298.96,1998579.8,13873719.16,99.998132,99.99564000000001,99.99840895999999,
13,1000000.0,100000.0,900000.0,100.0,100.0,100.0,0.0,0.0,0.0,22010279.6,4010585.2,17999694.4,21875005.32,2001098.96,19873906.36,99.99811600000001,99.99564000000001,99.99839112,
14,1000000.0,100000.0,900000.0,100.0,100.0,100.0,0.0,0.0,0.0,22115735.2,4115036.8,18000698.4,22010336.88,2011568.76,19998768.12,99.99807999999999,99.99528000000001,99.99839112,
15,1000000.0,100000.0,900000.0,100.0,100.0,100.0,0.0,0.0,0.0,23029462.4,4950850.8,18078611.6,22114256.12,2107641.32,20006614.8,99.99779199999999,99.99328,99.99829335999999,
16,1000000.0,100000.0,900000.0,100.0,100.0,100.0,0.0,0.0,0.0,26969165.2,5986454.4,20982710.8,23012240.6,2651076.4,20361164.2,99.99718000000001,99.99159999999996,99.99780000000001,
17,1000000.0,100000.0,900000.0,100.0,100.0,100.0,0.0,0.0,0.0,32877141.2,5999526.4,26877614.8,26867342.92,2998523.84,23868819.08,99.99621999999998,99.99159999999996,99.99673336000002,
18,1000000.0,100000.0,900000.0,100.0,100.0,100.0,0.0,0.0,0.0,33009652.4,6010096.0,26999556.4,32873739.92,3001065.44,29872674.48,99.996184,99.99147999999997,99.99670672000002,
19,1000000.0,100000.0,900000.0,100.0,100.0,100.0,0.0,0.0,0.0,33115012.0,6114478.8,27000533.2,33009654.72,3011529.32,29998125.4,99.996124,99.99088000000002,99.99670672000002,
20,1000000.0,100000.0,900000.0,100.0,100.0,100.0,0.0,0.0,0.0,34028854.0,6949337.2,27079516.8,33113565.6,3107483.6,30006082.0,99.995784,99.98856000000002,99.99658675999999,
21,1000000.0,100000.0,900000.0,100.0,100.0,100.0,0.0,0.0,0.0,37970098.4,7985807.6,29984290.8,34011295.6,3650671.64,30360623.96,99.99523599999999,99.987,99.99615112000001,
22,1000000.0,100000.0,900000.0,100.0,100.0,100.0,0.0,0.0,0.0,43877069.2,7999002.4,35878066.8,37870528.48,3998518.08,33872010.4,99.994396,99.987,99.9952178,
23,1000000.0,100000.0,900000.0,100.0,100.0,100.0,0.0,0.0,0.0,44008950.0,8009530.4,35999419.6,43873681.64,4001022.12,39872659.52,99.99438,99.98696,99.99520448000001,
24,1000000.0,100000.0,900000.0,100.0,100.0,100.0,0.0,0.0,0.0,44114136.4,8113700.0,36000436.4,44008970.56,4011463.84,39997506.72,99.99435599999998,99.98672,99.99520448000001,
25,1000000.0,100000.0,900000.0,100.0,100.0,100.0,0.0,0.0,0.0,45026168.8,8947353.6,36078815.2,44112622.56,4107216.52,40005406.04,99.994,99.98395999999997,99.99511552,
26,1000000.0,100000.0,900000.0,100.0,100.0,100.0,0.0,0.0,0.0,48967740.8,9985171.6,38982569.2,45010350.44,4650468.76,40359881.68,99.99344399999998,99.98232,99.99467996,
27,1000000.0,100000.0,900000.0,100.0,100.0,100.0,0.0,0.0,0.0,54876681.2,9998448.8,44878232.4,48870616.2,4998453.0,43872163.2,99.992572,99.98232,99.99371108,
28,1000000.0,100000.0,900000.0,100.0,100.0,100.0,0.0,0.0,0.0,55008271.6,10008987.2,44999284.4,54873516.36,5000982.0,49872534.36,99.99252800000001,99.98232,99.99366224,
29,1000000.0,100000.0,900000.0,100.0,100.0,100.0,0.0,0.0,0.0,55113614.0,10113284.4,45000329.6,55008308.56,5011435.32,49996873.24,99.99248799999998,99.98195999999999,99.9936578,
30,1000000.0,100000.0,900000.0,100.0,100.0,100.0,0.0,0.0,0.0,56028509.2,10948794.8,45079714.4,55112335.8,5107472.12,50004863.68,99.99211199999999,99.97932,99.99353339999999,
31,1000000.0,100000.0,900000.0,100.0,100.0,100.0,0.0,0.0,0.0,59976906.0,11984610.4,47992295.6,56011029.88,5650424.88,50360605.0,99.99151199999999,99.97736,99.99308448000002,
32,1000000.0,100000.0,900000.0,100.0,100.0,100.0,0.0,0.0,0.0,65876157.2,11997916.0,53878241.2,59872571.72,5998424.44,53874147.28,99.99066399999997,99.97736,99.9921422,
33,1000000.0,100000.0,900000.0,100.0,100.0,100.0,0.0,0.0,0.0,66007624.0,12008478.8,53999145.2,65872802.08,6000945.12,59871856.96,99.99063999999998,99.97728,99.99212444000001,
34,1000000.0,100000.0,900000.0,100.0,100.0,100.0,0.0,0.0,0.0,66113042.8,12112818.8,54000224.0,66007642.0,6011403.6,59996238.4,99.99059199999996,99.9768,99.99212444000001,
35,1000000.0,100000.0,900000.0,100.0,100.0,100.0,0.0,0.0,0.0,67026242.8,12947429.2,54078813.6,66111426.2,6107274.2,60004152.0,99.99024000000003,99.97435999999998,99.9920044,
36,1000000.0,100000.0,900000.0,100.0,100.0,100.0,0.0,0.0,0.0,70971792.4,13984237.6,56987554.8,67009671.92,6650403.28,60359268.64,99.98964799999997,99.97263999999996,99.99153772,
37,1000000.0,100000.0,900000.0,100.0,100.0,100.0,0.0,0.0,0.0,76875484.4,13997401.2,62878083.2,70872158.72,6998425.2,63873733.52,99.98876,99.97259999999997,99.99055556000002,
38,1000000.0,100000.0,900000.0,100.0,100.0,100.0,0.0,0.0,0.0,77006954.0,14007949.6,62999004.4,76872212.36,7000904.4,69871307.96,99.988724,99.97251999999999,99.99052448,
39,1000000.0,100000.0,900000.0,100.0,100.0,100.0,0.0,0.0,0.0,77112356.4,14112166.0,63000190.4,77006977.6,7011353.24,69995624.36,99.98869200000001,99.97219999999999,99.99052448,
40,1000000.0,100000.0,900000.0,100.0,100.0,100.0,0.0,0.0,0.0,78028156.4,14947540.4,63080616.0,77111055.84,7107332.48,70003723.36,99.98830799999998,99.96948000000002,99.99040008,
41,1000000.0,100000.0,900000.0,100.0,100.0,100.0,0.0,0.0,0.0,81977168.8,15983606.8,65993562.0,78009984.64,7650270.52,70359714.12,99.987652,99.96771999999999,99.98986664000002,
42,1000000.0,100000.0,900000.0,100.0,100.0,100.0,0.0,0.0,0.0,87875156.4,15996826.4,71878330.0,81873158.84,7998332.4,73874826.44,99.98686000000002,99.96771999999999,99.98898668000001,
43,1000000.0,100000.0,900000.0,100.0,100.0,100.0,0.0,0.0,0.0,88006244.8,16007374.8,71998870.0,87871831.24,8000865.72,79870965.52,99.98684399999998,99.96767999999999,99.98897336,
44,1000000.0,100000.0,900000.0,100.0,100.0,100.0,0.0,0.0,0.0,88111620.0,16111653.6,71999966.4,88006270.36,8011318.72,79994951.64,99.98679999999999,99.96723999999999,99.98897336,
45,1000000.0,100000.0,900000.0,100.0,100.0,100.0,8e-06,8e-05,0.0,89025521.6,16946429.6,72079092.0,88110110.24,8107193.08,80002917.16,99.98641999999998,99.96443999999998,99.98886219999999,
46,1000000.0,100000.0,900000.0,100.0,100.0,100.0,0.0010920000000000003,0.010520000000000003,4.44e-05,92971528.4,17983071.6,74988456.8,89008339.88,8650213.92,80358125.96,99.9859,99.96284,99.98846220000001,
47,1000000.0,100000.0,900000.0,100.0,100.0,100.0,0.011636,0.11544000000000004,0.00010212,98874456.8,17996276.0,80878180.8,92871861.64,8998290.04,83873571.6,99.98504400000002,99.96284,99.98751107999999,
48,1000000.0,100000.0,900000.0,100.0,100.0,100.0,0.116384,1.1619599999999999,0.00020872000000000002,99005572.0,18006813.2,80998758.8,98871149.6,9000820.04,89870329.56,99.985008,99.96276,99.98747996,
49,1000000.0,100000.0,900000.0,100.0,100.0,100.0,1.10808,10.98232,0.01094228,99111020.4,18111277.2,80999743.2,99005605.24,9011291.56,89994313.68,99.984964,99.96232,99.98747996,
50,1000000.0,100000.0,900000.0,100.0,100.0,100.0,7.412060000000001,65.94496,0.90840448,100028683.6,18948157.6,81080526.0,99109978.92,9107531.16,90002447.76,99.984656,99.95936000000003,99.98746664000001,
51,1000000.0,100000.0,900000.0,100.0,100.0,100.0,39.953492,99.80908000000004,33.302871159999995,103978807.6,19982356.8,83996450.8,100009070.84,9650238.32,90358832.52,99.984072,99.95748000000002,99.98702663999998,
52,1000000.0,100000.0,900000.0,100.0,100.0,100.0,98.77412000000002,99.95347999999998,98.64307996000001,109872478.4,19994616.8,89877861.6,103869977.28,9998143.92,93871833.36,99.983332,99.95744,99.98620887999999,
53,1000000.0,100000.0,900000.0,100.0,100.0,100.0,99.98117999999998,99.95364,99.98423991999998,109993206.0,19994624.4,89998581.6,109868896.6,9999621.6,99869275.0,99.98332400000001,99.95744,99.98620000000001,
54,1000000.0,100000.0,900000.0,100.0,100.0,100.0,99.9814,99.95364,99.98448448,109993228.0,19994624.4,89998603.6,109993206.04,9999623.2,99993582.84,99.98332400000001,99.95744,99.98620000000001,
55,1000000.0,100000.0,900000.0,100.0,100.0,100.0,99.9814,99.95364,99.98448448,109993228.0,19994624.4,89998603.6,109993228.0,9999623.2,99993604.8,99.98332400000001,99.95744,99.98620000000001,
56,1000000.0,100000.0,900000.0,100.0,100.0,100.0,99.9814,99.95364,99.98448448,109993228.0,19994624.4,89998603.6,109993228.0,9999623.2,99993604.8,99.98332400000001,99.95744,99.98620000000001,
57,1000000.0,100000.0,900000.0,100.0,100.0,100.0,99.9814,99.95364,99.98448448,109993228.0,19994624.4,89998603.6,109993228.0,9999623.2,99993604.8,99.98332400000001,99.95744,99.98620000000001,
58,1000000.0,100000.0,900000.0,100.0,100.0,100.0,99.9814,99.95364,99.98448448,109993228.0,19994624.4,89998603.6,109993228.0,9999623.2,99993604.8,99.98332400000001,99.95744,99.98620000000001,
59,1000000.0,100000.0,900000.0,100.0,100.0,100.0,99.9814,99.95364,99.98448448,109993228.0,19994624.4,89998603.6,109993228.0,9999623.2,99993604.8,99.98332400000001,99.95744,99.98620000000001,
60,1000000.0,100000.0,900000.0,100.0,100.0,100.0,99.9814,99.95364,99.98448448,109993228.0,19994624.4,89998603.6,109993228.0,9999623.2,99993604.8,99.98332400000001,99.95744,99.98620000000001,
61,1000000.0,100000.0,900000.0,100.0,100.0,100.0,99.9814,99.95364,99.98448448,109993228.0,19994624.4,89998603.6,109993228.0,9999623.2,99993604.8,99.98332400000001,99.95744,99.98620000000001,
62,1000000.0,100000.0,900000.0,100.0,100.0,100.0,99.9814,99.95364,99.98448448,109993228.0,19994624.4,89998603.6,109993228.0,9999623.2,99993604.8,99.98332400000001,99.95744,99.98620000000001,
63,1000000.0,100000.0,900000.0,100.0,100.0,100.0,99.9814,99.95364,99.98448448,109993228.0,19994624.4,89998603.6,109993228.0,9999623.2,99993604.8,99.98332400000001,99.95744,99.98620000000001,
64,1000000.0,100000.0,900000.0,100.0,100.0,100.0,99.9814,99.95364,99.98448448,109993228.0,19994624.4,89998603.6,109993228.0,9999623.2,99993604.8,99.98332400000001,99.95744,99.98620000000001,
65,1000000.0,100000.0,900000.0,100.0,100.0,100.0,99.9814,99.95364,99.98448448,109993228.0,19994624.4,89998603.6,109993228.0,9999623.2,99993604.8,99.98332400000001,99.95744,99.98620000000001,
66,1000000.0,100000.0,900000.0,100.0,100.0,100.0,99.9814,99.95364,99.98448448,109993228.0,19994624.4,89998603.6,109993228.0,9999623.2,99993604.8,99.98332400000001,99.95744,99.98620000000001,
67,1000000.0,100000.0,900000.0,100.0,100.0,100.0,99.9814,99.95364,99.98448448,109993228.0,19994624.4,89998603.6,109993228.0,9999623.2,99993604.8,99.98332400000001,99.95744,99.98620000000001,
68,1000000.0,100000.0,900000.0,100.0,100.0,100.0,99.9814,99.95364,99.98448448,109993228.0,19994624.4,89998603.6,109993228.0,9999623.2,99993604.8,99.98332400000001,99.95744,99.98620000000001,
69,1000000.0,100000.0,900000.0,100.0,100.0,100.0,99.9814,99.95364,99.98448448,109993228.0,19994624.4,89998603.6,109993228.0,9999623.2,99993604.8,99.98332400000001,99.95744,99.98620000000001,
70,1000000.0,100000.0,900000.0,100.0,100.0,100.0,99.9814,99.95364,99.98448448,109993228.0,19994624.4,89998603.6,109993228.0,9999623.2,99993604.8,99.98332400000001,99.95744,99.98620000000001,
71,1000000.0,100000.0,900000.0,100.0,100.0,100.0,99.9814,99.95364,99.98448448,109993228.0,19994624.4,89998603.6,109993228.0,9999623.2,99993604.8,99.98332400000001,99.95744,99.98620000000001,
72,1000000.0,100000.0,900000.0,100.0,100.0,100.0,99.9814,99.95364,99.98448448,109993228.0,19994624.4,89998603.6,109993228.0,9999623.2,99993604.8,99.98332400000001,99.95744,99.98620000000001,
73,1000000.0,100000.0,900000.0,100.0,100.0,100.0,99.9814,99.95364,99.98448448,109993228.0,19994624.4,89998603.6,109993228.0,9999623.2,99993604.8,99.98332400000001,99.95744,99.98620000000001,
