round,nodes,nodesP,nodesS,nodesSent,nodesSentP,nodesSentS,nodesRecv,nodesRecvP,nodesRecvS,msgSent,msgSentP,msgSentS,msgRecv,msgRecvP,msgRecvS,msgInfect,msgInfectP,msgInfectS
00,1000.000000,500.000000,500.000000,0.000000,0.000000,0.000000,0.000000,0.000000,0.000000,0.000000,0.000000,0.000000,0.000000,0.000000,0.000000,0.000000,0.000000,0.000000
01,1000.000000,500.000000,500.000000,0.100000,0.200000,0.000000,0.100000,0.200000,0.000000,10.000000,10.000000,0.000000,1.000000,1.000000,0.000000,0.500000,1.000000,0.000000
02,1000.000000,500.000000,500.000000,1.160000,2.320000,0.000000,1.160000,2.320000,0.000000,116.000000,116.000000,0.000000,11.600000,11.600000,0.000000,0.500000,1.000000,0.000000
03,1000.000000,500.000000,500.000000,10.590000,21.180000,0.000000,10.590000,21.180000,0.000000,1059.000000,1059.000000,0.000000,116.700000,116.700000,0.000000,0.500000,1.000000,0.000000
04,1000.000000,500.000000,500.000000,43.820000,87.640000,0.000000,43.820000,87.640000,0.000000,4382.000000,4382.000000,0.000000,1035.300000,1035.300000,0.000000,1.000000,2.000000,0.000000
05,1000.000000,500.000000,500.000000,50.160000,100.000000,0.320000,50.160000,100.000000,0.320000,5016.000000,5000.000000,16.000000,4357.400000,4355.800000,1.600000,4.350000,8.000000,0.700000
06,1000.000000,500.000000,500.000000,74.740000,100.000000,49.480000,74.740000,100.000000,49.480000,7474.000000,5000.000000,2474.000000,5014.900000,4677.500000,337.400000,5.000000,9.000000,1.000000
07,1000.000000,500.000000,500.000000,99.710000,100.000000,99.420000,99.710000,100.000000,99.420000,9971.000000,5000.000000,4971.000000,7425.600000,4677.500000,2748.100000,7.000000,9.000000,5.000000
08,1000.000000,500.000000,500.000000,100.000000,100.000000,100.000000,100.000000,100.000000,100.000000,10000.000000,5000.000000,5000.000000,9971.000000,4677.500000,5293.500000,9.500000,9.000000,10.000000
09,1000.000000,500.000000,500.000000,100.000000,100.000000,100.000000,100.000000,100.000000,100.000000,10000.000000,5000.000000,5000.000000,10001.000000,4677.500000,5323.500000,9.500000,9.000000,10.000000
10,1000.000000,500.000000,500.000000,100.000000,100.000000,100.000000,100.000000,100.000000,100.000000,10000.000000,5000.000000,5000.000000,10001.000000,4677.500000,5323.500000,9.500000,9.000000,10.000000
11,1000.000000,500.000000,500.000000,100.000000,100.000000,100.000000,100.000000,100.000000,100.000000,10000.000000,5000.000000,5000.000000,10001.000000,4677.500000,5323.500000,9.500000,9.000000,10.000000
12,1000.000000,500.000000,500.000000,100.000000,100.000000,100.000000,100.000000,100.000000,100.000000,10000.000000,5000.000000,5000.000000,10001.000000,4677.500000,5323.500000,9.500000,9.000000,10.000000
13,1000.000000,500.000000,500.000000,100.000000,100.000000,100.000000,100.000000,100.000000,100.000000,10000.000000,5000.000000,5000.000000,10001.000000,4677.500000,5323.500000,9.500000,9.000000,10.000000
14,1000.000000,500.000000,500.000000,100.000000,100.000000,100.000000,100.000000,100.000000,100.000000,10000.000000,5000.000000,5000.000000,10001.000000,4677.500000,5323.500000,9.500000,9.000000,10.000000
15,1000.000000,500.000000,500.000000,100.000000,100.000000,100.000000,100.000000,100.000000,100.000000,10000.000000,5000.000000,5000.000000,10001.000000,4677.500000,5323.500000,9.500000,9.000000,10.000000
16,1000.000000,500.000000,500.000000,100.000000,100.000000,100.000000,100.000000,100.000000,100.000000,10000.000000,5000.000000,5000.000000,10001.000000,4677.500000,5323.500000,9.500000,9.000000,10.000000
17,1000.000000,500.000000,500.000000,100.000000,100.000000,100.000000,100.000000,100.000000,100.000000,10000.000000,5000.000000,5000.000000,10001.000000,4677.500000,5323.500000,9.500000,9.000000,10.000000
18,1000.000000,500.000000,500.000000,100.000000,100.000000,100.000000,100.000000,100.000000,100.000000,10000.000000,5000.000000,5000.000000,10001.000000,4677.500000,5323.500000,9.500000,9.000000,10.000000
19,1000.000000,500.000000,500.000000,100.000000,100.000000,100.000000,100.000000,100.000000,100.000000,10000.000000,5000.000000,5000.000000,10001.000000,4677.500000,5323.500000,9.500000,9.000000,10.000000
