round,Simple mean,Simple std,Simple min,Simple q1,Simple q2,Simple q3,Simple max
0,100.0,0.0,100.0,100.0,100.0,100.0,100.0
1,99.99989999999998,0.0,99.9999,99.9999,99.9999,99.9999,99.9999
2,99.99879999999999,0.0,99.9988,99.9988,99.9988,99.9988,99.9988
3,99.987724,5.228129046821341e-05,99.9877,99.9877,99.9877,99.9877,99.9879
4,99.87516399999998,0.0006543953952610115,99.874,99.8749,99.875,99.8755,99.8766
5,98.85810000000001,0.003774917217634328,98.851,98.8558,98.8573,98.86,98.8655
6,95.192648,0.020216785929850222,95.1322,95.1827,95.1942,95.2043,95.2236
7,95.09543599999999,0.018683234016980438,95.0537,95.0817,95.0934,95.1115,95.1219
8,95.09823600000001,0.02545145509920338,95.0326,95.0881,95.0958,95.1102,95.1818
9,95.09092000000003,0.02187628091487862,95.0604,95.0769,95.0853,95.0992,95.1534
10,95.08475200000002,0.027515043158241822,95.0458,95.0692,95.078,95.0882,95.1726
11,95.07426800000002,0.024670726918086434,95.0379,95.0615,95.0642,95.0825,95.1443
12,95.08801199999998,0.029458421546307404,95.0413,95.0697,95.0811,95.1053,95.1473
13,95.197796,0.024525080360044835,95.1547,95.1791,95.1954,95.2063,95.2615
14,96.216088,0.01377005567648117,96.1992,96.2049,96.2118,96.2258,96.2493
15,99.86863600000001,0.0038477136068060763,99.8624,99.866,99.8689,99.871,99.8774
16,99.95894000000003,0.0022051077071170147,99.9543,99.958,99.9587,99.9604,99.9631
17,99.959012,0.002216476182292115,99.9543,99.9581,99.9588,99.9603,99.9632
18,99.959012,0.002216476182292115,99.9543,99.9581,99.9588,99.9603,99.9632
19,99.959012,0.002216476182292115,99.9543,99.9581,99.9588,99.9603,99.9632
20,99.959012,0.002216476182292115,99.9543,99.9581,99.9588,99.9603,99.9632
21,99.959012,0.002216476182292115,99.9543,99.9581,99.9588,99.9603,99.9632
22,99.959012,0.002216476182292115,99.9543,99.9581,99.9588,99.9603,99.9632
23,99.959012,0.002216476182292115,99.9543,99.9581,99.9588,99.9603,99.9632
24,99.959012,0.002216476182292115,99.9543,99.9581,99.9588,99.9603,99.9632
25,99.959012,0.002216476182292115,99.9543,99.9581,99.9588,99.9603,99.9632
