round,nodes,nodesP,nodesS,nodesSent,nodesSentP,nodesSentS,nodesRecv,nodesRecvP,nodesRecvS,msgSent,msgSentP,msgSentS,msgRecv,msgRecvP,msgRecvS,msgInfect,msgInfectP,msgInfectS
00,1000.000000,500.000000,500.000000,0.000000,0.000000,0.000000,0.000000,0.000000,0.000000,0.000000,0.000000,0.000000,0.000000,0.000000,0.000000,0.000000,0.000000,0.000000
01,1000.000000,500.000000,500.000000,0.110000,0.220000,0.000000,0.110000,0.220000,0.000000,11.000000,11.000000,0.000000,1.100000,1.100000,0.000000,0.500000,1.000000,0.000000
02,1000.000000,500.000000,500.000000,1.180000,2.360000,0.000000,1.180000,2.360000,0.000000,118.000000,118.000000,0.000000,11.900000,11.900000,0.000000,0.500000,1.000000,0.000000
03,1000.000000,500.000000,500.000000,10.230000,20.460000,0.000000,10.230000,20.460000,0.000000,1023.000000,1023.000000,0.000000,114.000000,114.000000,0.000000,0.500000,1.000000,0.000000
04,1000.000000,500.000000,500.000000,44.560000,87.180000,1.940000,44.560000,87.180000,1.940000,4456.000000,4359.000000,97.000000,1008.800000,998.900000,9.900000,1.500000,2.000000,1.000000
05,1000.000000,500.000000,500.000000,98.180000,99.540000,96.820000,98.180000,99.540000,96.820000,9818.000000,4977.000000,4841.000000,4377.200000,2681.000000,1696.200000,4.000000,5.000000,3.000000
06,1000.000000,500.000000,500.000000,99.970000,100.000000,99.940000,99.970000,100.000000,99.940000,9997.000000,5000.000000,4997.000000,9809.300000,5399.400000,4409.900000,9.000000,10.000000,8.000000
07,1000.000000,500.000000,500.000000,99.980000,100.000000,99.960000,99.980000,100.000000,99.960000,9998.000000,5000.000000,4998.000000,9998.000000,5493.500000,4504.500000,9.550000,10.400000,8.700000
08,1000.000000,500.000000,500.000000,99.980000,100.000000,99.960000,99.980000,100.000000,99.960000,9998.000000,5000.000000,4998.000000,9999.000000,5493.500000,4505.500000,9.550000,10.400000,8.700000
09,1000.000000,500.000000,500.000000,99.980000,100.000000,99.960000,99.980000,100.000000,99.960000,9998.000000,5000.000000,4998.000000,9999.000000,5493.500000,4505.500000,9.550000,10.400000,8.700000
10,1000.000000,500.000000,500.000000,99.980000,100.000000,99.960000,99.980000,100.000000,99.960000,9998.000000,5000.000000,4998.000000,9999.000000,5493.500000,4505.500000,9.550000,10.400000,8.700000
11,1000.000000,500.000000,500.000000,99.980000,100.000000,99.960000,99.980000,100.000000,99.960000,9998.000000,5000.000000,4998.000000,9999.000000,5493.500000,4505.500000,9.550000,10.400000,8.700000
12,1000.000000,500.000000,500.000000,99.980000,100.000000,99.960000,99.980000,100.000000,99.960000,9998.000000,5000.000000,4998.000000,9999.000000,5493.500000,4505.500000,9.550000,10.400000,8.700000
13,1000.000000,500.000000,500.000000,99.980000,100.000000,99.960000,99.980000,100.000000,99.960000,9998.000000,5000.000000,4998.000000,9999.000000,5493.500000,4505.500000,9.550000,10.400000,8.700000
14,1000.000000,500.000000,500.000000,99.980000,100.000000,99.960000,99.980000,100.000000,99.960000,9998.000000,5000.000000,4998.000000,9999.000000,5493.500000,4505.500000,9.550000,10.400000,8.700000
15,1000.000000,500.000000,500.000000,99.980000,100.000000,99.960000,99.980000,100.000000,99.960000,9998.000000,5000.000000,4998.000000,9999.000000,5493.500000,4505.500000,9.550000,10.400000,8.700000
16,1000.000000,500.000000,500.000000,99.980000,100.000000,99.960000,99.980000,100.000000,99.960000,9998.000000,5000.000000,4998.000000,9999.000000,5493.500000,4505.500000,9.550000,10.400000,8.700000
17,1000.000000,500.000000,500.000000,99.980000,100.000000,99.960000,99.980000,100.000000,99.960000,9998.000000,5000.000000,4998.000000,9999.000000,5493.500000,4505.500000,9.550000,10.400000,8.700000
18,1000.000000,500.000000,500.000000,99.980000,100.000000,99.960000,99.980000,100.000000,99.960000,9998.000000,5000.000000,4998.000000,9999.000000,5493.500000,4505.500000,9.550000,10.400000,8.700000
19,1000.000000,500.000000,500.000000,99.980000,100.000000,99.960000,99.980000,100.000000,99.960000,9998.000000,5000.000000,4998.000000,9999.000000,5493.500000,4505.500000,9.550000,10.400000,8.700000
