,mean,std,sem,cistd,cisem,min,05th,25th,50th,75th,95th,max
Uniform,,,,,,,,,,,,
P,4.783999999999999,0.11419281938896092,0.023309511649395983,0.022838563877792185,0.004661902329879197,4.579999999999998,4.613999999999999,4.709999999999994,4.769999999999996,4.859999999999999,4.939999999999998,5.099999999999994
S,3.0443717199999996,0.04758167844161885,0.00971256944059607,0.00951633568832377,0.0019425138881192141,2.9805049999999937,2.983454400000005,3.004544999999993,3.0366669999999942,3.080100999999999,3.124747400000001,3.1686870000000056
P+S,3.0443717199999996,0.04758167844161885,0.00971256944059607,0.00951633568832377,0.0019425138881192141,2.9805049999999937,2.983454400000005,3.004544999999993,3.0366669999999942,3.080100999999999,3.124747400000001,3.1686870000000056
