gossips,p2p mean,p2p std,p2p min,p2p q1,p2p q2,p2p q3,p2p max,p2s mean,p2s std,p2s min,p2s q1,p2s q2,p2s q3,p2s max,s2s mean,s2s std,s2s min,s2s q1,s2s q2,s2s q3,s2s max
1,49.01559999999999,0.1794284908628874,48.57,48.896,48.991,49.177,49.267,58.17251999999999,0.3289366859037359,57.69,57.948,58.103,58.487,58.753,55.106702119999994,0.30154941863832047,54.830332999999996,54.924889,54.948778000000004,55.095333,55.788332999999994
2,22.330519999999996,0.14909675829250416,22.061,22.221,22.302,22.445,22.567,20.37236,0.22172897871049718,19.909,20.211,20.442,20.541,20.75,21.734879960000004,0.18609997100538894,21.302332999999997,21.623667,21.786222,21.871667000000002,22.023889
3,2.0659199999999998,0.043614714642346696,1.96,2.043,2.064,2.104,2.143,0.34504000000000007,0.016694510075670566,0.311,0.333,0.345,0.355,0.38,0.47676455999999995,0.022358681054719366,0.43,0.463,0.479333,0.488333,0.515889
4,0.02412000000000001,0.005418486873657626,0.017,0.02,0.023,0.027,0.035,0.0016111111111111116,0.0007775443160352294,0.001,0.001,0.001,0.002,0.003,0.0025644800000000014,0.0005554411249928594,0.001667,0.002222,0.0025559999999999997,0.002778,0.004222
5,0.001,0.0,0.001,0.001,0.001,0.001,0.001,,,,,,,,,,,,,,
