gossips,p2p mean,p2p std,p2p min,p2p q1,p2p q2,p2p q3,p2p max,p2s mean,p2s std,p2s min,p2s q1,p2s q2,p2s q3,p2s max,s2s mean,s2s std,s2s min,s2s q1,s2s q2,s2s q3,s2s max
1,15.752119999999998,3.0335256072761276,10.173,13.872,15.588,17.869,23.226,1.8520400000000004,1.0770105802637224,0.551,1.152,1.532,2.307,5.261,0.08305332,0.055428706197481,0.019444,0.050222,0.068333,0.098,0.25166700000000003
2,0.7306799999999999,0.2570965642192313,0.269,0.554,0.692,0.907,1.186,0.0033636363636363647,0.002664501285337859,0.001,0.001,0.003,0.00475,0.01,,,,,,,
3,0.011250000000000003,0.006608624141489532,0.001,0.007,0.010499999999999999,0.015,0.028,,,,,,,,,,,,,,
4,0.001,0.0,0.001,0.001,0.001,0.001,0.001,,,,,,,,,,,,,,
5,,,,,,,,,,,,,,,,,,,,,
6,,,,,,,,,,,,,,,,,,,,,
7,,,,,,,,,,,,,,,,,,,,,
