round,P mean,P std,P min,P q1,P q2,P q3,P max,S mean,S std,S min,S q1,S q2,S q3,S max,P+S mean,P+S std,P+S min,P+S q1,P+S q2,P+S q3,P+S max
0,0.0,0.0,0,0,0,0,0,1.0,0.0,1,1,1,1,1,0.0,0.0,0,0,0,0,0
1,0.96,0.19999999999999998,0,1,1,1,1,1.0,0.0,1,1,1,1,1,0.96,0.19999999999999998,0,1,1,1,1
2,0.96,0.19999999999999998,0,1,1,1,1,1.0,0.0,1,1,1,1,1,0.96,0.19999999999999998,0,1,1,1,1
3,0.96,0.19999999999999998,0,1,1,1,1,1.0,0.0,1,1,1,1,1,0.96,0.19999999999999998,0,1,1,1,1
4,0.96,0.19999999999999998,0,1,1,1,1,1.0,0.0,1,1,1,1,1,0.96,0.19999999999999998,0,1,1,1,1
5,0.96,0.19999999999999998,0,1,1,1,1,1.0,0.0,1,1,1,1,1,0.96,0.19999999999999998,0,1,1,1,1
6,0.96,0.19999999999999998,0,1,1,1,1,1.0,0.0,1,1,1,1,1,0.96,0.19999999999999998,0,1,1,1,1
7,1.64,0.5686240703077327,0,1,2,2,2,1.04,0.19999999999999998,1,1,1,1,2,0.96,0.19999999999999998,0,1,1,1,1
8,2.08,0.9539392014169457,0,1,2,3,3,1.08,0.39999999999999997,1,1,1,1,3,0.96,0.19999999999999998,0,1,1,1,1
9,2.28,1.2083045973594573,0,1,2,3,4,1.08,0.39999999999999997,1,1,1,1,3,0.96,0.19999999999999998,0,1,1,1,1
10,2.44,1.474222959166399,0,1,2,3,5,1.16,0.7999999999999999,1,1,1,1,5,0.96,0.19999999999999998,0,1,1,1,1
11,2.56,1.709775813764288,0,1,2,3,6,1.2,1.0,1,1,1,1,6,0.96,0.19999999999999998,0,1,1,1,1
12,2.6,1.8027756377319948,0,1,2,3,7,1.2,1.0,1,1,1,1,6,0.96,0.19999999999999998,0,1,1,1,1
13,2.64,1.9122412679017957,0,1,2,3,8,1.24,1.2000000000000002,1,1,1,1,7,0.96,0.19999999999999998,0,1,1,1,1
14,2.64,1.9122412679017957,0,1,2,3,8,1.28,1.3999999999999997,1,1,1,1,8,0.96,0.19999999999999998,0,1,1,1,1
15,2.64,1.9122412679017957,0,1,2,3,8,1.32,1.5999999999999999,1,1,1,1,9,0.96,0.19999999999999998,0,1,1,1,1
16,2.64,1.9122412679017957,0,1,2,3,8,1.36,1.8000000000000003,1,1,1,1,10,0.96,0.19999999999999998,0,1,1,1,1
17,2.64,1.9122412679017957,0,1,2,3,8,1.36,1.8000000000000003,1,1,1,1,10,0.96,0.19999999999999998,0,1,1,1,1
18,2.64,1.9122412679017957,0,1,2,3,8,1.36,1.8000000000000003,1,1,1,1,10,0.96,0.19999999999999998,0,1,1,1,1
19,2.64,1.9122412679017957,0,1,2,3,8,1.36,1.8000000000000003,1,1,1,1,10,0.96,0.19999999999999998,0,1,1,1,1
20,2.64,1.9122412679017957,0,1,2,3,8,1.36,1.8000000000000003,1,1,1,1,10,0.96,0.19999999999999998,0,1,1,1,1
21,2.64,1.9122412679017957,0,1,2,3,8,1.36,1.8000000000000003,1,1,1,1,10,0.96,0.19999999999999998,0,1,1,1,1
22,2.64,1.9122412679017957,0,1,2,3,8,1.36,1.8000000000000003,1,1,1,1,10,0.96,0.19999999999999998,0,1,1,1,1
23,2.64,1.9122412679017957,0,1,2,3,8,1.36,1.8000000000000003,1,1,1,1,10,0.96,0.19999999999999998,0,1,1,1,1
24,2.64,1.9122412679017957,0,1,2,3,8,1.36,1.8000000000000003,1,1,1,1,10,0.96,0.19999999999999998,0,1,1,1,1
