gossips,p2p mean,p2p std,p2p min,p2p q1,p2p q2,p2p q3,p2p max,p2s mean,p2s std,p2s min,p2s q1,p2s q2,p2s q3,p2s max,s2s mean,s2s std,s2s min,s2s q1,s2s q2,s2s q3,s2s max
1,10.475439999999999,0.039363773531848875,10.379,10.444,10.479,10.5,10.547,0.0013000000000000004,0.0004830458915396479,0.001,0.001,0.001,0.00175,0.002,0.00011100000000000001,,0.00011100000000000001,0.00011100000000000001,0.00011100000000000001,0.00011100000000000001,0.00011100000000000001
2,0.10608000000000001,0.007999583322482073,0.087,0.101,0.107,0.111,0.122,,,,,,,,,,,,,,
3,0.001,0.0,0.001,0.001,0.001,0.001,0.001,,,,,,,,,,,,,,
4,,,,,,,,,,,,,,,,,,,,,
5,,,,,,,,,,,,,,,,,,,,,
