,mean,std,min,q1,q2,q3,max
Simple,,,,,,,
P,3.232364365117144,0.6558873625518375,1.0,3.0,3.0,4.0,6.0
S,7.8069206745521775,0.6234650780078335,5.0,8.0,8.0,8.0,11.0
P+S,7.8023460731721475,0.6400437704262886,1.0,8.0,8.0,8.0,11.0
