gossips,p2p mean,p2p std,p2p min,p2p q1,p2p q2,p2p q3,p2p max,p2s mean,p2s std,p2s min,p2s q1,p2s q2,p2s q3,p2s max,s2s mean,s2s std,s2s min,s2s q1,s2s q2,s2s q3,s2s max
1,0.1448,0.03525147751040609,0.06,0.12,0.16,0.17,0.21,1.0704,0.11016956627550707,0.87,0.97,1.09,1.16,1.28,53.42884443999999,0.1379883092445638,53.161212,53.353030000000004,53.438990000000004,53.514949,53.706465
2,,,,,,,,0.01,,0.01,0.01,0.01,0.01,0.01,20.465074840000003,0.2175826248885467,20.127071,20.28,20.494444,20.587879,20.862828
3,,,,,,,,,,,,,,,0.59641612,0.02722699870275825,0.541111,0.581616,0.593535,0.616869,0.646061
4,,,,,,,,,,,,,,,0.00291284,0.0006372344989614629,0.0013130000000000001,0.002424,0.0029289999999999997,0.003333,0.00404
5,,,,,,,,,,,,,,,0.000101,0.0,0.000101,0.000101,0.000101,0.000101,0.000101
