gossips,p2p mean,p2p std,p2p min,p2p q1,p2p q2,p2p q3,p2p max,p2s mean,p2s std,p2s min,p2s q1,p2s q2,p2s q3,p2s max,s2s mean,s2s std,s2s min,s2s q1,s2s q2,s2s q3,s2s max
1,51.508,1.3841122305169726,49.0,50.5,51.4,52.5,54.1,51.508,1.3841122305169726,49.0,50.5,51.4,52.5,54.1,55.55931136,0.08661597364559005,55.378679000000005,55.498498,55.54975,55.630430000000004,55.701802
2,18.715999999999998,0.7803204469959757,17.6,18.1,18.7,19.3,20.4,18.715999999999998,0.7803204469959757,17.6,18.1,18.7,19.3,20.4,19.536384399999992,0.14870192905103824,19.315616000000002,19.393594,19.494094,19.659259,19.757958
3,0.11666666666666668,0.0408248290463863,0.1,0.1,0.1,0.1,0.2,0.11666666666666668,0.0408248290463863,0.1,0.1,0.1,0.1,0.2,1.7167527599999999,0.03646171828470694,1.6629630000000002,1.6940939999999998,1.7054049999999998,1.7401400000000002,1.812913
4,,,,,,,,,,,,,,,0.036132199999999996,0.0021120679637107636,0.031632,0.034835000000000005,0.035836,0.038238,0.039339
5,,,,,,,,,,,,,,,0.00018666666666666663,7.432233529572063e-05,0.0001,0.0001,0.0002,0.0002,0.0003
