gossips,p2p mean,p2p std,p2p min,p2p q1,p2p q2,p2p q3,p2p max,p2s mean,p2s std,p2s min,p2s q1,p2s q2,p2s q3,p2s max,s2s mean,s2s std,s2s min,s2s q1,s2s q2,s2s q3,s2s max
1,,,,,,,,0.18666666666666665,0.1302013093343571,0.1,0.1,0.1,0.25,0.5,49.78663063999999,0.30979948614505587,49.391391,49.500501,49.768569,50.02032,50.41962
2,,,,,,,,,,,,,,,22.750738679999998,0.6447795162610982,21.041141,22.521221,22.757958,23.226526999999997,23.7002
3,,,,,,,,,,,,,,,1.35075872,0.09086294823731322,1.1527530000000001,1.278478,1.359459,1.3952950000000002,1.5235239999999999
4,,,,,,,,,,,,,,,0.013113199999999998,0.0023444964811233995,0.009609999999999999,0.011211,0.012713,0.014313999999999999,0.017518000000000002
5,,,,,,,,,,,,,,,,,,,,,
