gossips,p2p mean,p2p std,p2p min,p2p q1,p2p q2,p2p q3,p2p max,p2s mean,p2s std,p2s min,p2s q1,p2s q2,p2s q3,p2s max,s2s mean,s2s std,s2s min,s2s q1,s2s q2,s2s q3,s2s max
1,,,,,,,,,,,,,,,597870.8,3445.49210321738,591269.0,595905.0,597967.0,601075.0,604728.0
2,,,,,,,,,,,,,,,15742.64,846.5329231636533,14026.0,15203.0,15869.0,16389.0,16973.0
3,,,,,,,,,,,,,,,1.0,0.0,1.0,1.0,1.0,1.0,1.0
4,,,,,,,,,,,,,,,,,,,,,
5,,,,,,,,,,,,,,,,,,,,,
