gossips,p2p mean,p2p std,p2p min,p2p q1,p2p q2,p2p q3,p2p max,p2s mean,p2s std,p2s min,p2s q1,p2s q2,p2s q3,p2s max,s2s mean,s2s std,s2s min,s2s q1,s2s q2,s2s q3,s2s max
1,4946.28,45.303163980749346,4866.0,4913.0,4947.0,4985.0,5026.0,5853.84,63.535213333499826,5754.0,5809.0,5833.0,5910.0,5973.0,528621.16,1815.0623423636655,523575,527746.0,528988.0,529863.0,532015
2,2225.68,45.02658473983276,2136.0,2197.0,2223.0,2240.0,2335.0,2026.04,50.04621197786433,1896.0,2009.0,2032.0,2051.0,2127.0,213765.36,2405.532094291549,206447,212549.0,214297.0,215377.0,217479
3,202.44,12.055704044144413,181.0,195.0,204.0,210.0,224.0,31.72,6.04510821518799,22.0,26.0,32.0,36.0,48.0,11461.92,334.29352371830254,10799,11283.0,11478.0,11674.0,12152
4,2.0,1.044465935734187,1.0,1.0,2.0,2.0,5.0,1.0,,1.0,1.0,1.0,1.0,1.0,147.16,10.184465294424317,125,141.0,148.0,152.0,167
5,,,,,,,,,,,,,,,1.0,0.0,1,1.0,1.0,1.0,1
