gossips,p2p mean,p2p std,p2p min,p2p q1,p2p q2,p2p q3,p2p max,p2s mean,p2s std,p2s min,p2s q1,p2s q2,p2s q3,p2s max,s2s mean,s2s std,s2s min,s2s q1,s2s q2,s2s q3,s2s max
1,,,,,,,,,,,,,,,2.8015135200000008,0.29131173159365437,2.228729,2.621121,2.764565,3.00981,3.448949
2,,,,,,,,,,,,,,,0.00015000000000000001,5.270462766947299e-05,0.0001,0.0001,0.00015000000000000001,0.0002,0.0002
3,,,,,,,,,,,,,,,,,,,,,
4,,,,,,,,,,,,,,,,,,,,,
5,,,,,,,,,,,,,,,,,,,,,
