gossips,p2p mean,p2p std,p2p min,p2p q1,p2p q2,p2p q3,p2p max,p2s mean,p2s std,p2s min,p2s q1,p2s q2,p2s q3,p2s max,s2s mean,s2s std,s2s min,s2s q1,s2s q2,s2s q3,s2s max
1,49.784,1.8456435192094922,45.0,49.1,49.9,50.8,54.2,78.38400000000001,1.8562237652467095,74.7,77.4,77.9,79.4,82.2,50.296784800000005,0.2949502576236374,49.482883,50.152953000000004,50.284384,50.431231,50.824124
2,22.259999999999994,1.5705625319186323,19.9,21.3,22.0,23.4,26.5,9.883999999999999,1.2242957159118053,7.6,9.2,9.7,10.9,11.9,21.682202200000003,0.6787132979898428,20.202002,21.113413,21.81962,22.11982,23.027027
3,2.008,0.38935844667863573,1.4,1.8,2.0,2.3,2.7,0.175,0.09665456669582609,0.1,0.1,0.1,0.22500000000000003,0.4,2.0191711600000004,0.10202884339190554,1.8109110000000002,1.9727729999999999,2.0352349999999997,2.063564,2.254454
4,0.1,0.0,0.1,0.1,0.1,0.1,0.1,,,,,,,,0.020612520000000002,0.0018932631908955496,0.017818,0.019219,0.020419999999999997,0.021721999999999998,0.025225
5,,,,,,,,,,,,,,,0.00011111111111111114,3.3333333333333335e-05,0.0001,0.0001,0.0001,0.0001,0.0002
