gossips,p2p mean,p2p std,p2p min,p2p q1,p2p q2,p2p q3,p2p max,p2s mean,p2s std,p2s min,p2s q1,p2s q2,p2s q3,p2s max,s2s mean,s2s std,s2s min,s2s q1,s2s q2,s2s q3,s2s max
1,0.14880000000000002,0.043332051263085467,0.06,0.13,0.14,0.18,0.22,45.9524,0.6703809862061029,44.85,45.53,45.72,46.49,46.98,56.24443644000001,0.23278317640189689,55.81596,56.107576,56.220707,56.356566,56.631414
2,,,,,,,,0.07680000000000002,0.031053716900450636,0.03,0.06,0.07,0.09,0.14,19.459939520000002,0.3034784860168735,18.906768,19.315859,19.47798,19.592828,20.097576
3,,,,,,,,,,,,,,,1.5785939999999996,0.07571603276497438,1.417273,1.527677,1.5809090000000001,1.619899,1.709697
4,,,,,,,,,,,,,,,0.02541412,0.0022497906628543615,0.021111,0.023939,0.025152,0.026969999999999997,0.030404
5,,,,,,,,,,,,,,,,,,,,,
