round,nodes,nodesP,nodesS,nodesSent,nodesSentP,nodesSentS,nodesRecv,nodesRecvP,nodesRecvS,msgSent,msgSentP,msgSentS,msgRecv,msgRecvP,msgRecvS,msgInfect,msgInfectP,msgInfectS
00,1000.000000,10.000000,990.000000,0.000000,0.000000,0.000000,0.000000,0.000000,0.000000,0.000000,0.000000,0.000000,0.000000,0.000000,0.000000,0.000000,0.000000,0.000000
01,1000.000000,10.000000,990.000000,0.100000,10.000000,0.000000,0.100000,10.000000,0.000000,10.000000,10.000000,0.000000,1.000000,1.000000,0.000000,0.010000,1.000000,0.000000
02,1000.000000,10.000000,990.000000,1.010000,100.000000,0.010101,1.010000,100.000000,0.010101,117.000000,116.000000,1.000000,11.700000,11.600000,0.100000,0.109000,1.000000,0.100000
03,1000.000000,10.000000,990.000000,2.100000,100.000000,1.111111,2.100000,100.000000,1.111111,310.000000,200.000000,110.000000,112.000000,101.000000,11.000000,1.090000,10.000000,1.000000
04,1000.000000,10.000000,990.000000,19.580000,100.000000,18.767677,19.580000,100.000000,18.767677,2058.000000,200.000000,1858.000000,309.200000,101.000000,208.200000,1.090000,10.000000,1.000000
05,1000.000000,10.000000,990.000000,85.190000,100.000000,85.040404,85.190000,100.000000,85.040404,8619.000000,200.000000,8419.000000,2020.700000,101.000000,1919.700000,2.080000,10.000000,2.000000
06,1000.000000,10.000000,990.000000,99.970000,100.000000,99.969697,99.970000,100.000000,99.969697,10097.000000,200.000000,9897.000000,8579.800000,101.000000,8478.800000,8.020000,10.000000,8.000000
07,1000.000000,10.000000,990.000000,99.990000,100.000000,99.989899,99.990000,100.000000,99.989899,10099.000000,200.000000,9899.000000,10098.000000,101.000000,9997.000000,10.000000,10.000000,10.000000
08,1000.000000,10.000000,990.000000,99.990000,100.000000,99.989899,99.990000,100.000000,99.989899,10099.000000,200.000000,9899.000000,10100.000000,101.000000,9999.000000,10.000000,10.000000,10.000000
09,1000.000000,10.000000,990.000000,99.990000,100.000000,99.989899,99.990000,100.000000,99.989899,10099.000000,200.000000,9899.000000,10100.000000,101.000000,9999.000000,10.000000,10.000000,10.000000
10,1000.000000,10.000000,990.000000,99.990000,100.000000,99.989899,99.990000,100.000000,99.989899,10099.000000,200.000000,9899.000000,10100.000000,101.000000,9999.000000,10.000000,10.000000,10.000000
11,1000.000000,10.000000,990.000000,99.990000,100.000000,99.989899,99.990000,100.000000,99.989899,10099.000000,200.000000,9899.000000,10100.000000,101.000000,9999.000000,10.000000,10.000000,10.000000
12,1000.000000,10.000000,990.000000,99.990000,100.000000,99.989899,99.990000,100.000000,99.989899,10099.000000,200.000000,9899.000000,10100.000000,101.000000,9999.000000,10.000000,10.000000,10.000000
13,1000.000000,10.000000,990.000000,99.990000,100.000000,99.989899,99.990000,100.000000,99.989899,10099.000000,200.000000,9899.000000,10100.000000,101.000000,9999.000000,10.000000,10.000000,10.000000
14,1000.000000,10.000000,990.000000,99.990000,100.000000,99.989899,99.990000,100.000000,99.989899,10099.000000,200.000000,9899.000000,10100.000000,101.000000,9999.000000,10.000000,10.000000,10.000000
15,1000.000000,10.000000,990.000000,99.990000,100.000000,99.989899,99.990000,100.000000,99.989899,10099.000000,200.000000,9899.000000,10100.000000,101.000000,9999.000000,10.000000,10.000000,10.000000
16,1000.000000,10.000000,990.000000,99.990000,100.000000,99.989899,99.990000,100.000000,99.989899,10099.000000,200.000000,9899.000000,10100.000000,101.000000,9999.000000,10.000000,10.000000,10.000000
17,1000.000000,10.000000,990.000000,99.990000,100.000000,99.989899,99.990000,100.000000,99.989899,10099.000000,200.000000,9899.000000,10100.000000,101.000000,9999.000000,10.000000,10.000000,10.000000
18,1000.000000,10.000000,990.000000,99.990000,100.000000,99.989899,99.990000,100.000000,99.989899,10099.000000,200.000000,9899.000000,10100.000000,101.000000,9999.000000,10.000000,10.000000,10.000000
19,1000.000000,10.000000,990.000000,99.990000,100.000000,99.989899,99.990000,100.000000,99.989899,10099.000000,200.000000,9899.000000,10100.000000,101.000000,9999.000000,10.000000,10.000000,10.000000
