gossips,p2p mean,p2p std,p2p min,p2p q1,p2p q2,p2p q3,p2p max,p2s mean,p2s std,p2s min,p2s q1,p2s q2,p2s q3,p2s max,s2s mean,s2s std,s2s min,s2s q1,s2s q2,s2s q3,s2s max
1,49.23272,0.14382643475152126,48.753,49.174,49.23,49.299,49.53,58.35343999999999,0.16587773609901105,58.053,58.259,58.332,58.451,58.8,55.781884399999996,0.1526641556437425,55.546778,55.698778000000004,55.75155600000001,55.812111,56.218222
2,22.18416,0.1610459768720314,21.923,22.108,22.157,22.248,22.517,20.20232,0.1786070454004171,19.75,20.152,20.187,20.327,20.441,21.38773324,0.19184000104172805,20.835444,21.307667000000002,21.433556,21.513444,21.661444
3,2.0449599999999997,0.04720476670845856,1.915,2.026,2.049,2.07,2.137,0.3198,0.015036067748362058,0.282,0.311,0.322,0.33,0.349,0.44933780000000006,0.020172775777848064,0.396333,0.443222,0.453111,0.46177799999999997,0.482444
4,0.021200000000000007,0.004123105625617661,0.015,0.019,0.021,0.024,0.029,0.0013125000000000003,0.0004787135538781691,0.001,0.001,0.001,0.002,0.002,0.002315640000000001,0.0004870685167407147,0.001556,0.002,0.002333,0.0025559999999999997,0.0034439999999999996
5,0.001,0.0,0.001,0.001,0.001,0.001,0.001,,,,,,,,,,,,,,
