gossips,p2p mean,p2p std,p2p min,p2p q1,p2p q2,p2p q3,p2p max,p2s mean,p2s std,p2s min,p2s q1,p2s q2,p2s q3,p2s max,s2s mean,s2s std,s2s min,s2s q1,s2s q2,s2s q3,s2s max
1,,,,,,,,0.01,,0.01,0.01,0.01,0.01,0.01,60.49903032000002,0.4681444161336775,59.769091,60.20101,60.388889,60.805152,61.644141000000005
2,,,,,,,,,,,,,,,1.5693979200000001,0.05954158200851459,1.459394,1.54596,1.562424,1.604747,1.680202
3,,,,,,,,,,,,,,,,,,,,,
4,,,,,,,,,,,,,,,,,,,,,
5,,,,,,,,,,,,,,,,,,,,,
