gossips,p2p mean,p2p std,p2p min,p2p q1,p2p q2,p2p q3,p2p max,p2s mean,p2s std,p2s min,p2s q1,p2s q2,p2s q3,p2s max,s2s mean,s2s std,s2s min,s2s q1,s2s q2,s2s q3,s2s max
1,49.272639999999996,0.1566660141830396,48.989,49.144,49.237,49.379,49.619,43.02312,0.23565446455916544,42.535,42.886,43.025,43.199,43.412,13.209813319999999,0.18580258047605278,12.769778,13.094222,13.236889000000001,13.341778,13.585556
2,22.406960000000005,0.12085200315537326,22.202,22.324,22.381,22.508,22.648,5.491079999999998,0.10374565051123844,5.241,5.437,5.479,5.547,5.682,0.0074977600000000035,0.0009135069001746329,0.006,0.007,0.007333,0.007778,0.009667
3,2.0717600000000003,0.04869058772836211,1.967,2.034,2.074,2.116,2.154,,,,,,,,,,,,,,
4,0.02480000000000001,0.00479583152331272,0.016,0.021,0.025,0.029,0.033,,,,,,,,,,,,,,
5,,,,,,,,,,,,,,,,,,,,,
