gossips,p2p mean,p2p std,p2p min,p2p q1,p2p q2,p2p q3,p2p max,p2s mean,p2s std,p2s min,p2s q1,p2s q2,p2s q3,p2s max,s2s mean,s2s std,s2s min,s2s q1,s2s q2,s2s q3,s2s max
1,0.001,,0.001,0.001,0.001,0.001,0.001,0.011120000000000003,0.0031796226191169283,0.006,0.009,0.011,0.013,0.018,28.57419992,0.12451502842626376,28.283222,28.530444,28.590889,28.642667,28.891221999999996
2,,,,,,,,,,,,,,,0.008991120000000003,0.0010127948262111132,0.007333,0.008333,0.009,0.009667,0.010556
3,,,,,,,,,,,,,,,,,,,,,
4,,,,,,,,,,,,,,,,,,,,,
5,,,,,,,,,,,,,,,,,,,,,
