gossips,p2p mean,p2p std,p2p min,p2p q1,p2p q2,p2p q3,p2p max,p2s mean,p2s std,p2s min,p2s q1,p2s q2,p2s q3,p2s max,s2s mean,s2s std,s2s min,s2s q1,s2s q2,s2s q3,s2s max
1,49.50328000000001,0.11860456708463221,49.224,49.45,49.498,49.556,49.757,67.11888000000002,0.1953939013036703,66.723,67.023,67.138,67.226,67.45,53.92103112000001,0.07004916911077569,53.788,53.865444,53.924778,53.973110999999996,54.043110999999996
2,21.913800000000002,0.14524863740037872,21.618,21.808,21.912,22.005,22.222,14.876959999999999,0.2053433060348775,14.564,14.727,14.812,15.012,15.313,22.741591239999995,0.13017661537352526,22.266778,22.670889000000003,22.760667,22.838,22.905556
3,1.81384,0.042076992921706455,1.732,1.785,1.814,1.835,1.895,0.06768,0.00862998648125631,0.055,0.061,0.067,0.071,0.09,0.19822664,0.021978088445995487,0.123333,0.197444,0.20388900000000001,0.20777800000000002,0.216
4,0.002318181818181818,0.0016442211540614613,0.001,0.001,0.002,0.0027500000000000003,0.007,0.001,,0.001,0.001,0.001,0.001,0.001,0.0001735,0.00011463856244737196,0.00011100000000000001,0.00011100000000000001,0.00011100000000000001,0.00022200000000000003,0.000556
5,,,,,,,,,,,,,,,,,,,,,
