round,nodes,nodesP,nodesS,nodesSent,nodesSentP,nodesSentS,nodesRecv,nodesRecvP,nodesRecvS,msgSent,msgSentP,msgSentS,msgRecv,msgRecvP,msgRecvS,msgInfect,msgInfectP,msgInfectS
0,1000000.0,1000000.0,0.0,0.0,0.0,0.0,0.0,0.0,0.0,0.0,0.0,0.0,0.0,0.0,0.0,0.0,0.0,0.0
1,1000000.0,1000000.0,0.0,0.000104,0.000104,0.0,0.000104,0.000104,0.0,10.4,10.4,0.0,1.04,1.04,0.0,1.0,1.0,0.0
2,1000000.0,1000000.0,0.0,0.001184,0.001184,0.0,0.001184,0.001184,0.0,118.4,118.4,0.0,11.84,11.84,0.0,1.0,1.0,0.0
3,1000000.0,1000000.0,0.0,0.011756,0.011756,0.0,0.011756,0.011756,0.0,1175.6,1175.6,0.0,117.56,117.56,0.0,1.0,1.0,0.0
4,1000000.0,1000000.0,0.0,0.117108,0.117108,0.0,0.117108,0.117108,0.0,11710.8,11710.8,0.0,1171.52,1171.52,0.0,1.0,1.0,0.0
5,1000000.0,1000000.0,0.0,1.165372,1.165372,0.0,1.165372,1.165372,0.0,116537.2,116537.2,0.0,11723.2,11723.2,0.0,1.0,1.0,0.0
6,1000000.0,1000000.0,0.0,11.019576,11.019576,0.0,11.019576,11.019576,0.0,1101957.6,1101957.6,0.0,116797.2,116797.2,0.0,1.0,1.0,0.0
7,1000000.0,1000000.0,0.0,66.130388,66.130388,0.0,66.130388,66.130388,0.0,6613038.8,6613038.8,0.0,1082254.12,1082254.12,0.0,1.0,1.0,0.0
8,1000000.0,1000000.0,0.0,99.851088,99.851088,0.0,99.851088,99.851088,0.0,9985108.8,9985108.8,0.0,6509197.04,6509197.04,0.0,6.0,6.0,0.0
9,1000000.0,1000000.0,0.0,99.995316,99.995316,0.0,99.995316,99.995316,0.0,9999531.6,9999531.6,0.0,9984832.4,9984832.4,0.0,9.0,9.0,0.0
10,1000000.0,1000000.0,0.0,99.995352,99.995352,0.0,99.995352,99.995352,0.0,9999535.2,9999535.2,0.0,9999532.64,9999532.64,0.0,9.72,9.72,0.0
11,1000000.0,1000000.0,0.0,99.995352,99.995352,0.0,99.995352,99.995352,0.0,9999535.2,9999535.2,0.0,9999536.2,9999536.2,0.0,10.0,10.0,0.0
12,1000000.0,1000000.0,0.0,99.995352,99.995352,0.0,99.995352,99.995352,0.0,9999535.2,9999535.2,0.0,9999536.2,9999536.2,0.0,10.0,10.0,0.0
13,1000000.0,1000000.0,0.0,99.995352,99.995352,0.0,99.995352,99.995352,0.0,9999535.2,9999535.2,0.0,9999536.2,9999536.2,0.0,10.0,10.0,0.0
14,1000000.0,1000000.0,0.0,99.995352,99.995352,0.0,99.995352,99.995352,0.0,9999535.2,9999535.2,0.0,9999536.2,9999536.2,0.0,10.0,10.0,0.0
15,1000000.0,1000000.0,0.0,99.995352,99.995352,0.0,99.995352,99.995352,0.0,9999535.2,9999535.2,0.0,9999536.2,9999536.2,0.0,10.0,10.0,0.0
16,1000000.0,1000000.0,0.0,99.995352,99.995352,0.0,99.995352,99.995352,0.0,9999535.2,9999535.2,0.0,9999536.2,9999536.2,0.0,10.0,10.0,0.0
17,1000000.0,1000000.0,0.0,99.995352,99.995352,0.0,99.995352,99.995352,0.0,9999535.2,9999535.2,0.0,9999536.2,9999536.2,0.0,10.0,10.0,0.0
18,1000000.0,1000000.0,0.0,99.995352,99.995352,0.0,99.995352,99.995352,0.0,9999535.2,9999535.2,0.0,9999536.2,9999536.2,0.0,10.0,10.0,0.0
19,1000000.0,1000000.0,0.0,99.995352,99.995352,0.0,99.995352,99.995352,0.0,9999535.2,9999535.2,0.0,9999536.2,9999536.2,0.0,10.0,10.0,0.0
