gossips,p2p mean,p2p std,p2p min,p2p q1,p2p q2,p2p q3,p2p max,p2s mean,p2s std,p2s min,p2s q1,p2s q2,p2s q3,p2s max,s2s mean,s2s std,s2s min,s2s q1,s2s q2,s2s q3,s2s max
1,496.6,22.105806175452337,446.0,487.0,498.0,508.0,549.0,581.6,19.050371824892718,542.0,569.0,585.0,597.0,617.0,525397.36,3193.7647439972684,520063,523687,524638.0,527606.0,532250
2,220.16,11.352973178863762,200.0,213.0,224.0,227.0,241.0,204.48,15.105517755663548,178.0,198.0,204.0,213.0,232.0,216515.24,4534.495968682745,209157,212256,215357.0,220041.0,225087
3,21.44,3.742548151549511,16.0,19.0,20.0,24.0,29.0,3.2916666666666665,1.545798419465872,1.0,2.0,3.0,4.25,7.0,13309.24,677.5470020596357,11983,13069,13273.0,13678.0,15343
4,1.0,0.0,1.0,1.0,1.0,1.0,1.0,,,,,,,,256.32,26.883576151000938,196,243,253.0,273.0,331
5,,,,,,,,,,,,,,,2.1904761904761907,1.0304876330673562,1,2,2.0,3.0,5
