round,nodes,nodesP,nodesS,nodesSent,nodesSentP,nodesSentS,nodesRecv,nodesRecvP,nodesRecvS,msgSent,msgSentP,msgSentS,msgRecv,msgRecvP,msgRecvS,msgInfect,msgInfectP,msgInfectS
00,1000.000000,100.000000,900.000000,0.000000,0.000000,0.000000,0.000000,0.000000,0.000000,0.000000,0.000000,0.000000,0.000000,0.000000,0.000000,0.000000,0.000000,0.000000
01,1000.000000,100.000000,900.000000,0.120000,1.200000,0.000000,0.120000,1.200000,0.000000,12.000000,12.000000,0.000000,1.200000,1.200000,0.000000,0.100000,1.000000,0.000000
02,1000.000000,100.000000,900.000000,1.140000,11.400000,0.000000,1.140000,11.400000,0.000000,114.000000,114.000000,0.000000,11.600000,11.600000,0.000000,0.100000,1.000000,0.000000
03,1000.000000,100.000000,900.000000,6.900000,69.000000,0.000000,6.900000,69.000000,0.000000,690.000000,690.000000,0.000000,111.300000,111.300000,0.000000,0.100000,1.000000,0.000000
04,1000.000000,100.000000,900.000000,10.130000,100.000000,0.144444,10.130000,100.000000,0.144444,1013.000000,1000.000000,13.000000,685.000000,683.700000,1.300000,1.360000,6.400000,0.800000
05,1000.000000,100.000000,900.000000,24.850000,100.000000,16.500000,24.850000,100.000000,16.500000,2485.000000,1000.000000,1485.000000,1009.500000,846.800000,162.700000,1.700000,8.000000,1.000000
06,1000.000000,100.000000,900.000000,66.590000,100.000000,62.877778,66.590000,100.000000,62.877778,6659.000000,1000.000000,5659.000000,2484.700000,1583.100000,901.600000,2.430000,15.300000,1.000000
07,1000.000000,100.000000,900.000000,96.720000,100.000000,96.355555,96.720000,100.000000,96.355555,9672.000000,1000.000000,8672.000000,6635.100000,3649.000000,2986.100000,6.300000,36.000000,3.000000
08,1000.000000,100.000000,900.000000,99.920000,100.000000,99.911111,99.920000,100.000000,99.911111,9992.000000,1000.000000,8992.000000,9665.900000,3649.000000,6016.900000,9.000000,36.000000,6.000000
09,1000.000000,100.000000,900.000000,99.950000,100.000000,99.944445,99.950000,100.000000,99.944445,9995.000000,1000.000000,8995.000000,9993.000000,3649.000000,6344.000000,9.630000,36.000000,6.700000
10,1000.000000,100.000000,900.000000,99.950000,100.000000,99.944445,99.950000,100.000000,99.944445,9995.000000,1000.000000,8995.000000,9996.000000,3649.000000,6347.000000,9.630000,36.000000,6.700000
11,1000.000000,100.000000,900.000000,99.950000,100.000000,99.944445,99.950000,100.000000,99.944445,9995.000000,1000.000000,8995.000000,9996.000000,3649.000000,6347.000000,9.630000,36.000000,6.700000
12,1000.000000,100.000000,900.000000,99.950000,100.000000,99.944445,99.950000,100.000000,99.944445,9995.000000,1000.000000,8995.000000,9996.000000,3649.000000,6347.000000,9.630000,36.000000,6.700000
13,1000.000000,100.000000,900.000000,99.950000,100.000000,99.944445,99.950000,100.000000,99.944445,9995.000000,1000.000000,8995.000000,9996.000000,3649.000000,6347.000000,9.630000,36.000000,6.700000
14,1000.000000,100.000000,900.000000,99.950000,100.000000,99.944445,99.950000,100.000000,99.944445,9995.000000,1000.000000,8995.000000,9996.000000,3649.000000,6347.000000,9.630000,36.000000,6.700000
15,1000.000000,100.000000,900.000000,99.950000,100.000000,99.944445,99.950000,100.000000,99.944445,9995.000000,1000.000000,8995.000000,9996.000000,3649.000000,6347.000000,9.630000,36.000000,6.700000
16,1000.000000,100.000000,900.000000,99.950000,100.000000,99.944445,99.950000,100.000000,99.944445,9995.000000,1000.000000,8995.000000,9996.000000,3649.000000,6347.000000,9.630000,36.000000,6.700000
17,1000.000000,100.000000,900.000000,99.950000,100.000000,99.944445,99.950000,100.000000,99.944445,9995.000000,1000.000000,8995.000000,9996.000000,3649.000000,6347.000000,9.630000,36.000000,6.700000
18,1000.000000,100.000000,900.000000,99.950000,100.000000,99.944445,99.950000,100.000000,99.944445,9995.000000,1000.000000,8995.000000,9996.000000,3649.000000,6347.000000,9.630000,36.000000,6.700000
19,1000.000000,100.000000,900.000000,99.950000,100.000000,99.944445,99.950000,100.000000,99.944445,9995.000000,1000.000000,8995.000000,9996.000000,3649.000000,6347.000000,9.630000,36.000000,6.700000
