round,nodes,nodesP,nodesS,nodesSent,nodesSentP,nodesSentS,nodesRecv,nodesRecvP,nodesRecvS,msgSent,msgSentP,msgSentS,msgRecv,msgRecvP,msgRecvS,msgInfect,msgInfectP,msgInfectS
00,10000.000000,1000.000000,9000.000000,0.000000,0.000000,0.000000,0.000000,0.000000,0.000000,0.000000,0.000000,0.000000,0.000000,0.000000,0.000000,0.000000,0.000000,0.000000
01,10000.000000,1000.000000,9000.000000,0.012000,0.120000,0.000000,0.012000,0.120000,0.000000,15.600000,15.600000,0.000000,1.200000,1.200000,0.000000,0.100000,1.000000,0.000000
02,10000.000000,1000.000000,9000.000000,0.149000,1.490000,0.000000,0.149000,1.490000,0.000000,193.700000,193.700000,0.000000,15.000000,15.000000,0.000000,0.100000,1.000000,0.000000
03,10000.000000,1000.000000,9000.000000,1.781000,17.810000,0.000000,1.781000,17.810000,0.000000,2315.300000,2315.300000,0.000000,196.200000,196.200000,0.000000,0.100000,1.000000,0.000000
04,10000.000000,1000.000000,9000.000000,9.197000,89.320000,0.294444,9.197000,89.320000,0.294444,11956.100000,11611.600000,344.500000,2229.500000,2202.900000,26.600000,1.100000,2.000000,1.000000
05,10000.000000,1000.000000,9000.000000,46.136000,99.960000,40.155555,46.136000,99.960000,40.155555,59976.800000,12994.800000,46982.000000,11860.500000,7237.800000,4622.700000,1.600000,7.000000,1.000000
06,10000.000000,1000.000000,9000.000000,99.699000,99.960000,99.670000,99.699000,99.960000,99.670000,129608.700000,12994.800000,116613.900000,58174.500000,7237.800000,50936.700000,5.200000,7.000000,5.000000
07,10000.000000,1000.000000,9000.000000,99.996000,99.960000,100.000000,99.996000,99.960000,100.000000,129994.800000,12994.800000,117000.000000,129598.700000,7237.800000,122360.900000,12.400000,7.000000,13.000000
08,10000.000000,1000.000000,9000.000000,99.996000,99.960000,100.000000,99.996000,99.960000,100.000000,129994.800000,12994.800000,117000.000000,129995.800000,7237.800000,122758.000000,12.400000,7.000000,13.000000
09,10000.000000,1000.000000,9000.000000,99.996000,99.960000,100.000000,99.996000,99.960000,100.000000,129994.800000,12994.800000,117000.000000,129995.800000,7237.800000,122758.000000,12.400000,7.000000,13.000000
10,10000.000000,1000.000000,9000.000000,99.996000,99.960000,100.000000,99.996000,99.960000,100.000000,129994.800000,12994.800000,117000.000000,129995.800000,7237.800000,122758.000000,12.400000,7.000000,13.000000
11,10000.000000,1000.000000,9000.000000,99.996000,99.960000,100.000000,99.996000,99.960000,100.000000,129994.800000,12994.800000,117000.000000,129995.800000,7237.800000,122758.000000,12.400000,7.000000,13.000000
12,10000.000000,1000.000000,9000.000000,99.996000,99.960000,100.000000,99.996000,99.960000,100.000000,129994.800000,12994.800000,117000.000000,129995.800000,7237.800000,122758.000000,12.400000,7.000000,13.000000
13,10000.000000,1000.000000,9000.000000,99.996000,99.960000,100.000000,99.996000,99.960000,100.000000,129994.800000,12994.800000,117000.000000,129995.800000,7237.800000,122758.000000,12.400000,7.000000,13.000000
14,10000.000000,1000.000000,9000.000000,99.996000,99.960000,100.000000,99.996000,99.960000,100.000000,129994.800000,12994.800000,117000.000000,129995.800000,7237.800000,122758.000000,12.400000,7.000000,13.000000
15,10000.000000,1000.000000,9000.000000,99.996000,99.960000,100.000000,99.996000,99.960000,100.000000,129994.800000,12994.800000,117000.000000,129995.800000,7237.800000,122758.000000,12.400000,7.000000,13.000000
16,10000.000000,1000.000000,9000.000000,99.996000,99.960000,100.000000,99.996000,99.960000,100.000000,129994.800000,12994.800000,117000.000000,129995.800000,7237.800000,122758.000000,12.400000,7.000000,13.000000
17,10000.000000,1000.000000,9000.000000,99.996000,99.960000,100.000000,99.996000,99.960000,100.000000,129994.800000,12994.800000,117000.000000,129995.800000,7237.800000,122758.000000,12.400000,7.000000,13.000000
18,10000.000000,1000.000000,9000.000000,99.996000,99.960000,100.000000,99.996000,99.960000,100.000000,129994.800000,12994.800000,117000.000000,129995.800000,7237.800000,122758.000000,12.400000,7.000000,13.000000
19,10000.000000,1000.000000,9000.000000,99.996000,99.960000,100.000000,99.996000,99.960000,100.000000,129994.800000,12994.800000,117000.000000,129995.800000,7237.800000,122758.000000,12.400000,7.000000,13.000000
