gossips,p2p mean,p2p std,p2p min,p2p q1,p2p q2,p2p q3,p2p max,p2s mean,p2s std,p2s min,p2s q1,p2s q2,p2s q3,p2s max,s2s mean,s2s std,s2s min,s2s q1,s2s q2,s2s q3,s2s max
1,41.86000000000001,2.234576768279249,37.0,40.2,42.0,43.1,46.6,35.072,6.466549827123167,20.2,30.0,36.2,40.0,44.0,0.046025960000000005,0.02441471233955734,0.021121,0.026026,0.041141000000000004,0.057357000000000005,0.108509
2,13.895999999999999,3.050748542024837,9.4,11.4,13.6,16.5,20.4,4.376000000000001,2.869419221143308,1.0,2.1,3.5,7.4,11.3,0.000125,5e-05,0.0001,0.0001,0.0001,0.000125,0.0002
3,1.484,0.5312563725107994,0.7,1.1,1.5,1.8,3.0,0.17857142857142858,0.14769288003552106,0.1,0.1,0.1,0.2,0.6,,,,,,,
4,0.15000000000000002,0.06741998624632421,0.1,0.1,0.1,0.2,0.3,,,,,,,,,,,,,,
5,,,,,,,,,,,,,,,,,,,,,
6,,,,,,,,,,,,,,,,,,,,,
7,,,,,,,,,,,,,,,,,,,,,
