gossips,p2p mean,p2p std,p2p min,p2p q1,p2p q2,p2p q3,p2p max,p2s mean,p2s std,p2s min,p2s q1,p2s q2,p2s q3,p2s max,s2s mean,s2s std,s2s min,s2s q1,s2s q2,s2s q3,s2s max
1,53.52000000000001,1.4790199457749038,51.0,52.5,53.6,54.1,56.1,27.82,1.286144108048032,25.4,26.9,28.1,29.0,29.9,0.00586184,0.001929379621363648,0.002102,0.005005,0.006006,0.007006999999999999,0.009909999999999999
2,5.771999999999999,0.5919740985324723,4.7,5.4,5.9,6.1,6.8,0.19444444444444448,0.11099667309387475,0.1,0.1,0.2,0.2,0.5,,,,,,,
3,0.16250000000000003,0.10878112581387146,0.1,0.1,0.1,0.2,0.5,,,,,,,,,,,,,,
4,,,,,,,,,,,,,,,,,,,,,
5,,,,,,,,,,,,,,,,,,,,,
