,mean,std,min,q1,q2,q3,max
Simple,,,,,,,
P,4.236159407970399,0.6649334022380295,1.0,4.0,4.0,5.0,7.0
S,8.013596011981408,0.6218218794057114,6.0,8.0,8.0,8.0,11.0
P+S,7.975821871388641,0.726966107776949,1.0,8.0,8.0,8.0,11.0
