round,P mean,P std,P min,P q1,P q2,P q3,P max,S mean,S std,S min,S q1,S q2,S q3,S max,P+S mean,P+S std,P+S min,P+S q1,P+S q2,P+S q3,P+S max
0,0.0,0.0,0.0,0.0,0.0,0.0,0.0,0.0,0.0,0.0,0.0,0.0,0.0,0.0,0.0,0.0,0.0,0.0,0.0,0.0,0.0
1,0.0,0.0,0.0,0.0,0.0,0.0,0.0,0.0,0.0,0.0,0.0,0.0,0.0,0.0,0.0,0.0,0.0,0.0,0.0,0.0,0.0
2,0.0,0.0,0.0,0.0,0.0,0.0,0.0,0.0,0.0,0.0,0.0,0.0,0.0,0.0,0.0,0.0,0.0,0.0,0.0,0.0,0.0
3,0.0,0.0,0.0,0.0,0.0,0.0,0.0,0.0,0.0,0.0,0.0,0.0,0.0,0.0,0.0,0.0,0.0,0.0,0.0,0.0,0.0
4,0.0,0.0,0.0,0.0,0.0,0.0,0.0,0.0,0.0,0.0,0.0,0.0,0.0,0.0,0.0,0.0,0.0,0.0,0.0,0.0,0.0
5,0.0,0.0,0.0,0.0,0.0,0.0,0.0,0.0,0.0,0.0,0.0,0.0,0.0,0.0,0.0,0.0,0.0,0.0,0.0,0.0,0.0
6,0.0,0.0,0.0,0.0,0.0,0.0,0.0,0.0,0.0,0.0,0.0,0.0,0.0,0.0,0.0,0.0,0.0,0.0,0.0,0.0,0.0
7,0.0,0.0,0.0,0.0,0.0,0.0,0.0,0.0,0.0,0.0,0.0,0.0,0.0,0.0,0.0,0.0,0.0,0.0,0.0,0.0,0.0
8,0.0,0.0,0.0,0.0,0.0,0.0,0.0,0.0,0.0,0.0,0.0,0.0,0.0,0.0,0.0,0.0,0.0,0.0,0.0,0.0,0.0
9,0.0,0.0,0.0,0.0,0.0,0.0,0.0,0.0,0.0,0.0,0.0,0.0,0.0,0.0,0.0,0.0,0.0,0.0,0.0,0.0,0.0
10,0.036,0.06377042156569664,0.0,0.0,0.0,0.1,0.2,0.0,0.0,0.0,0.0,0.0,0.0,0.0,3.6e-05,6.377042156569664e-05,0.0,0.0,0.0,0.0001,0.0002
11,7.34,0.5575242894559245,6.2,7.0,7.3,7.8,8.3,0.0,0.0,0.0,0.0,0.0,0.0,0.0,0.007340000000000001,0.0005575242894559244,0.0062,0.007,0.0073,0.0078,0.0083
12,66.38,1.1481869766433241,64.6,65.7,66.2,67.2,68.8,0.0,0.0,0.0,0.0,0.0,0.0,0.0,0.06638,0.001148186976643325,0.0646,0.0657,0.0662,0.0672,0.0688
13,99.85600000000001,0.1325393023471417,99.5,99.8,99.9,99.9,100.0,0.00039228000000000006,0.00021626729603278747,0.0001,0.0002,0.0004,0.0005009999999999999,0.000801,0.100248,0.0002468467810876501,0.0998,0.1001,0.1003,0.1004,0.1008
14,99.984,0.037416573867737855,99.9,100.0,100.0,100.0,100.0,0.15536736,0.006962351080872993,0.13933900000000002,0.151652,0.156256,0.15966,0.16977,0.25519600000000003,0.006952666155272168,0.2392,0.2515,0.256,0.2595,0.2696
15,99.984,0.037416573867737855,99.9,100.0,100.0,100.0,100.0,8.12412812,0.349856536944588,7.420921000000001,7.943644,8.165566,8.38038,8.828327999999999,8.215988,0.3495051887073112,7.5135,8.0357,8.2573,8.472,8.9195
16,99.984,0.037416573867737855,99.9,100.0,100.0,100.0,100.0,68.68046051999998,1.3448632570610475,65.983684,67.53994,68.78458499999999,69.742042,71.226527,68.71176400000002,1.3435188138739738,66.0177,67.5724,68.8158,69.7723,71.2553
17,99.984,0.037416573867737855,99.9,100.0,100.0,100.0,100.0,99.85047847999998,0.01470713135727086,99.814314,99.838739,99.850551,99.862162,99.875876,99.85061199999998,0.01469408384351072,99.8145,99.8388,99.8506,99.8623,99.876
18,99.984,0.037416573867737855,99.9,100.0,100.0,100.0,100.0,99.95492699999998,0.0021478256058910443,99.951852,99.953554,99.954755,99.956056,99.95976,99.95495599999998,0.0021434162762586006,99.9519,99.9536,99.9548,99.9561,99.9598
19,99.984,0.037416573867737855,99.9,100.0,100.0,100.0,100.0,99.954963,0.0021525577421615235,99.951852,99.953554,99.954755,99.956056,99.95976,99.95499199999999,0.0021478516398204723,99.9519,99.9536,99.9548,99.9561,99.9598
20,99.984,0.037416573867737855,99.9,100.0,100.0,100.0,100.0,99.954963,0.0021525577421615235,99.951852,99.953554,99.954755,99.956056,99.95976,99.95499199999999,0.0021478516398204723,99.9519,99.9536,99.9548,99.9561,99.9598
21,99.984,0.037416573867737855,99.9,100.0,100.0,100.0,100.0,99.954963,0.0021525577421615235,99.951852,99.953554,99.954755,99.956056,99.95976,99.95499199999999,0.0021478516398204723,99.9519,99.9536,99.9548,99.9561,99.9598
22,99.984,0.037416573867737855,99.9,100.0,100.0,100.0,100.0,99.954963,0.0021525577421615235,99.951852,99.953554,99.954755,99.956056,99.95976,99.95499199999999,0.0021478516398204723,99.9519,99.9536,99.9548,99.9561,99.9598
23,99.984,0.037416573867737855,99.9,100.0,100.0,100.0,100.0,99.954963,0.0021525577421615235,99.951852,99.953554,99.954755,99.956056,99.95976,99.95499199999999,0.0021478516398204723,99.9519,99.9536,99.9548,99.9561,99.9598
24,99.984,0.037416573867737855,99.9,100.0,100.0,100.0,100.0,99.954963,0.0021525577421615235,99.951852,99.953554,99.954755,99.956056,99.95976,99.95499199999999,0.0021478516398204723,99.9519,99.9536,99.9548,99.9561,99.9598
25,99.984,0.037416573867737855,99.9,100.0,100.0,100.0,100.0,99.954963,0.0021525577421615235,99.951852,99.953554,99.954755,99.956056,99.95976,99.95499199999999,0.0021478516398204723,99.9519,99.9536,99.9548,99.9561,99.9598
