gossips,p2p mean,p2p std,p2p min,p2p q1,p2p q2,p2p q3,p2p max,p2s mean,p2s std,p2s min,p2s q1,p2s q2,p2s q3,p2s max,s2s mean,s2s std,s2s min,s2s q1,s2s q2,s2s q3,s2s max
1,51.64999999999999,0.3947256431159923,50.73,51.42,51.71,51.89,52.42,58.4796,0.5349803734717747,57.42,58.07,58.46,58.84,59.54,52.77258583999999,0.22413277708493626,52.438081000000004,52.644949,52.751616000000006,52.856667,53.396162
2,18.746800000000004,0.28962216765986565,18.17,18.49,18.77,19.0,19.11,20.0896,0.42360044066706687,19.42,19.69,20.15,20.42,20.79,21.796828240000004,0.2700804164834185,21.171717,21.67202,21.818485,21.943535,22.349394
3,0.03347826086956523,0.021869176243407465,0.01,0.02,0.03,0.045,0.08,0.1996,0.05003998401278722,0.12,0.17,0.18,0.24,0.31,1.2011030400000002,0.03057788934219189,1.105657,1.189495,1.202828,1.219091,1.249192
4,,,,,,,,,,,,,,,0.017378,0.0016295564836277783,0.014544999999999999,0.016566,0.01697,0.018081,0.022019999999999998
5,,,,,,,,,,,,,,,0.000101,,0.000101,0.000101,0.000101,0.000101,0.000101
