gossips,p2p mean,p2p std,p2p min,p2p q1,p2p q2,p2p q3,p2p max,p2s mean,p2s std,p2s min,p2s q1,p2s q2,p2s q3,p2s max,s2s mean,s2s std,s2s min,s2s q1,s2s q2,s2s q3,s2s max
1,53.78,1.2727922061357853,51.2,52.8,53.8,54.9,55.7,53.78,1.2727922061357853,51.2,52.8,53.8,54.9,55.7,0.20375983999999994,0.0024104321306908194,0.1999,0.202102,0.20430399999999999,0.205506,0.20860900000000002
2,5.803999999999999,0.5381139904022817,4.8,5.4,5.9,6.1,6.9,5.803999999999999,0.5381139904022817,4.8,5.4,5.9,6.1,6.9,0.00020000000000000004,9.607689228305227e-05,0.0001,0.0001,0.0002,0.000275,0.0004
3,0.12,0.0421637021355784,0.1,0.1,0.1,0.1,0.2,0.12,0.0421637021355784,0.1,0.1,0.1,0.1,0.2,,,,,,,
4,,,,,,,,,,,,,,,,,,,,,
5,,,,,,,,,,,,,,,,,,,,,
