gossips,p2p mean,p2p std,p2p min,p2p q1,p2p q2,p2p q3,p2p max,p2s mean,p2s std,p2s min,p2s q1,p2s q2,p2s q3,p2s max,s2s mean,s2s std,s2s min,s2s q1,s2s q2,s2s q3,s2s max
1,10.454080000000001,0.05323604668517999,10.295,10.431,10.463,10.481,10.543,0.5885999999999999,0.026115129714401192,0.529,0.575,0.583,0.604,0.643,0.009800040000000005,0.005580520416890645,0.003778,0.006778,0.008889,0.010778,0.031889
2,0.11152000000000001,0.01076305408949213,0.089,0.104,0.114,0.121,0.126,,,,,,,,,,,,,,
3,0.001,0.0,0.001,0.001,0.001,0.001,0.001,,,,,,,,,,,,,,
4,,,,,,,,,,,,,,,,,,,,,
5,,,,,,,,,,,,,,,,,,,,,
