round,P mean,P std,P min,P q1,P q2,P q3,P max,S mean,S std,S min,S q1,S q2,S q3,S max,P+S mean,P+S std,P+S min,P+S q1,P+S q2,P+S q3,P+S max
0,0.0,0.0,0.0,0.0,0.0,0.0,0.0,0.0,0.0,0.0,0.0,0.0,0.0,0.0,0.0,0.0,0.0,0.0,0.0,0.0,0.0
1,0.0,0.0,0.0,0.0,0.0,0.0,0.0,0.0,0.0,0.0,0.0,0.0,0.0,0.0,0.0,0.0,0.0,0.0,0.0,0.0,0.0
2,0.0,0.0,0.0,0.0,0.0,0.0,0.0,0.0,0.0,0.0,0.0,0.0,0.0,0.0,0.0,0.0,0.0,0.0,0.0,0.0,0.0
3,0.0,0.0,0.0,0.0,0.0,0.0,0.0,0.0,0.0,0.0,0.0,0.0,0.0,0.0,0.0,0.0,0.0,0.0,0.0,0.0,0.0
4,0.0,0.0,0.0,0.0,0.0,0.0,0.0,0.0,0.0,0.0,0.0,0.0,0.0,0.0,0.0,0.0,0.0,0.0,0.0,0.0,0.0
5,0.0,0.0,0.0,0.0,0.0,0.0,0.0,0.0,0.0,0.0,0.0,0.0,0.0,0.0,0.0,0.0,0.0,0.0,0.0,0.0,0.0
6,0.0,0.0,0.0,0.0,0.0,0.0,0.0,0.0,0.0,0.0,0.0,0.0,0.0,0.0,0.0,0.0,0.0,0.0,0.0,0.0,0.0
7,0.0,0.0,0.0,0.0,0.0,0.0,0.0,0.0,0.0,0.0,0.0,0.0,0.0,0.0,0.0,0.0,0.0,0.0,0.0,0.0,0.0
8,0.0,0.0,0.0,0.0,0.0,0.0,0.0,0.0,0.0,0.0,0.0,0.0,0.0,0.0,0.0,0.0,0.0,0.0,0.0,0.0,0.0
9,0.0,0.0,0.0,0.0,0.0,0.0,0.0,0.0,0.0,0.0,0.0,0.0,0.0,0.0,0.0,0.0,0.0,0.0,0.0,0.0,0.0
10,0.08800000000000001,0.0971253485622231,0.0,0.0,0.1,0.1,0.3,0.0,0.0,0.0,0.0,0.0,0.0,0.0,8.799999999999998e-05,9.712534856222309e-05,0.0,0.0,0.0001,0.0001,0.0003
11,7.043999999999999,0.5620498198558559,6.1,6.7,7.1,7.4,8.4,0.0,0.0,0.0,0.0,0.0,0.0,0.0,0.007044,0.0005620498198558557,0.0061,0.0067,0.0071,0.0074,0.0084
12,66.232,1.1560420984260666,63.3,65.7,66.3,67.0,67.9,0.0,0.0,0.0,0.0,0.0,0.0,0.0,0.06623200000000001,0.001156042098426061,0.0633,0.0657,0.0663,0.067,0.0679
13,99.816,0.13127579111677068,99.5,99.7,99.8,99.9,100.0,6.800000000000001e-05,8.020806277010643e-05,0.0,0.0,0.0,0.0001,0.0002,0.099884,0.00015187714333192507,0.0995,0.0998,0.0999,0.1,0.1002
14,99.94800000000001,0.06531972647421998,99.8,99.9,100.0,100.0,100.0,0.09534328,0.005473327237004317,0.082683,0.093193,0.095195,0.097497,0.111812,0.19519599999999998,0.005468049621818249,0.1826,0.193,0.195,0.1974,0.2116
15,99.94800000000001,0.06531972647421998,99.8,99.9,100.0,100.0,100.0,5.511859879999999,0.1465469956766771,5.221722,5.404905,5.513113,5.571672,5.858358,5.6062959999999995,0.14638475410142043,5.3165,5.4995,5.6076,5.6661,5.9524
16,99.94800000000001,0.06531972647421998,99.8,99.9,100.0,100.0,100.0,59.639923839999994,0.8347865828584415,58.238639,59.094294,59.75996,60.290991000000005,61.134234,59.680232000000004,0.8339478404552656,58.2804,59.135,59.8001,60.3307,61.173
17,99.94800000000001,0.06531972647421998,99.8,99.9,100.0,100.0,100.0,99.69451447999998,0.02354464627772819,99.64084100000001,99.684384,99.697497,99.708308,99.73583599999999,99.69476800000001,0.023513306870792196,99.6412,99.6845,99.6977,99.7085,99.736
18,99.94800000000001,0.06531972647421998,99.8,99.9,100.0,100.0,100.0,99.95515123999999,0.0021097290165632185,99.949149,99.953654,99.955055,99.95695699999999,99.957758,99.95514399999996,0.002085881108791441,99.9492,99.9537,99.9551,99.9569,99.9578
19,99.94800000000001,0.06531972647421998,99.8,99.9,100.0,100.0,100.0,99.95526739999997,0.0021107628557764063,99.949249,99.953754,99.955055,99.95705699999999,99.957858,99.95525999999998,0.0020874625745140665,99.9493,99.9538,99.9551,99.957,99.9579
20,99.94800000000001,0.06531972647421998,99.8,99.9,100.0,100.0,100.0,99.95526739999997,0.0021107628557764063,99.949249,99.953754,99.955055,99.95705699999999,99.957858,99.95525999999998,0.0020874625745140665,99.9493,99.9538,99.9551,99.957,99.9579
21,99.94800000000001,0.06531972647421998,99.8,99.9,100.0,100.0,100.0,99.95526739999997,0.0021107628557764063,99.949249,99.953754,99.955055,99.95705699999999,99.957858,99.95525999999998,0.0020874625745140665,99.9493,99.9538,99.9551,99.957,99.9579
22,99.94800000000001,0.06531972647421998,99.8,99.9,100.0,100.0,100.0,99.95526739999997,0.0021107628557764063,99.949249,99.953754,99.955055,99.95705699999999,99.957858,99.95525999999998,0.0020874625745140665,99.9493,99.9538,99.9551,99.957,99.9579
23,99.94800000000001,0.06531972647421998,99.8,99.9,100.0,100.0,100.0,99.95526739999997,0.0021107628557764063,99.949249,99.953754,99.955055,99.95705699999999,99.957858,99.95525999999998,0.0020874625745140665,99.9493,99.9538,99.9551,99.957,99.9579
24,99.94800000000001,0.06531972647421998,99.8,99.9,100.0,100.0,100.0,99.95526739999997,0.0021107628557764063,99.949249,99.953754,99.955055,99.95705699999999,99.957858,99.95525999999998,0.0020874625745140665,99.9493,99.9538,99.9551,99.957,99.9579
25,99.94800000000001,0.06531972647421998,99.8,99.9,100.0,100.0,100.0,99.95526739999997,0.0021107628557764063,99.949249,99.953754,99.955055,99.95705699999999,99.957858,99.95525999999998,0.0020874625745140665,99.9493,99.9538,99.9551,99.957,99.9579
