gossips,p2p mean,p2p std,p2p min,p2p q1,p2p q2,p2p q3,p2p max,p2s mean,p2s std,p2s min,p2s q1,p2s q2,p2s q3,p2s max,s2s mean,s2s std,s2s min,s2s q1,s2s q2,s2s q3,s2s max
1,49.15200000000001,1.506408532459462,46.5,47.9,49.1,50.2,51.9,58.187999999999995,1.1490285752176348,56.2,57.5,58.1,59.3,60.2,52.12986592,0.320214902181192,51.616116,51.89009,52.081081,52.317017,52.874474
2,22.279999999999994,1.1321071798494464,20.3,21.5,22.4,23.0,24.7,20.176,1.092123314160692,17.8,19.5,20.4,20.8,22.7,21.889453359999997,0.37540561421690744,21.191491,21.665465,21.904404,22.163463,22.675175
3,2.28,0.48476798574163293,1.1,1.9,2.3,2.6,3.0,0.32916666666666666,0.17810394294555532,0.1,0.2,0.3,0.5,0.7,1.4141901600000002,0.0592000705733532,1.311812,1.368168,1.4222219999999999,1.4451450000000001,1.508509
4,0.15000000000000002,0.07071067811865477,0.1,0.125,0.15000000000000002,0.17500000000000002,0.2,,,,,,,,0.02814012,0.0033854578754825273,0.022622999999999997,0.025325,0.028027999999999997,0.03023,0.034535
5,,,,,,,,,,,,,,,0.00019411764705882354,0.00010289915108550529,0.0001,0.0001,0.0002,0.0002,0.0004
