gossips,p2p mean,p2p std,p2p min,p2p q1,p2p q2,p2p q3,p2p max,p2s mean,p2s std,p2s min,p2s q1,p2s q2,p2s q3,p2s max,s2s mean,s2s std,s2s min,s2s q1,s2s q2,s2s q3,s2s max
1,53743.8,121.35519491695986,53473.0,53637.0,53762.0,53840.0,53938.0,28575.2,194.55783201917328,28192.0,28480.0,28577.0,28686.0,28993.0,7518.96,369.0324601802209,6973.0,7197.0,7461.0,7816.0,8278.0
2,5906.8,63.919219853395205,5820.0,5870.0,5895.0,5926.0,6069.0,178.68,11.19791647286821,154.0,171.0,178.0,185.0,204.0,1.7857142857142858,1.1883130530663677,1.0,1.0,1.0,2.0,5.0
3,63.48,7.089428749906443,50.0,59.0,64.0,68.0,77.0,1.0,0.0,1.0,1.0,1.0,1.0,1.0,,,,,,,
4,1.0,,1.0,1.0,1.0,1.0,1.0,,,,,,,,,,,,,,
5,,,,,,,,,,,,,,,,,,,,,
