gossips,p2p mean,p2p std,p2p min,p2p q1,p2p q2,p2p q3,p2p max,p2s mean,p2s std,p2s min,p2s q1,p2s q2,p2s q3,p2s max,s2s mean,s2s std,s2s min,s2s q1,s2s q2,s2s q3,s2s max
1,49.172000000000004,1.5172672803431833,46.6,48.0,49.3,50.4,51.7,58.292000000000016,1.33694926355989,56.0,57.2,57.8,59.1,61.4,52.28325928,0.2220521987317989,51.805305,52.125726,52.292092,52.437437,52.771871999999995
2,22.48,0.9665229778265322,20.9,21.7,22.6,23.3,24.2,20.164,1.1452365112354166,17.4,19.4,20.2,21.1,22.1,21.66749144,0.4319892066314732,21.049349,21.256657,21.742743,21.938038,22.475175
3,1.9199999999999997,0.4310839052125855,1.2,1.7,1.9,2.0,3.2,0.2880000000000001,0.10923979738782628,0.1,0.2,0.3,0.4,0.5,1.3605444799999997,0.060208223096406596,1.2569569999999999,1.316617,1.364164,1.397097,1.491191
4,0.1,0.0,0.1,0.1,0.1,0.1,0.1,,,,,,,,0.02643452,0.0027406870203168644,0.021622,0.024525,0.026026,0.029029000000000003,0.031331
5,,,,,,,,,,,,,,,0.00017333333333333334,8.837151016885365e-05,0.0001,0.0001,0.0001,0.00025,0.0003
6,,,,,,,,,,,,,,,,,,,,,
