gossips,p2p mean,p2p std,p2p min,p2p 05th,p2p 25th,p2p 50th,p2p 75th,p2p 95th,p2p max,p2s mean,p2s std,p2s min,p2s 05th,p2s 25th,p2s 50th,p2s 75th,p2s 95th,p2s max,s2s mean,s2s std,s2s min,s2s 05th,s2s 25th,s2s 50th,s2s 75th,s2s 95th,s2s max
1,49.31120000000001,0.1454529477184968,49.045,49.1398,49.21,49.287,49.394,49.5166,49.739,58.326359999999994,0.14439414946596704,58.07,58.1042,58.237,58.35,58.415,58.541399999999996,58.565,55.70866671999999,0.1676191799334485,55.510222,55.5621108,55.62566700000001,55.679,55.73566700000001,55.879644199999994,56.411556000000004
2,22.24876,0.11023149459206284,22.058,22.095399999999998,22.154,22.244,22.321,22.439600000000002,22.471,20.35412,0.14735326803298227,19.908,20.133000000000003,20.268,20.395,20.437,20.546599999999998,20.624,21.484591040000005,0.11066142203622008,21.130444,21.334955800000003,21.421889,21.512222,21.548222,21.6242002,21.695
3,2.0515999999999996,0.03995897896593455,1.977,1.9888,2.027,2.056,2.069,2.1008,2.161,0.3157600000000001,0.017030044039872603,0.286,0.2882,0.302,0.319,0.325,0.3406,0.355,0.4477956,0.01343400136072646,0.39922199999999997,0.42626639999999993,0.446667,0.449222,0.455111,0.46071120000000004,0.46888900000000006
4,0.023520000000000013,0.005769714031041747,0.011,0.0152,0.019,0.024,0.029,0.0318,0.033,0.0020000000000000005,0.0008819171036881969,0.001,0.001,0.001,0.002,0.0027500000000000003,0.0031499999999999987,0.004,0.0021333200000000006,0.0004575476123858587,0.001333,0.0013776,0.001889,0.002222,0.002444,0.0028668,0.002889
5,0.001,0.0,0.001,0.001,0.001,0.001,0.001,0.001,0.001,,,,,,,,,,,,,,,,,,
