round,nodes,nodesP,nodesS,nodesSent,nodesSentP,nodesSentS,nodesRecv,nodesRecvP,nodesRecvS,msgSent,msgSentP,msgSentS,msgRecv,msgRecvP,msgRecvS,msgInfect,msgInfectP,msgInfectS
00,1000.000000,10.000000,990.000000,0.000000,0.000000,0.000000,0.000000,0.000000,0.000000,0.000000,0.000000,0.000000,0.000000,0.000000,0.000000,0.000000,0.000000,0.000000
01,1000.000000,10.000000,990.000000,0.100000,10.000000,0.000000,0.100000,10.000000,0.000000,10.000000,10.000000,0.000000,1.000000,1.000000,0.000000,0.010000,1.000000,0.000000
02,1000.000000,10.000000,990.000000,1.000000,100.000000,0.000000,1.000000,100.000000,0.000000,100.000000,100.000000,0.000000,11.400000,11.400000,0.000000,0.010000,1.000000,0.000000
03,1000.000000,10.000000,990.000000,1.000000,100.000000,0.000000,1.000000,100.000000,0.000000,100.000000,100.000000,0.000000,101.000000,101.000000,0.000000,0.100000,10.000000,0.000000
04,1000.000000,10.000000,990.000000,1.000000,100.000000,0.000000,1.000000,100.000000,0.000000,100.000000,100.000000,0.000000,101.000000,101.000000,0.000000,0.100000,10.000000,0.000000
05,1000.000000,10.000000,990.000000,1.000000,100.000000,0.000000,1.000000,100.000000,0.000000,100.000000,100.000000,0.000000,101.000000,101.000000,0.000000,0.100000,10.000000,0.000000
06,1000.000000,10.000000,990.000000,1.000000,100.000000,0.000000,1.000000,100.000000,0.000000,100.000000,100.000000,0.000000,101.000000,101.000000,0.000000,0.100000,10.000000,0.000000
07,1000.000000,10.000000,990.000000,1.000000,100.000000,0.000000,1.000000,100.000000,0.000000,100.000000,100.000000,0.000000,101.000000,101.000000,0.000000,0.100000,10.000000,0.000000
08,1000.000000,10.000000,990.000000,1.000000,100.000000,0.000000,1.000000,100.000000,0.000000,100.000000,100.000000,0.000000,101.000000,101.000000,0.000000,0.100000,10.000000,0.000000
09,1000.000000,10.000000,990.000000,1.000000,100.000000,0.000000,1.000000,100.000000,0.000000,100.000000,100.000000,0.000000,101.000000,101.000000,0.000000,0.100000,10.000000,0.000000
10,1000.000000,10.000000,990.000000,1.000000,100.000000,0.000000,1.000000,100.000000,0.000000,100.000000,100.000000,0.000000,101.000000,101.000000,0.000000,0.100000,10.000000,0.000000
11,1000.000000,10.000000,990.000000,1.000000,100.000000,0.000000,1.000000,100.000000,0.000000,100.000000,100.000000,0.000000,101.000000,101.000000,0.000000,0.100000,10.000000,0.000000
12,1000.000000,10.000000,990.000000,1.000000,100.000000,0.000000,1.000000,100.000000,0.000000,100.000000,100.000000,0.000000,101.000000,101.000000,0.000000,0.100000,10.000000,0.000000
13,1000.000000,10.000000,990.000000,1.000000,100.000000,0.000000,1.000000,100.000000,0.000000,100.000000,100.000000,0.000000,101.000000,101.000000,0.000000,0.100000,10.000000,0.000000
14,1000.000000,10.000000,990.000000,1.000000,100.000000,0.000000,1.000000,100.000000,0.000000,100.000000,100.000000,0.000000,101.000000,101.000000,0.000000,0.100000,10.000000,0.000000
15,1000.000000,10.000000,990.000000,1.000000,100.000000,0.000000,1.000000,100.000000,0.000000,100.000000,100.000000,0.000000,101.000000,101.000000,0.000000,0.100000,10.000000,0.000000
16,1000.000000,10.000000,990.000000,1.000000,100.000000,0.000000,1.000000,100.000000,0.000000,100.000000,100.000000,0.000000,101.000000,101.000000,0.000000,0.100000,10.000000,0.000000
17,1000.000000,10.000000,990.000000,1.000000,100.000000,0.000000,1.000000,100.000000,0.000000,100.000000,100.000000,0.000000,101.000000,101.000000,0.000000,0.100000,10.000000,0.000000
18,1000.000000,10.000000,990.000000,1.000000,100.000000,0.000000,1.000000,100.000000,0.000000,100.000000,100.000000,0.000000,101.000000,101.000000,0.000000,0.100000,10.000000,0.000000
19,1000.000000,10.000000,990.000000,1.000000,100.000000,0.000000,1.000000,100.000000,0.000000,100.000000,100.000000,0.000000,101.000000,101.000000,0.000000,0.100000,10.000000,0.000000
