gossips,p2p mean,p2p std,p2p min,p2p q1,p2p q2,p2p q3,p2p max,p2s mean,p2s std,p2s min,p2s q1,p2s q2,p2s q3,p2s max,s2s mean,s2s std,s2s min,s2s q1,s2s q2,s2s q3,s2s max
1,53.76975999999999,0.15398817054133437,53.466,53.701,53.761,53.865,54.151,9.305,0.08286736390159916,9.177,9.238,9.292,9.39,9.437,0.06216452,0.005561180293786562,0.054111,0.057777999999999996,0.061333000000000006,0.064778,0.077556
2,5.880599999999999,0.05719119978924487,5.747,5.863,5.89,5.917,5.97,0.0024090909090909098,0.001221205138927114,0.001,0.00125,0.002,0.003,0.005,,,,,,,
3,0.06428,0.007026853254954643,0.047,0.059,0.066,0.07,0.074,,,,,,,,,,,,,,
4,0.0012000000000000001,0.00044721359549995795,0.001,0.001,0.001,0.001,0.002,,,,,,,,,,,,,,
5,,,,,,,,,,,,,,,,,,,,,
