gossips,p2p mean,p2p std,p2p min,p2p q1,p2p q2,p2p q3,p2p max,p2s mean,p2s std,p2s min,p2s q1,p2s q2,p2s q3,p2s max,s2s mean,s2s std,s2s min,s2s q1,s2s q2,s2s q3,s2s max
1,494.92,14.974756536696463,460.0,493.0,498.0,505.0,518.0,589.4,15.481171359644165,559.0,578.0,588.0,602.0,623.0,3372.12,161.5761739861419,3103.0,3267.0,3345.0,3435.0,3822.0
2,221.24,12.90439201719063,199.0,216.0,220.0,227.0,250.0,198.04,14.73227748856232,168.0,192.0,198.0,211.0,226.0,2.3157894736842106,1.3764944032233706,1.0,1.5,2.0,2.5,6.0
3,20.48,3.216105305075276,14.0,18.0,21.0,23.0,27.0,1.7777777777777777,0.8084520834544433,1.0,1.0,2.0,2.0,3.0,,,,,,,
4,1.5,0.5773502691896257,1.0,1.0,1.5,2.0,2.0,,,,,,,,,,,,,,
5,,,,,,,,,,,,,,,,,,,,,
