gossips,p2p mean,p2p std,p2p min,p2p q1,p2p q2,p2p q3,p2p max,p2s mean,p2s std,p2s min,p2s q1,p2s q2,p2s q3,p2s max,s2s mean,s2s std,s2s min,s2s q1,s2s q2,s2s q3,s2s max
1,,,,,,,,1.0,0.0,1.0,1.0,1.0,1.0,1.0,599880.6,4102.877008880477,592161.0,596313.0,600260.0,602479.0,608745.0
2,,,,,,,,,,,,,,,15528.24,785.893985640981,14076.0,14975.0,15673.0,16126.0,16767.0
3,,,,,,,,,,,,,,,1.4,0.5477225575051662,1.0,1.0,1.0,2.0,2.0
4,,,,,,,,,,,,,,,,,,,,,
5,,,,,,,,,,,,,,,,,,,,,
