gossips,p2p mean,p2p std,p2p min,p2p q1,p2p q2,p2p q3,p2p max,p2s mean,p2s std,p2s min,p2s q1,p2s q2,p2s q3,p2s max,s2s mean,s2s std,s2s min,s2s q1,s2s q2,s2s q3,s2s max
1,18.85288,0.08270344611925157,18.69,18.814,18.861,18.906,19.0,1.1823599999999999,0.03247932675821135,1.112,1.162,1.195,1.21,1.228,0.01853348,0.004367660177562656,0.011667,0.015111000000000001,0.017778,0.020556,0.029556
2,1.31316,0.029245626453653983,1.259,1.297,1.308,1.34,1.372,0.004166666666666668,0.0018336626845141693,0.001,0.003,0.004,0.005,0.009,,,,,,,
3,0.024760000000000015,0.0039399661589071214,0.015,0.022,0.025,0.027,0.033,,,,,,,,,,,,,,
4,0.001,0.0,0.001,0.001,0.001,0.001,0.001,,,,,,,,,,,,,,
5,,,,,,,,,,,,,,,,,,,,,
6,,,,,,,,,,,,,,,,,,,,,
7,,,,,,,,,,,,,,,,,,,,,
8,,,,,,,,,,,,,,,,,,,,,
