latency-in-ms,PMF
1,0.002084942085
2,0.008301158301
3,0.007374517375
4,0.004555984556
5,0.003436293436
6,0.002625482625
7,0.003436293436
8,0.003976833977
9,0.004826254826
10,0.003861003861
11,0.002972972973
12,0.004787644788
13,0.005675675676
14,0.004671814672
15,0.005366795367
16,0.004864864865
17,0.005289575290
18,0.004826254826
19,0.004054054054
20,0.003706563707
21,0.003667953668
22,0.002664092664
23,0.002972972973
24,0.002316602317
25,0.002123552124
26,0.002084942085
27,0.002200772201
28,0.002316602317
29,0.001969111969
30,0.001853281853
31,0.002393822394
32,0.002123552124
33,0.002471042471
34,0.002664092664
35,0.002664092664
36,0.002895752896
37,0.002432432432
38,0.002625482625
39,0.002741312741
40,0.001969111969
41,0.001930501931
42,0.001274131274
43,0.001274131274
44,0.001544401544
45,0.001274131274
46,0.001158301158
47,0.001776061776
48,0.001428571429
49,0.001235521236
50,0.001428571429
51,0.001505791506
52,0.001274131274
53,0.001003861004
54,0.000888030888
55,0.000926640927
56,0.001081081081
57,0.000733590734
58,0.001003861004
59,0.001042471042
60,0.000926640927
61,0.001003861004
62,0.001467181467
63,0.001621621622
64,0.001698841699
65,0.001274131274
66,0.001312741313
67,0.002200772201
68,0.001891891892
69,0.002007722008
70,0.001119691120
71,0.002355212355
72,0.002934362934
73,0.002818532819
74,0.002857142857
75,0.003861003861
76,0.005173745174
77,0.005559845560
78,0.005444015444
79,0.005559845560
80,0.005250965251
81,0.005598455598
82,0.006254826255
83,0.005791505792
84,0.005598455598
85,0.006293436293
86,0.005791505792
87,0.007683397683
88,0.007683397683
89,0.007528957529
90,0.007220077220
91,0.007876447876
92,0.006447876448
93,0.008532818533
94,0.007413127413
95,0.009652509653
96,0.008764478764
97,0.008223938224
98,0.008764478764
99,0.008416988417
100,0.007683397683
101,0.008339768340
102,0.006640926641
103,0.007142857143
104,0.005945945946
105,0.006332046332
106,0.006332046332
107,0.005675675676
108,0.005405405405
109,0.006447876448
110,0.007220077220
111,0.006525096525
112,0.005675675676
113,0.005830115830
114,0.004864864865
115,0.005984555985
116,0.004864864865
117,0.004749034749
118,0.005212355212
119,0.004517374517
120,0.004787644788
121,0.005057915058
122,0.004980694981
123,0.003590733591
124,0.004092664093
125,0.004324324324
126,0.003783783784
127,0.003667953668
128,0.003050193050
129,0.003552123552
130,0.003474903475
131,0.003088803089
132,0.003127413127
133,0.003127413127
134,0.003204633205
135,0.003397683398
136,0.003127413127
137,0.002084942085
138,0.002702702703
139,0.002123552124
140,0.002200772201
141,0.003166023166
142,0.002200772201
143,0.002432432432
144,0.002123552124
145,0.001930501931
146,0.001698841699
147,0.001660231660
148,0.001930501931
149,0.001969111969
150,0.002123552124
151,0.001853281853
152,0.002741312741
153,0.002200772201
154,0.002123552124
155,0.002393822394
156,0.002393822394
157,0.002239382239
158,0.002355212355
159,0.002625482625
160,0.001930501931
161,0.002355212355
162,0.002123552124
163,0.001930501931
164,0.001853281853
165,0.001158301158
166,0.002046332046
167,0.002162162162
168,0.001698841699
169,0.001814671815
170,0.001814671815
171,0.001583011583
172,0.001544401544
173,0.001814671815
174,0.001274131274
175,0.001583011583
176,0.001158301158
177,0.001621621622
178,0.001660231660
179,0.001274131274
180,0.001737451737
181,0.001274131274
182,0.001467181467
183,0.002200772201
184,0.002162162162
185,0.001814671815
186,0.002355212355
187,0.002355212355
188,0.001930501931
189,0.001814671815
190,0.001891891892
191,0.002548262548
192,0.001467181467
193,0.001853281853
194,0.002239382239
195,0.001853281853
196,0.001621621622
197,0.002046332046
198,0.002200772201
199,0.001621621622
200,0.001467181467
201,0.001660231660
202,0.001389961390
203,0.001351351351
204,0.001544401544
205,0.001312741313
206,0.001389961390
207,0.002007722008
208,0.001853281853
209,0.001660231660
210,0.002084942085
211,0.002702702703
212,0.001930501931
213,0.001930501931
214,0.002239382239
215,0.002046332046
216,0.002123552124
217,0.002393822394
218,0.002895752896
219,0.002702702703
220,0.003281853282
221,0.003320463320
222,0.003745173745
223,0.003474903475
224,0.002857142857
225,0.003938223938
226,0.004285714286
227,0.003474903475
228,0.004247104247
229,0.004864864865
230,0.004324324324
231,0.005482625483
232,0.004826254826
233,0.005057915058
234,0.004440154440
235,0.004749034749
236,0.004285714286
237,0.004864864865
238,0.005173745174
239,0.004247104247
240,0.004980694981
241,0.004478764479
242,0.004671814672
243,0.004555984556
244,0.004826254826
245,0.003320463320
246,0.003706563707
247,0.003474903475
248,0.003243243243
249,0.003050193050
250,0.003629343629
251,0.003204633205
252,0.003397683398
253,0.002664092664
254,0.003667953668
255,0.003088803089
256,0.002664092664
257,0.002818532819
258,0.002972972973
259,0.003281853282
260,0.002664092664
261,0.002702702703
262,0.002741312741
263,0.002857142857
264,0.002355212355
265,0.002471042471
266,0.001969111969
267,0.002355212355
268,0.002509652510
269,0.001737451737
270,0.002239382239
271,0.002432432432
272,0.001544401544
273,0.002084942085
274,0.001544401544
275,0.001389961390
276,0.001583011583
277,0.001505791506
278,0.001737451737
279,0.001698841699
280,0.001891891892
281,0.001660231660
282,0.002046332046
283,0.001621621622
284,0.001274131274
285,0.001428571429
286,0.001428571429
287,0.001544401544
288,0.001042471042
289,0.001621621622
290,0.001235521236
291,0.001119691120
292,0.001003861004
293,0.001196911197
294,0.001119691120
295,0.001351351351
296,0.000926640927
297,0.000965250965
298,0.001351351351
299,0.001081081081
300,0.001081081081
301,0.001119691120
302,0.000888030888
303,0.000965250965
304,0.000849420849
305,0.000656370656
306,0.001158301158
307,0.000772200772
308,0.000965250965
309,0.001119691120
310,0.000810810811
311,0.001081081081
312,0.000888030888
313,0.000501930502
314,0.000617760618
315,0.001119691120
316,0.000463320463
317,0.000733590734
318,0.001042471042
319,0.000617760618
320,0.000579150579
321,0.000579150579
322,0.000694980695
323,0.000424710425
324,0.000501930502
325,0.000501930502
326,0.000270270270
327,0.000579150579
328,0.000733590734
329,0.000424710425
330,0.000501930502
331,0.000424710425
332,0.000540540541
333,0.000579150579
334,0.000424710425
335,0.000617760618
336,0.000231660232
337,0.000386100386
338,0.000347490347
339,0.000270270270
340,0.000501930502
341,0.000308880309
342,0.000386100386
343,0.000540540541
344,0.000501930502
345,0.000617760618
346,0.000347490347
347,0.000154440154
348,0.000193050193
349,0.000270270270
350,0.000193050193
351,0.000270270270
352,0.000154440154
353,0.000386100386
354,0.000501930502
355,0.000347490347
356,0.000424710425
357,0.000154440154
358,0.000308880309
359,0.000656370656
360,0.000270270270
361,0.000154440154
362,0.000347490347
363,0.000308880309
364,0.000386100386
365,0.000308880309
366,0.000154440154
367,0.000231660232
368,0.000308880309
369,0.000270270270
370,0.000270270270
371,0.000308880309
372,0.000347490347
373,0.000231660232
374,0.000115830116
375,0.000424710425
376,0.000231660232
377,0.000308880309
378,0.000193050193
379,0.000231660232
380,0.000193050193
381,0.000193050193
382,0.000154440154
383,0.000270270270
384,0.000193050193
385,0.000270270270
386,0.000115830116
387,0.000115830116
388,0.000231660232
389,0.000308880309
390,0.000308880309
391,0.000231660232
392,0.000193050193
393,0.000231660232
394,0.000231660232
395,0.000115830116
396,0.000038610039
397,0.000115830116
398,0.000115830116
399,0.000115830116
400,0.000115830116
401,0.000154440154
402,0.000077220077
404,0.000154440154
405,0.000115830116
406,0.000193050193
407,0.000154440154
408,0.000193050193
409,0.000231660232
410,0.000038610039
411,0.000193050193
412,0.000077220077
413,0.000038610039
414,0.000115830116
415,0.000115830116
416,0.000077220077
417,0.000154440154
418,0.000154440154
419,0.000115830116
420,0.000077220077
421,0.000077220077
423,0.000077220077
424,0.000038610039
426,0.000038610039
427,0.000115830116
428,0.000115830116
429,0.000115830116
430,0.000115830116
431,0.000038610039
432,0.000270270270
433,0.000077220077
434,0.000038610039
435,0.000231660232
436,0.000154440154
437,0.000077220077
438,0.000077220077
439,0.000077220077
440,0.000038610039
441,0.000077220077
442,0.000231660232
443,0.000077220077
444,0.000038610039
445,0.000038610039
447,0.000154440154
448,0.000270270270
449,0.000038610039
450,0.000154440154
451,0.000115830116
452,0.000077220077
453,0.000077220077
454,0.000231660232
455,0.000038610039
456,0.000154440154
457,0.000231660232
458,0.000115830116
459,0.000038610039
460,0.000115830116
462,0.000115830116
464,0.000038610039
465,0.000077220077
467,0.000038610039
469,0.000115830116
470,0.000115830116
471,0.000154440154
472,0.000115830116
474,0.000115830116
475,0.000115830116
476,0.000038610039
477,0.000115830116
478,0.000115830116
479,0.000038610039
480,0.000077220077
481,0.000115830116
482,0.000115830116
484,0.000115830116
485,0.000077220077
486,0.000038610039
487,0.000038610039
488,0.000115830116
489,0.000154440154
490,0.000270270270
491,0.000231660232
493,0.000038610039
494,0.000077220077
495,0.000115830116
496,0.000115830116
497,0.000077220077
498,0.000115830116
500,0.000038610039
501,0.000154440154
502,0.000154440154
503,0.000115830116
507,0.000038610039
508,0.000038610039
509,0.000038610039
510,0.000077220077
512,0.000038610039
513,0.000038610039
515,0.000038610039
516,0.000038610039
518,0.000038610039
521,0.000077220077
523,0.000115830116
524,0.000038610039
525,0.000038610039
526,0.000038610039
527,0.000038610039
528,0.000038610039
530,0.000038610039
531,0.000077220077
532,0.000038610039
535,0.000038610039
536,0.000115830116
537,0.000077220077
539,0.000038610039
545,0.000038610039
547,0.000038610039
549,0.000038610039
550,0.000038610039
552,0.000038610039
553,0.000038610039
554,0.000038610039
557,0.000038610039
558,0.000038610039
559,0.000077220077
560,0.000038610039
565,0.000038610039
567,0.000038610039
570,0.000038610039
571,0.000038610039
573,0.000038610039
577,0.000038610039
583,0.000038610039
585,0.000038610039
586,0.000038610039
587,0.000038610039
589,0.000115830116
591,0.000038610039
597,0.000077220077
605,0.000038610039
607,0.000038610039
614,0.000077220077
617,0.000038610039
618,0.000038610039
626,0.000038610039
627,0.000038610039
628,0.000038610039
631,0.000077220077
636,0.000038610039
638,0.000038610039
642,0.000038610039
645,0.000038610039
646,0.000038610039
651,0.000038610039
652,0.000038610039
653,0.000038610039
654,0.000038610039
655,0.000038610039
659,0.000038610039
660,0.000038610039
666,0.000038610039
668,0.000038610039
675,0.000038610039
676,0.000038610039
680,0.000038610039
684,0.000038610039
691,0.000038610039
693,0.000038610039
711,0.000038610039
713,0.000038610039
722,0.000038610039
733,0.000038610039
746,0.000077220077
747,0.000038610039
749,0.000038610039
751,0.000038610039
769,0.000038610039
773,0.000038610039
790,0.000038610039
801,0.000038610039
807,0.000038610039
811,0.000038610039
831,0.000038610039
834,0.000038610039
838,0.000038610039
846,0.000038610039
852,0.000038610039
856,0.000038610039
877,0.000038610039
890,0.000077220077
895,0.000077220077
906,0.000038610039
908,0.000038610039
914,0.000038610039
920,0.000038610039
921,0.000038610039
922,0.000038610039
942,0.000038610039
955,0.000077220077
958,0.000038610039
961,0.000038610039
963,0.000038610039
969,0.000077220077
975,0.000038610039
978,0.000038610039
985,0.000038610039
996,0.000038610039
997,0.000038610039
999,0.000038610039
1000,0.000077220077
1002,0.000038610039
1012,0.000077220077
1014,0.000077220077
1019,0.000038610039
1030,0.000038610039
1033,0.000038610039
1046,0.000038610039
1052,0.000038610039
1053,0.000038610039
1056,0.000038610039
1062,0.000038610039
1064,0.000038610039
1074,0.000038610039
1076,0.000038610039
1088,0.000038610039
1095,0.000038610039
1097,0.000038610039
1101,0.000038610039
1108,0.000038610039
1109,0.000038610039
1124,0.000038610039
1125,0.000038610039
1133,0.000038610039
1134,0.000038610039
1142,0.000038610039
1143,0.000038610039
1147,0.000038610039
1170,0.000077220077
1172,0.000038610039
1174,0.000038610039
1175,0.000038610039
1178,0.000038610039
1182,0.000038610039
1195,0.000038610039
1216,0.000038610039
1223,0.000038610039
1228,0.000038610039
1230,0.000038610039
1232,0.000038610039
1244,0.000038610039
1252,0.000038610039
1254,0.000038610039
1284,0.000038610039
1286,0.000038610039
1305,0.000038610039
1317,0.000038610039
1336,0.000038610039
1341,0.000038610039
1348,0.000038610039
1399,0.000038610039
1409,0.000038610039
1425,0.000038610039
1442,0.000038610039
1455,0.000038610039
1456,0.000038610039
1500,0.000038610039
1515,0.000038610039
1519,0.000038610039
1522,0.000038610039
1540,0.000038610039
1549,0.000038610039
1553,0.000038610039
1571,0.000038610039
1581,0.000038610039
1596,0.000038610039
1601,0.000038610039
1619,0.000038610039
1620,0.000038610039
1653,0.000038610039
1689,0.000038610039
1703,0.000038610039
1722,0.000038610039
1723,0.000038610039
1736,0.000038610039
1749,0.000038610039
1805,0.000038610039
1811,0.000038610039
1817,0.000038610039
1838,0.000038610039
1847,0.000038610039
1854,0.000038610039
1900,0.000038610039
1940,0.000038610039
2003,0.000038610039
2019,0.000038610039
2060,0.000077220077
2089,0.000038610039
2102,0.000038610039
2113,0.000038610039
2116,0.000038610039
2156,0.000038610039
2187,0.000038610039
2215,0.000038610039
2224,0.000038610039
2228,0.000038610039
2247,0.000038610039
2258,0.000038610039
2277,0.000038610039
2298,0.000038610039
2306,0.000038610039
2333,0.000038610039
2348,0.000038610039
2369,0.000038610039
2421,0.000038610039
2426,0.000038610039
2458,0.000038610039
2464,0.000038610039
2475,0.000038610039
2516,0.000038610039
2531,0.000038610039
2561,0.000038610039
2566,0.000038610039
2572,0.000038610039
2599,0.000038610039
2619,0.000038610039
2630,0.000038610039
2637,0.000038610039
2682,0.000038610039
2746,0.000038610039
2780,0.000038610039
2821,0.000038610039
2861,0.000038610039
3011,0.000038610039
3079,0.000038610039
3104,0.000038610039
3177,0.000038610039
3250,0.000038610039
3425,0.000038610039
3460,0.000038610039
3549,0.000038610039
3573,0.000038610039
3625,0.000038610039
3647,0.000038610039
3722,0.000038610039
3723,0.000038610039
3748,0.000038610039
3792,0.000038610039
3836,0.000038610039
3907,0.000038610039
3934,0.000038610039
4019,0.000038610039
4176,0.000038610039
4221,0.000038610039
4230,0.000038610039
4355,0.000038610039
4370,0.000038610039
4418,0.000038610039
4444,0.000038610039
4496,0.000038610039
4504,0.000038610039
4552,0.000038610039
4768,0.000038610039
4891,0.000038610039
4931,0.000038610039
4938,0.000038610039
