round,Simple mean,Simple std,Simple min,Simple q1,Simple median,Simple q3,Simple max
0,0.0,0.0,0.0,0.0,0.0,0.0,0.0
1,0.0,0.0,0.0,0.0,0.0,0.0,0.0
2,0.0,0.0,0.0,0.0,0.0,0.0,0.0
3,0.0,0.0,0.0,0.0,0.0,0.0,0.0
4,0.0,0.0,0.0,0.0,0.0,0.0,0.0
5,0.0,0.0,0.0,0.0,0.0,0.0,0.0
6,0.0,0.0,0.0,0.0,0.0,0.0,0.0
7,0.0,0.0,0.0,0.0,0.0,0.0,0.0
8,0.0,0.0,0.0,0.0,0.0,0.0,0.0
9,0.0,0.0,0.0,0.0,0.0,0.0,0.0
10,0.0,0.0,0.0,0.0,0.0,0.0,0.0
11,0.0,0.0,0.0,0.0,0.0,0.0,0.0
12,0.0,0.0,0.0,0.0,0.0,0.0,0.0
13,0.0,0.0,0.0,0.0,0.0,0.0,0.0
14,0.0,0.0,0.0,0.0,0.0,0.0,0.0
15,0.0,0.0,0.0,0.0,0.0,0.0,0.0
16,0.0,0.0,0.0,0.0,0.0,0.0,0.0
17,0.0,0.0,0.0,0.0,0.0,0.0,0.0
18,0.0,0.0,0.0,0.0,0.0,0.0,0.0
19,0.0,0.0,0.0,0.0,0.0,0.0,0.0
20,0.0,0.0,0.0,0.0,0.0,0.0,0.0
21,0.0,0.0,0.0,0.0,0.0,0.0,0.0
22,0.0,0.0,0.0,0.0,0.0,0.0,0.0
23,0.0,0.0,0.0,0.0,0.0,0.0,0.0
24,0.0,0.0,0.0,0.0,0.0,0.0,0.0
25,0.0,0.0,0.0,0.0,0.0,0.0,0.0
26,0.0,0.0,0.0,0.0,0.0,0.0,0.0
27,0.0,0.0,0.0,0.0,0.0,0.0,0.0
28,0.0,0.0,0.0,0.0,0.0,0.0,0.0
29,0.0,0.0,0.0,0.0,0.0,0.0,0.0
30,0.0,0.0,0.0,0.0,0.0,0.0,0.0
31,0.0,0.0,0.0,0.0,0.0,0.0,0.0
32,0.0,0.0,0.0,0.0,0.0,0.0,0.0
33,0.0,0.0,0.0,0.0,0.0,0.0,0.0
34,0.0,0.0,0.0,0.0,0.0,0.0,0.0
35,0.0,0.0,0.0,0.0,0.0,0.0,0.0
36,0.0,0.0,0.0,0.0,0.0,0.0,0.0
37,0.0,0.0,0.0,0.0,0.0,0.0,0.0
38,0.0,0.0,0.0,0.0,0.0,0.0,0.0
39,0.0,0.0,0.0,0.0,0.0,0.0,0.0
40,0.0,0.0,0.0,0.0,0.0,0.0,0.0
41,0.0,0.0,0.0,0.0,0.0,0.0,0.0
42,0.0,0.0,0.0,0.0,0.0,0.0,0.0
43,0.0,0.0,0.0,0.0,0.0,0.0,0.0
44,0.0,0.0,0.0,0.0,0.0,0.0,0.0
45,0.0,0.0,0.0,0.0,0.0,0.0,0.0
46,0.0,0.0,0.0,0.0,0.0,0.0,0.0
47,0.0,0.0,0.0,0.0,0.0,0.0,0.0
48,0.0,0.0,0.0,0.0,0.0,0.0,0.0
49,0.0,0.0,0.0,0.0,0.0,0.0,0.0
50,0.0,0.0,0.0,0.0,0.0,0.0,0.0
51,0.0,0.0,0.0,0.0,0.0,0.0,0.0
52,0.0,0.0,0.0,0.0,0.0,0.0,0.0
53,0.0,0.0,0.0,0.0,0.0,0.0,0.0
54,0.0,0.0,0.0,0.0,0.0,0.0,0.0
55,0.0,0.0,0.0,0.0,0.0,0.0,0.0
56,0.0,0.0,0.0,0.0,0.0,0.0,0.0
57,0.0,0.0,0.0,0.0,0.0,0.0,0.0
58,0.0,0.0,0.0,0.0,0.0,0.0,0.0
59,0.0,0.0,0.0,0.0,0.0,0.0,0.0
60,0.0,0.0,0.0,0.0,0.0,0.0,0.0
61,0.0,0.0,0.0,0.0,0.0,0.0,0.0
62,0.0,0.0,0.0,0.0,0.0,0.0,0.0
63,0.0,0.0,0.0,0.0,0.0,0.0,0.0
64,0.0,0.0,0.0,0.0,0.0,0.0,0.0
65,0.0,0.0,0.0,0.0,0.0,0.0,0.0
66,0.0,0.0,0.0,0.0,0.0,0.0,0.0
67,0.0,0.0,0.0,0.0,0.0,0.0,0.0
68,0.0,0.0,0.0,0.0,0.0,0.0,0.0
69,0.0,0.0,0.0,0.0,0.0,0.0,0.0
70,0.0,0.0,0.0,0.0,0.0,0.0,0.0
71,0.0,0.0,0.0,0.0,0.0,0.0,0.0
72,0.0,0.0,0.0,0.0,0.0,0.0,0.0
73,0.0,0.0,0.0,0.0,0.0,0.0,0.0
74,0.0,0.0,0.0,0.0,0.0,0.0,0.0
75,0.0,0.0,0.0,0.0,0.0,0.0,0.0
76,0.0,0.0,0.0,0.0,0.0,0.0,0.0
77,0.0,0.0,0.0,0.0,0.0,0.0,0.0
78,0.0,0.0,0.0,0.0,0.0,0.0,0.0
79,0.0,0.0,0.0,0.0,0.0,0.0,0.0
80,0.0,0.0,0.0,0.0,0.0,0.0,0.0
81,0.0,0.0,0.0,0.0,0.0,0.0,0.0
82,0.0,0.0,0.0,0.0,0.0,0.0,0.0
83,0.0,0.0,0.0,0.0,0.0,0.0,0.0
84,0.0,0.0,0.0,0.0,0.0,0.0,0.0
85,0.0,0.0,0.0,0.0,0.0,0.0,0.0
86,0.0,0.0,0.0,0.0,0.0,0.0,0.0
87,0.0,0.0,0.0,0.0,0.0,0.0,0.0
88,0.0,0.0,0.0,0.0,0.0,0.0,0.0
89,0.0,0.0,0.0,0.0,0.0,0.0,0.0
90,9.999999999999999e-05,1.3552527156068805e-20,0.0001,0.0001,0.0001,0.0001,0.0001
91,0.001144,6.374950980203685e-05,0.0011,0.0011,0.0011,0.0012,0.0013
92,0.011500000000000002,0.0001649242250247065,0.0112,0.0114,0.0115,0.0116,0.0118
93,0.115092,0.0011306352196884734,0.1137,0.1145,0.1149,0.1155,0.1197
94,1.163652,0.002647431963242838,1.1565,1.1623,1.1635,1.1654,1.1691
95,10.943892,0.09429578959847575,10.7595,10.8661,10.9517,11.0073,11.103
96,65.991756,0.19504674327965585,65.5494,65.8478,66.0657,66.1399,66.2446
97,99.81086,0.0039009742372900042,99.8053,99.8077,99.8105,99.8135,99.8191
98,99.95470800000001,0.0019237297107449712,99.952,99.9532,99.9544,99.956,99.9589
99,99.95476400000001,0.0019429626862095585,99.952,99.9533,99.9545,99.9561,99.9589
100,99.95476400000001,0.0019429626862095585,99.952,99.9533,99.9545,99.9561,99.9589
101,99.95476400000001,0.0019429626862095585,99.952,99.9533,99.9545,99.9561,99.9589
102,99.95476400000001,0.0019429626862095585,99.952,99.9533,99.9545,99.9561,99.9589
103,99.95476400000001,0.0019429626862095585,99.952,99.9533,99.9545,99.9561,99.9589
104,99.95476400000001,0.0019429626862095585,99.952,99.9533,99.9545,99.9561,99.9589
105,99.95476400000001,0.0019429626862095585,99.952,99.9533,99.9545,99.9561,99.9589
106,99.95476400000001,0.0019429626862095585,99.952,99.9533,99.9545,99.9561,99.9589
107,99.95476400000001,0.0019429626862095585,99.952,99.9533,99.9545,99.9561,99.9589
108,99.95476400000001,0.0019429626862095585,99.952,99.9533,99.9545,99.9561,99.9589
109,99.95476400000001,0.0019429626862095585,99.952,99.9533,99.9545,99.9561,99.9589
110,99.95476400000001,0.0019429626862095585,99.952,99.9533,99.9545,99.9561,99.9589
111,99.95476400000001,0.0019429626862095585,99.952,99.9533,99.9545,99.9561,99.9589
112,99.95476400000001,0.0019429626862095585,99.952,99.9533,99.9545,99.9561,99.9589
113,99.95476400000001,0.0019429626862095585,99.952,99.9533,99.9545,99.9561,99.9589
114,99.95476400000001,0.0019429626862095585,99.952,99.9533,99.9545,99.9561,99.9589
115,99.95476400000001,0.0019429626862095585,99.952,99.9533,99.9545,99.9561,99.9589
116,99.95476400000001,0.0019429626862095585,99.952,99.9533,99.9545,99.9561,99.9589
117,99.95476400000001,0.0019429626862095585,99.952,99.9533,99.9545,99.9561,99.9589
118,99.95476400000001,0.0019429626862095585,99.952,99.9533,99.9545,99.9561,99.9589
119,99.95476400000001,0.0019429626862095585,99.952,99.9533,99.9545,99.9561,99.9589
120,99.95476400000001,0.0019429626862095585,99.952,99.9533,99.9545,99.9561,99.9589
121,99.95476400000001,0.0019429626862095585,99.952,99.9533,99.9545,99.9561,99.9589
122,99.95476400000001,0.0019429626862095585,99.952,99.9533,99.9545,99.9561,99.9589
123,99.95476400000001,0.0019429626862095585,99.952,99.9533,99.9545,99.9561,99.9589
