round,P mean,P std,P min,P q1,P q2,P q3,P max,S mean,S std,S min,S q1,S q2,S q3,S max,P+S mean,P+S std,P+S min,P+S q1,P+S q2,P+S q3,P+S max
0,100.0,0.0,100.0,100.0,100.0,100.0,100.0,100.0,0.0,100.0,100.0,100.0,100.0,100.0,100.0,0.0,100.0,100.0,100.0,100.0,100.0
1,100.0,0.0,100.0,100.0,100.0,100.0,100.0,100.0,0.0,100.0,100.0,100.0,100.0,100.0,100.0,0.0,100.0,100.0,100.0,100.0,100.0
2,99.99799999999999,0.004082482904641105,99.99,100.0,100.0,100.0,100.0,100.0,0.0,100.0,100.0,100.0,100.0,100.0,99.99998,4.082482904847408e-05,99.9999,100.0,100.0,100.0,100.0
3,99.8516,0.042493136700727296,99.78,99.81,99.85,99.89,99.93,100.0,0.0,100.0,100.0,100.0,100.0,100.0,99.99851599999998,0.0004249313670087931,99.9978,99.9981,99.9985,99.9989,99.9993
4,92.46640000000001,0.21236525139485196,92.17,92.31,92.46,92.55,92.98,99.99999192,2.7965633675528043e-05,99.999899,100.0,100.0,100.0,100.0,99.92465600000001,0.0021109002818703515,99.9217,99.9231,99.9246,99.9255,99.9297
5,66.6684,0.38595854699695226,65.74,66.46,66.68,66.93,67.32,99.99541427999999,0.001036599027266181,99.992929,99.994646,99.995859,99.996061,99.996768,99.66214399999998,0.004292442971858356,99.6515,99.6605,99.6621,99.6651,99.6691
6,66.4224,0.44746768970880263,65.48,66.01,66.48,66.67,67.35,98.65301804,0.033222745883504386,98.539293,98.644545,98.655253,98.67292900000001,98.708384,98.33071200000002,0.032604272726132234,98.2187,98.3234,98.3336,98.3494,98.3857
7,66.50440000000002,0.4562627167177547,65.7,66.19,66.44,66.92,67.41,73.96614544,0.1908511170553053,73.395455,73.883939,73.97100999999999,74.041111,74.459192,73.89152800000001,0.18904505970799748,73.3341,73.8143,73.902,73.967,74.3841
8,66.52639999999998,0.5875151061887773,65.45,66.06,66.54,66.83,67.9,71.19832736,0.26339715291644983,70.388182,71.090808,71.221414,71.333636,71.571111,71.15160800000001,0.26014843826810313,70.3546,71.0398,71.173,71.2865,71.5255
9,66.41159999999999,0.404100647528969,65.79,66.2,66.32,66.74,67.27,71.20362024,0.2964175265855707,70.49596,71.06434300000001,71.272424,71.36899,71.751111,71.15569999999998,0.2922192541568738,70.4539,71.0236,71.2236,71.328,71.6933
10,66.4364,0.4358696288264799,65.3,66.21,66.51,66.81,67.17,71.1424404,0.3696018961865166,70.42212099999999,70.99798,71.120101,71.407576,72.03070699999999,71.09538,0.3655760876115031,70.3865,70.9535,71.0704,71.3619,71.9732
11,66.48240000000001,0.5305051052220571,65.66,66.11,66.43,66.94,67.6,71.24472727999999,0.26225035544105574,70.642222,71.083333,71.186061,71.398081,71.775859,71.197104,0.2612281609372693,70.5975,71.0352,71.1387,71.3453,71.7259
12,66.3764,0.38434879992006965,65.51,66.19,66.41,66.56,67.22,71.01202824,0.34047968642518067,70.428283,70.754949,70.968687,71.320808,71.61070699999999,70.965672,0.33560098519919057,70.3885,70.7139,70.9226,71.2665,71.5598
13,66.7572,5.925820280771262,38.39,67.45,68.07,68.25,68.59,71.13753940000001,0.2746030312771196,70.570808,70.98201999999999,71.058485,71.38,71.66,71.093736,0.2824246800476155,70.5476,70.9007,71.0338,71.3407,71.623
14,77.01720000000002,2.26769986256265,66.26,77.19,77.51,77.72,78.0,71.226392,0.2951591806508845,70.435253,71.12565699999999,71.285253,71.434242,71.687374,71.2843,0.2954571147673811,70.5036,71.1716,71.3523,71.4975,71.7461
15,99.86159999999998,0.03670603946673345,99.75,99.84,99.86,99.88,99.92,70.92808892,1.9744767759401884,61.535354000000005,71.05171700000001,71.352121,71.54596,71.71777800000001,71.21742400000001,1.9547143225375243,61.9188,71.3399,71.6376,71.8291,71.9996
16,100.0,0.0,100.0,100.0,100.0,100.0,100.0,73.86924844,7.577787943598647,37.520101000000004,75.13798,75.454444,75.593131,75.819192,74.130556,7.502010073311465,38.1449,75.3866,75.6999,75.8372,76.061
17,100.0,0.0,100.0,100.0,100.0,100.0,100.0,97.55354344000001,0.09268748522727943,97.38686899999999,97.479495,97.540707,97.613636,97.784242,97.57800800000001,0.09176072562194952,97.413,97.5047,97.5653,97.6375,97.8064
18,100.0,0.0,100.0,100.0,100.0,100.0,100.0,99.99884051999999,0.0003376583727189769,99.998081,99.998687,99.998889,99.999091,99.99929300000001,99.998852,0.00033431522051889325,99.9981,99.9987,99.9989,99.9991,99.9993
19,100.0,0.0,100.0,100.0,100.0,100.0,100.0,100.0,0.0,100.0,100.0,100.0,100.0,100.0,100.0,0.0,100.0,100.0,100.0,100.0,100.0
20,100.0,0.0,100.0,100.0,100.0,100.0,100.0,100.0,0.0,100.0,100.0,100.0,100.0,100.0,100.0,0.0,100.0,100.0,100.0,100.0,100.0
21,100.0,0.0,100.0,100.0,100.0,100.0,100.0,100.0,0.0,100.0,100.0,100.0,100.0,100.0,100.0,0.0,100.0,100.0,100.0,100.0,100.0
22,100.0,0.0,100.0,100.0,100.0,100.0,100.0,100.0,0.0,100.0,100.0,100.0,100.0,100.0,100.0,0.0,100.0,100.0,100.0,100.0,100.0
23,100.0,0.0,100.0,100.0,100.0,100.0,100.0,100.0,0.0,100.0,100.0,100.0,100.0,100.0,100.0,0.0,100.0,100.0,100.0,100.0,100.0
24,100.0,0.0,100.0,100.0,100.0,100.0,100.0,100.0,0.0,100.0,100.0,100.0,100.0,100.0,100.0,0.0,100.0,100.0,100.0,100.0,100.0
25,100.0,0.0,100.0,100.0,100.0,100.0,100.0,100.0,0.0,100.0,100.0,100.0,100.0,100.0,100.0,0.0,100.0,100.0,100.0,100.0,100.0
