gossips,p2p mean,p2p std,p2p min,p2p q1,p2p q2,p2p q3,p2p max,p2s mean,p2s std,p2s min,p2s q1,p2s q2,p2s q3,p2s max,s2s mean,s2s std,s2s min,s2s q1,s2s q2,s2s q3,s2s max
1,5366.36,36.595628154193584,5293.0,5353.0,5372.0,5392.0,5432.0,2830.6,48.656962502811545,2738.0,2802.0,2825.0,2863.0,2917.0,713.88,120.36656512503798,517.0,617.0,719.0,777.0,1026.0
2,580.28,12.306908628896215,558.0,574.0,580.0,591.0,600.0,18.0,4.573474244670748,9.0,16.0,18.0,20.0,28.0,,,,,,,
3,6.04,2.2634781495153278,1.0,4.0,6.0,8.0,10.0,,,,,,,,,,,,,,
4,,,,,,,,,,,,,,,,,,,,,
5,,,,,,,,,,,,,,,,,,,,,
