round,P+S mean,P+S std,P+S min,P+S q1,P+S median,P+S q3,P+S max,P mean,P std,P min,P q1,P median,P q3,P max,S mean,S std,S min,S q1,S median,S q3,S max
0,0.00011199999999999998,3.249615361854386e-05,0.0001,0.0001,0.0001,0.0001,0.0002,0.00024,0.0005122499389946279,0.0,0.0,0.0,0.0,0.002,9.768e-05,3.607073051658365e-05,0.0,0.00011100000000000001,0.00011100000000000001,0.00011100000000000001,0.00011100000000000001
1,0.0011759999999999997,8.138795979750317e-05,0.0011,0.0011,0.0012,0.0012,0.0013,0.010880000000000003,0.0009516301802696254,0.01,0.01,0.011,0.012,0.013,9.768e-05,3.607073051658365e-05,0.0,0.00011100000000000001,0.00011100000000000001,0.00011100000000000001,0.00011100000000000001
2,0.011727999999999999,0.0002457966639317956,0.0113,0.0116,0.0118,0.0119,0.0123,0.11639999999999999,0.0023832750575625947,0.112,0.115,0.117,0.118,0.122,9.768e-05,3.607073051658365e-05,0.0,0.00011100000000000001,0.00011100000000000001,0.00011100000000000001,0.00011100000000000001
3,0.116096,0.0020359724949026215,0.1127,0.1144,0.1153,0.1182,0.1193,1.15896,0.021281879616236943,1.125,1.142,1.152,1.181,1.192,0.00022208,0.00031578865337437317,0.0,0.00011100000000000001,0.00011100000000000001,0.00022200000000000003,0.001333
4,1.1073039999999998,0.005799826204292683,1.0933,1.1037,1.1083,1.1111,1.1179,10.9528,0.0702731812286879,10.788,10.909,10.954,10.992,11.101,0.013359960000000004,0.005250010251266182,0.006111,0.009222,0.012,0.015444,0.03
5,7.479148,0.08023654588776856,7.2984,7.4524,7.4968,7.535,7.61,66.11728,0.38087609743852446,65.374,65.889,66.254,66.392,66.668,0.96380004,0.0685350525167844,0.827778,0.923,0.953778,1.009,1.134556
6,40.183547999999995,0.3244358218446292,39.4758,40.0504,40.2125,40.392,40.9111,99.85027999999998,0.012542790758042223,99.83,99.843,99.85,99.856,99.882,33.553911119999995,0.36055340619756493,32.768667,33.406667,33.584889000000004,33.787778,34.362778000000006
7,98.801408,0.02995826323403908,98.7528,98.7753,98.7989,98.8267,98.8758,99.99524000000002,0.002354230235130476,99.987,99.994,99.996,99.996,99.999,98.66876003999998,0.03334198559591731,98.614778,98.639889,98.665889,98.697778,98.751333
8,99.99785599999997,0.0004400727212621249,99.9972,99.9975,99.9979,99.9981,99.9987,99.99528000000002,0.0023752052542891544,99.987,99.994,99.996,99.997,99.999,99.99814220000002,0.00041756197144976996,99.997222,99.997889,99.998111,99.99844399999999,99.998889
9,99.99806799999999,0.0004066644808690605,99.9974,99.9977,99.9981,99.9983,99.9988,99.99528000000002,0.0023752052542891544,99.987,99.994,99.996,99.997,99.999,99.99837779999996,0.0003771237462689401,99.997556,99.998111,99.99844399999999,99.998667,99.999111
10,99.99806799999999,0.0004066644808690605,99.9974,99.9977,99.9981,99.9983,99.9988,99.99528000000002,0.0023752052542891544,99.987,99.994,99.996,99.997,99.999,99.99837779999996,0.0003771237462689401,99.997556,99.998111,99.99844399999999,99.998667,99.999111
11,99.99806799999999,0.0004066644808690605,99.9974,99.9977,99.9981,99.9983,99.9988,99.99528000000002,0.0023752052542891544,99.987,99.994,99.996,99.997,99.999,99.99837779999996,0.0003771237462689401,99.997556,99.998111,99.99844399999999,99.998667,99.999111
12,99.99806799999999,0.0004066644808690605,99.9974,99.9977,99.9981,99.9983,99.9988,99.99528000000002,0.0023752052542891544,99.987,99.994,99.996,99.997,99.999,99.99837779999996,0.0003771237462689401,99.997556,99.998111,99.99844399999999,99.998667,99.999111
13,99.99806799999999,0.0004066644808690605,99.9974,99.9977,99.9981,99.9983,99.9988,99.99528000000002,0.0023752052542891544,99.987,99.994,99.996,99.997,99.999,99.99837779999996,0.0003771237462689401,99.997556,99.998111,99.99844399999999,99.998667,99.999111
14,99.99806799999999,0.0004066644808690605,99.9974,99.9977,99.9981,99.9983,99.9988,99.99528000000002,0.0023752052542891544,99.987,99.994,99.996,99.997,99.999,99.99837779999996,0.0003771237462689401,99.997556,99.998111,99.99844399999999,99.998667,99.999111
15,99.99806799999999,0.0004066644808690605,99.9974,99.9977,99.9981,99.9983,99.9988,99.99528000000002,0.0023752052542891544,99.987,99.994,99.996,99.997,99.999,99.99837779999996,0.0003771237462689401,99.997556,99.998111,99.99844399999999,99.998667,99.999111
16,99.99806799999999,0.0004066644808690605,99.9974,99.9977,99.9981,99.9983,99.9988,99.99528000000002,0.0023752052542891544,99.987,99.994,99.996,99.997,99.999,99.99837779999996,0.0003771237462689401,99.997556,99.998111,99.99844399999999,99.998667,99.999111
17,99.99806799999999,0.0004066644808690605,99.9974,99.9977,99.9981,99.9983,99.9988,99.99528000000002,0.0023752052542891544,99.987,99.994,99.996,99.997,99.999,99.99837779999996,0.0003771237462689401,99.997556,99.998111,99.99844399999999,99.998667,99.999111
18,99.99806799999999,0.0004066644808690605,99.9974,99.9977,99.9981,99.9983,99.9988,99.99528000000002,0.0023752052542891544,99.987,99.994,99.996,99.997,99.999,99.99837779999996,0.0003771237462689401,99.997556,99.998111,99.99844399999999,99.998667,99.999111
19,99.99806799999999,0.0004066644808690605,99.9974,99.9977,99.9981,99.9983,99.9988,99.99528000000002,0.0023752052542891544,99.987,99.994,99.996,99.997,99.999,99.99837779999996,0.0003771237462689401,99.997556,99.998111,99.99844399999999,99.998667,99.999111
20,99.99806799999999,0.0004066644808690605,99.9974,99.9977,99.9981,99.9983,99.9988,99.99528000000002,0.0023752052542891544,99.987,99.994,99.996,99.997,99.999,99.99837779999996,0.0003771237462689401,99.997556,99.998111,99.99844399999999,99.998667,99.999111
21,99.99806799999999,0.0004066644808690605,99.9974,99.9977,99.9981,99.9983,99.9988,99.99528000000002,0.0023752052542891544,99.987,99.994,99.996,99.997,99.999,99.99837779999996,0.0003771237462689401,99.997556,99.998111,99.99844399999999,99.998667,99.999111
22,99.99806799999999,0.0004066644808690605,99.9974,99.9977,99.9981,99.9983,99.9988,99.99528000000002,0.0023752052542891544,99.987,99.994,99.996,99.997,99.999,99.99837779999996,0.0003771237462689401,99.997556,99.998111,99.99844399999999,99.998667,99.999111
23,99.99806799999999,0.0004066644808690605,99.9974,99.9977,99.9981,99.9983,99.9988,99.99528000000002,0.0023752052542891544,99.987,99.994,99.996,99.997,99.999,99.99837779999996,0.0003771237462689401,99.997556,99.998111,99.99844399999999,99.998667,99.999111
24,99.99806799999999,0.0004066644808690605,99.9974,99.9977,99.9981,99.9983,99.9988,99.99528000000002,0.0023752052542891544,99.987,99.994,99.996,99.997,99.999,99.99837779999996,0.0003771237462689401,99.997556,99.998111,99.99844399999999,99.998667,99.999111
