round,P mean,P std,P min,P q1,P q2,P q3,P max,S mean,S std,S min,S q1,S q2,S q3,S max,P+S mean,P+S std,P+S min,P+S q1,P+S q2,P+S q3,P+S max
0,0.0,0.0,0.0,0.0,0.0,0.0,0.0,0.0,0.0,0.0,0.0,0.0,0.0,0.0,0.0,0.0,0.0,0.0,0.0,0.0,0.0
1,0.0,0.0,0.0,0.0,0.0,0.0,0.0,0.0,0.0,0.0,0.0,0.0,0.0,0.0,0.0,0.0,0.0,0.0,0.0,0.0,0.0
2,0.0,0.0,0.0,0.0,0.0,0.0,0.0,0.0,0.0,0.0,0.0,0.0,0.0,0.0,0.0,0.0,0.0,0.0,0.0,0.0,0.0
3,0.0,0.0,0.0,0.0,0.0,0.0,0.0,0.0,0.0,0.0,0.0,0.0,0.0,0.0,0.0,0.0,0.0,0.0,0.0,0.0,0.0
4,0.0,0.0,0.0,0.0,0.0,0.0,0.0,0.0,0.0,0.0,0.0,0.0,0.0,0.0,0.0,0.0,0.0,0.0,0.0,0.0,0.0
5,0.0,0.0,0.0,0.0,0.0,0.0,0.0,0.0,0.0,0.0,0.0,0.0,0.0,0.0,0.0,0.0,0.0,0.0,0.0,0.0,0.0
6,0.0,0.0,0.0,0.0,0.0,0.0,0.0,0.0,0.0,0.0,0.0,0.0,0.0,0.0,0.0,0.0,0.0,0.0,0.0,0.0,0.0
7,0.0,0.0,0.0,0.0,0.0,0.0,0.0,0.0,0.0,0.0,0.0,0.0,0.0,0.0,0.0,0.0,0.0,0.0,0.0,0.0,0.0
8,0.0,0.0,0.0,0.0,0.0,0.0,0.0,0.0,0.0,0.0,0.0,0.0,0.0,0.0,0.0,0.0,0.0,0.0,0.0,0.0,0.0
9,0.0,0.0,0.0,0.0,0.0,0.0,0.0,0.0,0.0,0.0,0.0,0.0,0.0,0.0,0.0,0.0,0.0,0.0,0.0,0.0,0.0
10,0.0004,0.0020000000000000005,0.0,0.0,0.0,0.0,0.01,0.0,0.0,0.0,0.0,0.0,0.0,0.0,4e-06,2e-05,0.0,0.0,0.0,0.0,0.0001
11,0.07960000000000003,0.02491318258807306,0.04,0.06,0.08,0.1,0.13,0.0,0.0,0.0,0.0,0.0,0.0,0.0,0.000796,0.00024913182588073054,0.0004,0.0006,0.0008,0.001,0.0013
12,7.105199999999997,0.14989218347421152,6.72,6.99,7.13,7.24,7.32,0.0,0.0,0.0,0.0,0.0,0.0,0.0,0.07105199999999999,0.0014989218347421136,0.0672,0.0699,0.0713,0.0724,0.0732
13,65.4972,0.5363885407674807,64.38,65.18,65.48,65.95,66.4,0.0019755600000000003,0.0004844491786211084,0.001212,0.001616,0.00202,0.002222,0.00303,0.656928,0.005297209957452421,0.6461,0.6531,0.6568,0.6612,0.6653
14,99.81119999999999,0.03854867053479169,99.73,99.78,99.81,99.83,99.9,1.43114336,0.0330870143697897,1.339899,1.4161620000000001,1.434242,1.453333,1.480404,2.4149439999999998,0.03279624063821953,2.3244,2.4004,2.4184,2.4372,2.4638
15,99.9576,0.018991226044321588,99.93,99.94,99.96,99.97,99.99,35.409810119999996,0.4399956068144614,34.668889,35.133939,35.408687,35.705556,36.241009999999996,36.055288,0.4356361644384751,35.3217,35.7819,36.0543,36.3479,36.8784
16,99.95800000000001,0.018929694485998818,99.93,99.94,99.96,99.97,99.99,97.43782631999999,0.09340908582668109,97.244646,97.378687,97.415051,97.48595999999999,97.622828,97.463028,0.09250794344270875,97.2717,97.4042,97.4405,97.5105,97.6464
17,99.95800000000001,0.018929694485998818,99.93,99.94,99.96,99.97,99.99,99.95789915999998,0.0019347320158958883,99.954646,99.95676800000001,99.957576,99.959293,99.961616,99.95790000000001,0.001897366596099948,99.9549,99.9567,99.9578,99.9593,99.9616
18,99.95800000000001,0.018929694485998818,99.93,99.94,99.96,99.97,99.99,99.95908696000001,0.0019498668433162358,99.956162,99.957778,99.958889,99.960505,99.96303,99.95907599999998,0.001920564153226457,99.9562,99.9578,99.9588,99.9604,99.963
19,99.95800000000001,0.018929694485998818,99.93,99.94,99.96,99.97,99.99,99.95908696000001,0.0019498668433162358,99.956162,99.957778,99.958889,99.960505,99.96303,99.95907599999998,0.001920564153226457,99.9562,99.9578,99.9588,99.9604,99.963
20,99.95800000000001,0.018929694485998818,99.93,99.94,99.96,99.97,99.99,99.95908696000001,0.0019498668433162358,99.956162,99.957778,99.958889,99.960505,99.96303,99.95907599999998,0.001920564153226457,99.9562,99.9578,99.9588,99.9604,99.963
21,99.95800000000001,0.018929694485998818,99.93,99.94,99.96,99.97,99.99,99.95908696000001,0.0019498668433162358,99.956162,99.957778,99.958889,99.960505,99.96303,99.95907599999998,0.001920564153226457,99.9562,99.9578,99.9588,99.9604,99.963
22,99.95800000000001,0.018929694485998818,99.93,99.94,99.96,99.97,99.99,99.95908696000001,0.0019498668433162358,99.956162,99.957778,99.958889,99.960505,99.96303,99.95907599999998,0.001920564153226457,99.9562,99.9578,99.9588,99.9604,99.963
23,99.95800000000001,0.018929694485998818,99.93,99.94,99.96,99.97,99.99,99.95908696000001,0.0019498668433162358,99.956162,99.957778,99.958889,99.960505,99.96303,99.95907599999998,0.001920564153226457,99.9562,99.9578,99.9588,99.9604,99.963
24,99.95800000000001,0.018929694485998818,99.93,99.94,99.96,99.97,99.99,99.95908696000001,0.0019498668433162358,99.956162,99.957778,99.958889,99.960505,99.96303,99.95907599999998,0.001920564153226457,99.9562,99.9578,99.9588,99.9604,99.963
25,99.95800000000001,0.018929694485998818,99.93,99.94,99.96,99.97,99.99,99.95908696000001,0.0019498668433162358,99.956162,99.957778,99.958889,99.960505,99.96303,99.95907599999998,0.001920564153226457,99.9562,99.9578,99.9588,99.9604,99.963
