round,P mean,P std,P min,P q1,P q2,P q3,P max,S mean,S std,S min,S q1,S q2,S q3,S max,P+S mean,P+S std,P+S min,P+S q1,P+S q2,P+S q3,P+S max
0,100.0,0.0,100.0,100.0,100.0,100.0,100.0,100.0,0.0,100.0,100.0,100.0,100.0,100.0,100.0,0.0,100.0,100.0,100.0,100.0,100.0
1,100.0,0.0,100.0,100.0,100.0,100.0,100.0,99.99989999999998,0.0,99.9999,99.9999,99.9999,99.9999,99.9999,99.99989999999998,0.0,99.9999,99.9999,99.9999,99.9999,99.9999
2,99.104,0.10598742063723265,99.0,99.0,99.1,99.2,99.4,99.99980000000004,0.0,99.9998,99.9998,99.9998,99.9998,99.9998,99.998904,0.00010598742063611589,99.9988,99.9988,99.9989,99.999,99.9992
3,95.64,0.46904157598233964,94.7,95.4,95.7,96.0,96.4,99.99969999999999,0.0,99.9997,99.9997,99.9997,99.9997,99.9997,99.99534,0.0004690415759809406,99.9944,99.9951,99.9954,99.9957,99.9961
4,95.49199999999999,0.5195510882803844,94.4,95.2,95.3,95.8,96.7,99.99960000000004,0.0,99.9996,99.9996,99.9996,99.9996,99.9996,99.995092,0.0005195510882810988,99.994,99.9948,99.9949,99.9954,99.9963
5,95.31599999999999,0.5063595560468861,94.6,94.9,95.3,95.6,96.6,99.99949904,2.9012181350693556e-05,99.999399,99.999499,99.999499,99.999499,99.9996,99.99481599999999,0.0005080026246645496,99.9941,99.9944,99.9948,99.9951,99.9961
6,95.63600000000001,0.5376492040974933,94.4,95.3,95.7,95.9,96.7,99.79768568,0.01920446108486133,99.761261,99.780681,99.8004,99.811011,99.833433,99.79352399999999,0.019159729469209,99.7568,99.7765,99.7957,99.8066,99.8295
7,95.48800000000001,0.5418486873657625,94.7,95.1,95.3,95.8,96.5,97.71654452000003,0.16324868003757512,97.325225,97.601502,97.738238,97.828929,98.003103,97.714316,0.16292787432889835,97.3235,97.6004,97.7353,97.8258,98.0
8,95.316,0.49470529947973485,94.5,95.0,95.2,95.6,96.4,95.65937944000001,0.32095381800594,94.722222,95.465766,95.682182,95.924424,96.127528,95.659036,0.3204396457473162,94.7232,95.4655,95.6819,95.923,96.1269
9,95.34799999999997,0.6205642593640103,94.1,95.0,95.3,95.8,96.5,95.56829624000002,0.31047227823849893,94.99339300000001,95.41491500000001,95.54424399999999,95.772272,96.092993,95.56807600000002,0.31029891674534466,94.9935,95.415,95.5439,95.7723,96.0926
10,95.228,0.519230199429887,94.1,95.1,95.3,95.5,96.3,95.60872472,0.2967729086910735,94.872072,95.506807,95.648849,95.796196,96.262763,95.60834400000003,0.29659336512021583,94.872,95.5058,95.6484,95.7959,96.2622
11,96.27599999999998,0.6036555309114662,95.2,95.9,96.2,96.6,97.3,95.72032831999996,0.2914767643128839,95.169169,95.521221,95.78989,95.93243199999999,96.198098,95.72088400000001,0.2911223005886022,95.1702,95.5222,95.79,95.9336,96.198
12,99.876,0.09255628917943384,99.7,99.8,99.9,99.9,100.0,95.64595795999999,0.361602386658614,94.837738,95.47897900000001,95.661461,95.862062,96.423624,95.650188,0.3612515101698557,94.8429,95.4834,95.6655,95.866,96.4272
13,99.96400000000001,0.05686240703077339,99.8,99.9,100.0,100.0,100.0,95.62553759999999,0.2311555474999466,95.224525,95.47978,95.64434399999999,95.783884,96.061862,95.62987599999998,0.2309139906256578,95.2293,95.4843,95.6486,95.7881,96.0658
14,99.96800000000002,0.0556776436282985,99.8,99.9,100.0,100.0,100.0,95.69405404000001,0.30267214806694337,94.49789799999999,95.645145,95.68959,95.895195,95.98979,95.69832800000002,0.30236146899585814,94.5034,95.6495,95.6939,95.8993,95.9938
15,99.96800000000002,0.0556776436282985,99.8,99.9,100.0,100.0,100.0,95.82642248,0.2667884923697539,95.293594,95.66996999999999,95.877477,95.996697,96.34164200000001,95.83056399999998,0.2665328698928766,95.2982,95.6743,95.8816,96.0007,96.3453
16,99.96800000000002,0.0556776436282985,99.8,99.9,100.0,100.0,100.0,97.99786196000001,0.17217079241736516,97.659059,97.86967,98.012513,98.133534,98.3003,97.99983200000003,0.1719931895938535,97.6614,97.8718,98.0145,98.1354,98.302
17,99.96800000000002,0.0556776436282985,99.8,99.9,100.0,100.0,100.0,99.95497088000002,0.0022978923734572206,99.95035,99.953353,99.954755,99.95695699999999,99.959159,99.95498400000001,0.0022892283998454475,99.9503,99.9534,99.9548,99.9568,99.9591
18,99.96800000000002,0.0556776436282985,99.8,99.9,100.0,100.0,100.0,99.95984772,0.0021575964736981167,99.95575600000001,99.958559,99.95935899999999,99.961361,99.963964,99.95985599999999,0.0021473006310237857,99.9557,99.9586,99.9594,99.9614,99.9639
19,99.96800000000002,0.0556776436282985,99.8,99.9,100.0,100.0,100.0,99.95984772,0.0021575964736981167,99.95575600000001,99.958559,99.95935899999999,99.961361,99.963964,99.95985599999999,0.0021473006310237857,99.9557,99.9586,99.9594,99.9614,99.9639
20,99.96800000000002,0.0556776436282985,99.8,99.9,100.0,100.0,100.0,99.95984772,0.0021575964736981167,99.95575600000001,99.958559,99.95935899999999,99.961361,99.963964,99.95985599999999,0.0021473006310237857,99.9557,99.9586,99.9594,99.9614,99.9639
21,99.96800000000002,0.0556776436282985,99.8,99.9,100.0,100.0,100.0,99.95984772,0.0021575964736981167,99.95575600000001,99.958559,99.95935899999999,99.961361,99.963964,99.95985599999999,0.0021473006310237857,99.9557,99.9586,99.9594,99.9614,99.9639
22,99.96800000000002,0.0556776436282985,99.8,99.9,100.0,100.0,100.0,99.95984772,0.0021575964736981167,99.95575600000001,99.958559,99.95935899999999,99.961361,99.963964,99.95985599999999,0.0021473006310237857,99.9557,99.9586,99.9594,99.9614,99.9639
23,99.96800000000002,0.0556776436282985,99.8,99.9,100.0,100.0,100.0,99.95984772,0.0021575964736981167,99.95575600000001,99.958559,99.95935899999999,99.961361,99.963964,99.95985599999999,0.0021473006310237857,99.9557,99.9586,99.9594,99.9614,99.9639
24,99.96800000000002,0.0556776436282985,99.8,99.9,100.0,100.0,100.0,99.95984772,0.0021575964736981167,99.95575600000001,99.958559,99.95935899999999,99.961361,99.963964,99.95985599999999,0.0021473006310237857,99.9557,99.9586,99.9594,99.9614,99.9639
25,99.96800000000002,0.0556776436282985,99.8,99.9,100.0,100.0,100.0,99.95984772,0.0021575964736981167,99.95575600000001,99.958559,99.95935899999999,99.961361,99.963964,99.95985599999999,0.0021473006310237857,99.9557,99.9586,99.9594,99.9614,99.9639
