,mean,std,min,q1,q2,q3,max
Simple,,,,,,,
P,3.2339924237272544,0.6565554318318177,1.0,3.0,3.0,4.0,5.0
S,6.628336032122231,0.6247960923597076,3.0,6.0,7.0,7.0,10.0
P+S,6.624941655329215,0.6339724060891172,1.0,6.0,7.0,7.0,10.0
