gossips,p2p mean,p2p std,p2p min,p2p q1,p2p q2,p2p q3,p2p max,p2s mean,p2s std,p2s min,p2s q1,p2s q2,p2s q3,p2s max,s2s mean,s2s std,s2s min,s2s q1,s2s q2,s2s q3,s2s max
1,49.2934,0.1998980990404861,48.909,49.185,49.246,49.388,49.705,48.404799999999994,0.2098332671432251,48.063,48.263,48.363,48.578,48.753,31.11048892000001,0.20540150372074598,30.783222,30.975778000000002,31.113667,31.213444,31.589778000000003
2,22.26712,0.15343058148013852,21.99,22.167,22.258,22.342,22.627,14.769079999999999,0.19862064343869196,14.358,14.704,14.762,14.903,15.042,0.04559108000000001,0.002023263698417321,0.041888999999999996,0.044111000000000004,0.045889,0.046778,0.050889
3,2.0551600000000003,0.0410311670156562,1.937,2.038,2.055,2.091,2.111,0.001,0.0,0.001,0.001,0.001,0.001,0.001,,,,,,,
4,0.024200000000000013,0.005330728530573158,0.016,0.021,0.023,0.028,0.035,,,,,,,,,,,,,,
5,,,,,,,,,,,,,,,,,,,,,
