gossips,p2p mean,p2p std,p2p min,p2p q1,p2p q2,p2p q3,p2p max,p2s mean,p2s std,p2s min,p2s q1,p2s q2,p2s q3,p2s max,s2s mean,s2s std,s2s min,s2s q1,s2s q2,s2s q3,s2s max
1,,,,,,,,,,,,,,,1.1789429200000001,2.201779051342628,0.28969,0.41991999999999996,0.608408,0.977377,11.532833
2,,,,,,,,,,,,,,,0.0016098750000000002,0.002009137935674208,0.0002,0.0004,0.000951,0.001552,0.008408
3,,,,,,,,,,,,,,,0.0001,,0.0001,0.0001,0.0001,0.0001,0.0001
4,,,,,,,,,,,,,,,,,,,,,
5,,,,,,,,,,,,,,,,,,,,,
6,,,,,,,,,,,,,,,,,,,,,
7,,,,,,,,,,,,,,,,,,,,,
