round,nodes,nodesP,nodesS,nodesSent,nodesSentP,nodesSentS,nodesRecv,nodesRecvP,nodesRecvS,msgSent,msgSentP,msgSentS,msgRecv,msgRecvP,msgRecvS,msgInfect,msgInfectP,msgInfectS
0,1000000.0,990000.0,10000.0,0.0,0.0,0.0,0.0,0.0,0.0,0.0,0.0,0.0,0.0,0.0,0.0,0.0,0.0,0.0
1,1000000.0,990000.0,10000.0,0.0001,0.000101,0.0,0.0001,0.000101,0.0,10.0,10.0,0.0,1.0,1.0,0.0,0.99,1.0,0.0
2,1000000.0,990000.0,10000.0,0.001176,0.00118776,0.0,0.001176,0.00118776,0.0,117.6,117.6,0.0,11.76,11.76,0.0,0.99,1.0,0.0
3,1000000.0,990000.0,10000.0,0.011756,0.01187456,0.0,0.011756,0.01187456,0.0,1175.6,1175.6,0.0,117.6,117.6,0.0,0.99,1.0,0.0
4,1000000.0,990000.0,10000.0,0.1168,0.11798,0.0,0.1168,0.11798,0.0,11680.0,11680.0,0.0,1168.52,1168.52,0.0,0.99,1.0,0.0
5,1000000.0,990000.0,10000.0,1.165752,1.17752732,0.0,1.165752,1.17752732,0.0,116575.2,116575.2,0.0,11726.8,11726.8,0.0,0.99,1.0,0.0
6,1000000.0,990000.0,10000.0,11.062316,11.17405664,0.0,11.062316,11.17405664,0.0,1106231.6,1106231.6,0.0,117313.84,117313.84,0.0,0.99,1.0,0.0
7,1000000.0,990000.0,10000.0,66.08496,65.88928884,85.4564,66.08496,65.88928884,85.4564,6608496.0,6523039.6,85456.4,1084333.6,1064677.2,19656.4,1.0088,1.0,1.88
8,1000000.0,990000.0,10000.0,97.751548,97.72883628,100.0,97.751548,97.72883628,100.0,9775154.8,9675154.8,100000.0,6479706.96,3750224.4,2729482.56,5.6952,3.0,272.52
9,1000000.0,990000.0,10000.0,97.751548,97.72883628,100.0,97.751548,97.72883628,100.0,9775154.8,9675154.8,100000.0,9775155.8,3750224.4,6024931.4,8.9904,3.0,602.04
10,1000000.0,990000.0,10000.0,97.751548,97.72883628,100.0,97.751548,97.72883628,100.0,9775154.8,9675154.8,100000.0,9775155.8,3750224.4,6024931.4,8.9904,3.0,602.04
11,1000000.0,990000.0,10000.0,97.751548,97.72883628,100.0,97.751548,97.72883628,100.0,9775154.8,9675154.8,100000.0,9775155.8,3750224.4,6024931.4,8.9904,3.0,602.04
12,1000000.0,990000.0,10000.0,97.751548,97.72883628,100.0,97.751548,97.72883628,100.0,9775154.8,9675154.8,100000.0,9775155.8,3750224.4,6024931.4,8.9904,3.0,602.04
13,1000000.0,990000.0,10000.0,97.751548,97.72883628,100.0,97.751548,97.72883628,100.0,9775154.8,9675154.8,100000.0,9775155.8,3750224.4,6024931.4,8.9904,3.0,602.04
14,1000000.0,990000.0,10000.0,97.751548,97.72883628,100.0,97.751548,97.72883628,100.0,9775154.8,9675154.8,100000.0,9775155.8,3750224.4,6024931.4,8.9904,3.0,602.04
15,1000000.0,990000.0,10000.0,97.751548,97.72883628,100.0,97.751548,97.72883628,100.0,9775154.8,9675154.8,100000.0,9775155.8,3750224.4,6024931.4,8.9904,3.0,602.04
16,1000000.0,990000.0,10000.0,97.751548,97.72883628,100.0,97.751548,97.72883628,100.0,9775154.8,9675154.8,100000.0,9775155.8,3750224.4,6024931.4,8.9904,3.0,602.04
17,1000000.0,990000.0,10000.0,97.751548,97.72883628,100.0,97.751548,97.72883628,100.0,9775154.8,9675154.8,100000.0,9775155.8,3750224.4,6024931.4,8.9904,3.0,602.04
18,1000000.0,990000.0,10000.0,97.751548,97.72883628,100.0,97.751548,97.72883628,100.0,9775154.8,9675154.8,100000.0,9775155.8,3750224.4,6024931.4,8.9904,3.0,602.04
19,1000000.0,990000.0,10000.0,97.751548,97.72883628,100.0,97.751548,97.72883628,100.0,9775154.8,9675154.8,100000.0,9775155.8,3750224.4,6024931.4,8.9904,3.0,602.04
