round,nodes,nodesP,nodesS,nodesSent,nodesSentP,nodesSentS,nodesRecv,nodesRecvP,nodesRecvS,msgSent,msgSentP,msgSentS,msgRecv,msgRecvP,msgRecvS,msgInfect,msgInfectP,msgInfectS
00,10000.000000,1000.000000,9000.000000,0.000000,0.000000,0.000000,0.000000,0.000000,0.000000,0.000000,0.000000,0.000000,0.000000,0.000000,0.000000,0.000000,0.000000,0.000000
01,10000.000000,1000.000000,9000.000000,0.011000,0.110000,0.000000,0.011000,0.110000,0.000000,14.300000,14.300000,0.000000,1.100000,1.100000,0.000000,0.100000,1.000000,0.000000
02,10000.000000,1000.000000,9000.000000,0.153000,1.530000,0.000000,0.153000,1.530000,0.000000,198.900000,198.900000,0.000000,15.300000,15.300000,0.000000,0.100000,1.000000,0.000000
03,10000.000000,1000.000000,9000.000000,1.796000,17.880000,0.008889,1.796000,17.880000,0.008889,2548.000000,2537.600000,10.400000,197.400000,196.600000,0.800000,0.640000,1.000000,0.600000
04,10000.000000,1000.000000,9000.000000,11.351000,90.030000,2.608889,11.351000,90.030000,2.608889,23255.700000,20203.300000,3052.400000,2468.200000,2230.900000,237.300000,1.100000,2.000000,1.000000
05,10000.000000,1000.000000,9000.000000,74.074000,100.000000,71.193333,74.074000,100.000000,71.193333,109294.900000,25998.700000,83296.200000,22829.900000,11645.500000,11184.400000,2.000000,11.000000,1.000000
06,10000.000000,1000.000000,9000.000000,100.000000,100.000000,100.000000,100.000000,100.000000,100.000000,142998.700000,25998.700000,117000.000000,107602.700000,13001.000000,94601.700000,10.300000,13.000000,10.000000
07,10000.000000,1000.000000,9000.000000,100.000000,100.000000,100.000000,100.000000,100.000000,100.000000,142998.700000,25998.700000,117000.000000,142999.700000,13001.000000,129998.700000,13.900000,13.000000,14.000000
08,10000.000000,1000.000000,9000.000000,100.000000,100.000000,100.000000,100.000000,100.000000,100.000000,142998.700000,25998.700000,117000.000000,142999.700000,13001.000000,129998.700000,13.900000,13.000000,14.000000
09,10000.000000,1000.000000,9000.000000,100.000000,100.000000,100.000000,100.000000,100.000000,100.000000,142998.700000,25998.700000,117000.000000,142999.700000,13001.000000,129998.700000,13.900000,13.000000,14.000000
10,10000.000000,1000.000000,9000.000000,100.000000,100.000000,100.000000,100.000000,100.000000,100.000000,142998.700000,25998.700000,117000.000000,142999.700000,13001.000000,129998.700000,13.900000,13.000000,14.000000
11,10000.000000,1000.000000,9000.000000,100.000000,100.000000,100.000000,100.000000,100.000000,100.000000,142998.700000,25998.700000,117000.000000,142999.700000,13001.000000,129998.700000,13.900000,13.000000,14.000000
12,10000.000000,1000.000000,9000.000000,100.000000,100.000000,100.000000,100.000000,100.000000,100.000000,142998.700000,25998.700000,117000.000000,142999.700000,13001.000000,129998.700000,13.900000,13.000000,14.000000
13,10000.000000,1000.000000,9000.000000,100.000000,100.000000,100.000000,100.000000,100.000000,100.000000,142998.700000,25998.700000,117000.000000,142999.700000,13001.000000,129998.700000,13.900000,13.000000,14.000000
14,10000.000000,1000.000000,9000.000000,100.000000,100.000000,100.000000,100.000000,100.000000,100.000000,142998.700000,25998.700000,117000.000000,142999.700000,13001.000000,129998.700000,13.900000,13.000000,14.000000
15,10000.000000,1000.000000,9000.000000,100.000000,100.000000,100.000000,100.000000,100.000000,100.000000,142998.700000,25998.700000,117000.000000,142999.700000,13001.000000,129998.700000,13.900000,13.000000,14.000000
16,10000.000000,1000.000000,9000.000000,100.000000,100.000000,100.000000,100.000000,100.000000,100.000000,142998.700000,25998.700000,117000.000000,142999.700000,13001.000000,129998.700000,13.900000,13.000000,14.000000
17,10000.000000,1000.000000,9000.000000,100.000000,100.000000,100.000000,100.000000,100.000000,100.000000,142998.700000,25998.700000,117000.000000,142999.700000,13001.000000,129998.700000,13.900000,13.000000,14.000000
18,10000.000000,1000.000000,9000.000000,100.000000,100.000000,100.000000,100.000000,100.000000,100.000000,142998.700000,25998.700000,117000.000000,142999.700000,13001.000000,129998.700000,13.900000,13.000000,14.000000
19,10000.000000,1000.000000,9000.000000,100.000000,100.000000,100.000000,100.000000,100.000000,100.000000,142998.700000,25998.700000,117000.000000,142999.700000,13001.000000,129998.700000,13.900000,13.000000,14.000000
