gossips,p2p mean,p2p std,p2p min,p2p q1,p2p q2,p2p q3,p2p max,p2s mean,p2s std,p2s min,p2s q1,p2s q2,p2s q3,p2s max,s2s mean,s2s std,s2s min,s2s q1,s2s q2,s2s q3,s2s max
1,53.73792,0.2127954651772451,53.072,53.673,53.751,53.892,54.01,28.485519999999998,0.2495238999908957,27.608,28.443,28.56,28.609,28.713,0.83247996,0.04699636111221804,0.704444,0.8194440000000001,0.836889,0.8554440000000001,0.9077780000000001
2,5.85484,0.07984238640388107,5.623,5.829,5.871,5.891,5.984,0.17459999999999998,0.010824355254086341,0.156,0.17,0.175,0.184,0.194,0.0002035,0.00011431416042086507,0.00011100000000000001,0.00011100000000000001,0.00016650000000000004,0.00024975,0.00044400000000000006
3,0.06372000000000001,0.006907242575731649,0.052,0.06,0.064,0.066,0.089,,,,,,,,,,,,,,
4,0.001,,0.001,0.001,0.001,0.001,0.001,,,,,,,,,,,,,,
5,,,,,,,,,,,,,,,,,,,,,
