gossips,p2p mean,p2p std,p2p min,p2p q1,p2p q2,p2p q3,p2p max,p2s mean,p2s std,p2s min,p2s q1,p2s q2,p2s q3,p2s max,s2s mean,s2s std,s2s min,s2s q1,s2s q2,s2s q3,s2s max
1,51.395999999999994,1.4979096545964765,48.2,50.1,51.9,52.6,53.7,46.93999999999999,1.6758082626999233,43.3,45.9,46.8,48.0,49.8,55.54041248000001,0.49911253986376486,54.580881000000005,55.162162,55.669169,55.916416000000005,56.483784
2,18.708000000000006,0.7894723976597706,17.1,18.0,18.8,19.4,20.2,10.16,0.7410578025138569,8.9,9.5,10.2,10.6,11.6,19.39130336,0.6001127683508661,18.029729999999997,18.967768,19.341141,19.674975,20.52993
3,0.15,0.05477225575051661,0.1,0.1,0.15000000000000002,0.2,0.2,0.1,0.0,0.1,0.1,0.1,0.1,0.1,1.6403162800000004,0.15525403707379082,1.367367,1.534334,1.626627,1.7453450000000001,1.948348
4,,,,,,,,,,,,,,,0.034966920000000005,0.004692813068228196,0.028629,0.030731,0.034434,0.036837,0.047147
5,,,,,,,,,,,,,,,0.00019999999999999998,7.745966692414832e-05,0.0001,0.0001,0.0002,0.0003,0.0003
