gossips,p2p mean,p2p std,p2p min,p2p 05th,p2p 25th,p2p 50th,p2p 75th,p2p 95th,p2p max,p2s mean,p2s std,p2s min,p2s 05th,p2s 25th,p2s 50th,p2s 75th,p2s 95th,p2s max,s2s mean,s2s std,s2s min,s2s 05th,s2s 25th,s2s 50th,s2s 75th,s2s 95th,s2s max
1,10.474120000000001,0.04034979058186047,10.351,10.413,10.459,10.481,10.495,10.52,10.547,0.59188,0.02226085353260293,0.545,0.5631999999999999,0.572,0.591,0.604,0.6244,0.644,0.008097840000000002,0.0027074470289185715,0.003556,0.0042446,0.006333,0.007667,0.009444,0.012888799999999997,0.016222
2,0.10856000000000003,0.008471505179128444,0.087,0.0932,0.105,0.111,0.113,0.115,0.133,,,,,,,,,,,,,,,,,,
3,0.0013333333333333333,0.0004714045207910317,0.001,0.001,0.001,0.001,0.0015,0.0019,0.002,,,,,,,,,,,,,,,,,,
4,,,,,,,,,,,,,,,,,,,,,,,,,,,
5,,,,,,,,,,,,,,,,,,,,,,,,,,,
