gossips,p2p mean,p2p std,p2p min,p2p q1,p2p q2,p2p q3,p2p max,p2s mean,p2s std,p2s min,p2s q1,p2s q2,p2s q3,p2s max,s2s mean,s2s std,s2s min,s2s q1,s2s q2,s2s q3,s2s max
1,0.0355,0.024809802816416614,0.01,0.02,0.03,0.042499999999999996,0.11,0.22200000000000006,0.1508862706367503,0.06,0.15,0.19,0.29,0.82,36.79067067999999,3.728781855950679,26.699899,35.888687,38.254746999999995,38.949899,41.802525
2,,,,,,,,,,,,,,,5.8271878400000015,2.3637121822764944,2.493838,4.134848000000001,5.772323,7.158989999999999,12.957980000000001
3,,,,,,,,,,,,,,,0.24231928000000003,0.27381055501242096,0.04,0.105859,0.178182,0.25848499999999996,1.405657
4,,,,,,,,,,,,,,,0.00298984,0.008170999279361938,0.000101,0.000505,0.00101,0.002121,0.041616
5,,,,,,,,,,,,,,,,,,,,,
6,,,,,,,,,,,,,,,,,,,,,
7,,,,,,,,,,,,,,,,,,,,,
