gossips,p2p mean,p2p std,p2p min,p2p q1,p2p q2,p2p q3,p2p max,p2s mean,p2s std,p2s min,p2s q1,p2s q2,p2s q3,p2s max,s2s mean,s2s std,s2s min,s2s q1,s2s q2,s2s q3,s2s max
1,0.14479999999999996,0.012072696467649639,0.121,0.135,0.145,0.153,0.165,30.166879999999995,0.2552371968711982,29.613,30.007,30.157,30.358,30.633,52.09625772,0.06301231766257968,51.963333,52.047667,52.103667,52.141889,52.207889
2,,,,,,,,0.017040000000000007,0.0038565960811748653,0.012,0.015,0.017,0.019,0.026,23.714493360000002,0.11855970881791933,23.505667000000003,23.607222,23.752333,23.789556,23.888222
3,,,,,,,,,,,,,,,0.051182240000000004,0.0020007641306927395,0.047,0.050111,0.051222000000000004,0.052333000000000005,0.054778
4,,,,,,,,,,,,,,,,,,,,,
5,,,,,,,,,,,,,,,,,,,,,
