gossips,p2p mean,p2p std,p2p min,p2p q1,p2p q2,p2p q3,p2p max,p2s mean,p2s std,p2s min,p2s q1,p2s q2,p2s q3,p2s max,s2s mean,s2s std,s2s min,s2s q1,s2s q2,s2s q3,s2s max
1,51588.2,176.70573467396744,51261.0,51465.0,51642.0,51729.0,51890.0,58733.6,387.31963544338885,58199.0,58428.0,58710.0,59054.0,59582.0,503672.4,3141.6458133702226,498978.0,501430.0,502176.0,506572.0,508693.0
2,18823.4,134.35711121237028,18570.0,18754.0,18813.0,18863.0,19124.0,19982.72,154.47586650779226,19706.0,19855.0,19994.0,20104.0,20247.0,191830.76,1575.0543715482754,188509.0,190376.0,192637.0,192825.0,194206.0
3,28.68,5.289297369846649,16.0,25.0,28.0,33.0,37.0,204.8,15.10242806085608,176.0,195.0,208.0,215.0,230.0,3930.56,176.80004713423207,3583.0,3804.0,3942.0,4051.0,4239.0
4,,,,,,,,,,,,,,,18.16,4.588754369833568,9.0,16.0,17.0,21.0,30.0
5,,,,,,,,,,,,,,,,,,,,,
