round,nodes,nodesP,nodesS,nodesSent,nodesSentP,nodesSentS,nodesRecv,nodesRecvP,nodesRecvS,msgSent,msgSentP,msgSentS,msgRecv,msgRecvP,msgRecvS,msgInfect,msgInfectP,msgInfectS
00,1000.000000,10.000000,990.000000,0.000000,0.000000,0.000000,0.000000,0.000000,0.000000,0.000000,0.000000,0.000000,0.000000,0.000000,0.000000,0.000000,0.000000,0.000000
01,1000.000000,10.000000,990.000000,0.100000,10.000000,0.000000,0.100000,10.000000,0.000000,10.000000,10.000000,0.000000,1.000000,1.000000,0.000000,0.010000,1.000000,0.000000
02,1000.000000,10.000000,990.000000,1.000000,100.000000,0.000000,1.000000,100.000000,0.000000,115.000000,115.000000,0.000000,11.600000,11.600000,0.000000,0.010000,1.000000,0.000000
03,1000.000000,10.000000,990.000000,2.160000,100.000000,1.171717,2.160000,100.000000,1.171717,316.000000,200.000000,116.000000,112.600000,101.000000,11.600000,1.090000,10.000000,1.000000
04,1000.000000,10.000000,990.000000,20.000000,100.000000,19.191919,20.000000,100.000000,19.191919,2100.000000,200.000000,1900.000000,309.900000,101.000000,208.900000,1.090000,10.000000,1.000000
05,1000.000000,10.000000,990.000000,86.190000,100.000000,86.050505,86.190000,100.000000,86.050505,8719.000000,200.000000,8519.000000,2063.800000,101.000000,1962.800000,2.080000,10.000000,2.000000
06,1000.000000,10.000000,990.000000,99.990000,100.000000,99.989899,99.990000,100.000000,99.989899,10099.000000,200.000000,9899.000000,8682.200000,101.000000,8581.200000,8.020000,10.000000,8.000000
07,1000.000000,10.000000,990.000000,100.000000,100.000000,100.000000,100.000000,100.000000,100.000000,10100.000000,200.000000,9900.000000,10100.000000,101.000000,9999.000000,10.000000,10.000000,10.000000
08,1000.000000,10.000000,990.000000,100.000000,100.000000,100.000000,100.000000,100.000000,100.000000,10100.000000,200.000000,9900.000000,10101.000000,101.000000,10000.000000,10.000000,10.000000,10.000000
09,1000.000000,10.000000,990.000000,100.000000,100.000000,100.000000,100.000000,100.000000,100.000000,10100.000000,200.000000,9900.000000,10101.000000,101.000000,10000.000000,10.000000,10.000000,10.000000
10,1000.000000,10.000000,990.000000,100.000000,100.000000,100.000000,100.000000,100.000000,100.000000,10100.000000,200.000000,9900.000000,10101.000000,101.000000,10000.000000,10.000000,10.000000,10.000000
11,1000.000000,10.000000,990.000000,100.000000,100.000000,100.000000,100.000000,100.000000,100.000000,10100.000000,200.000000,9900.000000,10101.000000,101.000000,10000.000000,10.000000,10.000000,10.000000
12,1000.000000,10.000000,990.000000,100.000000,100.000000,100.000000,100.000000,100.000000,100.000000,10100.000000,200.000000,9900.000000,10101.000000,101.000000,10000.000000,10.000000,10.000000,10.000000
13,1000.000000,10.000000,990.000000,100.000000,100.000000,100.000000,100.000000,100.000000,100.000000,10100.000000,200.000000,9900.000000,10101.000000,101.000000,10000.000000,10.000000,10.000000,10.000000
14,1000.000000,10.000000,990.000000,100.000000,100.000000,100.000000,100.000000,100.000000,100.000000,10100.000000,200.000000,9900.000000,10101.000000,101.000000,10000.000000,10.000000,10.000000,10.000000
15,1000.000000,10.000000,990.000000,100.000000,100.000000,100.000000,100.000000,100.000000,100.000000,10100.000000,200.000000,9900.000000,10101.000000,101.000000,10000.000000,10.000000,10.000000,10.000000
16,1000.000000,10.000000,990.000000,100.000000,100.000000,100.000000,100.000000,100.000000,100.000000,10100.000000,200.000000,9900.000000,10101.000000,101.000000,10000.000000,10.000000,10.000000,10.000000
17,1000.000000,10.000000,990.000000,100.000000,100.000000,100.000000,100.000000,100.000000,100.000000,10100.000000,200.000000,9900.000000,10101.000000,101.000000,10000.000000,10.000000,10.000000,10.000000
18,1000.000000,10.000000,990.000000,100.000000,100.000000,100.000000,100.000000,100.000000,100.000000,10100.000000,200.000000,9900.000000,10101.000000,101.000000,10000.000000,10.000000,10.000000,10.000000
19,1000.000000,10.000000,990.000000,100.000000,100.000000,100.000000,100.000000,100.000000,100.000000,10100.000000,200.000000,9900.000000,10101.000000,101.000000,10000.000000,10.000000,10.000000,10.000000
