gossips,p2p mean,p2p std,p2p min,p2p q1,p2p q2,p2p q3,p2p max,p2s mean,p2s std,p2s min,p2s q1,p2s q2,p2s q3,p2s max,s2s mean,s2s std,s2s min,s2s q1,s2s q2,s2s q3,s2s max
1,,,,,,,,,,,,,,,54.901389359999996,0.7900364551224248,53.300701000000004,54.305806000000004,54.925726,55.551552,56.168769
2,,,,,,,,,,,,,,,18.761425439999996,1.1574213134815783,16.745946,17.978779,18.729229,19.476976999999998,21.399099
3,,,,,,,,,,,,,,,1.71892692,0.23795088495736538,1.316116,1.574174,1.704705,1.911311,2.226627
4,,,,,,,,,,,,,,,0.0004764799999999999,0.00025251916098915477,0.0002,0.0003,0.0004,0.000601,0.001301
5,,,,,,,,,,,,,,,,,,,,,
