,P+S mean,P+S std,P+S min,P+S q1,P+S median,P+S q3,P+S max,P mean,P std,P min,P q1,P median,P q3,P max,S mean,S std,S min,S q1,S median,S q3,S max
10% nodes,15,0,15,15,15,15,15,13,0,13,13,13,13,13,15,0,15,15,15,15,15
50% nodes,16,0,16,16,16,16,16,13,0,13,13,13,13,13,16,0,16,16,16,16,16
99% nodes,17,0,17,17,17,17,17,14,0,14,14,14,14,14,17,0,17,17,17,17,17
