gossips,p2p mean,p2p std,p2p min,p2p q1,p2p q2,p2p q3,p2p max,p2s mean,p2s std,p2s min,p2s q1,p2s q2,p2s q3,p2s max,s2s mean,s2s std,s2s min,s2s q1,s2s q2,s2s q3,s2s max
1,,,,,,,,0.01,0.0,0.01,0.01,0.01,0.01,0.01,60.31676768000001,0.3061631815939463,59.51949499999999,60.152929,60.338283,60.447879,61.086667000000006
2,,,,,,,,,,,,,,,1.5546383600000002,0.070672049690737,1.425354,1.5078790000000002,1.562323,1.5977780000000001,1.680505
3,,,,,,,,,,,,,,,0.000101,0.0,0.000101,0.000101,0.000101,0.000101,0.000101
