round,P+S mean,P+S std,P+S min,P+S q1,P+S median,P+S q3,P+S max,P mean,P std,P min,P q1,P median,P q3,P max,S mean,S std,S min,S q1,S median,S q3,S max
0,100.0,0.0,100.0,100.0,100.0,100.0,100.0,100.0,0.0,100.0,100.0,100.0,100.0,100.0,100.0,0.0,100.0,100.0,100.0,100.0,100.0
1,100.0,0.0,100.0,100.0,100.0,100.0,100.0,100.0,0.0,100.0,100.0,100.0,100.0,100.0,100.0,0.0,100.0,100.0,100.0,100.0,100.0
2,100.0,0.0,100.0,100.0,100.0,100.0,100.0,100.0,0.0,100.0,100.0,100.0,100.0,100.0,100.0,0.0,100.0,100.0,100.0,100.0,100.0
3,100.0,0.0,100.0,100.0,100.0,100.0,100.0,100.0,0.0,100.0,100.0,100.0,100.0,100.0,100.0,0.0,100.0,100.0,100.0,100.0,100.0
4,100.0,0.0,100.0,100.0,100.0,100.0,100.0,100.0,0.0,100.0,100.0,100.0,100.0,100.0,100.0,0.0,100.0,100.0,100.0,100.0,100.0
5,99.99989599999998,1.9595917942915938e-05,99.9998,99.9999,99.9999,99.9999,99.9999,99.99988000000002,0.00032496153618699007,99.999,100.0,100.0,100.0,100.0,99.99989787999999,3.011354512615296e-05,99.999889,99.999889,99.999889,99.999889,100.0
6,99.99994399999997,4.963869458561125e-05,99.9999,99.9999,99.9999,100.0,100.0,99.99995999999999,0.00019595917942358992,99.999,100.0,100.0,100.0,100.0,99.99994228000001,5.545558222776071e-05,99.999889,99.999889,99.999889,100.0,100.0
7,100.0,0.0,100.0,100.0,100.0,100.0,100.0,100.0,0.0,100.0,100.0,100.0,100.0,100.0,100.0,0.0,100.0,100.0,100.0,100.0,100.0
8,100.0,0.0,100.0,100.0,100.0,100.0,100.0,100.0,0.0,100.0,100.0,100.0,100.0,100.0,100.0,0.0,100.0,100.0,100.0,100.0,100.0
9,99.999968,5.4552726789754385e-05,99.9998,99.9999,100.0,100.0,100.0,99.99972,0.0005306599664575553,99.998,100.0,100.0,100.0,100.0,99.99999556,2.175146891669239e-05,99.999889,100.0,100.0,100.0,100.0
10,99.99965999999999,0.00018973665960747354,99.9993,99.9995,99.9997,99.9998,99.9999,99.99744000000001,0.0017681628884241762,99.994,99.996,99.998,99.999,100.0,99.99990675999999,6.0227090249875394e-05,99.999778,99.999889,99.999889,99.999889,100.0
11,99.99898800000001,0.0003010913482642355,99.9984,99.9988,99.999,99.9992,99.9996,99.99564000000001,0.0018736061485799752,99.992,99.994,99.996,99.996,99.999,99.99935996,0.00021847571581553446,99.998778,99.999333,99.999333,99.99955600000001,99.999667
12,99.998132,0.0004066644808672377,99.9972,99.9979,99.9981,99.9984,99.9988,99.99564000000001,0.0018736061485799752,99.992,99.994,99.996,99.996,99.999,99.99840895999999,0.00043285808113025816,99.997556,99.998222,99.99844399999999,99.998667,99.999111
13,99.99811600000001,0.00041442007673340363,99.9971,99.9979,99.9981,99.9984,99.9988,99.99564000000001,0.0018736061485799752,99.992,99.994,99.996,99.996,99.999,99.99839112,0.0004367930695428725,99.99744399999999,99.998111,99.99844399999999,99.998667,99.999
14,99.99807999999999,0.0004019950248445492,99.9971,99.9979,99.998,99.9984,99.9987,99.99528000000001,0.0019082976707003663,99.991,99.994,99.995,99.996,99.999,99.99839112,0.0004367930695428725,99.99744399999999,99.998111,99.99844399999999,99.998667,99.999
15,99.99779199999999,0.00042039980970519635,99.9969,99.9974,99.9978,99.9981,99.9986,99.99328,0.0021637005338078596,99.99,99.992,99.993,99.995,99.997,99.99829335999999,0.0004261990971372425,99.997333,99.998111,99.998333,99.99855600000001,99.999
16,99.99718000000001,0.0004890807704251149,99.9961,99.9969,99.9972,99.9975,99.9981,99.99159999999996,0.00211660104885254,99.987,99.99,99.991,99.993,99.995,99.99780000000001,0.0005027353180341206,99.996667,99.997556,99.997889,99.998222,99.99855600000001
17,99.99621999999998,0.0006196773353927148,99.9953,99.9957,99.9963,99.9966,99.9979,99.99159999999996,0.00211660104885254,99.987,99.99,99.991,99.993,99.995,99.99673336000002,0.0006150342351447121,99.995778,99.99633299999999,99.996778,99.997,99.998222
18,99.996184,0.0006341482476518021,99.9952,99.9957,99.9962,99.9966,99.9979,99.99147999999997,0.002193080025899731,99.987,99.99,99.991,99.993,99.995,99.99670672000002,0.0006213277087004367,99.995778,99.996111,99.996778,99.997,99.998222
19,99.996124,0.0006179190885543431,99.9952,99.9957,99.9961,99.9965,99.9978,99.99088000000002,0.0022148589119849985,99.987,99.989,99.991,99.993,99.994,99.99670672000002,0.0006213277087004367,99.995778,99.996111,99.996778,99.997,99.998222
20,99.995784,0.0006201161181576188,99.9948,99.9954,99.9958,99.9962,99.9974,99.98856000000002,0.002608907817460432,99.984,99.987,99.988,99.99,99.994,99.99658675999999,0.0006398396224048765,99.99555600000001,99.996,99.996667,99.996889,99.998111
21,99.99523599999999,0.0006950568322095861,99.994,99.9947,99.9951,99.9957,99.997,99.987,0.0025922962793634616,99.982,99.985,99.987,99.989,99.991,99.99615112000001,0.0006784327421370675,99.995,99.995667,99.996111,99.99655600000001,99.997667
22,99.994396,0.0007591995785042215,99.9924,99.994,99.9944,99.995,99.9961,99.987,0.0025922962793634616,99.982,99.985,99.987,99.989,99.991,99.9952178,0.0007815927328222497,99.993222,99.994778,99.995333,99.995667,99.996667
23,99.99438,0.0007720103626258164,99.9923,99.9939,99.9944,99.995,99.9961,99.98696,0.0026454489222056485,99.982,99.985,99.987,99.989,99.991,99.99520448000001,0.0007942430922589844,99.993111,99.994778,99.995333,99.995667,99.996667
24,99.99435599999998,0.0007761855448292226,99.9923,99.9939,99.9944,99.995,99.9961,99.98672,0.002821630734168428,99.981,99.984,99.987,99.988,99.991,99.99520448000001,0.0007942430922589844,99.993111,99.994778,99.995333,99.995667,99.996667
25,99.994,0.0007914543574950692,99.992,99.9935,99.9941,99.9945,99.9957,99.98395999999997,0.0030262848510993656,99.979,99.982,99.984,99.986,99.99,99.99511552,0.0007922883878993133,99.993111,99.994667,99.995222,99.995667,99.99655600000001
26,99.99344399999998,0.0008438388471720333,99.9911,99.9929,99.9937,99.9939,99.9952,99.98232,0.003585749572962129,99.976,99.98,99.982,99.985,99.989,99.99467996,0.0008346508961236599,99.992333,99.994111,99.994778,99.995222,99.996222
27,99.992572,0.0008190335768447409,99.9902,99.9921,99.9926,99.993,99.994,99.98232,0.003585749572962129,99.976,99.98,99.982,99.985,99.989,99.99371108,0.0008326835134667308,99.991333,99.993111,99.993889,99.994333,99.995111
28,99.99252800000001,0.000810195038246562,99.9902,99.9921,99.9926,99.9929,99.9939,99.98232,0.003585749572962129,99.976,99.98,99.982,99.985,99.989,99.99366224,0.0008240311780507007,99.991333,99.993111,99.993778,99.994333,99.995111
29,99.99248799999998,0.0008001599840024511,99.9902,99.9921,99.9925,99.9929,99.9939,99.98195999999999,0.0033879787484576355,99.975,99.98,99.982,99.985,99.988,99.9936578,0.0008188884173068293,99.991333,99.993111,99.993778,99.994333,99.995111
30,99.99211199999999,0.0008135453275629007,99.9898,99.9917,99.992,99.9925,99.9937,99.97932,0.0039670644058297,99.967,99.977,99.98,99.982,99.985,99.99353339999999,0.0008165292891271686,99.991222,99.993,99.993667,99.994222,99.995
31,99.99151199999999,0.0008344195587353587,99.9894,99.9912,99.9914,99.992,99.9928,99.97736,0.004533254901282579,99.964,99.975,99.977,99.981,99.983,99.99308448000002,0.0008123849885374087,99.990889,99.99255600000001,99.993,99.993778,99.994333
32,99.99066399999997,0.0008427953488234508,99.989,99.9901,99.9905,99.9913,99.9921,99.97736,0.004533254901282579,99.964,99.975,99.977,99.981,99.983,99.9921422,0.0007954298460587111,99.990444,99.991556,99.992111,99.992889,99.99355600000001
33,99.99063999999998,0.0008442748367686398,99.9889,99.9901,99.9905,99.9913,99.992,99.97728,0.004503509742412169,99.964,99.975,99.977,99.981,99.983,99.99212444000001,0.0007859470760818558,99.990444,99.991556,99.992111,99.992778,99.99355600000001
34,99.99059199999996,0.0008726603004611675,99.9888,99.99,99.9905,99.9913,99.992,99.9768,0.004664761515876677,99.964,99.974,99.977,99.981,99.982,99.99212444000001,0.0007859470760818558,99.990444,99.991556,99.992111,99.992778,99.99355600000001
35,99.99024000000003,0.0008593020423562592,99.9885,99.9897,99.9901,99.9909,99.9917,99.97435999999998,0.004697914430893698,99.962,99.972,99.975,99.977,99.982,99.9920044,0.0007859591846913623,99.99033299999999,99.991444,99.992,99.992667,99.993444
36,99.98964799999997,0.0009342890345065556,99.9878,99.989,99.9894,99.9907,99.9911,99.97263999999996,0.004689392284721128,99.962,99.97,99.973,99.976,99.98,99.99153772,0.0007860725930856184,99.990111,99.990889,99.991556,99.992222,99.992889
37,99.98876,0.000798498591106584,99.9869,99.9883,99.9886,99.9894,99.9899,99.97259999999997,0.004715930449021002,99.962,99.969,99.973,99.976,99.98,99.99055556000002,0.000706168992805634,99.988889,99.989889,99.990667,99.991,99.991667
38,99.988724,0.0007834692080725625,99.9869,99.9883,99.9885,99.9894,99.9898,99.97251999999999,0.004657209464905,99.962,99.969,99.973,99.976,99.98,99.99052448,0.0006859912605858745,99.988889,99.989889,99.990667,99.991,99.991667
39,99.98869200000001,0.0007974559548959531,99.9869,99.9882,99.9885,99.9894,99.9898,99.97219999999999,0.004698936049789099,99.962,99.969,99.972,99.976,99.98,99.99052448,0.0006859912605858745,99.988889,99.989889,99.990667,99.991,99.991667
40,99.98830799999998,0.0008138402791681568,99.9865,99.9877,99.9883,99.9891,99.9896,99.96948000000002,0.005084250190539436,99.961,99.966,99.969,99.974,99.979,99.99040008,0.0006948987218289613,99.988778,99.989778,99.99055600000001,99.990889,99.991556
41,99.987652,0.0008786899339350947,99.9855,99.9871,99.9877,99.9884,99.9892,99.96771999999999,0.005149912620617326,99.959,99.964,99.967,99.971,99.978,99.98986664000002,0.0007255342241421517,99.987889,99.98944399999999,99.989889,99.990444,99.990889
42,99.98686000000002,0.000951630180269367,99.9842,99.9863,99.9868,99.9875,99.9884,99.96771999999999,0.005149912620617326,99.959,99.964,99.967,99.971,99.978,99.98898668000001,0.0008597848903072706,99.98644399999999,99.988667,99.989,99.989667,99.99
43,99.98684399999998,0.0009461839144679168,99.9842,99.9863,99.9867,99.9875,99.9883,99.96767999999999,0.005159224747963041,99.959,99.964,99.967,99.971,99.978,99.98897336,0.0008620518258215557,99.98644399999999,99.988556,99.989,99.989667,99.990111
44,99.98679999999999,0.0009558242516270218,99.9842,99.9862,99.9865,99.9875,99.9882,99.96723999999999,0.005209836849651849,99.959,99.964,99.967,99.971,99.978,99.98897336,0.0008620518258215557,99.98644399999999,99.988556,99.989,99.989667,99.990111
45,99.98641999999998,0.0009863062404759189,99.9837,99.9859,99.9862,99.9873,99.988,99.96443999999998,0.00547780978129077,99.954,99.96,99.964,99.968,99.976,99.98886219999999,0.0008643666814494226,99.986333,99.988444,99.988889,99.98955600000001,99.99
46,99.9859,0.000957914401186296,99.9832,99.9853,99.9858,99.9866,99.9875,99.96284,0.005682816203257146,99.954,99.958,99.962,99.965,99.975,99.98846220000001,0.0008683567008995627,99.986,99.988111,99.988556,99.989222,99.989778
47,99.98504400000002,0.001029982524124116,99.9823,99.9843,99.9849,99.9858,99.9872,99.96284,0.005682816203257146,99.954,99.958,99.962,99.965,99.975,99.98751107999999,0.0009091280622651848,99.985,99.987,99.98755600000001,99.988222,99.989111
48,99.985008,0.0010295319324812697,99.9822,99.9842,99.9849,99.9858,99.9872,99.96276,0.005729083696368642,99.954,99.958,99.962,99.965,99.975,99.98747996,0.0009197594676858226,99.984889,99.987,99.987444,99.988222,99.989111
49,99.984964,0.0010372579235642008,99.9822,99.9842,99.9848,99.9858,99.9871,99.96232,0.005760000000000151,99.952,99.958,99.962,99.965,99.975,99.98747996,0.0009197594676858226,99.984889,99.987,99.987444,99.988222,99.989111
50,99.984656,0.0010012312420210768,99.9818,99.9841,99.9846,99.9853,99.9864,99.95936000000003,0.0062410255567507305,99.948,99.954,99.958,99.963,99.974,99.98746664000001,0.0009042212508011034,99.984889,99.987,99.987444,99.988222,99.989
51,99.984072,0.0010285990472480011,99.9811,99.9835,99.9843,99.9848,99.9859,99.95748000000002,0.005845476883881917,99.948,99.953,99.957,99.961,99.972,99.98702663999998,0.0009739696044536603,99.984222,99.986333,99.987111,99.987778,99.988556
52,99.983332,0.0010566815982119965,99.9805,99.9825,99.9833,99.9842,99.9852,99.95744,0.005783286263016428,99.948,99.953,99.957,99.961,99.972,99.98620887999999,0.0009611067919848262,99.98355600000001,99.985556,99.986222,99.986778,99.987778
53,99.98332400000001,0.0010492969074578052,99.9805,99.9825,99.9833,99.9842,99.9852,99.95744,0.005783286263016428,99.948,99.953,99.957,99.961,99.972,99.98620000000001,0.0009506224487144865,99.98355600000001,99.985556,99.986222,99.986778,99.987778
54,99.98332400000001,0.0010492969074578052,99.9805,99.9825,99.9833,99.9842,99.9852,99.95744,0.005783286263016428,99.948,99.953,99.957,99.961,99.972,99.98620000000001,0.0009506224487144865,99.98355600000001,99.985556,99.986222,99.986778,99.987778
55,99.98332400000001,0.0010492969074578052,99.9805,99.9825,99.9833,99.9842,99.9852,99.95744,0.005783286263016428,99.948,99.953,99.957,99.961,99.972,99.98620000000001,0.0009506224487144865,99.98355600000001,99.985556,99.986222,99.986778,99.987778
56,99.98332400000001,0.0010492969074578052,99.9805,99.9825,99.9833,99.9842,99.9852,99.95744,0.005783286263016428,99.948,99.953,99.957,99.961,99.972,99.98620000000001,0.0009506224487144865,99.98355600000001,99.985556,99.986222,99.986778,99.987778
57,99.98332400000001,0.0010492969074578052,99.9805,99.9825,99.9833,99.9842,99.9852,99.95744,0.005783286263016428,99.948,99.953,99.957,99.961,99.972,99.98620000000001,0.0009506224487144865,99.98355600000001,99.985556,99.986222,99.986778,99.987778
58,99.98332400000001,0.0010492969074578052,99.9805,99.9825,99.9833,99.9842,99.9852,99.95744,0.005783286263016428,99.948,99.953,99.957,99.961,99.972,99.98620000000001,0.0009506224487144865,99.98355600000001,99.985556,99.986222,99.986778,99.987778
59,99.98332400000001,0.0010492969074578052,99.9805,99.9825,99.9833,99.9842,99.9852,99.95744,0.005783286263016428,99.948,99.953,99.957,99.961,99.972,99.98620000000001,0.0009506224487144865,99.98355600000001,99.985556,99.986222,99.986778,99.987778
60,99.98332400000001,0.0010492969074578052,99.9805,99.9825,99.9833,99.9842,99.9852,99.95744,0.005783286263016428,99.948,99.953,99.957,99.961,99.972,99.98620000000001,0.0009506224487144865,99.98355600000001,99.985556,99.986222,99.986778,99.987778
61,99.98332400000001,0.0010492969074578052,99.9805,99.9825,99.9833,99.9842,99.9852,99.95744,0.005783286263016428,99.948,99.953,99.957,99.961,99.972,99.98620000000001,0.0009506224487144865,99.98355600000001,99.985556,99.986222,99.986778,99.987778
62,99.98332400000001,0.0010492969074578052,99.9805,99.9825,99.9833,99.9842,99.9852,99.95744,0.005783286263016428,99.948,99.953,99.957,99.961,99.972,99.98620000000001,0.0009506224487144865,99.98355600000001,99.985556,99.986222,99.986778,99.987778
63,99.98332400000001,0.0010492969074578052,99.9805,99.9825,99.9833,99.9842,99.9852,99.95744,0.005783286263016428,99.948,99.953,99.957,99.961,99.972,99.98620000000001,0.0009506224487144865,99.98355600000001,99.985556,99.986222,99.986778,99.987778
64,99.98332400000001,0.0010492969074578052,99.9805,99.9825,99.9833,99.9842,99.9852,99.95744,0.005783286263016428,99.948,99.953,99.957,99.961,99.972,99.98620000000001,0.0009506224487144865,99.98355600000001,99.985556,99.986222,99.986778,99.987778
65,99.98332400000001,0.0010492969074578052,99.9805,99.9825,99.9833,99.9842,99.9852,99.95744,0.005783286263016428,99.948,99.953,99.957,99.961,99.972,99.98620000000001,0.0009506224487144865,99.98355600000001,99.985556,99.986222,99.986778,99.987778
66,99.98332400000001,0.0010492969074578052,99.9805,99.9825,99.9833,99.9842,99.9852,99.95744,0.005783286263016428,99.948,99.953,99.957,99.961,99.972,99.98620000000001,0.0009506224487144865,99.98355600000001,99.985556,99.986222,99.986778,99.987778
67,99.98332400000001,0.0010492969074578052,99.9805,99.9825,99.9833,99.9842,99.9852,99.95744,0.005783286263016428,99.948,99.953,99.957,99.961,99.972,99.98620000000001,0.0009506224487144865,99.98355600000001,99.985556,99.986222,99.986778,99.987778
68,99.98332400000001,0.0010492969074578052,99.9805,99.9825,99.9833,99.9842,99.9852,99.95744,0.005783286263016428,99.948,99.953,99.957,99.961,99.972,99.98620000000001,0.0009506224487144865,99.98355600000001,99.985556,99.986222,99.986778,99.987778
69,99.98332400000001,0.0010492969074578052,99.9805,99.9825,99.9833,99.9842,99.9852,99.95744,0.005783286263016428,99.948,99.953,99.957,99.961,99.972,99.98620000000001,0.0009506224487144865,99.98355600000001,99.985556,99.986222,99.986778,99.987778
70,99.98332400000001,0.0010492969074578052,99.9805,99.9825,99.9833,99.9842,99.9852,99.95744,0.005783286263016428,99.948,99.953,99.957,99.961,99.972,99.98620000000001,0.0009506224487144865,99.98355600000001,99.985556,99.986222,99.986778,99.987778
71,99.98332400000001,0.0010492969074578052,99.9805,99.9825,99.9833,99.9842,99.9852,99.95744,0.005783286263016428,99.948,99.953,99.957,99.961,99.972,99.98620000000001,0.0009506224487144865,99.98355600000001,99.985556,99.986222,99.986778,99.987778
72,99.98332400000001,0.0010492969074578052,99.9805,99.9825,99.9833,99.9842,99.9852,99.95744,0.005783286263016428,99.948,99.953,99.957,99.961,99.972,99.98620000000001,0.0009506224487144865,99.98355600000001,99.985556,99.986222,99.986778,99.987778
73,99.98332400000001,0.0010492969074578052,99.9805,99.9825,99.9833,99.9842,99.9852,99.95744,0.005783286263016428,99.948,99.953,99.957,99.961,99.972,99.98620000000001,0.0009506224487144865,99.98355600000001,99.985556,99.986222,99.986778,99.987778
