<?xml version="1.1" encoding="UTF-8"?>
<svg xmlns="http://www.w3.org/2000/svg"
    xmlns:latexdraw="http://latexdraw.sourceforge.net/namespaces/latexdraw"
    version="1.1" baseProfile="full">
    <g>
        <g latexdraw:type="circle" id="id340285034">
            <circle cx="10.0" cy="70.0" r="9.0"
                latexdraw:borderPos="outer" stroke-width="2.0"
                stroke="black" fill="#a70b0b"/>
        </g>
        <g latexdraw:type="circle" id="id1276753324">
            <circle cx="150.0" cy="10.0" r="9.0"
                latexdraw:borderPos="outer" stroke-width="2.0"
                stroke="black" fill="#a70b0b"/>
        </g>
        <g latexdraw:type="circle" id="id1605234810">
            <circle cx="130.0" cy="130.0" r="9.0"
                latexdraw:borderPos="outer" stroke-width="2.0"
                stroke="black" fill="#a70b0b"/>
        </g>
        <g latexdraw:type="circle" id="id1716000116">
            <circle cx="270.0" cy="50.0" r="9.0"
                latexdraw:borderPos="outer" stroke-width="2.0"
                stroke="black" fill="#a70b0b"/>
        </g>
        <g latexdraw:type="circle" id="id1128691316">
            <circle cx="270.0" cy="190.0" r="9.0"
                latexdraw:borderPos="outer" stroke-width="2.0"
                stroke="black" fill="#a70b0b"/>
        </g>
        <g latexdraw:type="circle" id="id1765139257">
            <circle cx="70.0" cy="230.0" r="9.0"
                latexdraw:borderPos="outer" stroke-width="2.0"
                stroke="black" fill="#a70b0b"/>
        </g>
        <g latexdraw:type="joinedLines" id="id1704023890">
            <polyline
                points="63.33333333333371,217.77777777777817 13.333333333333655,84.44444444444463 "
                stroke-width="2.0" stroke="black"
                latexdraw:rotationAngle="0.0" marker-end="url(#arrow1-1704023890)"/>
        </g>
        <g latexdraw:type="joinedLines" id="id661180344">
            <polyline
                points="74.44444444444485,217.77777777777817 118.88888888888931,140.00000000000026 "
                stroke-width="2.0" stroke="black"
                latexdraw:rotationAngle="0.0" marker-start="url(#arrow0-661180344)"/>
        </g>
        <g latexdraw:type="joinedLines" id="id5126761">
            <polyline
                points="24.44444444444477,62.222222222222385 135.55555555555605,12.222222222222314 "
                stroke-width="2.0" stroke="black"
                latexdraw:rotationAngle="0.0" marker-start="url(#arrow0-5126761)"/>
        </g>
        <g latexdraw:type="joinedLines" id="id1085779416">
            <polyline
                points="24.44444444444477,67.77777777777794 113.33333333333377,123.33333333333357 "
                stroke-width="2.0" stroke="black"
                latexdraw:rotationAngle="0.0" marker-end="url(#arrow1-1085779416)"/>
        </g>
        <g latexdraw:type="joinedLines" id="id137372864">
            <polyline
                points="163.33333333333383,12.222222222222314 257.7777777777784,45.5555555555557 "
                stroke-width="2.0" stroke="black"
                latexdraw:rotationAngle="0.0" marker-end="url(#arrow1-137372864)"/>
        </g>
        <g latexdraw:type="joinedLines" id="id1240548661">
            <polyline
                points="130.00000000000045,117.77777777777803 146.66666666666714,23.333333333333442 "
                stroke-width="2.0" stroke="black"
                latexdraw:rotationAngle="0.0" marker-end="url(#arrow1-1240548661)"/>
        </g>
        <g latexdraw:type="joinedLines" id="id1602935689">
            <polyline
                points="252.22222222222285,195.55555555555588 85.55555555555594,223.3333333333337 "
                stroke-width="2.0" stroke="black"
                latexdraw:rotationAngle="0.0" marker-start="url(#arrow0-1602935689)"/>
        </g>
        <g latexdraw:type="joinedLines" id="id124204802">
            <polyline
                points="141.1111111111116,134.4444444444447 257.7777777777784,184.44444444444477 "
                stroke-width="2.0" stroke="black"
                latexdraw:rotationAngle="0.0" marker-start="url(#arrow0-124204802)"/>
        </g>
        <g latexdraw:type="joinedLines" id="id2001305106">
            <polyline
                points="274.4444444444451,67.77777777777794 274.4444444444451,173.33333333333366 "
                stroke-width="2.0" stroke="black"
                latexdraw:rotationAngle="0.0" marker-end="url(#arrow1-2001305106)"/>
        </g>
        <g latexdraw:type="text" id="id981747688" fill="black" latexdraw:position="bl">
            <text x="146.8712328767126" y="13.61643835616442">1</text>
        </g>
        <g latexdraw:type="text" id="id301495071" fill="black" latexdraw:position="bl">
            <text x="267.20000000000016" y="53.599999999999994">2</text>
        </g>
        <g latexdraw:type="text" id="id1082552299" fill="black" latexdraw:position="bl">
            <text x="267.2" y="193.9999999999999">3</text>
        </g>
        <g latexdraw:type="text" id="id1787914238" fill="black" latexdraw:position="bl">
            <text x="126.40000000000003" y="133.60000000000014">4</text>
        </g>
        <g latexdraw:type="text" id="id324788772" fill="black" latexdraw:position="bl">
            <text x="66.7999999999999" y="233.60000000000008">5</text>
        </g>
        <g latexdraw:type="text" id="id621798034" fill="#010101" latexdraw:position="bl">
            <text x="6.000000000000142" y="73.60000000000004">6</text>
        </g>
    </g>
    <defs>
        <marker overflow="visible" orient="auto" id="arrow1-1704023890">
            <path
                d="M 0.0 0.0 L -4.652083333333334 1.6614583333333335 L -4.652083333333334 0.0 L -4.652083333333334 -1.6614583333333335 z "
                latexdraw:arrSizeNum="2.0" fill="black"/>
        </marker>
        <marker overflow="visible" orient="auto" id="arrow0-661180344">
            <path
                d="M 0.0 0.0 L 4.652083333333334 1.6614583333333335 L 4.652083333333334 0.0 L 4.652083333333334 -1.6614583333333335 z "
                latexdraw:arrSizeNum="2.0" fill="black"/>
        </marker>
        <marker overflow="visible" orient="auto" id="arrow0-5126761">
            <path
                d="M 0.0 0.0 L 4.652083333333334 1.6614583333333335 L 4.652083333333334 0.0 L 4.652083333333334 -1.6614583333333335 z "
                latexdraw:arrSizeNum="2.0" fill="black"/>
        </marker>
        <marker overflow="visible" orient="auto" id="arrow1-1085779416">
            <path
                d="M 0.0 0.0 L -4.652083333333334 1.6614583333333335 L -4.652083333333334 0.0 L -4.652083333333334 -1.6614583333333335 z "
                latexdraw:arrSizeNum="2.0" fill="black"/>
        </marker>
        <marker overflow="visible" orient="auto" id="arrow1-137372864">
            <path
                d="M 0.0 0.0 L -4.652083333333334 1.6614583333333335 L -4.652083333333334 0.0 L -4.652083333333334 -1.6614583333333335 z "
                latexdraw:arrSizeNum="2.0" fill="black"/>
        </marker>
        <marker overflow="visible" orient="auto" id="arrow1-1240548661">
            <path
                d="M 0.0 0.0 L -4.652083333333334 1.6614583333333335 L -4.652083333333334 0.0 L -4.652083333333334 -1.6614583333333335 z "
                latexdraw:arrSizeNum="2.0" fill="black"/>
        </marker>
        <marker overflow="visible" orient="auto" id="arrow0-1602935689">
            <path
                d="M 0.0 0.0 L 4.652083333333334 1.6614583333333335 L 4.652083333333334 0.0 L 4.652083333333334 -1.6614583333333335 z "
                latexdraw:arrSizeNum="2.0" fill="black"/>
        </marker>
        <marker overflow="visible" orient="auto" id="arrow0-124204802">
            <path
                d="M 0.0 0.0 L 4.652083333333334 1.6614583333333335 L 4.652083333333334 0.0 L 4.652083333333334 -1.6614583333333335 z "
                latexdraw:arrSizeNum="2.0" fill="black"/>
        </marker>
        <marker overflow="visible" orient="auto" id="arrow1-2001305106">
            <path
                d="M 0.0 0.0 L -4.652083333333334 1.6614583333333335 L -4.652083333333334 0.0 L -4.652083333333334 -1.6614583333333335 z "
                latexdraw:arrSizeNum="2.0" fill="black"/>
        </marker>
    </defs>
    <metadata>
        <latexdraw:metadata>
            <latexdraw:latexIncludes/>
            <latexdraw:displayXScale>true</latexdraw:displayXScale>
            <latexdraw:displayYScale>true</latexdraw:displayYScale>
            <latexdraw:unit>CM</latexdraw:unit>
            <latexdraw:zoom>2.499999999999999</latexdraw:zoom>
            <latexdraw:magneticGridStyle>CUSTOMISED</latexdraw:magneticGridStyle>
            <latexdraw:gridGap>20</latexdraw:gridGap>
            <latexdraw:magneticGrid>false</latexdraw:magneticGrid>
            <latexdraw:version>3.3.8</latexdraw:version>
            <latexdraw:size>
                <latexdraw:width>1253</latexdraw:width>
                <latexdraw:height>1173</latexdraw:height>
            </latexdraw:size>
            <latexdraw:position>
                <latexdraw:x>301.0</latexdraw:x>
                <latexdraw:y>27.0</latexdraw:y>
            </latexdraw:position>
        </latexdraw:metadata>
    </metadata>
</svg>
