<?xml version="1.0" encoding="UTF-8" standalone="no"?>
<!-- Created with Inkscape (http://www.inkscape.org/) -->

<svg
   xmlns:dc="http://purl.org/dc/elements/1.1/"
   xmlns:cc="http://creativecommons.org/ns#"
   xmlns:rdf="http://www.w3.org/1999/02/22-rdf-syntax-ns#"
   xmlns:svg="http://www.w3.org/2000/svg"
   xmlns="http://www.w3.org/2000/svg"
   xmlns:xlink="http://www.w3.org/1999/xlink"
   xmlns:sodipodi="http://sodipodi.sourceforge.net/DTD/sodipodi-0.dtd"
   xmlns:inkscape="http://www.inkscape.org/namespaces/inkscape"
   width="208"
   height="208"
   id="svg3304"
   sodipodi:version="0.32"
   inkscape:version="0.92.4 (unknown)"
   sodipodi:docname="computer+mail+red.svg"
   inkscape:output_extension="org.inkscape.output.svg.inkscape"
   version="1.1"
   viewBox="0 0 52 52">
  <defs
     id="defs3306">
    <linearGradient
       id="linearGradient4196">
      <stop
         style="stop-color:black;stop-opacity:1;"
         offset="0"
         id="stop4198" />
      <stop
         style="stop-color:black;stop-opacity:0;"
         offset="1"
         id="stop4200" />
    </linearGradient>
    <linearGradient
       id="linearGradient3907">
      <stop
         style="stop-color:#ffffff;stop-opacity:1;"
         offset="0"
         id="stop3909" />
      <stop
         style="stop-color:#ffffff;stop-opacity:0;"
         offset="1"
         id="stop3911" />
    </linearGradient>
    <linearGradient
       inkscape:collect="always"
       id="linearGradient3899">
      <stop
         style="stop-color:#eeeeec"
         offset="0"
         id="stop3901" />
      <stop
         style="stop-color:#d3d7cf"
         offset="1"
         id="stop3903" />
    </linearGradient>
    <linearGradient
       id="linearGradient5233">
      <stop
         style="stop-color:#729fcf;stop-opacity:1;"
         offset="0"
         id="stop5235" />
      <stop
         style="stop-color:#326194;stop-opacity:1;"
         offset="1"
         id="stop5237" />
    </linearGradient>
    <linearGradient
       inkscape:collect="always"
       id="linearGradient5225">
      <stop
         style="stop-color:black;stop-opacity:1;"
         offset="0"
         id="stop5227" />
      <stop
         style="stop-color:black;stop-opacity:0;"
         offset="1"
         id="stop5229" />
    </linearGradient>
    <linearGradient
       id="linearGradient5137">
      <stop
         style="stop-color:#eeeeec;stop-opacity:1;"
         offset="0"
         id="stop5139" />
      <stop
         style="stop-color:#e6e6e3;stop-opacity:1;"
         offset="1"
         id="stop5141" />
    </linearGradient>
    <linearGradient
       inkscape:collect="always"
       id="linearGradient6240">
      <stop
         style="stop-color:#ffffff;stop-opacity:1;"
         offset="0"
         id="stop6242" />
      <stop
         style="stop-color:#ffffff;stop-opacity:0;"
         offset="1"
         id="stop6244" />
    </linearGradient>
    <linearGradient
       id="linearGradient11400">
      <stop
         style="stop-color:#000000;stop-opacity:1;"
         offset="0"
         id="stop11402" />
      <stop
         style="stop-color:#000000;stop-opacity:0;"
         offset="1"
         id="stop11404" />
    </linearGradient>
    <linearGradient
       inkscape:collect="always"
       xlink:href="#linearGradient6240"
       id="linearGradient6246"
       x1="20.156862"
       y1="5.0996137"
       x2="20.156862"
       y2="26.039215"
       gradientUnits="userSpaceOnUse"
       gradientTransform="translate(0.037705,-159.17927)" />
    <linearGradient
       inkscape:collect="always"
       xlink:href="#linearGradient5137"
       id="linearGradient5147"
       gradientUnits="userSpaceOnUse"
       x1="17.247635"
       y1="6.3760414"
       x2="39.904388"
       y2="38.876041"
       gradientTransform="matrix(0.999303,0,0,0.998527,0.064296,-159.11137)" />
    <radialGradient
       inkscape:collect="always"
       xlink:href="#linearGradient5233"
       id="radialGradient5239"
       cx="24.006104"
       cy="32.997028"
       fx="24.006104"
       fy="32.997028"
       r="19.00016"
       gradientTransform="matrix(1.232634,0,0,0.778392,-5.529347,-156.9875)"
       gradientUnits="userSpaceOnUse" />
    <linearGradient
       inkscape:collect="always"
       xlink:href="#linearGradient5137"
       id="linearGradient2308"
       gradientUnits="userSpaceOnUse"
       gradientTransform="matrix(1,0,0,0.992781,0,-2.718035)"
       x1="31.743324"
       y1="37.842293"
       x2="31.86105"
       y2="43.82579" />
    <linearGradient
       inkscape:collect="always"
       xlink:href="#linearGradient11400"
       id="linearGradient2310"
       gradientUnits="userSpaceOnUse"
       gradientTransform="matrix(1.004187,0,0,1,-0.12454,-3.011765)"
       x1="23.154902"
       y1="34.572548"
       x2="23.529411"
       y2="40.219608" />
    <linearGradient
       id="linearGradient1558"
       inkscape:collect="always">
      <stop
         id="stop1560"
         offset="0"
         style="stop-color:#babdb6" />
      <stop
         id="stop1562"
         offset="1"
         style="stop-color:#eeeeec" />
    </linearGradient>
    <linearGradient
       id="linearGradient3028"
       inkscape:collect="always">
      <stop
         id="stop3030"
         offset="0"
         style="stop-color:black;stop-opacity:1;" />
      <stop
         id="stop3032"
         offset="1"
         style="stop-color:black;stop-opacity:0;" />
    </linearGradient>
    <linearGradient
       id="linearGradient3042">
      <stop
         id="stop3044"
         offset="0"
         style="stop-color:black;stop-opacity:0;" />
      <stop
         style="stop-color:black;stop-opacity:1;"
         offset="0.5"
         id="stop3050" />
      <stop
         id="stop3046"
         offset="1"
         style="stop-color:black;stop-opacity:0;" />
    </linearGradient>
    <radialGradient
       inkscape:collect="always"
       xlink:href="#linearGradient3907"
       id="radialGradient2433"
       gradientUnits="userSpaceOnUse"
       gradientTransform="matrix(1.382603,3.581398e-5,0,0.171503,-6.729684,34.0972)"
       cx="20.913568"
       cy="47.045319"
       fx="20.913568"
       fy="47.045319"
       r="19.5" />
    <radialGradient
       inkscape:collect="always"
       xlink:href="#linearGradient3028"
       id="radialGradient2517"
       gradientUnits="userSpaceOnUse"
       gradientTransform="matrix(0,-0.750002,1.333334,0,-40.28573,35.00001)"
       cx="2.9999995"
       cy="33.214287"
       fx="2.9999995"
       fy="33.214287"
       r="3" />
    <radialGradient
       inkscape:collect="always"
       xlink:href="#linearGradient3028"
       id="radialGradient2519"
       gradientUnits="userSpaceOnUse"
       gradientTransform="matrix(0,-0.750002,1.333334,0,-88.28573,-30.49999)"
       cx="2.9999995"
       cy="33.214287"
       fx="2.9999995"
       fy="33.214287"
       r="3" />
    <linearGradient
       inkscape:collect="always"
       xlink:href="#linearGradient3042"
       id="linearGradient2521"
       gradientUnits="userSpaceOnUse"
       gradientTransform="matrix(1,0,0,0.888889,0,3.833333)"
       x1="37.03125"
       y1="35.062885"
       x2="37.03125"
       y2="29.995127" />
    <linearGradient
       inkscape:collect="always"
       xlink:href="#linearGradient1558"
       id="linearGradient3320"
       gradientUnits="userSpaceOnUse"
       gradientTransform="matrix(1,0,0,0.833169,-48,19.08245)"
       x1="16.396038"
       y1="19.659277"
       x2="16.396038"
       y2="32.448051" />
    <radialGradient
       inkscape:collect="always"
       xlink:href="#linearGradient3907"
       id="radialGradient3322"
       gradientUnits="userSpaceOnUse"
       gradientTransform="matrix(1.382603,3.581398e-5,0,0.171503,-6.729684,34.0972)"
       cx="20.913568"
       cy="47.045319"
       fx="20.913568"
       fy="47.045319"
       r="19.5" />
    <radialGradient
       inkscape:collect="always"
       xlink:href="#linearGradient3907"
       id="radialGradient3324"
       gradientUnits="userSpaceOnUse"
       gradientTransform="matrix(1.382603,3.581398e-5,0,0.171503,-6.729684,34.0972)"
       cx="20.913568"
       cy="47.045319"
       fx="20.913568"
       fy="47.045319"
       r="19.5" />
    <radialGradient
       inkscape:collect="always"
       xlink:href="#linearGradient3907"
       id="radialGradient3326"
       gradientUnits="userSpaceOnUse"
       gradientTransform="matrix(1.382603,3.581398e-5,0,0.171503,-6.729684,34.0972)"
       cx="20.913568"
       cy="47.045319"
       fx="20.913568"
       fy="47.045319"
       r="19.5" />
    <radialGradient
       inkscape:collect="always"
       xlink:href="#linearGradient3907"
       id="radialGradient3328"
       gradientUnits="userSpaceOnUse"
       gradientTransform="matrix(1.382603,3.581398e-5,0,0.171503,-6.729684,34.0972)"
       cx="20.913568"
       cy="47.045319"
       fx="20.913568"
       fy="47.045319"
       r="19.5" />
    <radialGradient
       inkscape:collect="always"
       xlink:href="#linearGradient3907"
       id="radialGradient3330"
       gradientUnits="userSpaceOnUse"
       gradientTransform="matrix(1.382603,3.581398e-5,0,0.171503,-6.729684,34.0972)"
       cx="20.913568"
       cy="47.045319"
       fx="20.913568"
       fy="47.045319"
       r="19.5" />
    <radialGradient
       inkscape:collect="always"
       xlink:href="#linearGradient3907"
       id="radialGradient3332"
       gradientUnits="userSpaceOnUse"
       gradientTransform="matrix(1.382603,3.581398e-5,0,0.171503,-6.729684,34.0972)"
       cx="20.913568"
       cy="47.045319"
       fx="20.913568"
       fy="47.045319"
       r="19.5" />
    <radialGradient
       inkscape:collect="always"
       xlink:href="#linearGradient3907"
       id="radialGradient3334"
       gradientUnits="userSpaceOnUse"
       gradientTransform="matrix(1.382603,3.581398e-5,0,0.171503,-6.729684,34.0972)"
       cx="20.913568"
       cy="47.045319"
       fx="20.913568"
       fy="47.045319"
       r="19.5" />
    <radialGradient
       inkscape:collect="always"
       xlink:href="#linearGradient3907"
       id="radialGradient3336"
       gradientUnits="userSpaceOnUse"
       gradientTransform="matrix(1.382603,3.581398e-5,0,0.171503,-6.729684,34.0972)"
       cx="20.913568"
       cy="47.045319"
       fx="20.913568"
       fy="47.045319"
       r="19.5" />
    <radialGradient
       inkscape:collect="always"
       xlink:href="#linearGradient3907"
       id="radialGradient3338"
       gradientUnits="userSpaceOnUse"
       gradientTransform="matrix(1.382603,3.581398e-5,0,0.171503,-6.729684,34.0972)"
       cx="20.913568"
       cy="47.045319"
       fx="20.913568"
       fy="47.045319"
       r="19.5" />
    <radialGradient
       inkscape:collect="always"
       xlink:href="#linearGradient3907"
       id="radialGradient3340"
       gradientUnits="userSpaceOnUse"
       gradientTransform="matrix(1.382603,3.581398e-5,0,0.171503,-6.729684,34.0972)"
       cx="20.913568"
       cy="47.045319"
       fx="20.913568"
       fy="47.045319"
       r="19.5" />
    <radialGradient
       inkscape:collect="always"
       xlink:href="#linearGradient3907"
       id="radialGradient3342"
       gradientUnits="userSpaceOnUse"
       gradientTransform="matrix(1.382603,3.581398e-5,0,0.171503,-6.729684,34.0972)"
       cx="20.913568"
       cy="47.045319"
       fx="20.913568"
       fy="47.045319"
       r="19.5" />
    <radialGradient
       inkscape:collect="always"
       xlink:href="#linearGradient3907"
       id="radialGradient3344"
       gradientUnits="userSpaceOnUse"
       gradientTransform="matrix(1.382603,3.581398e-5,0,0.171503,-6.729684,34.0972)"
       cx="20.913568"
       cy="47.045319"
       fx="20.913568"
       fy="47.045319"
       r="19.5" />
    <radialGradient
       inkscape:collect="always"
       xlink:href="#linearGradient3907"
       id="radialGradient3346"
       gradientUnits="userSpaceOnUse"
       gradientTransform="matrix(1.382603,3.581398e-5,0,0.171503,-6.729684,34.0972)"
       cx="20.913568"
       cy="47.045319"
       fx="20.913568"
       fy="47.045319"
       r="19.5" />
    <radialGradient
       inkscape:collect="always"
       xlink:href="#linearGradient3907"
       id="radialGradient3348"
       gradientUnits="userSpaceOnUse"
       gradientTransform="matrix(1.382603,3.581398e-5,0,0.171503,-6.729684,34.0972)"
       cx="20.913568"
       cy="47.045319"
       fx="20.913568"
       fy="47.045319"
       r="19.5" />
    <radialGradient
       inkscape:collect="always"
       xlink:href="#linearGradient3907"
       id="radialGradient3350"
       gradientUnits="userSpaceOnUse"
       gradientTransform="matrix(1.382603,3.581398e-5,0,0.171503,-6.729684,34.0972)"
       cx="20.913568"
       cy="47.045319"
       fx="20.913568"
       fy="47.045319"
       r="19.5" />
    <radialGradient
       inkscape:collect="always"
       xlink:href="#linearGradient3907"
       id="radialGradient3352"
       gradientUnits="userSpaceOnUse"
       gradientTransform="matrix(1.382603,3.581398e-5,0,0.171503,-6.729684,34.0972)"
       cx="20.913568"
       cy="47.045319"
       fx="20.913568"
       fy="47.045319"
       r="19.5" />
    <radialGradient
       inkscape:collect="always"
       xlink:href="#linearGradient3907"
       id="radialGradient3354"
       gradientUnits="userSpaceOnUse"
       gradientTransform="matrix(1.382603,3.581398e-5,0,0.171503,-6.729684,34.0972)"
       cx="20.913568"
       cy="47.045319"
       fx="20.913568"
       fy="47.045319"
       r="19.5" />
    <radialGradient
       inkscape:collect="always"
       xlink:href="#linearGradient3907"
       id="radialGradient3356"
       gradientUnits="userSpaceOnUse"
       gradientTransform="matrix(1.382603,3.581398e-5,0,0.171503,-6.729684,34.0972)"
       cx="20.913568"
       cy="47.045319"
       fx="20.913568"
       fy="47.045319"
       r="19.5" />
    <radialGradient
       inkscape:collect="always"
       xlink:href="#linearGradient3907"
       id="radialGradient3358"
       gradientUnits="userSpaceOnUse"
       gradientTransform="matrix(1.382603,3.581398e-5,0,0.171503,-6.729684,34.0972)"
       cx="20.913568"
       cy="47.045319"
       fx="20.913568"
       fy="47.045319"
       r="19.5" />
    <radialGradient
       inkscape:collect="always"
       xlink:href="#linearGradient3907"
       id="radialGradient3360"
       gradientUnits="userSpaceOnUse"
       gradientTransform="matrix(1.382603,3.581398e-5,0,0.171503,-6.729684,34.0972)"
       cx="20.913568"
       cy="47.045319"
       fx="20.913568"
       fy="47.045319"
       r="19.5" />
    <radialGradient
       inkscape:collect="always"
       xlink:href="#linearGradient3907"
       id="radialGradient3362"
       gradientUnits="userSpaceOnUse"
       gradientTransform="matrix(1.382603,3.581398e-5,0,0.171503,-6.729684,34.0972)"
       cx="20.913568"
       cy="47.045319"
       fx="20.913568"
       fy="47.045319"
       r="19.5" />
    <radialGradient
       inkscape:collect="always"
       xlink:href="#linearGradient3907"
       id="radialGradient3364"
       gradientUnits="userSpaceOnUse"
       gradientTransform="matrix(1.382603,3.581398e-5,0,0.171503,-6.729684,34.0972)"
       cx="20.913568"
       cy="47.045319"
       fx="20.913568"
       fy="47.045319"
       r="19.5" />
    <radialGradient
       inkscape:collect="always"
       xlink:href="#linearGradient3907"
       id="radialGradient3366"
       gradientUnits="userSpaceOnUse"
       gradientTransform="matrix(1.382603,3.581398e-5,0,0.171503,-6.729684,34.0972)"
       cx="20.913568"
       cy="47.045319"
       fx="20.913568"
       fy="47.045319"
       r="19.5" />
    <radialGradient
       inkscape:collect="always"
       xlink:href="#linearGradient3907"
       id="radialGradient3368"
       gradientUnits="userSpaceOnUse"
       gradientTransform="matrix(1.382603,3.581398e-5,0,0.171503,-6.729684,34.0972)"
       cx="20.913568"
       cy="47.045319"
       fx="20.913568"
       fy="47.045319"
       r="19.5" />
    <radialGradient
       inkscape:collect="always"
       xlink:href="#linearGradient3907"
       id="radialGradient3370"
       gradientUnits="userSpaceOnUse"
       gradientTransform="matrix(1.382603,3.581398e-5,0,0.171503,-6.729684,34.0972)"
       cx="20.913568"
       cy="47.045319"
       fx="20.913568"
       fy="47.045319"
       r="19.5" />
    <radialGradient
       inkscape:collect="always"
       xlink:href="#linearGradient3907"
       id="radialGradient3372"
       gradientUnits="userSpaceOnUse"
       gradientTransform="matrix(1.382603,3.581398e-5,0,0.171503,-6.729684,34.0972)"
       cx="20.913568"
       cy="47.045319"
       fx="20.913568"
       fy="47.045319"
       r="19.5" />
    <radialGradient
       inkscape:collect="always"
       xlink:href="#linearGradient3907"
       id="radialGradient3374"
       gradientUnits="userSpaceOnUse"
       gradientTransform="matrix(1.382603,3.581398e-5,0,0.171503,-6.729684,34.0972)"
       cx="20.913568"
       cy="47.045319"
       fx="20.913568"
       fy="47.045319"
       r="19.5" />
    <radialGradient
       inkscape:collect="always"
       xlink:href="#linearGradient3907"
       id="radialGradient3376"
       gradientUnits="userSpaceOnUse"
       gradientTransform="matrix(1.382603,3.581398e-5,0,0.171503,-6.729684,34.0972)"
       cx="20.913568"
       cy="47.045319"
       fx="20.913568"
       fy="47.045319"
       r="19.5" />
    <radialGradient
       inkscape:collect="always"
       xlink:href="#linearGradient3907"
       id="radialGradient3378"
       gradientUnits="userSpaceOnUse"
       gradientTransform="matrix(1.382603,3.581398e-5,0,0.171503,-6.729684,34.0972)"
       cx="20.913568"
       cy="47.045319"
       fx="20.913568"
       fy="47.045319"
       r="19.5" />
    <radialGradient
       inkscape:collect="always"
       xlink:href="#linearGradient3907"
       id="radialGradient3380"
       gradientUnits="userSpaceOnUse"
       gradientTransform="matrix(1.382603,3.581398e-5,0,0.171503,-6.729684,34.0972)"
       cx="20.913568"
       cy="47.045319"
       fx="20.913568"
       fy="47.045319"
       r="19.5" />
    <radialGradient
       inkscape:collect="always"
       xlink:href="#linearGradient3907"
       id="radialGradient3382"
       gradientUnits="userSpaceOnUse"
       gradientTransform="matrix(1.382603,3.581398e-5,0,0.171503,-6.729684,34.0972)"
       cx="20.913568"
       cy="47.045319"
       fx="20.913568"
       fy="47.045319"
       r="19.5" />
    <radialGradient
       inkscape:collect="always"
       xlink:href="#linearGradient3907"
       id="radialGradient3384"
       gradientUnits="userSpaceOnUse"
       gradientTransform="matrix(1.382603,3.581398e-5,0,0.171503,-6.729684,34.0972)"
       cx="20.913568"
       cy="47.045319"
       fx="20.913568"
       fy="47.045319"
       r="19.5" />
    <radialGradient
       inkscape:collect="always"
       xlink:href="#linearGradient3907"
       id="radialGradient3386"
       gradientUnits="userSpaceOnUse"
       gradientTransform="matrix(1.382603,3.581398e-5,0,0.171503,-6.729684,34.0972)"
       cx="20.913568"
       cy="47.045319"
       fx="20.913568"
       fy="47.045319"
       r="19.5" />
    <radialGradient
       inkscape:collect="always"
       xlink:href="#linearGradient3907"
       id="radialGradient3388"
       gradientUnits="userSpaceOnUse"
       gradientTransform="matrix(1.382603,3.581398e-5,0,0.171503,-6.729684,34.0972)"
       cx="20.913568"
       cy="47.045319"
       fx="20.913568"
       fy="47.045319"
       r="19.5" />
    <radialGradient
       inkscape:collect="always"
       xlink:href="#linearGradient3907"
       id="radialGradient3390"
       gradientUnits="userSpaceOnUse"
       gradientTransform="matrix(1.382603,3.581398e-5,0,0.171503,-6.729684,34.0972)"
       cx="20.913568"
       cy="47.045319"
       fx="20.913568"
       fy="47.045319"
       r="19.5" />
    <radialGradient
       inkscape:collect="always"
       xlink:href="#linearGradient3907"
       id="radialGradient3392"
       gradientUnits="userSpaceOnUse"
       gradientTransform="matrix(1.382603,3.581398e-5,0,0.171503,-6.729684,34.0972)"
       cx="20.913568"
       cy="47.045319"
       fx="20.913568"
       fy="47.045319"
       r="19.5" />
    <radialGradient
       inkscape:collect="always"
       xlink:href="#linearGradient3907"
       id="radialGradient3394"
       gradientUnits="userSpaceOnUse"
       gradientTransform="matrix(1.382603,3.581398e-5,0,0.171503,-6.729684,34.0972)"
       cx="20.913568"
       cy="47.045319"
       fx="20.913568"
       fy="47.045319"
       r="19.5" />
    <radialGradient
       inkscape:collect="always"
       xlink:href="#linearGradient3907"
       id="radialGradient3396"
       gradientUnits="userSpaceOnUse"
       gradientTransform="matrix(1.382603,3.581398e-5,0,0.171503,-6.729684,34.0972)"
       cx="20.913568"
       cy="47.045319"
       fx="20.913568"
       fy="47.045319"
       r="19.5" />
    <radialGradient
       inkscape:collect="always"
       xlink:href="#linearGradient3907"
       id="radialGradient3398"
       gradientUnits="userSpaceOnUse"
       gradientTransform="matrix(1.382603,3.581398e-5,0,0.171503,-6.729684,34.0972)"
       cx="20.913568"
       cy="47.045319"
       fx="20.913568"
       fy="47.045319"
       r="19.5" />
    <radialGradient
       inkscape:collect="always"
       xlink:href="#linearGradient3907"
       id="radialGradient3400"
       gradientUnits="userSpaceOnUse"
       gradientTransform="matrix(1.382603,3.581398e-5,0,0.171503,-6.729684,34.0972)"
       cx="20.913568"
       cy="47.045319"
       fx="20.913568"
       fy="47.045319"
       r="19.5" />
    <radialGradient
       inkscape:collect="always"
       xlink:href="#linearGradient3907"
       id="radialGradient3402"
       gradientUnits="userSpaceOnUse"
       gradientTransform="matrix(1.382603,3.581398e-5,0,0.171503,-6.729684,34.0972)"
       cx="20.913568"
       cy="47.045319"
       fx="20.913568"
       fy="47.045319"
       r="19.5" />
    <radialGradient
       inkscape:collect="always"
       xlink:href="#linearGradient3907"
       id="radialGradient3404"
       gradientUnits="userSpaceOnUse"
       gradientTransform="matrix(1.382603,3.581398e-5,0,0.171503,-6.729684,34.0972)"
       cx="20.913568"
       cy="47.045319"
       fx="20.913568"
       fy="47.045319"
       r="19.5" />
    <radialGradient
       inkscape:collect="always"
       xlink:href="#linearGradient3907"
       id="radialGradient3406"
       gradientUnits="userSpaceOnUse"
       gradientTransform="matrix(1.382603,3.581398e-5,0,0.171503,-6.729684,34.0972)"
       cx="20.913568"
       cy="47.045319"
       fx="20.913568"
       fy="47.045319"
       r="19.5" />
    <radialGradient
       inkscape:collect="always"
       xlink:href="#linearGradient3907"
       id="radialGradient3408"
       gradientUnits="userSpaceOnUse"
       gradientTransform="matrix(1.382603,3.581398e-5,0,0.171503,-6.729684,34.0972)"
       cx="20.913568"
       cy="47.045319"
       fx="20.913568"
       fy="47.045319"
       r="19.5" />
    <radialGradient
       inkscape:collect="always"
       xlink:href="#linearGradient3907"
       id="radialGradient3410"
       gradientUnits="userSpaceOnUse"
       gradientTransform="matrix(1.382603,3.581398e-5,0,0.171503,-6.729684,34.0972)"
       cx="20.913568"
       cy="47.045319"
       fx="20.913568"
       fy="47.045319"
       r="19.5" />
    <radialGradient
       inkscape:collect="always"
       xlink:href="#linearGradient3907"
       id="radialGradient3412"
       gradientUnits="userSpaceOnUse"
       gradientTransform="matrix(1.382603,3.581398e-5,0,0.171503,-6.729684,34.0972)"
       cx="20.913568"
       cy="47.045319"
       fx="20.913568"
       fy="47.045319"
       r="19.5" />
    <radialGradient
       inkscape:collect="always"
       xlink:href="#linearGradient3907"
       id="radialGradient3414"
       gradientUnits="userSpaceOnUse"
       gradientTransform="matrix(1.382603,3.581398e-5,0,0.171503,-6.729684,34.0972)"
       cx="20.913568"
       cy="47.045319"
       fx="20.913568"
       fy="47.045319"
       r="19.5" />
    <radialGradient
       inkscape:collect="always"
       xlink:href="#linearGradient3907"
       id="radialGradient3416"
       gradientUnits="userSpaceOnUse"
       gradientTransform="matrix(1.382603,3.581398e-5,0,0.171503,-6.729684,34.0972)"
       cx="20.913568"
       cy="47.045319"
       fx="20.913568"
       fy="47.045319"
       r="19.5" />
    <radialGradient
       inkscape:collect="always"
       xlink:href="#linearGradient3907"
       id="radialGradient3418"
       gradientUnits="userSpaceOnUse"
       gradientTransform="matrix(1.382603,3.581398e-5,0,0.171503,-6.729684,34.0972)"
       cx="20.913568"
       cy="47.045319"
       fx="20.913568"
       fy="47.045319"
       r="19.5" />
    <radialGradient
       inkscape:collect="always"
       xlink:href="#linearGradient3907"
       id="radialGradient3420"
       gradientUnits="userSpaceOnUse"
       gradientTransform="matrix(1.382603,3.581398e-5,0,0.171503,-6.729684,34.0972)"
       cx="20.913568"
       cy="47.045319"
       fx="20.913568"
       fy="47.045319"
       r="19.5" />
    <radialGradient
       inkscape:collect="always"
       xlink:href="#linearGradient3907"
       id="radialGradient3422"
       gradientUnits="userSpaceOnUse"
       gradientTransform="matrix(1.382603,3.581398e-5,0,0.171503,-6.729684,34.0972)"
       cx="20.913568"
       cy="47.045319"
       fx="20.913568"
       fy="47.045319"
       r="19.5" />
    <radialGradient
       inkscape:collect="always"
       xlink:href="#linearGradient3907"
       id="radialGradient3424"
       gradientUnits="userSpaceOnUse"
       gradientTransform="matrix(1.382603,3.581398e-5,0,0.171503,-6.729684,34.0972)"
       cx="20.913568"
       cy="47.045319"
       fx="20.913568"
       fy="47.045319"
       r="19.5" />
    <radialGradient
       inkscape:collect="always"
       xlink:href="#linearGradient3907"
       id="radialGradient3426"
       gradientUnits="userSpaceOnUse"
       gradientTransform="matrix(1.382603,3.581398e-5,0,0.171503,-6.729684,34.0972)"
       cx="20.913568"
       cy="47.045319"
       fx="20.913568"
       fy="47.045319"
       r="19.5" />
    <radialGradient
       inkscape:collect="always"
       xlink:href="#linearGradient3907"
       id="radialGradient3428"
       gradientUnits="userSpaceOnUse"
       gradientTransform="matrix(1.382603,3.581398e-5,0,0.171503,-6.729684,34.0972)"
       cx="20.913568"
       cy="47.045319"
       fx="20.913568"
       fy="47.045319"
       r="19.5" />
    <radialGradient
       inkscape:collect="always"
       xlink:href="#linearGradient3907"
       id="radialGradient3430"
       gradientUnits="userSpaceOnUse"
       gradientTransform="matrix(1.382603,3.581398e-5,0,0.171503,-6.729684,34.0972)"
       cx="20.913568"
       cy="47.045319"
       fx="20.913568"
       fy="47.045319"
       r="19.5" />
    <radialGradient
       inkscape:collect="always"
       xlink:href="#linearGradient3907"
       id="radialGradient3432"
       gradientUnits="userSpaceOnUse"
       gradientTransform="matrix(1.382603,3.581398e-5,0,0.171503,-6.729684,34.0972)"
       cx="20.913568"
       cy="47.045319"
       fx="20.913568"
       fy="47.045319"
       r="19.5" />
    <radialGradient
       inkscape:collect="always"
       xlink:href="#linearGradient3907"
       id="radialGradient3434"
       gradientUnits="userSpaceOnUse"
       gradientTransform="matrix(1.382603,3.581398e-5,0,0.171503,-6.729684,34.0972)"
       cx="20.913568"
       cy="47.045319"
       fx="20.913568"
       fy="47.045319"
       r="19.5" />
    <radialGradient
       inkscape:collect="always"
       xlink:href="#linearGradient3907"
       id="radialGradient3436"
       gradientUnits="userSpaceOnUse"
       gradientTransform="matrix(1.382603,3.581398e-5,0,0.171503,-6.729684,34.0972)"
       cx="20.913568"
       cy="47.045319"
       fx="20.913568"
       fy="47.045319"
       r="19.5" />
    <radialGradient
       inkscape:collect="always"
       xlink:href="#linearGradient3907"
       id="radialGradient3438"
       gradientUnits="userSpaceOnUse"
       gradientTransform="matrix(1.382603,3.581398e-5,0,0.171503,-6.729684,34.0972)"
       cx="20.913568"
       cy="47.045319"
       fx="20.913568"
       fy="47.045319"
       r="19.5" />
    <radialGradient
       inkscape:collect="always"
       xlink:href="#linearGradient3907"
       id="radialGradient3440"
       gradientUnits="userSpaceOnUse"
       gradientTransform="matrix(1.382603,3.581398e-5,0,0.171503,-6.729684,34.0972)"
       cx="20.913568"
       cy="47.045319"
       fx="20.913568"
       fy="47.045319"
       r="19.5" />
    <linearGradient
       inkscape:collect="always"
       xlink:href="#linearGradient3899"
       id="linearGradient3442"
       gradientUnits="userSpaceOnUse"
       gradientTransform="matrix(1,0,0,0.753044,-48,12.25251)"
       x1="26.5"
       y1="43.249905"
       x2="26.5"
       y2="35.75" />
    <radialGradient
       inkscape:collect="always"
       xlink:href="#linearGradient5225"
       id="radialGradient4337"
       gradientUnits="userSpaceOnUse"
       gradientTransform="matrix(0.968245,0,0,0.21390205,1.508866,-129.14508)"
       cx="23.9375"
       cy="42.6875"
       fx="23.9375"
       fy="42.6875"
       r="23.75956" />
    <linearGradient
       inkscape:collect="always"
       xlink:href="#linearGradient4196"
       id="linearGradient4343"
       gradientUnits="userSpaceOnUse"
       gradientTransform="translate(24)"
       x1="37.484837"
       y1="38.267769"
       x2="37.295498"
       y2="33.637787" />
    <linearGradient
       inkscape:collect="always"
       xlink:href="#linearGradient3042"
       id="linearGradient10235"
       gradientUnits="userSpaceOnUse"
       gradientTransform="matrix(2.774389,0,0,1.969706,-1892.179,-872.8854)"
       x1="302.85715"
       y1="366.64789"
       x2="302.85715"
       y2="609.50507" />
    <radialGradient
       inkscape:collect="always"
       xlink:href="#linearGradient4196"
       id="radialGradient10237"
       gradientUnits="userSpaceOnUse"
       gradientTransform="matrix(2.774389,0,0,1.969706,-1891.633,-872.8854)"
       cx="605.71429"
       cy="486.64789"
       fx="605.71429"
       fy="486.64789"
       r="117.14286" />
    <radialGradient
       inkscape:collect="always"
       xlink:href="#linearGradient4196"
       id="radialGradient10239"
       gradientUnits="userSpaceOnUse"
       gradientTransform="matrix(-2.774389,0,0,1.969706,112.7623,-872.8854)"
       cx="605.71429"
       cy="486.64789"
       fx="605.71429"
       fy="486.64789"
       r="117.14286" />
    <linearGradient
       inkscape:collect="always"
       xlink:href="#linearGradient6934"
       id="linearGradient10247"
       gradientUnits="userSpaceOnUse"
       gradientTransform="translate(10.061112,-213.07376)"
       x1="14.125"
       y1="79.81311"
       x2="14.125"
       y2="75.499176" />
    <linearGradient
       inkscape:collect="always"
       id="linearGradient6934">
      <stop
         style="stop-color:#babdb6;stop-opacity:1"
         offset="0"
         id="stop6936" />
      <stop
         style="stop-color:#babdb6;stop-opacity:0"
         offset="1"
         id="stop6938" />
    </linearGradient>
  </defs>
  <sodipodi:namedview
     id="base"
     pagecolor="#ffffff"
     bordercolor="#849193"
     borderopacity="1"
     inkscape:pageopacity="0.0"
     inkscape:pageshadow="2"
     inkscape:zoom="2"
     inkscape:cx="-5.3163386"
     inkscape:cy="111.22112"
     inkscape:current-layer="layer2"
     showgrid="false"
     inkscape:grid-bbox="true"
     inkscape:document-units="px"
     inkscape:showpageshadow="false"
     showborder="false"
     inkscape:window-width="1247"
     inkscape:window-height="718"
     inkscape:window-x="2503"
     inkscape:window-y="232"
     showguides="true"
     inkscape:guide-bbox="true"
     inkscape:grid-points="false"
     stroke="#babdb6"
     fill="#888a85"
     borderlayer="top"
     inkscape:window-maximized="0"
     scale-x="0.25"
     units="px"
     fit-margin-top="0"
     fit-margin-left="0"
     fit-margin-right="0"
     fit-margin-bottom="0">
    <inkscape:grid
       id="GridFromPre046Settings"
       type="xygrid"
       originx="0"
       originy="0"
       spacingx="0.5"
       spacingy="0.5"
       color="#3f3fff"
       empcolor="#3f3fff"
       opacity="0.15"
       empopacity="0.38"
       empspacing="2" />
    <sodipodi:guide
       position="-70.125,0.125"
       orientation="0,1"
       id="guide5478"
       inkscape:locked="false" />
    <sodipodi:guide
       position="0,19.625"
       orientation="1,0"
       id="guide5480"
       inkscape:locked="false" />
  </sodipodi:namedview>
  <metadata
     id="metadata3309">
    <rdf:RDF>
      <cc:Work
         rdf:about="">
        <dc:format>image/svg+xml</dc:format>
        <dc:type
           rdf:resource="http://purl.org/dc/dcmitype/StillImage" />
        <dc:title></dc:title>
        <dc:creator>
          <cc:Agent>
            <dc:title>Lapo Calamandrei</dc:title>
          </cc:Agent>
        </dc:creator>
        <cc:license
           rdf:resource="http://creativecommons.org/licenses/GPL/2.0/" />
        <dc:subject>
          <rdf:Bag />
        </dc:subject>
        <dc:contributor>
          <cc:Agent>
            <dc:title>Jakub Steiner
Luca Ferretti &lt;elle.uca@libero.it&gt;</dc:title>
          </cc:Agent>
        </dc:contributor>
      </cc:Work>
      <cc:License
         rdf:about="http://creativecommons.org/licenses/GPL/2.0/">
        <cc:permits
           rdf:resource="http://web.resource.org/cc/Reproduction" />
        <cc:permits
           rdf:resource="http://web.resource.org/cc/Distribution" />
        <cc:requires
           rdf:resource="http://web.resource.org/cc/Notice" />
        <cc:permits
           rdf:resource="http://web.resource.org/cc/DerivativeWorks" />
        <cc:requires
           rdf:resource="http://web.resource.org/cc/ShareAlike" />
        <cc:requires
           rdf:resource="http://web.resource.org/cc/SourceCode" />
      </cc:License>
    </rdf:RDF>
  </metadata>
  <g
     id="layer1"
     inkscape:label="Layer 1"
     inkscape:groupmode="layer"
     style="display:inline"
     transform="translate(0,160)">
    <ellipse
       style="opacity:0.2;fill:url(#radialGradient4337);fill-opacity:1;fill-rule:evenodd;stroke:none;stroke-width:0.91453111px;stroke-linecap:butt;stroke-linejoin:miter;stroke-opacity:1"
       id="path1379"
       cx="24.686232"
       cy="-120.01414"
       rx="23.005075"
       ry="5.0822172" />
    <g
       id="g4339"
       transform="translate(-24.938765,-156.14006)">
      <path
         style="display:inline;opacity:0.20786516;fill:none;fill-opacity:1;fill-rule:evenodd;stroke:url(#linearGradient4343);stroke-width:1;stroke-linecap:butt;stroke-linejoin:miter;stroke-miterlimit:4;stroke-dasharray:none;stroke-opacity:1"
         d="M 66.13085,41.787912 C 57.847275,31.229854 73.566661,39.498791 71.897463,35.839689 70.26171,32.253903 51.343195,36.513864 53.3325,30.513864"
         id="use4184"
         sodipodi:nodetypes="czz"
         inkscape:connector-curvature="0" />
      <path
         sodipodi:nodetypes="czz"
         id="path4172"
         d="M 65.675044,41.213388 C 57.656634,30.125 72.913568,39.404152 71.161327,35 69.172021,30 52.551603,36.027728 53.480248,30.116116"
         style="display:inline;fill:none;fill-opacity:1;fill-rule:evenodd;stroke:#729fcf;stroke-width:1.00000012;stroke-linecap:butt;stroke-linejoin:miter;stroke-miterlimit:4;stroke-dasharray:none;stroke-opacity:1"
         inkscape:connector-curvature="0" />
    </g>
    <g
       id="g2302"
       transform="matrix(0.811017,0,0,0.811017,4.597298,-151.99527)">
      <path
         style="color:#000000;display:inline;overflow:visible;visibility:visible;opacity:1;fill:url(#linearGradient2308);fill-opacity:1;fill-rule:evenodd;stroke:#888a85;stroke-width:1.23301888;stroke-linecap:butt;stroke-linejoin:miter;stroke-miterlimit:4;stroke-dasharray:none;stroke-dashoffset:0;stroke-opacity:1;marker:none;marker-start:none;marker-mid:none;marker-end:none"
         d="m 14.375479,32.558794 c 0,0 1.216876,4.898976 -3.856329,4.944966 -2.4302757,0.02175 -1.9324777,4.006021 -1.9324777,4.006021 l 30.8464667,-0.03115 c 0,0 0.418438,-3.867241 -2.022217,-3.912581 -4.987467,-0.09147 -3.810529,-5.06955 -3.810529,-5.06955 z"
         id="path1359"
         sodipodi:nodetypes="csccscc"
         inkscape:connector-curvature="0" />
      <path
         style="opacity:0.5;fill:url(#linearGradient2310);fill-opacity:1;fill-rule:evenodd;stroke:none;stroke-width:1px;stroke-linecap:butt;stroke-linejoin:miter;stroke-opacity:1"
         d="m 13.926195,33.027451 c 0.08401,2.172549 -0.28454,2.911443 -1.640464,3.675231 L 36,38 c -0.952992,-1.168628 -2.339163,-2.933334 -1.961117,-4.988235 z"
         id="path1367"
         sodipodi:nodetypes="ccccc"
         inkscape:connector-curvature="0" />
      <path
         sodipodi:nodetypes="cc"
         id="path1393"
         d="m 10.436202,38.661601 c 6.564263,0.002 27.126435,0 27.126435,0"
         style="fill:none;fill-opacity:1;fill-rule:evenodd;stroke:#8d8d8f;stroke-width:1.23301923px;stroke-linecap:round;stroke-linejoin:miter;stroke-opacity:0.43902438"
         inkscape:connector-curvature="0" />
      <path
         style="fill:none;fill-opacity:1;fill-rule:evenodd;stroke:#ffffff;stroke-width:1.23301911px;stroke-linecap:round;stroke-linejoin:miter;stroke-opacity:1"
         d="m 9.647928,39.660187 c 6.706693,0.002 28.719861,0 28.719861,0"
         id="path1395"
         sodipodi:nodetypes="cc"
         inkscape:connector-curvature="0" />
    </g>
    <rect
       style="fill:none;fill-opacity:0.75;fill-rule:evenodd;stroke:none;stroke-width:1px;stroke-linecap:butt;stroke-linejoin:miter;stroke-opacity:1"
       id="rect4784"
       width="48"
       height="48"
       x="0.061233521"
       y="-158.98381" />
    <path
       style="fill:url(#linearGradient5147);fill-opacity:1;fill-rule:evenodd;stroke:#888a85;stroke-width:1.00000036;stroke-linecap:butt;stroke-linejoin:miter;stroke-miterlimit:4;stroke-opacity:1"
       d="m 4.949514,-155.63806 h 38.10226 c 2.023707,0 3.498537,1.42555 3.498537,3.6208 l 0.01094,25.16524 c 3e-6,1.68957 -0.527976,2.21196 -2.033235,2.21196 l -40.934119,-0.0189 c -1.178449,-0.0288 -2.017188,-0.49393 -2.033011,-2.01633 l 0.01517,-25.52943 c 0,-1.77121 1.538334,-3.43333 3.373461,-3.43333 z"
       id="rect5040"
       sodipodi:nodetypes="ccccccccc"
       inkscape:connector-curvature="0" />
    <rect
       style="fill:url(#radialGradient5239);fill-opacity:1;fill-rule:evenodd;stroke:#204a87;stroke-width:1px;stroke-linecap:butt;stroke-linejoin:miter;stroke-opacity:1"
       id="rect9208"
       width="37"
       height="23"
       x="5.5612335"
       y="-151.64006" />
    <path
       style="opacity:0.75;fill:url(#linearGradient6246);fill-opacity:1;fill-rule:evenodd;stroke:none;stroke-width:1px;stroke-linecap:butt;stroke-linejoin:miter;stroke-opacity:1"
       d="m 6.061235,-151.1479 v 18.00784 c 16.444445,-1.35425 22.598693,-10.11242 35.968627,-11.02745 l 10e-7,-7.01176 z"
       id="path4073"
       sodipodi:nodetypes="ccccc"
       inkscape:connector-curvature="0" />
    <rect
       y="-158.98381"
       x="0.061233521"
       height="48"
       width="48"
       id="rect1355"
       style="fill:none;fill-opacity:0.75;fill-rule:evenodd;stroke:none;stroke-width:1px;stroke-linecap:butt;stroke-linejoin:miter;stroke-opacity:1" />
    <rect
       style="fill:none;fill-opacity:0.75;fill-rule:evenodd;stroke:none;stroke-width:1px;stroke-linecap:butt;stroke-linejoin:miter;stroke-opacity:1"
       id="rect1377"
       width="48"
       height="48"
       x="0.061233521"
       y="-158.98381" />
    <path
       style="fill:none;fill-opacity:1;fill-rule:evenodd;stroke:#ffffff;stroke-width:0.99999958;stroke-linecap:butt;stroke-linejoin:miter;stroke-miterlimit:4;stroke-opacity:1"
       d="m 5.045074,-154.64513 c -1.299488,0 -2.483839,1.28152 -2.483839,2.53651 v 25.32404 c 0.0062,0.59716 0.144754,0.78257 0.279431,0.89706 0.134678,0.11448 0.419191,0.20482 0.900392,0.21653 l 40.672854,0.0309 c 0.646964,0 0.851442,-0.1 0.931439,-0.1856 0.08,-0.0856 0.217336,-0.39664 0.217336,-1.14452 l 1e-6,-24.95284 c 0,-1.78882 -1.004252,-2.72211 -2.60803,-2.72211 z"
       id="path1387"
       sodipodi:nodetypes="cccsccscccc"
       inkscape:connector-curvature="0" />
    <g
       style="opacity:0.4"
       id="g3052"
       transform="translate(0.061235,-143.14006)">
      <rect
         style="opacity:1;fill:url(#radialGradient2517);fill-opacity:1;stroke:none;stroke-width:1;stroke-linejoin:round;stroke-miterlimit:4;stroke-dasharray:none;stroke-opacity:1"
         id="rect3026"
         width="4"
         height="4.5"
         x="0"
         y="30.5" />
      <rect
         style="display:inline;opacity:1;fill:url(#radialGradient2519);fill-opacity:1;stroke:none;stroke-width:1;stroke-linejoin:round;stroke-miterlimit:4;stroke-dasharray:none;stroke-opacity:1"
         id="rect3036"
         width="4"
         height="4.5"
         x="-48"
         y="-35"
         transform="scale(-1)" />
      <rect
         style="opacity:1;fill:url(#linearGradient2521);fill-opacity:1;stroke:none;stroke-width:1;stroke-linejoin:round;stroke-miterlimit:4;stroke-dasharray:none;stroke-opacity:1"
         id="rect3040"
         width="40"
         height="4.5"
         x="4"
         y="30.5" />
    </g>
    <g
       id="g3316"
       transform="translate(48.061235,-156.14006)">
      <path
         style="fill:url(#linearGradient3442);fill-opacity:1;stroke:#888a85;stroke-width:1.00000417;stroke-linejoin:round;stroke-miterlimit:4;stroke-opacity:1"
         d="m -42.6875,40.49166 c -0.967886,0 -1.847763,0.285348 -2.4375,1.247229 l -1.8125,2.918046 c -0.808653,1.054721 -0.156385,1.859077 2.59375,1.859077 h 40.4375 c 2.750135,0 3.402403,-0.804356 2.59375,-1.859077 L -3.125,41.738889 C -3.714737,40.777008 -4.594614,40.49166 -5.5625,40.49166 Z"
         id="rect2024"
         sodipodi:nodetypes="ccccccccc"
         inkscape:connector-curvature="0" />
      <path
         transform="matrix(1,0,0,0.666668,-48,15.83327)"
         sodipodi:type="inkscape:offset"
         inkscape:radius="-1"
         inkscape:original="M 5.3125 37.5 C 4.344614 37.5 3.4647369 37.878926 2.875 39.15625 L 1.0625 43.03125 C 0.253847 44.43186 0.90611493 45.5 3.65625 45.5 L 44.09375 45.5 C 46.843885 45.5 47.496153 44.43186 46.6875 43.03125 L 44.875 39.15625 C 44.285263 37.878926 43.405386 37.5 42.4375 37.5 L 5.3125 37.5 z "
         style="display:inline;fill:none;fill-opacity:0.46875;stroke:#ffffff;stroke-width:1.22474873;stroke-linejoin:round;stroke-miterlimit:4;stroke-opacity:1"
         id="path2920"
         d="m 5.3125,38.5 c -0.7068869,0 -1.0666848,0.07419 -1.5292969,1.076172 a 1.0001,1.0001 0 0 1 -0.00195,0.0039 l -1.8125,3.875 a 1.0001,1.0001 0 0 1 -0.041016,0.07617 c -0.1455375,0.252075 -0.1851561,0.437195 -0.1875,0.509766 -0.00234,0.07257 -0.01383,0.03574 0.021484,0.07422 C 1.8323476,44.192192 2.4106476,44.5 3.65625,44.5 h 40.4375 c 1.245602,0 1.823902,-0.307808 1.894531,-0.384766 0.03531,-0.03848 0.02383,-0.0016 0.02148,-0.07422 -0.0023,-0.07257 -0.04196,-0.257691 -0.1875,-0.509766 a 1.0001,1.0001 0 0 1 -0.04102,-0.07617 l -1.8125,-3.875 a 1.0001,1.0001 0 0 1 -0.002,-0.0039 C 43.504185,38.57419 43.144387,38.5 42.4375,38.5 Z" />
    </g>
    <g
       transform="translate(-102,13.18088)"
       inkscape:label="Shadow"
       id="g2299" />
    <g
       id="g2301"
       inkscape:label="Shadow"
       transform="translate(-102,28.24691)" />
    <g
       id="g2303"
       inkscape:label="Lavoro"
       style="display:inline"
       transform="translate(-102,28.24691)" />
    <g
       id="g3252"
       transform="translate(48.061235,-156.14006)">
      <path
         style="color:#000000;display:inline;overflow:visible;visibility:visible;fill:url(#linearGradient3320);fill-opacity:1;fill-rule:nonzero;stroke:#babdb6;stroke-width:0.99999923;stroke-linecap:square;stroke-linejoin:round;stroke-miterlimit:4;stroke-dashoffset:0;stroke-opacity:1;marker:none;marker-start:none;marker-mid:none;marker-end:none"
         d="m -41.565234,39.500963 c -0.003,0.0031 0.0028,0.02359 0,0.026 -0.01467,0.0041 -0.05022,0.02021 -0.06523,0.02601 -0.005,0.0021 -0.02762,-0.0023 -0.03262,0 -0.005,0.0025 -0.02769,0.0233 -0.03262,0.026 -0.0097,0.0058 -0.02321,0.01943 -0.03262,0.026 -0.0046,0.0035 -0.02815,0.02233 -0.03262,0.02601 -0.0043,0.0039 -0.02844,0.02193 -0.03262,0.02601 -0.06487,0.075 -0.133186,0.205396 -0.228319,0.364081 l -2.22755,3.952895 c 0,0.0049 -2.28e-4,0.02105 0,0.026 4.53e-4,0.005 -6.74e-4,0.02104 0,0.026 8.91e-4,0.005 -0.0011,0.02106 0,0.02601 0.0026,0.0099 0.02917,0.04222 0.03262,0.05201 0.0019,0.0049 -0.0021,0.02117 0,0.02601 0.0069,0.01439 0.02403,0.03804 0.03262,0.05201 0.0091,0.0138 0.02197,0.03881 0.03262,0.05201 0.0037,0.0043 0.02875,0.02176 0.03262,0.026 0.004,0.0042 0.02844,0.02194 0.03262,0.02601 0.02595,0.02385 0.06703,0.05818 0.09785,0.07802 0.0053,0.0032 0.02724,0.02296 0.03262,0.02601 0.0165,0.0079 0.04736,0.01884 0.06523,0.026 0.120228,0.04402 0.279283,0.07802 0.42402,0.07802 h 23.114643 l -0.09785,-4.993121 -20.789242,-6e-6 c -0.06851,0 -0.143762,-0.0019 -0.195701,0 -0.01215,5.7e-5 -0.05203,5.11e-4 -0.06523,0 -0.004,2.5e-5 -0.02896,-2.14e-4 -0.03262,0 -0.0028,0.0024 -0.02957,-0.0031 -0.03262,0 z m 23.039809,6e-6 0.09785,1.664375 h 5.642726 l -0.260935,-1.664375 z m 7.436655,0 1.17421,4.993121 h 5.218705 c 0.144736,0 0.303792,-0.034 0.42402,-0.07802 0.017877,-0.0072 0.048735,-0.0181 0.065233,-0.026 0.00538,-0.003 0.027357,-0.02283 0.032617,-0.02601 0.030821,-0.01983 0.071897,-0.05416 0.097851,-0.07802 0.00418,-0.0041 0.028592,-0.02185 0.032616,-0.02601 0.00387,-0.0042 0.028906,-0.02168 0.032618,-0.026 0.010648,-0.0132 0.023496,-0.03821 0.032617,-0.05201 0.00859,-0.01397 0.025688,-0.03762 0.032617,-0.05201 0.00212,-0.0048 -0.00192,-0.02114 0,-0.02601 0.00345,-0.0098 0.029987,-0.04214 0.032617,-0.05201 0.0011,-0.005 -8.92e-4,-0.02105 0,-0.02601 6.73e-4,-0.005 -4.54e-4,-0.02104 0,-0.026 2.29e-4,-0.005 0,-0.02106 0,-0.026 l -1.826015,-3.9529 C -5.834197,39.862396 -5.902512,39.732002 -5.967383,39.656999 -5.971557,39.652925 -5.99567,39.634868 -6,39.630993 c -0.00447,-0.0037 -0.028021,-0.02252 -0.032617,-0.02601 -0.00941,-0.0066 -0.022876,-0.02021 -0.032617,-0.026 -0.00493,-0.0027 -0.027643,-0.0235 -0.032616,-0.026 -0.005,-0.0023 -0.027608,0.0021 -0.032617,0 -0.015014,-0.0058 -0.050564,-0.02192 -0.065234,-0.02601 -0.016117,-0.0031 -0.041567,-0.02056 -0.065235,-0.026 -0.011875,-0.0025 -0.054353,0.0014 -0.065233,0 -0.05194,-0.0019 -0.127187,0 -0.195701,0 z m -6.131978,3.328747 -1.043741,1.664374 h 6.001511 l -1.304677,-1.664374 z"
         id="path2308"
         sodipodi:nodetypes="csssssssccssssssssssssccccssscccccccccssssssssssssccsssssssssccccccc"
         inkscape:connector-curvature="0" />
      <g
         id="g2310"
         style="fill:url(#radialGradient2433);fill-opacity:1"
         transform="translate(-48,-0.00589)">
        <rect
           ry="0.26516503"
           rx="0.26516503"
           y="39"
           x="7"
           height="1"
           width="1"
           id="rect2312"
           style="color:#000000;display:inline;overflow:visible;visibility:visible;opacity:1;fill:url(#radialGradient3322);fill-opacity:1;fill-rule:nonzero;stroke:none;stroke-width:1;stroke-linecap:square;stroke-linejoin:round;stroke-miterlimit:4;stroke-dasharray:none;stroke-dashoffset:0;stroke-opacity:1;marker:none;marker-start:none;marker-mid:none;marker-end:none" />
        <rect
           ry="0.26516503"
           rx="0.26516503"
           y="39"
           x="9"
           height="1"
           width="1"
           id="rect2314"
           style="color:#000000;display:inline;overflow:visible;visibility:visible;opacity:1;fill:url(#radialGradient3324);fill-opacity:1;fill-rule:nonzero;stroke:none;stroke-width:1;stroke-linecap:square;stroke-linejoin:round;stroke-miterlimit:4;stroke-dasharray:none;stroke-dashoffset:0;stroke-opacity:1;marker:none;marker-start:none;marker-mid:none;marker-end:none" />
        <rect
           ry="0.26516503"
           rx="0.26516503"
           y="39"
           x="11"
           height="1"
           width="1"
           id="rect2316"
           style="color:#000000;display:inline;overflow:visible;visibility:visible;opacity:1;fill:url(#radialGradient3326);fill-opacity:1;fill-rule:nonzero;stroke:none;stroke-width:1;stroke-linecap:square;stroke-linejoin:round;stroke-miterlimit:4;stroke-dasharray:none;stroke-dashoffset:0;stroke-opacity:1;marker:none;marker-start:none;marker-mid:none;marker-end:none" />
        <rect
           ry="0.26516503"
           rx="0.26516503"
           y="39"
           x="13"
           height="1"
           width="1"
           id="rect2318"
           style="color:#000000;display:inline;overflow:visible;visibility:visible;opacity:1;fill:url(#radialGradient3328);fill-opacity:1;fill-rule:nonzero;stroke:none;stroke-width:1;stroke-linecap:square;stroke-linejoin:round;stroke-miterlimit:4;stroke-dasharray:none;stroke-dashoffset:0;stroke-opacity:1;marker:none;marker-start:none;marker-mid:none;marker-end:none" />
        <rect
           ry="0.26516503"
           rx="0.26516503"
           y="39"
           x="15"
           height="1"
           width="1"
           id="rect2320"
           style="color:#000000;display:inline;overflow:visible;visibility:visible;opacity:1;fill:url(#radialGradient3330);fill-opacity:1;fill-rule:nonzero;stroke:none;stroke-width:1;stroke-linecap:square;stroke-linejoin:round;stroke-miterlimit:4;stroke-dasharray:none;stroke-dashoffset:0;stroke-opacity:1;marker:none;marker-start:none;marker-mid:none;marker-end:none" />
        <rect
           ry="0.26516503"
           rx="0.26516503"
           y="39"
           x="17"
           height="1"
           width="1"
           id="rect2322"
           style="color:#000000;display:inline;overflow:visible;visibility:visible;opacity:1;fill:url(#radialGradient3332);fill-opacity:1;fill-rule:nonzero;stroke:none;stroke-width:1;stroke-linecap:square;stroke-linejoin:round;stroke-miterlimit:4;stroke-dasharray:none;stroke-dashoffset:0;stroke-opacity:1;marker:none;marker-start:none;marker-mid:none;marker-end:none" />
        <rect
           ry="0.26516503"
           rx="0.26516503"
           y="39"
           x="19"
           height="1"
           width="1"
           id="rect2324"
           style="color:#000000;display:inline;overflow:visible;visibility:visible;opacity:1;fill:url(#radialGradient3334);fill-opacity:1;fill-rule:nonzero;stroke:none;stroke-width:1;stroke-linecap:square;stroke-linejoin:round;stroke-miterlimit:4;stroke-dasharray:none;stroke-dashoffset:0;stroke-opacity:1;marker:none;marker-start:none;marker-mid:none;marker-end:none" />
        <rect
           ry="0.26516503"
           rx="0.26516503"
           y="39"
           x="21"
           height="1"
           width="1"
           id="rect2326"
           style="color:#000000;display:inline;overflow:visible;visibility:visible;opacity:1;fill:url(#radialGradient3336);fill-opacity:1;fill-rule:nonzero;stroke:none;stroke-width:1;stroke-linecap:square;stroke-linejoin:round;stroke-miterlimit:4;stroke-dasharray:none;stroke-dashoffset:0;stroke-opacity:1;marker:none;marker-start:none;marker-mid:none;marker-end:none" />
        <rect
           ry="0.26516503"
           rx="0.26516503"
           y="40"
           x="6"
           height="1"
           width="1"
           id="rect2328"
           style="color:#000000;display:inline;overflow:visible;visibility:visible;opacity:1;fill:url(#radialGradient3338);fill-opacity:1;fill-rule:nonzero;stroke:none;stroke-width:1;stroke-linecap:square;stroke-linejoin:round;stroke-miterlimit:4;stroke-dasharray:none;stroke-dashoffset:0;stroke-opacity:1;marker:none;marker-start:none;marker-mid:none;marker-end:none" />
        <rect
           ry="0.26516503"
           rx="0.26516503"
           y="40"
           x="8"
           height="1"
           width="1"
           id="rect2330"
           style="color:#000000;display:inline;overflow:visible;visibility:visible;opacity:1;fill:url(#radialGradient3340);fill-opacity:1;fill-rule:nonzero;stroke:none;stroke-width:1;stroke-linecap:square;stroke-linejoin:round;stroke-miterlimit:4;stroke-dasharray:none;stroke-dashoffset:0;stroke-opacity:1;marker:none;marker-start:none;marker-mid:none;marker-end:none" />
        <rect
           ry="0.26516503"
           rx="0.26516503"
           y="40"
           x="10"
           height="1"
           width="1"
           id="rect2332"
           style="color:#000000;display:inline;overflow:visible;visibility:visible;opacity:1;fill:url(#radialGradient3342);fill-opacity:1;fill-rule:nonzero;stroke:none;stroke-width:1;stroke-linecap:square;stroke-linejoin:round;stroke-miterlimit:4;stroke-dasharray:none;stroke-dashoffset:0;stroke-opacity:1;marker:none;marker-start:none;marker-mid:none;marker-end:none" />
        <rect
           ry="0.26516503"
           rx="0.26516503"
           y="40"
           x="12"
           height="1"
           width="1"
           id="rect2334"
           style="color:#000000;display:inline;overflow:visible;visibility:visible;opacity:1;fill:url(#radialGradient3344);fill-opacity:1;fill-rule:nonzero;stroke:none;stroke-width:1;stroke-linecap:square;stroke-linejoin:round;stroke-miterlimit:4;stroke-dasharray:none;stroke-dashoffset:0;stroke-opacity:1;marker:none;marker-start:none;marker-mid:none;marker-end:none" />
        <rect
           ry="0.26516503"
           rx="0.26516503"
           y="40"
           x="14"
           height="1"
           width="1"
           id="rect2336"
           style="color:#000000;display:inline;overflow:visible;visibility:visible;opacity:1;fill:url(#radialGradient3346);fill-opacity:1;fill-rule:nonzero;stroke:none;stroke-width:1;stroke-linecap:square;stroke-linejoin:round;stroke-miterlimit:4;stroke-dasharray:none;stroke-dashoffset:0;stroke-opacity:1;marker:none;marker-start:none;marker-mid:none;marker-end:none" />
        <rect
           ry="0.26516503"
           rx="0.26516503"
           y="40"
           x="16"
           height="1"
           width="1"
           id="rect2338"
           style="color:#000000;display:inline;overflow:visible;visibility:visible;opacity:1;fill:url(#radialGradient3348);fill-opacity:1;fill-rule:nonzero;stroke:none;stroke-width:1;stroke-linecap:square;stroke-linejoin:round;stroke-miterlimit:4;stroke-dasharray:none;stroke-dashoffset:0;stroke-opacity:1;marker:none;marker-start:none;marker-mid:none;marker-end:none" />
        <rect
           ry="0.26516503"
           rx="0.26516503"
           y="40"
           x="18"
           height="1"
           width="1"
           id="rect2341"
           style="color:#000000;display:inline;overflow:visible;visibility:visible;opacity:1;fill:url(#radialGradient3350);fill-opacity:1;fill-rule:nonzero;stroke:none;stroke-width:1;stroke-linecap:square;stroke-linejoin:round;stroke-miterlimit:4;stroke-dasharray:none;stroke-dashoffset:0;stroke-opacity:1;marker:none;marker-start:none;marker-mid:none;marker-end:none" />
        <rect
           ry="0.26516503"
           rx="0.26516503"
           y="40"
           x="20"
           height="1"
           width="1"
           id="rect2343"
           style="color:#000000;display:inline;overflow:visible;visibility:visible;opacity:1;fill:url(#radialGradient3352);fill-opacity:1;fill-rule:nonzero;stroke:none;stroke-width:1;stroke-linecap:square;stroke-linejoin:round;stroke-miterlimit:4;stroke-dasharray:none;stroke-dashoffset:0;stroke-opacity:1;marker:none;marker-start:none;marker-mid:none;marker-end:none" />
        <rect
           ry="0.26516503"
           rx="0.26516503"
           y="41"
           x="7"
           height="1"
           width="1"
           id="rect2345"
           style="color:#000000;display:inline;overflow:visible;visibility:visible;opacity:1;fill:url(#radialGradient3354);fill-opacity:1;fill-rule:nonzero;stroke:none;stroke-width:1;stroke-linecap:square;stroke-linejoin:round;stroke-miterlimit:4;stroke-dasharray:none;stroke-dashoffset:0;stroke-opacity:1;marker:none;marker-start:none;marker-mid:none;marker-end:none" />
        <rect
           ry="0.26516503"
           rx="0.26516503"
           y="41"
           x="9"
           height="1"
           width="1"
           id="rect2347"
           style="color:#000000;display:inline;overflow:visible;visibility:visible;opacity:1;fill:url(#radialGradient3356);fill-opacity:1;fill-rule:nonzero;stroke:none;stroke-width:1;stroke-linecap:square;stroke-linejoin:round;stroke-miterlimit:4;stroke-dasharray:none;stroke-dashoffset:0;stroke-opacity:1;marker:none;marker-start:none;marker-mid:none;marker-end:none" />
        <rect
           ry="0.26516503"
           rx="0.26516503"
           y="41"
           x="11"
           height="1"
           width="1"
           id="rect2349"
           style="color:#000000;display:inline;overflow:visible;visibility:visible;opacity:1;fill:url(#radialGradient3358);fill-opacity:1;fill-rule:nonzero;stroke:none;stroke-width:1;stroke-linecap:square;stroke-linejoin:round;stroke-miterlimit:4;stroke-dasharray:none;stroke-dashoffset:0;stroke-opacity:1;marker:none;marker-start:none;marker-mid:none;marker-end:none" />
        <rect
           ry="0.26516503"
           rx="0.26516503"
           y="41"
           x="13"
           height="1"
           width="1"
           id="rect2351"
           style="color:#000000;display:inline;overflow:visible;visibility:visible;opacity:1;fill:url(#radialGradient3360);fill-opacity:1;fill-rule:nonzero;stroke:none;stroke-width:1;stroke-linecap:square;stroke-linejoin:round;stroke-miterlimit:4;stroke-dasharray:none;stroke-dashoffset:0;stroke-opacity:1;marker:none;marker-start:none;marker-mid:none;marker-end:none" />
        <rect
           ry="0.26516503"
           rx="0.26516503"
           y="41"
           x="15"
           height="1"
           width="1"
           id="rect2353"
           style="color:#000000;display:inline;overflow:visible;visibility:visible;opacity:1;fill:url(#radialGradient3362);fill-opacity:1;fill-rule:nonzero;stroke:none;stroke-width:1;stroke-linecap:square;stroke-linejoin:round;stroke-miterlimit:4;stroke-dasharray:none;stroke-dashoffset:0;stroke-opacity:1;marker:none;marker-start:none;marker-mid:none;marker-end:none" />
        <rect
           ry="0.26516503"
           rx="0.26516503"
           y="41"
           x="17"
           height="1"
           width="1"
           id="rect2355"
           style="color:#000000;display:inline;overflow:visible;visibility:visible;opacity:1;fill:url(#radialGradient3364);fill-opacity:1;fill-rule:nonzero;stroke:none;stroke-width:1;stroke-linecap:square;stroke-linejoin:round;stroke-miterlimit:4;stroke-dasharray:none;stroke-dashoffset:0;stroke-opacity:1;marker:none;marker-start:none;marker-mid:none;marker-end:none" />
        <rect
           ry="0.26516503"
           rx="0.26516503"
           y="41"
           x="19"
           height="1"
           width="1"
           id="rect2357"
           style="color:#000000;display:inline;overflow:visible;visibility:visible;opacity:1;fill:url(#radialGradient3366);fill-opacity:1;fill-rule:nonzero;stroke:none;stroke-width:1;stroke-linecap:square;stroke-linejoin:round;stroke-miterlimit:4;stroke-dasharray:none;stroke-dashoffset:0;stroke-opacity:1;marker:none;marker-start:none;marker-mid:none;marker-end:none" />
        <rect
           ry="0.26516503"
           rx="0.26516503"
           y="41"
           x="21"
           height="1"
           width="1"
           id="rect2359"
           style="color:#000000;display:inline;overflow:visible;visibility:visible;opacity:1;fill:url(#radialGradient3368);fill-opacity:1;fill-rule:nonzero;stroke:none;stroke-width:1;stroke-linecap:square;stroke-linejoin:round;stroke-miterlimit:4;stroke-dasharray:none;stroke-dashoffset:0;stroke-opacity:1;marker:none;marker-start:none;marker-mid:none;marker-end:none" />
        <rect
           ry="0.26516503"
           rx="0.26516503"
           y="42"
           x="6"
           height="1"
           width="1"
           id="rect2361"
           style="color:#000000;display:inline;overflow:visible;visibility:visible;opacity:1;fill:url(#radialGradient3370);fill-opacity:1;fill-rule:nonzero;stroke:none;stroke-width:1;stroke-linecap:square;stroke-linejoin:round;stroke-miterlimit:4;stroke-dasharray:none;stroke-dashoffset:0;stroke-opacity:1;marker:none;marker-start:none;marker-mid:none;marker-end:none" />
        <rect
           ry="0.26516503"
           rx="0.26516503"
           y="42"
           x="8"
           height="1"
           width="1"
           id="rect2363"
           style="color:#000000;display:inline;overflow:visible;visibility:visible;opacity:1;fill:url(#radialGradient3372);fill-opacity:1;fill-rule:nonzero;stroke:none;stroke-width:1;stroke-linecap:square;stroke-linejoin:round;stroke-miterlimit:4;stroke-dasharray:none;stroke-dashoffset:0;stroke-opacity:1;marker:none;marker-start:none;marker-mid:none;marker-end:none" />
        <rect
           ry="0.26516503"
           rx="0.26516503"
           y="42"
           x="10"
           height="1"
           width="1"
           id="rect2365"
           style="color:#000000;display:inline;overflow:visible;visibility:visible;opacity:1;fill:url(#radialGradient3374);fill-opacity:1;fill-rule:nonzero;stroke:none;stroke-width:1;stroke-linecap:square;stroke-linejoin:round;stroke-miterlimit:4;stroke-dasharray:none;stroke-dashoffset:0;stroke-opacity:1;marker:none;marker-start:none;marker-mid:none;marker-end:none" />
        <rect
           ry="0.26516503"
           rx="0.26516503"
           y="42"
           x="12"
           height="1"
           width="1"
           id="rect2367"
           style="color:#000000;display:inline;overflow:visible;visibility:visible;opacity:1;fill:url(#radialGradient3376);fill-opacity:1;fill-rule:nonzero;stroke:none;stroke-width:1;stroke-linecap:square;stroke-linejoin:round;stroke-miterlimit:4;stroke-dasharray:none;stroke-dashoffset:0;stroke-opacity:1;marker:none;marker-start:none;marker-mid:none;marker-end:none" />
        <rect
           ry="0.26516503"
           rx="0.26516503"
           y="42"
           x="14"
           height="1"
           width="1"
           id="rect2369"
           style="color:#000000;display:inline;overflow:visible;visibility:visible;opacity:1;fill:url(#radialGradient3378);fill-opacity:1;fill-rule:nonzero;stroke:none;stroke-width:1;stroke-linecap:square;stroke-linejoin:round;stroke-miterlimit:4;stroke-dasharray:none;stroke-dashoffset:0;stroke-opacity:1;marker:none;marker-start:none;marker-mid:none;marker-end:none" />
        <rect
           ry="0.26516503"
           rx="0.26516503"
           y="42"
           x="16"
           height="1"
           width="1"
           id="rect2371"
           style="color:#000000;display:inline;overflow:visible;visibility:visible;opacity:1;fill:url(#radialGradient3380);fill-opacity:1;fill-rule:nonzero;stroke:none;stroke-width:1;stroke-linecap:square;stroke-linejoin:round;stroke-miterlimit:4;stroke-dasharray:none;stroke-dashoffset:0;stroke-opacity:1;marker:none;marker-start:none;marker-mid:none;marker-end:none" />
        <rect
           ry="0.26516503"
           rx="0.26516503"
           y="42"
           x="18"
           height="1"
           width="1"
           id="rect2373"
           style="color:#000000;display:inline;overflow:visible;visibility:visible;opacity:1;fill:url(#radialGradient3382);fill-opacity:1;fill-rule:nonzero;stroke:none;stroke-width:1;stroke-linecap:square;stroke-linejoin:round;stroke-miterlimit:4;stroke-dasharray:none;stroke-dashoffset:0;stroke-opacity:1;marker:none;marker-start:none;marker-mid:none;marker-end:none" />
        <rect
           ry="0.26516503"
           rx="0.26516503"
           y="42"
           x="20"
           height="1"
           width="1"
           id="rect2375"
           style="color:#000000;display:inline;overflow:visible;visibility:visible;opacity:1;fill:url(#radialGradient3384);fill-opacity:1;fill-rule:nonzero;stroke:none;stroke-width:1;stroke-linecap:square;stroke-linejoin:round;stroke-miterlimit:4;stroke-dasharray:none;stroke-dashoffset:0;stroke-opacity:1;marker:none;marker-start:none;marker-mid:none;marker-end:none" />
        <rect
           ry="0.26516503"
           rx="0.26516503"
           y="43"
           x="5"
           height="1"
           width="1"
           id="rect2377"
           style="color:#000000;display:inline;overflow:visible;visibility:visible;opacity:1;fill:url(#radialGradient3386);fill-opacity:1;fill-rule:nonzero;stroke:none;stroke-width:1;stroke-linecap:square;stroke-linejoin:round;stroke-miterlimit:4;stroke-dasharray:none;stroke-dashoffset:0;stroke-opacity:1;marker:none;marker-start:none;marker-mid:none;marker-end:none" />
        <rect
           ry="0.26516503"
           rx="0.26516503"
           y="43"
           x="7"
           height="1"
           width="1"
           id="rect2379"
           style="color:#000000;display:inline;overflow:visible;visibility:visible;opacity:1;fill:url(#radialGradient3388);fill-opacity:1;fill-rule:nonzero;stroke:none;stroke-width:1;stroke-linecap:square;stroke-linejoin:round;stroke-miterlimit:4;stroke-dasharray:none;stroke-dashoffset:0;stroke-opacity:1;marker:none;marker-start:none;marker-mid:none;marker-end:none" />
        <rect
           ry="0.26516503"
           rx="0.26516503"
           y="42"
           x="22"
           height="1"
           width="1"
           id="rect2381"
           style="color:#000000;display:inline;overflow:visible;visibility:visible;opacity:1;fill:url(#radialGradient3390);fill-opacity:1;fill-rule:nonzero;stroke:none;stroke-width:1;stroke-linecap:square;stroke-linejoin:round;stroke-miterlimit:4;stroke-dasharray:none;stroke-dashoffset:0;stroke-opacity:1;marker:none;marker-start:none;marker-mid:none;marker-end:none" />
        <rect
           ry="0.26516503"
           rx="0.26516503"
           y="41"
           x="23"
           height="1"
           width="1"
           id="rect2383"
           style="color:#000000;display:inline;overflow:visible;visibility:visible;opacity:1;fill:url(#radialGradient3392);fill-opacity:1;fill-rule:nonzero;stroke:none;stroke-width:1;stroke-linecap:square;stroke-linejoin:round;stroke-miterlimit:4;stroke-dasharray:none;stroke-dashoffset:0;stroke-opacity:1;marker:none;marker-start:none;marker-mid:none;marker-end:none" />
        <rect
           ry="0.26516503"
           rx="0.26516503"
           y="40"
           x="22"
           height="1"
           width="1"
           id="rect2385"
           style="color:#000000;display:inline;overflow:visible;visibility:visible;opacity:1;fill:url(#radialGradient3394);fill-opacity:1;fill-rule:nonzero;stroke:none;stroke-width:1;stroke-linecap:square;stroke-linejoin:round;stroke-miterlimit:4;stroke-dasharray:none;stroke-dashoffset:0;stroke-opacity:1;marker:none;marker-start:none;marker-mid:none;marker-end:none" />
        <rect
           ry="0.26516503"
           rx="0.26516503"
           y="39"
           x="23"
           height="1"
           width="1"
           id="rect2387"
           style="color:#000000;display:inline;overflow:visible;visibility:visible;opacity:1;fill:url(#radialGradient3396);fill-opacity:1;fill-rule:nonzero;stroke:none;stroke-width:1;stroke-linecap:square;stroke-linejoin:round;stroke-miterlimit:4;stroke-dasharray:none;stroke-dashoffset:0;stroke-opacity:1;marker:none;marker-start:none;marker-mid:none;marker-end:none" />
        <rect
           ry="0.26516503"
           rx="0.26516503"
           y="40"
           x="24"
           height="1"
           width="1"
           id="rect2389"
           style="color:#000000;display:inline;overflow:visible;visibility:visible;opacity:1;fill:url(#radialGradient3398);fill-opacity:1;fill-rule:nonzero;stroke:none;stroke-width:1;stroke-linecap:square;stroke-linejoin:round;stroke-miterlimit:4;stroke-dasharray:none;stroke-dashoffset:0;stroke-opacity:1;marker:none;marker-start:none;marker-mid:none;marker-end:none" />
        <rect
           ry="0.26516503"
           rx="0.26516503"
           y="39"
           x="25"
           height="1"
           width="1"
           id="rect2391"
           style="color:#000000;display:inline;overflow:visible;visibility:visible;opacity:1;fill:url(#radialGradient3400);fill-opacity:1;fill-rule:nonzero;stroke:none;stroke-width:1;stroke-linecap:square;stroke-linejoin:round;stroke-miterlimit:4;stroke-dasharray:none;stroke-dashoffset:0;stroke-opacity:1;marker:none;marker-start:none;marker-mid:none;marker-end:none" />
        <rect
           ry="0.26516503"
           rx="0.26516503"
           y="40"
           x="26"
           height="1"
           width="1"
           id="rect2393"
           style="color:#000000;display:inline;overflow:visible;visibility:visible;opacity:1;fill:url(#radialGradient3402);fill-opacity:1;fill-rule:nonzero;stroke:none;stroke-width:1;stroke-linecap:square;stroke-linejoin:round;stroke-miterlimit:4;stroke-dasharray:none;stroke-dashoffset:0;stroke-opacity:1;marker:none;marker-start:none;marker-mid:none;marker-end:none" />
        <rect
           ry="0.26516503"
           rx="0.26516503"
           y="41"
           x="25"
           height="1"
           width="1"
           id="rect2395"
           style="color:#000000;display:inline;overflow:visible;visibility:visible;opacity:1;fill:url(#radialGradient3404);fill-opacity:1;fill-rule:nonzero;stroke:none;stroke-width:1;stroke-linecap:square;stroke-linejoin:round;stroke-miterlimit:4;stroke-dasharray:none;stroke-dashoffset:0;stroke-opacity:1;marker:none;marker-start:none;marker-mid:none;marker-end:none" />
        <rect
           ry="0.26516503"
           rx="0.26516503"
           y="42"
           x="24"
           height="1"
           width="1"
           id="rect2397"
           style="color:#000000;display:inline;overflow:visible;visibility:visible;opacity:1;fill:url(#radialGradient3406);fill-opacity:1;fill-rule:nonzero;stroke:none;stroke-width:1;stroke-linecap:square;stroke-linejoin:round;stroke-miterlimit:4;stroke-dasharray:none;stroke-dashoffset:0;stroke-opacity:1;marker:none;marker-start:none;marker-mid:none;marker-end:none" />
        <rect
           ry="0.26516503"
           rx="0.26516503"
           y="42"
           x="26"
           height="1"
           width="1"
           id="rect2399"
           style="color:#000000;display:inline;overflow:visible;visibility:visible;opacity:1;fill:url(#radialGradient3408);fill-opacity:1;fill-rule:nonzero;stroke:none;stroke-width:1;stroke-linecap:square;stroke-linejoin:round;stroke-miterlimit:4;stroke-dasharray:none;stroke-dashoffset:0;stroke-opacity:1;marker:none;marker-start:none;marker-mid:none;marker-end:none" />
        <rect
           ry="0.26516503"
           rx="0.26516503"
           y="43"
           x="25"
           height="1"
           width="1"
           id="rect2401"
           style="color:#000000;display:inline;overflow:visible;visibility:visible;opacity:1;fill:url(#radialGradient3410);fill-opacity:1;fill-rule:nonzero;stroke:none;stroke-width:1;stroke-linecap:square;stroke-linejoin:round;stroke-miterlimit:4;stroke-dasharray:none;stroke-dashoffset:0;stroke-opacity:1;marker:none;marker-start:none;marker-mid:none;marker-end:none" />
        <rect
           ry="0.26516503"
           rx="0.26516503"
           y="43"
           x="23"
           height="1"
           width="1"
           id="rect2403"
           style="color:#000000;display:inline;overflow:visible;visibility:visible;opacity:1;fill:url(#radialGradient3412);fill-opacity:1;fill-rule:nonzero;stroke:none;stroke-width:1;stroke-linecap:square;stroke-linejoin:round;stroke-miterlimit:4;stroke-dasharray:none;stroke-dashoffset:0;stroke-opacity:1;marker:none;marker-start:none;marker-mid:none;marker-end:none" />
        <rect
           ry="0.26516503"
           rx="0.26516503"
           y="43"
           x="31"
           height="1"
           width="1"
           id="rect2405"
           style="color:#000000;display:inline;overflow:visible;visibility:visible;opacity:1;fill:url(#radialGradient3414);fill-opacity:1;fill-rule:nonzero;stroke:none;stroke-width:1;stroke-linecap:square;stroke-linejoin:round;stroke-miterlimit:4;stroke-dasharray:none;stroke-dashoffset:0;stroke-opacity:1;marker:none;marker-start:none;marker-mid:none;marker-end:none" />
        <rect
           ry="0.26516503"
           rx="0.26516503"
           y="43"
           x="33"
           height="1"
           width="1"
           id="rect2407"
           style="color:#000000;display:inline;overflow:visible;visibility:visible;opacity:1;fill:url(#radialGradient3416);fill-opacity:1;fill-rule:nonzero;stroke:none;stroke-width:1;stroke-linecap:square;stroke-linejoin:round;stroke-miterlimit:4;stroke-dasharray:none;stroke-dashoffset:0;stroke-opacity:1;marker:none;marker-start:none;marker-mid:none;marker-end:none" />
        <rect
           ry="0.26516503"
           rx="0.26516503"
           y="39"
           x="31"
           height="1"
           width="1"
           id="rect2409"
           style="color:#000000;display:inline;overflow:visible;visibility:visible;opacity:1;fill:url(#radialGradient3418);fill-opacity:1;fill-rule:nonzero;stroke:none;stroke-width:1;stroke-linecap:square;stroke-linejoin:round;stroke-miterlimit:4;stroke-dasharray:none;stroke-dashoffset:0;stroke-opacity:1;marker:none;marker-start:none;marker-mid:none;marker-end:none" />
        <rect
           ry="0.26516503"
           rx="0.26516503"
           y="39"
           x="33"
           height="1"
           width="1"
           id="rect2411"
           style="color:#000000;display:inline;overflow:visible;visibility:visible;opacity:1;fill:url(#radialGradient3420);fill-opacity:1;fill-rule:nonzero;stroke:none;stroke-width:1;stroke-linecap:square;stroke-linejoin:round;stroke-miterlimit:4;stroke-dasharray:none;stroke-dashoffset:0;stroke-opacity:1;marker:none;marker-start:none;marker-mid:none;marker-end:none" />
        <rect
           ry="0.26516503"
           rx="0.26516503"
           y="39"
           x="37"
           height="1"
           width="1"
           id="rect2413"
           style="color:#000000;display:inline;overflow:visible;visibility:visible;opacity:1;fill:url(#radialGradient3422);fill-opacity:1;fill-rule:nonzero;stroke:none;stroke-width:1;stroke-linecap:square;stroke-linejoin:round;stroke-miterlimit:4;stroke-dasharray:none;stroke-dashoffset:0;stroke-opacity:1;marker:none;marker-start:none;marker-mid:none;marker-end:none" />
        <rect
           ry="0.26516503"
           rx="0.26516503"
           y="40"
           x="38"
           height="1"
           width="1"
           id="rect2415"
           style="color:#000000;display:inline;overflow:visible;visibility:visible;opacity:1;fill:url(#radialGradient3424);fill-opacity:1;fill-rule:nonzero;stroke:none;stroke-width:1;stroke-linecap:square;stroke-linejoin:round;stroke-miterlimit:4;stroke-dasharray:none;stroke-dashoffset:0;stroke-opacity:1;marker:none;marker-start:none;marker-mid:none;marker-end:none" />
        <rect
           ry="0.26516503"
           rx="0.26516503"
           y="39"
           x="39"
           height="1"
           width="1"
           id="rect2417"
           style="color:#000000;display:inline;overflow:visible;visibility:visible;opacity:1;fill:url(#radialGradient3426);fill-opacity:1;fill-rule:nonzero;stroke:none;stroke-width:1;stroke-linecap:square;stroke-linejoin:round;stroke-miterlimit:4;stroke-dasharray:none;stroke-dashoffset:0;stroke-opacity:1;marker:none;marker-start:none;marker-mid:none;marker-end:none" />
        <rect
           ry="0.26516503"
           rx="0.26516503"
           y="41"
           x="41"
           height="1"
           width="1"
           id="rect2419"
           style="color:#000000;display:inline;overflow:visible;visibility:visible;opacity:1;fill:url(#radialGradient3428);fill-opacity:1;fill-rule:nonzero;stroke:none;stroke-width:1;stroke-linecap:square;stroke-linejoin:round;stroke-miterlimit:4;stroke-dasharray:none;stroke-dashoffset:0;stroke-opacity:1;marker:none;marker-start:none;marker-mid:none;marker-end:none" />
        <rect
           ry="0.26516503"
           rx="0.26516503"
           y="41"
           x="39"
           height="1"
           width="1"
           id="rect2421"
           style="color:#000000;display:inline;overflow:visible;visibility:visible;opacity:1;fill:url(#radialGradient3430);fill-opacity:1;fill-rule:nonzero;stroke:none;stroke-width:1;stroke-linecap:square;stroke-linejoin:round;stroke-miterlimit:4;stroke-dasharray:none;stroke-dashoffset:0;stroke-opacity:1;marker:none;marker-start:none;marker-mid:none;marker-end:none" />
        <rect
           ry="0.26516503"
           rx="0.26516503"
           y="42"
           x="38"
           height="1"
           width="1"
           id="rect2423"
           style="color:#000000;display:inline;overflow:visible;visibility:visible;opacity:1;fill:url(#radialGradient3432);fill-opacity:1;fill-rule:nonzero;stroke:none;stroke-width:1;stroke-linecap:square;stroke-linejoin:round;stroke-miterlimit:4;stroke-dasharray:none;stroke-dashoffset:0;stroke-opacity:1;marker:none;marker-start:none;marker-mid:none;marker-end:none" />
        <rect
           ry="0.26516503"
           rx="0.26516503"
           y="42"
           x="40"
           height="1"
           width="1"
           id="rect2425"
           style="color:#000000;display:inline;overflow:visible;visibility:visible;opacity:1;fill:url(#radialGradient3434);fill-opacity:1;fill-rule:nonzero;stroke:none;stroke-width:1;stroke-linecap:square;stroke-linejoin:round;stroke-miterlimit:4;stroke-dasharray:none;stroke-dashoffset:0;stroke-opacity:1;marker:none;marker-start:none;marker-mid:none;marker-end:none" />
        <rect
           ry="0.26516503"
           rx="0.26516503"
           y="43"
           x="41"
           height="1"
           width="1"
           id="rect2427"
           style="color:#000000;display:inline;overflow:visible;visibility:visible;opacity:1;fill:url(#radialGradient3436);fill-opacity:1;fill-rule:nonzero;stroke:none;stroke-width:1;stroke-linecap:square;stroke-linejoin:round;stroke-miterlimit:4;stroke-dasharray:none;stroke-dashoffset:0;stroke-opacity:1;marker:none;marker-start:none;marker-mid:none;marker-end:none" />
        <rect
           ry="0.26516503"
           rx="0.26516503"
           y="40"
           x="40"
           height="1"
           width="1"
           id="rect2429"
           style="color:#000000;display:inline;overflow:visible;visibility:visible;opacity:1;fill:url(#radialGradient3438);fill-opacity:1;fill-rule:nonzero;stroke:none;stroke-width:1;stroke-linecap:square;stroke-linejoin:round;stroke-miterlimit:4;stroke-dasharray:none;stroke-dashoffset:0;stroke-opacity:1;marker:none;marker-start:none;marker-mid:none;marker-end:none" />
        <rect
           ry="0.26516503"
           rx="0.26516503"
           y="43"
           x="43"
           height="1"
           width="1"
           id="rect2431"
           style="color:#000000;display:inline;overflow:visible;visibility:visible;opacity:1;fill:url(#radialGradient3440);fill-opacity:1;fill-rule:nonzero;stroke:none;stroke-width:1;stroke-linecap:square;stroke-linejoin:round;stroke-miterlimit:4;stroke-dasharray:none;stroke-dashoffset:0;stroke-opacity:1;marker:none;marker-start:none;marker-mid:none;marker-end:none" />
      </g>
    </g>
  </g>
  <g
     inkscape:groupmode="layer"
     id="layer3"
     inkscape:label="tastiera"
     style="display:inline"
     transform="translate(0,160)">
    <g
       id="g3270"
       inkscape:label="Shadow"
       transform="translate(-54,0.18088)" />
    <g
       transform="translate(-54,15.24691)"
       inkscape:label="Shadow"
       id="g2611" />
    <g
       transform="translate(-54,15.24691)"
       style="display:inline"
       inkscape:label="Lavoro"
       id="g2613" />
  </g>
  <g
     inkscape:groupmode="layer"
     id="layer2"
     inkscape:label="tasti"
     style="display:inline"
     transform="translate(0,160)">
    <g
       style="display:inline;opacity:0.7"
       id="g11038"
       transform="matrix(0.02216275,0,0,0.01069518,53.273452,-135.02009)">
      <rect
         y="-150.69685"
         x="-1559.2523"
         height="478.35718"
         width="1339.6335"
         id="rect11040"
         style="color:#000000;display:inline;overflow:visible;visibility:visible;opacity:0.39195981;fill:url(#linearGradient10235);fill-opacity:1;fill-rule:nonzero;stroke:none;stroke-width:1;stroke-linecap:round;stroke-linejoin:miter;stroke-miterlimit:4;stroke-dasharray:none;stroke-dashoffset:0;stroke-opacity:1;marker:none;marker-start:none;marker-mid:none;marker-end:none" />
      <path
         sodipodi:nodetypes="cccc"
         id="path11042"
         d="m -219.61876,-150.68038 c 0,0 0,478.33079 0,478.33079 142.874166,0.90045 345.40022,-107.16966 345.40014,-239.196175 0,-132.026537 -159.436816,-239.134595 -345.40014,-239.134615 z"
         style="color:#000000;display:inline;overflow:visible;visibility:visible;opacity:0.40206185;fill:url(#radialGradient10237);fill-opacity:1;fill-rule:nonzero;stroke:none;stroke-width:1;stroke-linecap:round;stroke-linejoin:miter;stroke-miterlimit:4;stroke-dasharray:none;stroke-dashoffset:0;stroke-opacity:1;marker:none;marker-start:none;marker-mid:none;marker-end:none"
         inkscape:connector-curvature="0" />
      <path
         style="color:#000000;display:inline;overflow:visible;visibility:visible;opacity:0.40206185;fill:url(#radialGradient10239);fill-opacity:1;fill-rule:nonzero;stroke:none;stroke-width:1;stroke-linecap:round;stroke-linejoin:miter;stroke-miterlimit:4;stroke-dasharray:none;stroke-dashoffset:0;stroke-opacity:1;marker:none;marker-start:none;marker-mid:none;marker-end:none"
         d="m -1559.2523,-150.68038 c 0,0 0,478.33079 0,478.33079 -142.8742,0.90045 -345.4002,-107.16966 -345.4002,-239.196175 0,-132.026537 159.4368,-239.134595 345.4002,-239.134615 z"
         id="path11044"
         sodipodi:nodetypes="cccc"
         inkscape:connector-curvature="0" />
    </g>
    <rect
       style="opacity:1;fill:#e9afaf;fill-opacity:1;fill-rule:evenodd;stroke:#888a85;stroke-width:1;stroke-linecap:butt;stroke-linejoin:miter;stroke-miterlimit:4;stroke-dasharray:none;stroke-dashoffset:0.69999993;stroke-opacity:0.99236642"
       id="rect11046"
       width="36"
       height="25"
       x="15.561111"
       y="-158.57376"
       rx="1.5340841"
       ry="1.5340841" />
    <path
       style="opacity:0.23134329;fill:#a02c2c;fill-opacity:1;fill-rule:evenodd;stroke:none;stroke-width:0.89999998;stroke-linecap:butt;stroke-linejoin:round;stroke-miterlimit:4;stroke-opacity:1"
       d="m 16.967362,-158.13626 c -0.549278,0 -0.96875,0.41947 -0.96875,0.96875 v 1.40625 l 9.09375,11.59375 1.125,-1.25 c 0.469373,-0.46937 0.93435,-1.08498 1.96875,-1.5 1.0344,-0.41502 2.58364,-0.65625 5.375,-0.65625 2.780132,0 4.338454,0.24163 5.375,0.65625 1.036546,0.41462 1.498047,1.0293 1.96875,1.5 l 1.125,1.25 9.09375,-11.59375 v -1.40625 c 0,-0.54928 -0.41947,-0.96875 -0.96875,-0.96875 z"
       id="path11048"
       sodipodi:nodetypes="cccccssscccccc"
       inkscape:connector-curvature="0" />
    <path
       style="fill:#888a85;fill-opacity:1;fill-rule:evenodd;stroke:none;stroke-width:0.89999998;stroke-linecap:butt;stroke-linejoin:round;stroke-miterlimit:4;stroke-dasharray:none;stroke-opacity:1"
       d="m 16.061112,-134.07376 10.15625,-11.34375 c 0.469373,-0.46937 0.93435,-1.08498 1.96875,-1.5 1.0344,-0.41502 2.58364,-0.65625 5.375,-0.65625 2.780132,0 4.338454,0.24163 5.375,0.65625 1.036546,0.41462 1.498047,1.0293 1.96875,1.5 l 10.15625,11.34375 -10.15625,-10.34375 c -2.044007,-1.96959 -4.518247,-2.27216 -7.34375,-2.15625 -2.67085,0.0495 -5.464303,-3.3e-4 -7.34375,2.15625 z"
       id="path11050"
       sodipodi:nodetypes="ccssscccccc"
       inkscape:connector-curvature="0" />
    <path
       style="fill:#ffffff;fill-opacity:1;fill-rule:evenodd;stroke:none;stroke-width:0.89999998;stroke-linecap:butt;stroke-linejoin:round;stroke-miterlimit:4;stroke-dasharray:none;stroke-opacity:1"
       d="m 16.061112,-134.05226 10.15625,-9.34375 c 1.879447,-2.15658 4.6729,-2.10671 7.34375,-2.15625 2.825503,-0.11591 5.299743,0.18665 7.34375,2.15625 l 10.15625,9.34375 -10.15625,-10.34375 c -2.044007,-1.9696 -4.518247,-2.27216 -7.34375,-2.15625 -2.67085,0.0495 -5.464303,-3.3e-4 -7.34375,2.15625 z"
       id="path11052"
       sodipodi:nodetypes="ccccccccc"
       inkscape:connector-curvature="0" />
    <path
       sodipodi:type="inkscape:offset"
       inkscape:radius="-0.44194174"
       inkscape:original="M -42.09375 12.5 C -42.877224 12.5 -43.5 13.122774 -43.5 13.90625 L -43.5 15.5 L -32.5 26.5 C -31.5 27.500002 -31.022703 28.5 -25.5 28.5 C -20 28.500002 -19.5 27.5 -18.5 26.5 L -7.5 15.5 L -7.5 13.90625 C -7.5 13.122776 -8.122774 12.5 -8.90625 12.5 L -42.09375 12.5 z "
       style="fill:#e9afaf;fill-opacity:1;fill-rule:evenodd;stroke:none;stroke-width:0.89999998;stroke-linecap:butt;stroke-linejoin:round;stroke-miterlimit:4;stroke-dasharray:none;stroke-opacity:1"
       id="path11054"
       d="m -42.09375,12.941406 c -0.549278,0 -0.964844,0.415564 -0.964844,0.964844 v 1.410156 L -32.1875,26.1875 c 0.527224,0.527225 0.810244,0.937914 1.65625,1.277344 0.846006,0.339429 2.296573,0.59375 5.03125,0.59375 2.723216,1e-6 4.173978,-0.253966 5.023438,-0.59375 0.849459,-0.339784 1.13802,-0.751302 1.664062,-1.277344 L -7.9414062,15.316406 V 13.90625 c 0,-0.549278 -0.415564,-0.964844 -0.9648438,-0.964844 z"
       transform="translate(59.061112,-171.07376)" />
    <path
       style="fill:#888a85;fill-opacity:1;fill-rule:evenodd;stroke:none;stroke-width:0.89999998;stroke-linecap:butt;stroke-linejoin:round;stroke-miterlimit:4;stroke-dasharray:none;stroke-opacity:1"
       d="m 16.061112,-155.57376 10.15625,11.34375 c 0.469373,0.46937 0.93435,1.08498 1.96875,1.5 1.0344,0.41502 2.58364,0.65625 5.375,0.65625 2.780132,0 4.338454,-0.24163 5.375,-0.65625 1.036546,-0.41462 1.498047,-1.0293 1.96875,-1.5 l 10.15625,-11.34375 -10.15625,10.34375 c -2.044007,1.96959 -4.518247,2.27216 -7.34375,2.15625 -2.67085,-0.0495 -5.464303,3.3e-4 -7.34375,-2.15625 z"
       id="path11056"
       sodipodi:nodetypes="ccssscccccc"
       inkscape:connector-curvature="0" />
    <path
       style="fill:#ffffff;fill-opacity:1;fill-rule:evenodd;stroke:none;stroke-width:0.89999998;stroke-linecap:butt;stroke-linejoin:round;stroke-miterlimit:4;stroke-dasharray:none;stroke-opacity:1"
       d="m 16.061112,-155.57376 10.15625,9.34375 c 1.879447,2.15658 4.6729,2.10671 7.34375,2.15625 2.825503,0.11591 5.299743,-0.18666 7.34375,-2.15625 l 10.15625,-9.34375 -10.15625,10.34375 c -2.044007,1.96959 -4.518247,2.27216 -7.34375,2.15625 -2.67085,-0.0495 -5.464303,3.3e-4 -7.34375,-2.15625 z"
       id="path11058"
       sodipodi:nodetypes="ccccccccc"
       inkscape:connector-curvature="0" />
    <path
       sodipodi:type="inkscape:offset"
       inkscape:radius="-0.99436891"
       inkscape:original="M 6.90625 54.5 C 6.1227756 54.5 5.5 55.122774 5.5 55.90625 L 5.5 78.09375 C 5.5 78.877224 6.1227756 79.499998 6.90625 79.5 L 40.09375 79.5 C 40.877224 79.5 41.5 78.877224 41.5 78.09375 L 41.5 55.90625 C 41.5 55.122776 40.877226 54.5 40.09375 54.5 L 6.90625 54.5 z "
       style="opacity:0.7;fill:none;fill-opacity:1;fill-rule:evenodd;stroke:#ffffff;stroke-width:0.99999988;stroke-linecap:butt;stroke-linejoin:round;stroke-miterlimit:4;stroke-dasharray:none;stroke-dashoffset:0.69999993;stroke-opacity:0.99236642"
       id="path11060"
       d="m 6.90625,55.494141 c -0.2565335,0 -0.4121094,0.155574 -0.4121094,0.412109 v 22.1875 c 0,0.256531 0.1555746,0.412109 0.4121094,0.412109 h 33.1875 c 0.256531,0 0.412109,-0.155578 0.412109,-0.412109 v -22.1875 c 0,-0.256533 -0.155575,-0.412109 -0.412109,-0.412109 z"
       transform="translate(10.061112,-213.07376)" />
    <path
       style="opacity:0.55597014;fill:url(#linearGradient10247);fill-opacity:1;fill-rule:evenodd;stroke:none;stroke-width:0.99999988;stroke-linecap:butt;stroke-linejoin:round;stroke-miterlimit:4;stroke-dashoffset:0.69999993;stroke-opacity:0.99236642"
       d="m 16.061112,-138.16751 v 3.1875 c 0,0.52101 0.385241,0.90625 0.90625,0.90625 h 33.1875 c 0.52101,0 0.90625,-0.38524 0.90625,-0.90625 v -3.1875 z"
       id="path11062"
       sodipodi:nodetypes="ccccccc"
       inkscape:connector-curvature="0" />
  </g>
</svg>
