<?xml version="1.0" encoding="UTF-8" standalone="no"?>
<!-- Created with Inkscape (http://www.inkscape.org/) -->

<svg
   xmlns:dc="http://purl.org/dc/elements/1.1/"
   xmlns:cc="http://creativecommons.org/ns#"
   xmlns:rdf="http://www.w3.org/1999/02/22-rdf-syntax-ns#"
   xmlns:svg="http://www.w3.org/2000/svg"
   xmlns="http://www.w3.org/2000/svg"
   xmlns:sodipodi="http://sodipodi.sourceforge.net/DTD/sodipodi-0.dtd"
   xmlns:inkscape="http://www.inkscape.org/namespaces/inkscape"
   width="210mm"
   height="297mm"
   viewBox="0 0 210 297"
   version="1.1"
   id="svg8"
   inkscape:version="0.92.2 (5c3e80d, 2017-08-06)"
   sodipodi:docname="butterfly4.svg"
   inkscape:export-filename="/home/qdufour/nosave/Seafile/inria/prez/winter-school-2018/butterfly3.png"
   inkscape:export-xdpi="174.35466"
   inkscape:export-ydpi="174.35466">
  <defs
     id="defs2">
    <marker
       inkscape:stockid="Arrow2Mend"
       orient="auto"
       refY="0.0"
       refX="0.0"
       id="marker6286"
       style="overflow:visible;"
       inkscape:isstock="true">
      <path
         id="path6284"
         style="fill-rule:evenodd;stroke-width:0.625;stroke-linejoin:round;stroke:#000000;stroke-opacity:1;fill:#000000;fill-opacity:1"
         d="M 8.7185878,4.0337352 L -2.2072895,0.016013256 L 8.7185884,-4.0017078 C 6.9730900,-1.6296469 6.9831476,1.6157441 8.7185878,4.0337352 z "
         transform="scale(0.6) rotate(180) translate(0,0)" />
    </marker>
    <marker
       inkscape:stockid="Arrow2Mend"
       orient="auto"
       refY="0.0"
       refX="0.0"
       id="marker6186"
       style="overflow:visible;"
       inkscape:isstock="true">
      <path
         id="path6184"
         style="fill-rule:evenodd;stroke-width:0.625;stroke-linejoin:round;stroke:#000000;stroke-opacity:1;fill:#000000;fill-opacity:1"
         d="M 8.7185878,4.0337352 L -2.2072895,0.016013256 L 8.7185884,-4.0017078 C 6.9730900,-1.6296469 6.9831476,1.6157441 8.7185878,4.0337352 z "
         transform="scale(0.6) rotate(180) translate(0,0)" />
    </marker>
    <marker
       inkscape:stockid="Arrow2Mend"
       orient="auto"
       refY="0.0"
       refX="0.0"
       id="marker6092"
       style="overflow:visible;"
       inkscape:isstock="true">
      <path
         id="path6090"
         style="fill-rule:evenodd;stroke-width:0.625;stroke-linejoin:round;stroke:#000000;stroke-opacity:1;fill:#000000;fill-opacity:1"
         d="M 8.7185878,4.0337352 L -2.2072895,0.016013256 L 8.7185884,-4.0017078 C 6.9730900,-1.6296469 6.9831476,1.6157441 8.7185878,4.0337352 z "
         transform="scale(0.6) rotate(180) translate(0,0)" />
    </marker>
    <marker
       inkscape:stockid="Arrow2Mend"
       orient="auto"
       refY="0.0"
       refX="0.0"
       id="marker6004"
       style="overflow:visible;"
       inkscape:isstock="true">
      <path
         id="path6002"
         style="fill-rule:evenodd;stroke-width:0.625;stroke-linejoin:round;stroke:#000000;stroke-opacity:1;fill:#000000;fill-opacity:1"
         d="M 8.7185878,4.0337352 L -2.2072895,0.016013256 L 8.7185884,-4.0017078 C 6.9730900,-1.6296469 6.9831476,1.6157441 8.7185878,4.0337352 z "
         transform="scale(0.6) rotate(180) translate(0,0)" />
    </marker>
    <marker
       inkscape:stockid="Arrow2Mend"
       orient="auto"
       refY="0.0"
       refX="0.0"
       id="marker5922"
       style="overflow:visible;"
       inkscape:isstock="true">
      <path
         id="path5920"
         style="fill-rule:evenodd;stroke-width:0.625;stroke-linejoin:round;stroke:#000000;stroke-opacity:1;fill:#000000;fill-opacity:1"
         d="M 8.7185878,4.0337352 L -2.2072895,0.016013256 L 8.7185884,-4.0017078 C 6.9730900,-1.6296469 6.9831476,1.6157441 8.7185878,4.0337352 z "
         transform="scale(0.6) rotate(180) translate(0,0)" />
    </marker>
    <marker
       inkscape:stockid="Arrow2Mend"
       orient="auto"
       refY="0.0"
       refX="0.0"
       id="marker5846"
       style="overflow:visible;"
       inkscape:isstock="true">
      <path
         id="path5844"
         style="fill-rule:evenodd;stroke-width:0.625;stroke-linejoin:round;stroke:#000000;stroke-opacity:1;fill:#000000;fill-opacity:1"
         d="M 8.7185878,4.0337352 L -2.2072895,0.016013256 L 8.7185884,-4.0017078 C 6.9730900,-1.6296469 6.9831476,1.6157441 8.7185878,4.0337352 z "
         transform="scale(0.6) rotate(180) translate(0,0)" />
    </marker>
    <marker
       inkscape:stockid="Arrow2Mend"
       orient="auto"
       refY="0.0"
       refX="0.0"
       id="marker5776"
       style="overflow:visible;"
       inkscape:isstock="true">
      <path
         id="path5774"
         style="fill-rule:evenodd;stroke-width:0.625;stroke-linejoin:round;stroke:#000000;stroke-opacity:1;fill:#000000;fill-opacity:1"
         d="M 8.7185878,4.0337352 L -2.2072895,0.016013256 L 8.7185884,-4.0017078 C 6.9730900,-1.6296469 6.9831476,1.6157441 8.7185878,4.0337352 z "
         transform="scale(0.6) rotate(180) translate(0,0)" />
    </marker>
    <marker
       inkscape:stockid="Arrow2Mend"
       orient="auto"
       refY="0.0"
       refX="0.0"
       id="marker5718"
       style="overflow:visible;"
       inkscape:isstock="true">
      <path
         id="path5716"
         style="fill-rule:evenodd;stroke-width:0.625;stroke-linejoin:round;stroke:#000000;stroke-opacity:1;fill:#000000;fill-opacity:1"
         d="M 8.7185878,4.0337352 L -2.2072895,0.016013256 L 8.7185884,-4.0017078 C 6.9730900,-1.6296469 6.9831476,1.6157441 8.7185878,4.0337352 z "
         transform="scale(0.6) rotate(180) translate(0,0)" />
    </marker>
    <marker
       inkscape:stockid="Arrow2Mend"
       orient="auto"
       refY="0.0"
       refX="0.0"
       id="marker5666"
       style="overflow:visible;"
       inkscape:isstock="true">
      <path
         id="path5664"
         style="fill-rule:evenodd;stroke-width:0.625;stroke-linejoin:round;stroke:#000000;stroke-opacity:1;fill:#000000;fill-opacity:1"
         d="M 8.7185878,4.0337352 L -2.2072895,0.016013256 L 8.7185884,-4.0017078 C 6.9730900,-1.6296469 6.9831476,1.6157441 8.7185878,4.0337352 z "
         transform="scale(0.6) rotate(180) translate(0,0)" />
    </marker>
    <marker
       inkscape:stockid="Arrow1Send"
       orient="auto"
       refY="0.0"
       refX="0.0"
       id="Arrow1Send"
       style="overflow:visible;"
       inkscape:isstock="true">
      <path
         id="path4784"
         d="M 0.0,0.0 L 5.0,-5.0 L -12.5,0.0 L 5.0,5.0 L 0.0,0.0 z "
         style="fill-rule:evenodd;stroke:#000000;stroke-width:1pt;stroke-opacity:1;fill:#000000;fill-opacity:1"
         transform="scale(0.2) rotate(180) translate(6,0)" />
    </marker>
    <marker
       inkscape:stockid="Arrow2Mend"
       orient="auto"
       refY="0.0"
       refX="0.0"
       id="Arrow2Mend"
       style="overflow:visible;"
       inkscape:isstock="true">
      <path
         id="path4796"
         style="fill-rule:evenodd;stroke-width:0.625;stroke-linejoin:round;stroke:#000000;stroke-opacity:1;fill:#000000;fill-opacity:1"
         d="M 8.7185878,4.0337352 L -2.2072895,0.016013256 L 8.7185884,-4.0017078 C 6.9730900,-1.6296469 6.9831476,1.6157441 8.7185878,4.0337352 z "
         transform="scale(0.6) rotate(180) translate(0,0)" />
    </marker>
    <marker
       inkscape:stockid="Arrow1Lend"
       orient="auto"
       refY="0.0"
       refX="0.0"
       id="Arrow1Lend"
       style="overflow:visible;"
       inkscape:isstock="true">
      <path
         id="path4772"
         d="M 0.0,0.0 L 5.0,-5.0 L -12.5,0.0 L 5.0,5.0 L 0.0,0.0 z "
         style="fill-rule:evenodd;stroke:#000000;stroke-width:1pt;stroke-opacity:1;fill:#000000;fill-opacity:1"
         transform="scale(0.8) rotate(180) translate(12.5,0)" />
    </marker>
    <marker
       inkscape:stockid="Arrow1Lstart"
       orient="auto"
       refY="0.0"
       refX="0.0"
       id="Arrow1Lstart"
       style="overflow:visible"
       inkscape:isstock="true">
      <path
         id="path4769"
         d="M 0.0,0.0 L 5.0,-5.0 L -12.5,0.0 L 5.0,5.0 L 0.0,0.0 z "
         style="fill-rule:evenodd;stroke:#000000;stroke-width:1pt;stroke-opacity:1;fill:#000000;fill-opacity:1"
         transform="scale(0.8) translate(12.5,0)" />
    </marker>
    <marker
       inkscape:stockid="Arrow2Mend"
       orient="auto"
       refY="0"
       refX="0"
       id="Arrow2Mend-3"
       style="overflow:visible"
       inkscape:isstock="true">
      <path
         inkscape:connector-curvature="0"
         id="path4796-6"
         style="fill:#000000;fill-opacity:1;fill-rule:evenodd;stroke:#000000;stroke-width:0.625;stroke-linejoin:round;stroke-opacity:1"
         d="M 8.7185878,4.0337352 -2.2072895,0.01601326 8.7185884,-4.0017078 c -1.7454984,2.3720609 -1.7354408,5.6174519 -6e-7,8.035443 z"
         transform="scale(-0.6)" />
    </marker>
    <marker
       inkscape:stockid="Arrow2Mend"
       orient="auto"
       refY="0"
       refX="0"
       id="Arrow2Mend-36"
       style="overflow:visible"
       inkscape:isstock="true">
      <path
         inkscape:connector-curvature="0"
         id="path4796-7"
         style="fill:#000000;fill-opacity:1;fill-rule:evenodd;stroke:#000000;stroke-width:0.625;stroke-linejoin:round;stroke-opacity:1"
         d="M 8.7185878,4.0337352 -2.2072895,0.01601326 8.7185884,-4.0017078 c -1.7454984,2.3720609 -1.7354408,5.6174519 -6e-7,8.035443 z"
         transform="scale(-0.6)" />
    </marker>
  </defs>
  <sodipodi:namedview
     id="base"
     pagecolor="#ffffff"
     bordercolor="#666666"
     borderopacity="1.0"
     inkscape:pageopacity="0.0"
     inkscape:pageshadow="2"
     inkscape:zoom="1"
     inkscape:cx="-85.268399"
     inkscape:cy="774.92964"
     inkscape:document-units="mm"
     inkscape:current-layer="layer1"
     showgrid="false"
     inkscape:window-width="1920"
     inkscape:window-height="1136"
     inkscape:window-x="0"
     inkscape:window-y="27"
     inkscape:window-maximized="1"
     showguides="true"
     inkscape:guide-bbox="true" />
  <metadata
     id="metadata5">
    <rdf:RDF>
      <cc:Work
         rdf:about="">
        <dc:format>image/svg+xml</dc:format>
        <dc:type
           rdf:resource="http://purl.org/dc/dcmitype/StillImage" />
        <dc:title></dc:title>
      </cc:Work>
    </rdf:RDF>
  </metadata>
  <g
     inkscape:label="Calque 1"
     inkscape:groupmode="layer"
     id="layer1">
    <g
       id="g981"
       transform="translate(3.124099,-1.2282238)"
       inkscape:export-xdpi="174"
       inkscape:export-ydpi="174">
      <ellipse
         style="fill:#800000;stroke-width:0.26458332"
         ry="9.2207985"
         rx="9.6217022"
         cy="13.120143"
         cx="15.799811"
         id="path3699" />
      <text
         id="text3703"
         y="16.461014"
         x="12.340075"
         style="font-style:normal;font-weight:normal;font-size:10.58333302px;line-height:1.25;font-family:sans-serif;letter-spacing:0px;word-spacing:0px;fill:#000000;fill-opacity:1;stroke:none;stroke-width:0.26458332"
         xml:space="preserve"><tspan
           style="fill:#f9f9f9;stroke-width:0.26458332"
           y="16.461014"
           x="12.340075"
           id="tspan3701"
           sodipodi:role="line">A</tspan></text>
    </g>
    <g
       id="g976"
       transform="translate(-2.8452966)"
       inkscape:export-xdpi="174"
       inkscape:export-ydpi="174">
      <ellipse
         style="fill:#800000;stroke-width:0.26458332"
         ry="9.2207985"
         rx="9.6217022"
         cy="11.891919"
         cx="69.729073"
         id="path3699-8" />
      <text
         id="text3703-7"
         y="15.232789"
         x="66.504463"
         style="font-style:normal;font-weight:normal;font-size:10.58333302px;line-height:1.25;font-family:sans-serif;letter-spacing:0px;word-spacing:0px;fill:#000000;fill-opacity:1;stroke:none;stroke-width:0.26458332"
         xml:space="preserve"><tspan
           style="fill:#f9f9f9;stroke-width:0.26458332"
           y="15.232789"
           x="66.504463"
           id="tspan3701-9"
           sodipodi:role="line">B</tspan></text>
    </g>
    <g
       id="g9107">
      <ellipse
         inkscape:export-ydpi="174"
         inkscape:export-xdpi="174"
         style="fill:#ff2a2a;stroke-width:0.26458332"
         ry="9.2207985"
         rx="9.6217022"
         cy="95.642639"
         cx="18.181061"
         id="path3699-20" />
      <text
         inkscape:export-ydpi="174"
         inkscape:export-xdpi="174"
         id="text3703-2"
         y="98.983505"
         x="14.853099"
         style="font-style:normal;font-weight:normal;font-size:10.58333302px;line-height:1.25;font-family:sans-serif;letter-spacing:0px;word-spacing:0px;fill:#000000;fill-opacity:1;stroke:none;stroke-width:0.26458332"
         xml:space="preserve"><tspan
           style="fill:#f9f9f9;stroke-width:0.26458332"
           y="98.983505"
           x="14.853099"
           id="tspan3701-3"
           sodipodi:role="line">D</tspan></text>
    </g>
    <g
       id="g9102">
      <ellipse
         inkscape:export-ydpi="174"
         inkscape:export-xdpi="174"
         style="fill:#ff0000;stroke-width:0.26458332"
         ry="9.2207985"
         rx="9.6217022"
         cy="95.642639"
         cx="68.935326"
         id="path3699-7" />
      <text
         inkscape:export-ydpi="174"
         inkscape:export-xdpi="174"
         id="text3703-5"
         y="98.983505"
         x="65.622864"
         style="font-style:normal;font-weight:normal;font-size:10.58333302px;line-height:1.25;font-family:sans-serif;letter-spacing:0px;word-spacing:0px;fill:#000000;fill-opacity:1;stroke:none;stroke-width:0.26458332"
         xml:space="preserve"><tspan
           style="fill:#f9f9f9;stroke-width:0.26458332"
           y="98.983505"
           x="65.622864"
           id="tspan3701-92"
           sodipodi:role="line">E</tspan></text>
    </g>
    <g
       id="g4100"
       transform="translate(-0.52916667,9.6401031)">
      <ellipse
         style="fill:#800000;stroke-width:0.26458332"
         ry="9.2207985"
         rx="9.6217022"
         cy="44.637249"
         cx="43.262985"
         id="path3699-28" />
      <text
         id="text3703-9"
         y="48.489727"
         x="39.557785"
         style="font-style:normal;font-weight:normal;font-size:10.58333302px;line-height:1.25;font-family:sans-serif;letter-spacing:0px;word-spacing:0px;fill:#000000;fill-opacity:1;stroke:none;stroke-width:0.26458332"
         xml:space="preserve"><tspan
           style="fill:#f9f9f9;stroke-width:0.26458332"
           y="48.489727"
           x="39.557785"
           id="tspan3701-7"
           sodipodi:role="line">C</tspan></text>
    </g>
    <path
       style="fill:none;stroke:#000000;stroke-width:1;stroke-linecap:butt;stroke-linejoin:miter;stroke-miterlimit:4;stroke-dasharray:none;stroke-opacity:1;marker-end:url(#Arrow2Mend)"
       d="M 69.199417,22.554488 68.887823,84.620099"
       id="path3962"
       inkscape:connector-curvature="0"
       sodipodi:nodetypes="cc"
       inkscape:export-xdpi="174"
       inkscape:export-ydpi="174" />
    <path
       style="fill:none;stroke:#000000;stroke-width:1;stroke-linecap:butt;stroke-linejoin:miter;stroke-miterlimit:4;stroke-dasharray:none;stroke-opacity:1;marker-end:url(#marker6092)"
       d="M 23.146779,21.83333 37.434273,44.322914"
       id="path5602"
       inkscape:connector-curvature="0"
       sodipodi:nodetypes="cc"
       inkscape:export-xdpi="174"
       inkscape:export-ydpi="174" />
    <path
       style="fill:none;stroke:#000000;stroke-width:1;stroke-linecap:butt;stroke-linejoin:miter;stroke-miterlimit:4;stroke-dasharray:none;stroke-opacity:1;marker-end:url(#marker6286)"
       d="M 34.131254,60.462506 21.431247,85.333339"
       id="path5606"
       inkscape:connector-curvature="0"
       sodipodi:nodetypes="cc"
       inkscape:export-xdpi="174"
       inkscape:export-ydpi="174" />
    <path
       style="fill:none;stroke:#000000;stroke-width:1;stroke-linecap:butt;stroke-linejoin:miter;stroke-miterlimit:4;stroke-dasharray:none;stroke-opacity:1;marker-end:url(#marker6004)"
       d="M 63.79196,21.83333 49.239874,44.587504"
       id="path5608"
       inkscape:connector-curvature="0"
       sodipodi:nodetypes="cc"
       inkscape:export-xdpi="174"
       inkscape:export-ydpi="174" />
    <path
       style="fill:none;stroke:#000000;stroke-width:1;stroke-linecap:butt;stroke-linejoin:miter;stroke-miterlimit:4;stroke-dasharray:none;stroke-opacity:1;marker-end:url(#marker5846)"
       d="M 52.122917,59.66876 65.352083,84.80417"
       id="path5614"
       inkscape:connector-curvature="0"
       sodipodi:nodetypes="cc"
       inkscape:export-xdpi="174"
       inkscape:export-ydpi="174" />
    <path
       style="fill:none;stroke:#000000;stroke-width:1;stroke-linecap:butt;stroke-linejoin:miter;stroke-miterlimit:4;stroke-dasharray:none;stroke-opacity:1;marker-end:url(#Arrow2Mend-36)"
       d="m 18.445155,22.854735 -0.311594,61.80103"
       id="path3962-5"
       inkscape:connector-curvature="0"
       sodipodi:nodetypes="cc"
       inkscape:export-xdpi="174"
       inkscape:export-ydpi="174" />
    <text
       xml:space="preserve"
       style="font-style:normal;font-weight:normal;font-size:10.58333302px;line-height:1.25;font-family:sans-serif;letter-spacing:0px;word-spacing:0px;fill:#000000;fill-opacity:1;stroke:none;stroke-width:0.26458332"
       x="-58.049522"
       y="16.340731"
       id="text1925"
       inkscape:export-xdpi="174"
       inkscape:export-ydpi="174"
       transform="rotate(-89.77606)"><tspan
         sodipodi:role="line"
         id="tspan1923"
         x="-58.049522"
         y="16.340731"
         style="font-size:6.3499999px;stroke-width:0.26458332">m<tspan
   style="font-size:64.99999762%;baseline-shift:sub"
   id="tspan989">1</tspan></tspan></text>
    <text
       xml:space="preserve"
       style="font-style:normal;font-weight:normal;font-size:10.58333302px;line-height:1.25;font-family:sans-serif;letter-spacing:0px;word-spacing:0px;fill:#000000;fill-opacity:1;stroke:none;stroke-width:0.26458332"
       x="37.376205"
       y="-11.196194"
       id="text1925-3"
       inkscape:export-xdpi="174"
       inkscape:export-ydpi="174"
       transform="rotate(58.290465)"
       inkscape:transform-center-x="-5.7275197"
       inkscape:transform-center-y="-0.04371256"><tspan
         sodipodi:role="line"
         id="tspan1923-5"
         x="37.376205"
         y="-11.196194"
         style="font-size:6.3499999px;line-height:1.25;stroke-width:0.26458332">m<tspan
   style="font-size:64.99999762%;baseline-shift:sub"
   id="tspan991">1</tspan></tspan></text>
    <text
       xml:space="preserve"
       style="font-style:normal;font-weight:normal;font-size:10.58333302px;line-height:1.25;font-family:sans-serif;letter-spacing:0px;word-spacing:0px;fill:#000000;fill-opacity:1;stroke:none;stroke-width:0.26458332"
       x="0.70316756"
       y="62.602699"
       id="text1925-3-6"
       inkscape:export-xdpi="174"
       inkscape:export-ydpi="174"
       transform="rotate(-56.317321)"><tspan
         sodipodi:role="line"
         id="tspan1923-5-2"
         x="0.70316756"
         y="62.602699"
         style="font-size:6.3499999px;line-height:1.25;stroke-width:0.26458332">m<tspan
   style="font-size:64.99999762%;baseline-shift:sub"
   id="tspan993">2</tspan></tspan></text>
    <text
       xml:space="preserve"
       style="font-style:normal;font-weight:normal;font-size:10.58333302px;line-height:1.25;font-family:sans-serif;letter-spacing:0px;word-spacing:0px;fill:#000000;fill-opacity:1;stroke:none;stroke-width:0.26458332"
       x="49.027554"
       y="-71.462303"
       id="text1925-3-6-9"
       inkscape:export-xdpi="174"
       inkscape:export-ydpi="174"
       transform="rotate(90)"><tspan
         sodipodi:role="line"
         id="tspan1923-5-2-1"
         x="49.027554"
         y="-71.462303"
         style="font-size:6.3499999px;line-height:1.25;stroke-width:0.26458332">m<tspan
   style="font-size:64.99999762%;baseline-shift:sub"
   id="tspan995">2</tspan></tspan></text>
    <text
       xml:space="preserve"
       style="font-style:normal;font-weight:normal;font-size:10.58333302px;line-height:1.25;font-family:sans-serif;letter-spacing:0px;word-spacing:0px;fill:#000000;fill-opacity:1;stroke:none;stroke-width:0.26458332"
       x="-61.14225"
       y="62.297535"
       id="text1925-3-6-6"
       inkscape:export-xdpi="174"
       inkscape:export-ydpi="174"
       transform="rotate(-64.596906)"><tspan
         sodipodi:role="line"
         id="tspan1923-5-2-0"
         x="-61.14225"
         y="62.297535"
         style="font-size:6.3499999px;line-height:1.25;stroke-width:0.26458332">m<tspan
   style="font-size:64.99999762%;baseline-shift:sub"
   id="tspan1001">1⊕</tspan>m<tspan
   style="font-size:64.99999762%;baseline-shift:sub"
   id="tspan1003">2</tspan></tspan></text>
    <text
       xml:space="preserve"
       style="font-style:normal;font-weight:normal;font-size:10.58333302px;line-height:1.25;font-family:sans-serif;letter-spacing:0px;word-spacing:0px;fill:#000000;fill-opacity:1;stroke:none;stroke-width:0.26458332"
       x="78.597267"
       y="-10.204299"
       id="text1925-3-6-62"
       inkscape:export-xdpi="174"
       inkscape:export-ydpi="174"
       transform="rotate(60.983266)"><tspan
         sodipodi:role="line"
         id="tspan1923-5-2-6"
         x="78.597267"
         y="-10.204299"
         style="font-size:6.3499999px;line-height:1.25;stroke-width:0.26458332">m<tspan
   style="font-size:64.99999762%;baseline-shift:sub"
   id="tspan999">2⊕</tspan>m<tspan
   style="font-size:64.99999762%;baseline-shift:sub"
   id="tspan997">1 </tspan></tspan></text>
  </g>
</svg>
