
*** Yes
> > 
*** Yes
--1> 
*** No
> (cout)
*** Yes
> cout(@)
*** Yes
X = @.
--1> 
*** No
> cout @
*** Yes
X = @.
--1> 
*** No
> cout(@)
*** Yes
X = @.
--1> 
*** Yes
X = @.

*** No
> f(s,d,cout(@),s,d)
*** Yes
X = @.
--1> 
*** No
> f(s,d,(cout),s,d)
*** Yes
> 
