Geometry file
Geometry file
node id given
element id assign
coordinates
     100
       1 0.00000e+00 0.00000e+00 0.00000e+00
       2 1.00000e+00 0.00000e+00 0.00000e+00
       3 1.00000e+00 1.00000e+00 0.00000e+00
       4 0.00000e+00 1.00000e+00 0.00000e+00
       5 1.11111e-01 0.00000e+00 0.00000e+00
       6 2.22222e-01 0.00000e+00 0.00000e+00
       7 3.33333e-01 0.00000e+00 0.00000e+00
       8 4.44444e-01 0.00000e+00 0.00000e+00
       9 5.55556e-01 0.00000e+00 0.00000e+00
      10 6.66667e-01 0.00000e+00 0.00000e+00
      11 7.77778e-01 0.00000e+00 0.00000e+00
      12 8.88889e-01 0.00000e+00 0.00000e+00
      13 1.00000e+00 1.11111e-01 0.00000e+00
      14 1.00000e+00 2.22222e-01 0.00000e+00
      15 1.00000e+00 3.33333e-01 0.00000e+00
      16 1.00000e+00 4.44444e-01 0.00000e+00
      17 1.00000e+00 5.55556e-01 0.00000e+00
      18 1.00000e+00 6.66667e-01 0.00000e+00
      19 1.00000e+00 7.77778e-01 0.00000e+00
      20 1.00000e+00 8.88889e-01 0.00000e+00
      21 8.88889e-01 1.00000e+00 0.00000e+00
      22 7.77778e-01 1.00000e+00 0.00000e+00
      23 6.66667e-01 1.00000e+00 0.00000e+00
      24 5.55556e-01 1.00000e+00 0.00000e+00
      25 4.44444e-01 1.00000e+00 0.00000e+00
      26 3.33333e-01 1.00000e+00 0.00000e+00
      27 2.22222e-01 1.00000e+00 0.00000e+00
      28 1.11111e-01 1.00000e+00 0.00000e+00
      29 0.00000e+00 8.88889e-01 0.00000e+00
      30 0.00000e+00 7.77778e-01 0.00000e+00
      31 0.00000e+00 6.66667e-01 0.00000e+00
      32 0.00000e+00 5.55556e-01 0.00000e+00
      33 0.00000e+00 4.44444e-01 0.00000e+00
      34 0.00000e+00 3.33333e-01 0.00000e+00
      35 0.00000e+00 2.22222e-01 0.00000e+00
      36 0.00000e+00 1.11111e-01 0.00000e+00
      37 1.11111e-01 1.11111e-01 0.00000e+00
      38 1.11111e-01 2.22222e-01 0.00000e+00
      39 1.11111e-01 3.33333e-01 0.00000e+00
      40 1.11111e-01 4.44444e-01 0.00000e+00
      41 1.11111e-01 5.55556e-01 0.00000e+00
      42 1.11111e-01 6.66667e-01 0.00000e+00
      43 1.11111e-01 7.77778e-01 0.00000e+00
      44 1.11111e-01 8.88889e-01 0.00000e+00
      45 2.22222e-01 1.11111e-01 0.00000e+00
      46 2.22222e-01 2.22222e-01 0.00000e+00
      47 2.22222e-01 3.33333e-01 0.00000e+00
      48 2.22222e-01 4.44444e-01 0.00000e+00
      49 2.22222e-01 5.55556e-01 0.00000e+00
      50 2.22222e-01 6.66667e-01 0.00000e+00
      51 2.22222e-01 7.77778e-01 0.00000e+00
      52 2.22222e-01 8.88889e-01 0.00000e+00
      53 3.33333e-01 1.11111e-01 0.00000e+00
      54 3.33333e-01 2.22222e-01 0.00000e+00
      55 3.33333e-01 3.33333e-01 0.00000e+00
      56 3.33333e-01 4.44444e-01 0.00000e+00
      57 3.33333e-01 5.55556e-01 0.00000e+00
      58 3.33333e-01 6.66667e-01 0.00000e+00
      59 3.33333e-01 7.77778e-01 0.00000e+00
      60 3.33333e-01 8.88889e-01 0.00000e+00
      61 4.44444e-01 1.11111e-01 0.00000e+00
      62 4.44444e-01 2.22222e-01 0.00000e+00
      63 4.44444e-01 3.33333e-01 0.00000e+00
      64 4.44444e-01 4.44444e-01 0.00000e+00
      65 4.44444e-01 5.55556e-01 0.00000e+00
      66 4.44444e-01 6.66667e-01 0.00000e+00
      67 4.44444e-01 7.77778e-01 0.00000e+00
      68 4.44444e-01 8.88889e-01 0.00000e+00
      69 5.55556e-01 1.11111e-01 0.00000e+00
      70 5.55556e-01 2.22222e-01 0.00000e+00
      71 5.55556e-01 3.33333e-01 0.00000e+00
      72 5.55556e-01 4.44444e-01 0.00000e+00
      73 5.55556e-01 5.55556e-01 0.00000e+00
      74 5.55556e-01 6.66667e-01 0.00000e+00
      75 5.55556e-01 7.77778e-01 0.00000e+00
      76 5.55556e-01 8.88889e-01 0.00000e+00
      77 6.66667e-01 1.11111e-01 0.00000e+00
      78 6.66667e-01 2.22222e-01 0.00000e+00
      79 6.66667e-01 3.33333e-01 0.00000e+00
      80 6.66667e-01 4.44444e-01 0.00000e+00
      81 6.66667e-01 5.55556e-01 0.00000e+00
      82 6.66667e-01 6.66667e-01 0.00000e+00
      83 6.66667e-01 7.77778e-01 0.00000e+00
      84 6.66667e-01 8.88889e-01 0.00000e+00
      85 7.77778e-01 1.11111e-01 0.00000e+00
      86 7.77778e-01 2.22222e-01 0.00000e+00
      87 7.77778e-01 3.33333e-01 0.00000e+00
      88 7.77778e-01 4.44444e-01 0.00000e+00
      89 7.77778e-01 5.55556e-01 0.00000e+00
      90 7.77778e-01 6.66667e-01 0.00000e+00
      91 7.77778e-01 7.77778e-01 0.00000e+00
      92 7.77778e-01 8.88889e-01 0.00000e+00
      93 8.88889e-01 1.11111e-01 0.00000e+00
      94 8.88889e-01 2.22222e-01 0.00000e+00
      95 8.88889e-01 3.33333e-01 0.00000e+00
      96 8.88889e-01 4.44444e-01 0.00000e+00
      97 8.88889e-01 5.55556e-01 0.00000e+00
      98 8.88889e-01 6.66667e-01 0.00000e+00
      99 8.88889e-01 7.77778e-01 0.00000e+00
     100 8.88889e-01 8.88889e-01 0.00000e+00
part       1
MeshLabel_1
tria3
     162
       1       5      36
      36       5      37
      36      37      35
      35      37      38
      35      38      34
      34      38      39
      34      39      33
      33      39      40
      33      40      32
      32      40      41
      32      41      31
      31      41      42
      31      42      30
      30      42      43
      30      43      29
      29      43      44
      29      44       4
       4      44      28
       5       6      37
      37       6      45
      37      45      38
      38      45      46
      38      46      39
      39      46      47
      39      47      40
      40      47      48
      40      48      41
      41      48      49
      41      49      42
      42      49      50
      42      50      43
      43      50      51
      43      51      44
      44      51      52
      44      52      28
      28      52      27
       6       7      45
      45       7      53
      45      53      46
      46      53      54
      46      54      47
      47      54      55
      47      55      48
      48      55      56
      48      56      49
      49      56      57
      49      57      50
      50      57      58
      50      58      51
      51      58      59
      51      59      52
      52      59      60
      52      60      27
      27      60      26
       7       8      53
      53       8      61
      53      61      54
      54      61      62
      54      62      55
      55      62      63
      55      63      56
      56      63      64
      56      64      57
      57      64      65
      57      65      58
      58      65      66
      58      66      59
      59      66      67
      59      67      60
      60      67      68
      60      68      26
      26      68      25
       8       9      61
      61       9      69
      61      69      62
      62      69      70
      62      70      63
      63      70      71
      63      71      64
      64      71      72
      64      72      65
      65      72      73
      65      73      66
      66      73      74
      66      74      67
      67      74      75
      67      75      68
      68      75      76
      68      76      25
      25      76      24
       9      10      69
      69      10      77
      69      77      70
      70      77      78
      70      78      71
      71      78      79
      71      79      72
      72      79      80
      72      80      73
      73      80      81
      73      81      74
      74      81      82
      74      82      75
      75      82      83
      75      83      76
      76      83      84
      76      84      24
      24      84      23
      10      11      77
      77      11      85
      77      85      78
      78      85      86
      78      86      79
      79      86      87
      79      87      80
      80      87      88
      80      88      81
      81      88      89
      81      89      82
      82      89      90
      82      90      83
      83      90      91
      83      91      84
      84      91      92
      84      92      23
      23      92      22
      11      12      85
      85      12      93
      85      93      86
      86      93      94
      86      94      87
      87      94      95
      87      95      88
      88      95      96
      88      96      89
      89      96      97
      89      97      90
      90      97      98
      90      98      91
      91      98      99
      91      99      92
      92      99     100
      92     100      22
      22     100      21
      12       2      93
      93       2      13
      93      13      94
      94      13      14
      94      14      95
      95      14      15
      95      15      96
      96      15      16
      96      16      97
      97      16      17
      97      17      98
      98      17      18
      98      18      99
      99      18      19
      99      19     100
     100      19      20
     100      20      21
      21      20       3
part       2
MeshLabel_2
bar2
       9
       1       5
       5       6
       6       7
       7       8
       8       9
       9      10
      10      11
      11      12
      12       2
part       3
MeshLabel_3
bar2
       9
       2      13
      13      14
      14      15
      15      16
      16      17
      17      18
      18      19
      19      20
      20       3
part       4
MeshLabel_4
bar2
       9
       3      21
      21      22
      22      23
      23      24
      24      25
      25      26
      26      27
      27      28
      28       4
part       5
MeshLabel_5
bar2
       9
       4      29
      29      30
      30      31
      31      32
      32      33
      33      34
      34      35
      35      36
      36       1
