Geometry file
Geometry file
node id given
element id assign
coordinates
     400
       1 0.00000e+00 0.00000e+00 0.00000e+00
       2 1.00000e+00 0.00000e+00 0.00000e+00
       3 1.00000e+00 1.00000e+00 0.00000e+00
       4 0.00000e+00 1.00000e+00 0.00000e+00
       5 5.26316e-02 0.00000e+00 0.00000e+00
       6 1.05263e-01 0.00000e+00 0.00000e+00
       7 1.57895e-01 0.00000e+00 0.00000e+00
       8 2.10526e-01 0.00000e+00 0.00000e+00
       9 2.63158e-01 0.00000e+00 0.00000e+00
      10 3.15789e-01 0.00000e+00 0.00000e+00
      11 3.68421e-01 0.00000e+00 0.00000e+00
      12 4.21053e-01 0.00000e+00 0.00000e+00
      13 4.73684e-01 0.00000e+00 0.00000e+00
      14 5.26316e-01 0.00000e+00 0.00000e+00
      15 5.78947e-01 0.00000e+00 0.00000e+00
      16 6.31579e-01 0.00000e+00 0.00000e+00
      17 6.84211e-01 0.00000e+00 0.00000e+00
      18 7.36842e-01 0.00000e+00 0.00000e+00
      19 7.89474e-01 0.00000e+00 0.00000e+00
      20 8.42105e-01 0.00000e+00 0.00000e+00
      21 8.94737e-01 0.00000e+00 0.00000e+00
      22 9.47368e-01 0.00000e+00 0.00000e+00
      23 1.00000e+00 5.26316e-02 0.00000e+00
      24 1.00000e+00 1.05263e-01 0.00000e+00
      25 1.00000e+00 1.57895e-01 0.00000e+00
      26 1.00000e+00 2.10526e-01 0.00000e+00
      27 1.00000e+00 2.63158e-01 0.00000e+00
      28 1.00000e+00 3.15789e-01 0.00000e+00
      29 1.00000e+00 3.68421e-01 0.00000e+00
      30 1.00000e+00 4.21053e-01 0.00000e+00
      31 1.00000e+00 4.73684e-01 0.00000e+00
      32 1.00000e+00 5.26316e-01 0.00000e+00
      33 1.00000e+00 5.78947e-01 0.00000e+00
      34 1.00000e+00 6.31579e-01 0.00000e+00
      35 1.00000e+00 6.84211e-01 0.00000e+00
      36 1.00000e+00 7.36842e-01 0.00000e+00
      37 1.00000e+00 7.89474e-01 0.00000e+00
      38 1.00000e+00 8.42105e-01 0.00000e+00
      39 1.00000e+00 8.94737e-01 0.00000e+00
      40 1.00000e+00 9.47368e-01 0.00000e+00
      41 9.47368e-01 1.00000e+00 0.00000e+00
      42 8.94737e-01 1.00000e+00 0.00000e+00
      43 8.42105e-01 1.00000e+00 0.00000e+00
      44 7.89474e-01 1.00000e+00 0.00000e+00
      45 7.36842e-01 1.00000e+00 0.00000e+00
      46 6.84211e-01 1.00000e+00 0.00000e+00
      47 6.31579e-01 1.00000e+00 0.00000e+00
      48 5.78947e-01 1.00000e+00 0.00000e+00
      49 5.26316e-01 1.00000e+00 0.00000e+00
      50 4.73684e-01 1.00000e+00 0.00000e+00
      51 4.21053e-01 1.00000e+00 0.00000e+00
      52 3.68421e-01 1.00000e+00 0.00000e+00
      53 3.15789e-01 1.00000e+00 0.00000e+00
      54 2.63158e-01 1.00000e+00 0.00000e+00
      55 2.10526e-01 1.00000e+00 0.00000e+00
      56 1.57895e-01 1.00000e+00 0.00000e+00
      57 1.05263e-01 1.00000e+00 0.00000e+00
      58 5.26316e-02 1.00000e+00 0.00000e+00
      59 0.00000e+00 9.47368e-01 0.00000e+00
      60 0.00000e+00 8.94737e-01 0.00000e+00
      61 0.00000e+00 8.42105e-01 0.00000e+00
      62 0.00000e+00 7.89474e-01 0.00000e+00
      63 0.00000e+00 7.36842e-01 0.00000e+00
      64 0.00000e+00 6.84211e-01 0.00000e+00
      65 0.00000e+00 6.31579e-01 0.00000e+00
      66 0.00000e+00 5.78947e-01 0.00000e+00
      67 0.00000e+00 5.26316e-01 0.00000e+00
      68 0.00000e+00 4.73684e-01 0.00000e+00
      69 0.00000e+00 4.21053e-01 0.00000e+00
      70 0.00000e+00 3.68421e-01 0.00000e+00
      71 0.00000e+00 3.15789e-01 0.00000e+00
      72 0.00000e+00 2.63158e-01 0.00000e+00
      73 0.00000e+00 2.10526e-01 0.00000e+00
      74 0.00000e+00 1.57895e-01 0.00000e+00
      75 0.00000e+00 1.05263e-01 0.00000e+00
      76 0.00000e+00 5.26316e-02 0.00000e+00
      77 5.26316e-02 5.26316e-02 0.00000e+00
      78 5.26316e-02 1.05263e-01 0.00000e+00
      79 5.26316e-02 1.57895e-01 0.00000e+00
      80 5.26316e-02 2.10526e-01 0.00000e+00
      81 5.26316e-02 2.63158e-01 0.00000e+00
      82 5.26316e-02 3.15789e-01 0.00000e+00
      83 5.26316e-02 3.68421e-01 0.00000e+00
      84 5.26316e-02 4.21053e-01 0.00000e+00
      85 5.26316e-02 4.73684e-01 0.00000e+00
      86 5.26316e-02 5.26316e-01 0.00000e+00
      87 5.26316e-02 5.78947e-01 0.00000e+00
      88 5.26316e-02 6.31579e-01 0.00000e+00
      89 5.26316e-02 6.84211e-01 0.00000e+00
      90 5.26316e-02 7.36842e-01 0.00000e+00
      91 5.26316e-02 7.89474e-01 0.00000e+00
      92 5.26316e-02 8.42105e-01 0.00000e+00
      93 5.26316e-02 8.94737e-01 0.00000e+00
      94 5.26316e-02 9.47368e-01 0.00000e+00
      95 1.05263e-01 5.26316e-02 0.00000e+00
      96 1.05263e-01 1.05263e-01 0.00000e+00
      97 1.05263e-01 1.57895e-01 0.00000e+00
      98 1.05263e-01 2.10526e-01 0.00000e+00
      99 1.05263e-01 2.63158e-01 0.00000e+00
     100 1.05263e-01 3.15789e-01 0.00000e+00
     101 1.05263e-01 3.68421e-01 0.00000e+00
     102 1.05263e-01 4.21053e-01 0.00000e+00
     103 1.05263e-01 4.73684e-01 0.00000e+00
     104 1.05263e-01 5.26316e-01 0.00000e+00
     105 1.05263e-01 5.78947e-01 0.00000e+00
     106 1.05263e-01 6.31579e-01 0.00000e+00
     107 1.05263e-01 6.84211e-01 0.00000e+00
     108 1.05263e-01 7.36842e-01 0.00000e+00
     109 1.05263e-01 7.89474e-01 0.00000e+00
     110 1.05263e-01 8.42105e-01 0.00000e+00
     111 1.05263e-01 8.94737e-01 0.00000e+00
     112 1.05263e-01 9.47368e-01 0.00000e+00
     113 1.57895e-01 5.26316e-02 0.00000e+00
     114 1.57895e-01 1.05263e-01 0.00000e+00
     115 1.57895e-01 1.57895e-01 0.00000e+00
     116 1.57895e-01 2.10526e-01 0.00000e+00
     117 1.57895e-01 2.63158e-01 0.00000e+00
     118 1.57895e-01 3.15789e-01 0.00000e+00
     119 1.57895e-01 3.68421e-01 0.00000e+00
     120 1.57895e-01 4.21053e-01 0.00000e+00
     121 1.57895e-01 4.73684e-01 0.00000e+00
     122 1.57895e-01 5.26316e-01 0.00000e+00
     123 1.57895e-01 5.78947e-01 0.00000e+00
     124 1.57895e-01 6.31579e-01 0.00000e+00
     125 1.57895e-01 6.84211e-01 0.00000e+00
     126 1.57895e-01 7.36842e-01 0.00000e+00
     127 1.57895e-01 7.89474e-01 0.00000e+00
     128 1.57895e-01 8.42105e-01 0.00000e+00
     129 1.57895e-01 8.94737e-01 0.00000e+00
     130 1.57895e-01 9.47368e-01 0.00000e+00
     131 2.10526e-01 5.26316e-02 0.00000e+00
     132 2.10526e-01 1.05263e-01 0.00000e+00
     133 2.10526e-01 1.57895e-01 0.00000e+00
     134 2.10526e-01 2.10526e-01 0.00000e+00
     135 2.10526e-01 2.63158e-01 0.00000e+00
     136 2.10526e-01 3.15789e-01 0.00000e+00
     137 2.10526e-01 3.68421e-01 0.00000e+00
     138 2.10526e-01 4.21053e-01 0.00000e+00
     139 2.10526e-01 4.73684e-01 0.00000e+00
     140 2.10526e-01 5.26316e-01 0.00000e+00
     141 2.10526e-01 5.78947e-01 0.00000e+00
     142 2.10526e-01 6.31579e-01 0.00000e+00
     143 2.10526e-01 6.84211e-01 0.00000e+00
     144 2.10526e-01 7.36842e-01 0.00000e+00
     145 2.10526e-01 7.89474e-01 0.00000e+00
     146 2.10526e-01 8.42105e-01 0.00000e+00
     147 2.10526e-01 8.94737e-01 0.00000e+00
     148 2.10526e-01 9.47368e-01 0.00000e+00
     149 2.63158e-01 5.26316e-02 0.00000e+00
     150 2.63158e-01 1.05263e-01 0.00000e+00
     151 2.63158e-01 1.57895e-01 0.00000e+00
     152 2.63158e-01 2.10526e-01 0.00000e+00
     153 2.63158e-01 2.63158e-01 0.00000e+00
     154 2.63158e-01 3.15789e-01 0.00000e+00
     155 2.63158e-01 3.68421e-01 0.00000e+00
     156 2.63158e-01 4.21053e-01 0.00000e+00
     157 2.63158e-01 4.73684e-01 0.00000e+00
     158 2.63158e-01 5.26316e-01 0.00000e+00
     159 2.63158e-01 5.78947e-01 0.00000e+00
     160 2.63158e-01 6.31579e-01 0.00000e+00
     161 2.63158e-01 6.84211e-01 0.00000e+00
     162 2.63158e-01 7.36842e-01 0.00000e+00
     163 2.63158e-01 7.89474e-01 0.00000e+00
     164 2.63158e-01 8.42105e-01 0.00000e+00
     165 2.63158e-01 8.94737e-01 0.00000e+00
     166 2.63158e-01 9.47368e-01 0.00000e+00
     167 3.15789e-01 5.26316e-02 0.00000e+00
     168 3.15789e-01 1.05263e-01 0.00000e+00
     169 3.15789e-01 1.57895e-01 0.00000e+00
     170 3.15789e-01 2.10526e-01 0.00000e+00
     171 3.15789e-01 2.63158e-01 0.00000e+00
     172 3.15789e-01 3.15789e-01 0.00000e+00
     173 3.15789e-01 3.68421e-01 0.00000e+00
     174 3.15789e-01 4.21053e-01 0.00000e+00
     175 3.15789e-01 4.73684e-01 0.00000e+00
     176 3.15789e-01 5.26316e-01 0.00000e+00
     177 3.15789e-01 5.78947e-01 0.00000e+00
     178 3.15789e-01 6.31579e-01 0.00000e+00
     179 3.15789e-01 6.84211e-01 0.00000e+00
     180 3.15789e-01 7.36842e-01 0.00000e+00
     181 3.15789e-01 7.89474e-01 0.00000e+00
     182 3.15789e-01 8.42105e-01 0.00000e+00
     183 3.15789e-01 8.94737e-01 0.00000e+00
     184 3.15789e-01 9.47368e-01 0.00000e+00
     185 3.68421e-01 5.26316e-02 0.00000e+00
     186 3.68421e-01 1.05263e-01 0.00000e+00
     187 3.68421e-01 1.57895e-01 0.00000e+00
     188 3.68421e-01 2.10526e-01 0.00000e+00
     189 3.68421e-01 2.63158e-01 0.00000e+00
     190 3.68421e-01 3.15789e-01 0.00000e+00
     191 3.68421e-01 3.68421e-01 0.00000e+00
     192 3.68421e-01 4.21053e-01 0.00000e+00
     193 3.68421e-01 4.73684e-01 0.00000e+00
     194 3.68421e-01 5.26316e-01 0.00000e+00
     195 3.68421e-01 5.78947e-01 0.00000e+00
     196 3.68421e-01 6.31579e-01 0.00000e+00
     197 3.68421e-01 6.84211e-01 0.00000e+00
     198 3.68421e-01 7.36842e-01 0.00000e+00
     199 3.68421e-01 7.89474e-01 0.00000e+00
     200 3.68421e-01 8.42105e-01 0.00000e+00
     201 3.68421e-01 8.94737e-01 0.00000e+00
     202 3.68421e-01 9.47368e-01 0.00000e+00
     203 4.21053e-01 5.26316e-02 0.00000e+00
     204 4.21053e-01 1.05263e-01 0.00000e+00
     205 4.21053e-01 1.57895e-01 0.00000e+00
     206 4.21053e-01 2.10526e-01 0.00000e+00
     207 4.21053e-01 2.63158e-01 0.00000e+00
     208 4.21053e-01 3.15789e-01 0.00000e+00
     209 4.21053e-01 3.68421e-01 0.00000e+00
     210 4.21053e-01 4.21053e-01 0.00000e+00
     211 4.21053e-01 4.73684e-01 0.00000e+00
     212 4.21053e-01 5.26316e-01 0.00000e+00
     213 4.21053e-01 5.78947e-01 0.00000e+00
     214 4.21053e-01 6.31579e-01 0.00000e+00
     215 4.21053e-01 6.84211e-01 0.00000e+00
     216 4.21053e-01 7.36842e-01 0.00000e+00
     217 4.21053e-01 7.89474e-01 0.00000e+00
     218 4.21053e-01 8.42105e-01 0.00000e+00
     219 4.21053e-01 8.94737e-01 0.00000e+00
     220 4.21053e-01 9.47368e-01 0.00000e+00
     221 4.73684e-01 5.26316e-02 0.00000e+00
     222 4.73684e-01 1.05263e-01 0.00000e+00
     223 4.73684e-01 1.57895e-01 0.00000e+00
     224 4.73684e-01 2.10526e-01 0.00000e+00
     225 4.73684e-01 2.63158e-01 0.00000e+00
     226 4.73684e-01 3.15789e-01 0.00000e+00
     227 4.73684e-01 3.68421e-01 0.00000e+00
     228 4.73684e-01 4.21053e-01 0.00000e+00
     229 4.73684e-01 4.73684e-01 0.00000e+00
     230 4.73684e-01 5.26316e-01 0.00000e+00
     231 4.73684e-01 5.78947e-01 0.00000e+00
     232 4.73684e-01 6.31579e-01 0.00000e+00
     233 4.73684e-01 6.84211e-01 0.00000e+00
     234 4.73684e-01 7.36842e-01 0.00000e+00
     235 4.73684e-01 7.89474e-01 0.00000e+00
     236 4.73684e-01 8.42105e-01 0.00000e+00
     237 4.73684e-01 8.94737e-01 0.00000e+00
     238 4.73684e-01 9.47368e-01 0.00000e+00
     239 5.26316e-01 5.26316e-02 0.00000e+00
     240 5.26316e-01 1.05263e-01 0.00000e+00
     241 5.26316e-01 1.57895e-01 0.00000e+00
     242 5.26316e-01 2.10526e-01 0.00000e+00
     243 5.26316e-01 2.63158e-01 0.00000e+00
     244 5.26316e-01 3.15789e-01 0.00000e+00
     245 5.26316e-01 3.68421e-01 0.00000e+00
     246 5.26316e-01 4.21053e-01 0.00000e+00
     247 5.26316e-01 4.73684e-01 0.00000e+00
     248 5.26316e-01 5.26316e-01 0.00000e+00
     249 5.26316e-01 5.78947e-01 0.00000e+00
     250 5.26316e-01 6.31579e-01 0.00000e+00
     251 5.26316e-01 6.84211e-01 0.00000e+00
     252 5.26316e-01 7.36842e-01 0.00000e+00
     253 5.26316e-01 7.89474e-01 0.00000e+00
     254 5.26316e-01 8.42105e-01 0.00000e+00
     255 5.26316e-01 8.94737e-01 0.00000e+00
     256 5.26316e-01 9.47368e-01 0.00000e+00
     257 5.78947e-01 5.26316e-02 0.00000e+00
     258 5.78947e-01 1.05263e-01 0.00000e+00
     259 5.78947e-01 1.57895e-01 0.00000e+00
     260 5.78947e-01 2.10526e-01 0.00000e+00
     261 5.78947e-01 2.63158e-01 0.00000e+00
     262 5.78947e-01 3.15789e-01 0.00000e+00
     263 5.78947e-01 3.68421e-01 0.00000e+00
     264 5.78947e-01 4.21053e-01 0.00000e+00
     265 5.78947e-01 4.73684e-01 0.00000e+00
     266 5.78947e-01 5.26316e-01 0.00000e+00
     267 5.78947e-01 5.78947e-01 0.00000e+00
     268 5.78947e-01 6.31579e-01 0.00000e+00
     269 5.78947e-01 6.84211e-01 0.00000e+00
     270 5.78947e-01 7.36842e-01 0.00000e+00
     271 5.78947e-01 7.89474e-01 0.00000e+00
     272 5.78947e-01 8.42105e-01 0.00000e+00
     273 5.78947e-01 8.94737e-01 0.00000e+00
     274 5.78947e-01 9.47368e-01 0.00000e+00
     275 6.31579e-01 5.26316e-02 0.00000e+00
     276 6.31579e-01 1.05263e-01 0.00000e+00
     277 6.31579e-01 1.57895e-01 0.00000e+00
     278 6.31579e-01 2.10526e-01 0.00000e+00
     279 6.31579e-01 2.63158e-01 0.00000e+00
     280 6.31579e-01 3.15789e-01 0.00000e+00
     281 6.31579e-01 3.68421e-01 0.00000e+00
     282 6.31579e-01 4.21053e-01 0.00000e+00
     283 6.31579e-01 4.73684e-01 0.00000e+00
     284 6.31579e-01 5.26316e-01 0.00000e+00
     285 6.31579e-01 5.78947e-01 0.00000e+00
     286 6.31579e-01 6.31579e-01 0.00000e+00
     287 6.31579e-01 6.84211e-01 0.00000e+00
     288 6.31579e-01 7.36842e-01 0.00000e+00
     289 6.31579e-01 7.89474e-01 0.00000e+00
     290 6.31579e-01 8.42105e-01 0.00000e+00
     291 6.31579e-01 8.94737e-01 0.00000e+00
     292 6.31579e-01 9.47368e-01 0.00000e+00
     293 6.84211e-01 5.26316e-02 0.00000e+00
     294 6.84211e-01 1.05263e-01 0.00000e+00
     295 6.84211e-01 1.57895e-01 0.00000e+00
     296 6.84211e-01 2.10526e-01 0.00000e+00
     297 6.84211e-01 2.63158e-01 0.00000e+00
     298 6.84211e-01 3.15789e-01 0.00000e+00
     299 6.84211e-01 3.68421e-01 0.00000e+00
     300 6.84211e-01 4.21053e-01 0.00000e+00
     301 6.84211e-01 4.73684e-01 0.00000e+00
     302 6.84211e-01 5.26316e-01 0.00000e+00
     303 6.84211e-01 5.78947e-01 0.00000e+00
     304 6.84211e-01 6.31579e-01 0.00000e+00
     305 6.84211e-01 6.84211e-01 0.00000e+00
     306 6.84211e-01 7.36842e-01 0.00000e+00
     307 6.84211e-01 7.89474e-01 0.00000e+00
     308 6.84211e-01 8.42105e-01 0.00000e+00
     309 6.84211e-01 8.94737e-01 0.00000e+00
     310 6.84211e-01 9.47368e-01 0.00000e+00
     311 7.36842e-01 5.26316e-02 0.00000e+00
     312 7.36842e-01 1.05263e-01 0.00000e+00
     313 7.36842e-01 1.57895e-01 0.00000e+00
     314 7.36842e-01 2.10526e-01 0.00000e+00
     315 7.36842e-01 2.63158e-01 0.00000e+00
     316 7.36842e-01 3.15789e-01 0.00000e+00
     317 7.36842e-01 3.68421e-01 0.00000e+00
     318 7.36842e-01 4.21053e-01 0.00000e+00
     319 7.36842e-01 4.73684e-01 0.00000e+00
     320 7.36842e-01 5.26316e-01 0.00000e+00
     321 7.36842e-01 5.78947e-01 0.00000e+00
     322 7.36842e-01 6.31579e-01 0.00000e+00
     323 7.36842e-01 6.84211e-01 0.00000e+00
     324 7.36842e-01 7.36842e-01 0.00000e+00
     325 7.36842e-01 7.89474e-01 0.00000e+00
     326 7.36842e-01 8.42105e-01 0.00000e+00
     327 7.36842e-01 8.94737e-01 0.00000e+00
     328 7.36842e-01 9.47368e-01 0.00000e+00
     329 7.89474e-01 5.26316e-02 0.00000e+00
     330 7.89474e-01 1.05263e-01 0.00000e+00
     331 7.89474e-01 1.57895e-01 0.00000e+00
     332 7.89474e-01 2.10526e-01 0.00000e+00
     333 7.89474e-01 2.63158e-01 0.00000e+00
     334 7.89474e-01 3.15789e-01 0.00000e+00
     335 7.89474e-01 3.68421e-01 0.00000e+00
     336 7.89474e-01 4.21053e-01 0.00000e+00
     337 7.89474e-01 4.73684e-01 0.00000e+00
     338 7.89474e-01 5.26316e-01 0.00000e+00
     339 7.89474e-01 5.78947e-01 0.00000e+00
     340 7.89474e-01 6.31579e-01 0.00000e+00
     341 7.89474e-01 6.84211e-01 0.00000e+00
     342 7.89474e-01 7.36842e-01 0.00000e+00
     343 7.89474e-01 7.89474e-01 0.00000e+00
     344 7.89474e-01 8.42105e-01 0.00000e+00
     345 7.89474e-01 8.94737e-01 0.00000e+00
     346 7.89474e-01 9.47368e-01 0.00000e+00
     347 8.42105e-01 5.26316e-02 0.00000e+00
     348 8.42105e-01 1.05263e-01 0.00000e+00
     349 8.42105e-01 1.57895e-01 0.00000e+00
     350 8.42105e-01 2.10526e-01 0.00000e+00
     351 8.42105e-01 2.63158e-01 0.00000e+00
     352 8.42105e-01 3.15789e-01 0.00000e+00
     353 8.42105e-01 3.68421e-01 0.00000e+00
     354 8.42105e-01 4.21053e-01 0.00000e+00
     355 8.42105e-01 4.73684e-01 0.00000e+00
     356 8.42105e-01 5.26316e-01 0.00000e+00
     357 8.42105e-01 5.78947e-01 0.00000e+00
     358 8.42105e-01 6.31579e-01 0.00000e+00
     359 8.42105e-01 6.84211e-01 0.00000e+00
     360 8.42105e-01 7.36842e-01 0.00000e+00
     361 8.42105e-01 7.89474e-01 0.00000e+00
     362 8.42105e-01 8.42105e-01 0.00000e+00
     363 8.42105e-01 8.94737e-01 0.00000e+00
     364 8.42105e-01 9.47368e-01 0.00000e+00
     365 8.94737e-01 5.26316e-02 0.00000e+00
     366 8.94737e-01 1.05263e-01 0.00000e+00
     367 8.94737e-01 1.57895e-01 0.00000e+00
     368 8.94737e-01 2.10526e-01 0.00000e+00
     369 8.94737e-01 2.63158e-01 0.00000e+00
     370 8.94737e-01 3.15789e-01 0.00000e+00
     371 8.94737e-01 3.68421e-01 0.00000e+00
     372 8.94737e-01 4.21053e-01 0.00000e+00
     373 8.94737e-01 4.73684e-01 0.00000e+00
     374 8.94737e-01 5.26316e-01 0.00000e+00
     375 8.94737e-01 5.78947e-01 0.00000e+00
     376 8.94737e-01 6.31579e-01 0.00000e+00
     377 8.94737e-01 6.84211e-01 0.00000e+00
     378 8.94737e-01 7.36842e-01 0.00000e+00
     379 8.94737e-01 7.89474e-01 0.00000e+00
     380 8.94737e-01 8.42105e-01 0.00000e+00
     381 8.94737e-01 8.94737e-01 0.00000e+00
     382 8.94737e-01 9.47368e-01 0.00000e+00
     383 9.47368e-01 5.26316e-02 0.00000e+00
     384 9.47368e-01 1.05263e-01 0.00000e+00
     385 9.47368e-01 1.57895e-01 0.00000e+00
     386 9.47368e-01 2.10526e-01 0.00000e+00
     387 9.47368e-01 2.63158e-01 0.00000e+00
     388 9.47368e-01 3.15789e-01 0.00000e+00
     389 9.47368e-01 3.68421e-01 0.00000e+00
     390 9.47368e-01 4.21053e-01 0.00000e+00
     391 9.47368e-01 4.73684e-01 0.00000e+00
     392 9.47368e-01 5.26316e-01 0.00000e+00
     393 9.47368e-01 5.78947e-01 0.00000e+00
     394 9.47368e-01 6.31579e-01 0.00000e+00
     395 9.47368e-01 6.84211e-01 0.00000e+00
     396 9.47368e-01 7.36842e-01 0.00000e+00
     397 9.47368e-01 7.89474e-01 0.00000e+00
     398 9.47368e-01 8.42105e-01 0.00000e+00
     399 9.47368e-01 8.94737e-01 0.00000e+00
     400 9.47368e-01 9.47368e-01 0.00000e+00
part       1
MeshLabel_1
quad4
     361
       1       5      77      76
      76      77      78      75
      75      78      79      74
      74      79      80      73
      73      80      81      72
      72      81      82      71
      71      82      83      70
      70      83      84      69
      69      84      85      68
      68      85      86      67
      67      86      87      66
      66      87      88      65
      65      88      89      64
      64      89      90      63
      63      90      91      62
      62      91      92      61
      61      92      93      60
      60      93      94      59
      59      94      58       4
       5       6      95      77
      77      95      96      78
      78      96      97      79
      79      97      98      80
      80      98      99      81
      81      99     100      82
      82     100     101      83
      83     101     102      84
      84     102     103      85
      85     103     104      86
      86     104     105      87
      87     105     106      88
      88     106     107      89
      89     107     108      90
      90     108     109      91
      91     109     110      92
      92     110     111      93
      93     111     112      94
      94     112      57      58
       6       7     113      95
      95     113     114      96
      96     114     115      97
      97     115     116      98
      98     116     117      99
      99     117     118     100
     100     118     119     101
     101     119     120     102
     102     120     121     103
     103     121     122     104
     104     122     123     105
     105     123     124     106
     106     124     125     107
     107     125     126     108
     108     126     127     109
     109     127     128     110
     110     128     129     111
     111     129     130     112
     112     130      56      57
       7       8     131     113
     113     131     132     114
     114     132     133     115
     115     133     134     116
     116     134     135     117
     117     135     136     118
     118     136     137     119
     119     137     138     120
     120     138     139     121
     121     139     140     122
     122     140     141     123
     123     141     142     124
     124     142     143     125
     125     143     144     126
     126     144     145     127
     127     145     146     128
     128     146     147     129
     129     147     148     130
     130     148      55      56
       8       9     149     131
     131     149     150     132
     132     150     151     133
     133     151     152     134
     134     152     153     135
     135     153     154     136
     136     154     155     137
     137     155     156     138
     138     156     157     139
     139     157     158     140
     140     158     159     141
     141     159     160     142
     142     160     161     143
     143     161     162     144
     144     162     163     145
     145     163     164     146
     146     164     165     147
     147     165     166     148
     148     166      54      55
       9      10     167     149
     149     167     168     150
     150     168     169     151
     151     169     170     152
     152     170     171     153
     153     171     172     154
     154     172     173     155
     155     173     174     156
     156     174     175     157
     157     175     176     158
     158     176     177     159
     159     177     178     160
     160     178     179     161
     161     179     180     162
     162     180     181     163
     163     181     182     164
     164     182     183     165
     165     183     184     166
     166     184      53      54
      10      11     185     167
     167     185     186     168
     168     186     187     169
     169     187     188     170
     170     188     189     171
     171     189     190     172
     172     190     191     173
     173     191     192     174
     174     192     193     175
     175     193     194     176
     176     194     195     177
     177     195     196     178
     178     196     197     179
     179     197     198     180
     180     198     199     181
     181     199     200     182
     182     200     201     183
     183     201     202     184
     184     202      52      53
      11      12     203     185
     185     203     204     186
     186     204     205     187
     187     205     206     188
     188     206     207     189
     189     207     208     190
     190     208     209     191
     191     209     210     192
     192     210     211     193
     193     211     212     194
     194     212     213     195
     195     213     214     196
     196     214     215     197
     197     215     216     198
     198     216     217     199
     199     217     218     200
     200     218     219     201
     201     219     220     202
     202     220      51      52
      12      13     221     203
     203     221     222     204
     204     222     223     205
     205     223     224     206
     206     224     225     207
     207     225     226     208
     208     226     227     209
     209     227     228     210
     210     228     229     211
     211     229     230     212
     212     230     231     213
     213     231     232     214
     214     232     233     215
     215     233     234     216
     216     234     235     217
     217     235     236     218
     218     236     237     219
     219     237     238     220
     220     238      50      51
      13      14     239     221
     221     239     240     222
     222     240     241     223
     223     241     242     224
     224     242     243     225
     225     243     244     226
     226     244     245     227
     227     245     246     228
     228     246     247     229
     229     247     248     230
     230     248     249     231
     231     249     250     232
     232     250     251     233
     233     251     252     234
     234     252     253     235
     235     253     254     236
     236     254     255     237
     237     255     256     238
     238     256      49      50
      14      15     257     239
     239     257     258     240
     240     258     259     241
     241     259     260     242
     242     260     261     243
     243     261     262     244
     244     262     263     245
     245     263     264     246
     246     264     265     247
     247     265     266     248
     248     266     267     249
     249     267     268     250
     250     268     269     251
     251     269     270     252
     252     270     271     253
     253     271     272     254
     254     272     273     255
     255     273     274     256
     256     274      48      49
      15      16     275     257
     257     275     276     258
     258     276     277     259
     259     277     278     260
     260     278     279     261
     261     279     280     262
     262     280     281     263
     263     281     282     264
     264     282     283     265
     265     283     284     266
     266     284     285     267
     267     285     286     268
     268     286     287     269
     269     287     288     270
     270     288     289     271
     271     289     290     272
     272     290     291     273
     273     291     292     274
     274     292      47      48
      16      17     293     275
     275     293     294     276
     276     294     295     277
     277     295     296     278
     278     296     297     279
     279     297     298     280
     280     298     299     281
     281     299     300     282
     282     300     301     283
     283     301     302     284
     284     302     303     285
     285     303     304     286
     286     304     305     287
     287     305     306     288
     288     306     307     289
     289     307     308     290
     290     308     309     291
     291     309     310     292
     292     310      46      47
      17      18     311     293
     293     311     312     294
     294     312     313     295
     295     313     314     296
     296     314     315     297
     297     315     316     298
     298     316     317     299
     299     317     318     300
     300     318     319     301
     301     319     320     302
     302     320     321     303
     303     321     322     304
     304     322     323     305
     305     323     324     306
     306     324     325     307
     307     325     326     308
     308     326     327     309
     309     327     328     310
     310     328      45      46
      18      19     329     311
     311     329     330     312
     312     330     331     313
     313     331     332     314
     314     332     333     315
     315     333     334     316
     316     334     335     317
     317     335     336     318
     318     336     337     319
     319     337     338     320
     320     338     339     321
     321     339     340     322
     322     340     341     323
     323     341     342     324
     324     342     343     325
     325     343     344     326
     326     344     345     327
     327     345     346     328
     328     346      44      45
      19      20     347     329
     329     347     348     330
     330     348     349     331
     331     349     350     332
     332     350     351     333
     333     351     352     334
     334     352     353     335
     335     353     354     336
     336     354     355     337
     337     355     356     338
     338     356     357     339
     339     357     358     340
     340     358     359     341
     341     359     360     342
     342     360     361     343
     343     361     362     344
     344     362     363     345
     345     363     364     346
     346     364      43      44
      20      21     365     347
     347     365     366     348
     348     366     367     349
     349     367     368     350
     350     368     369     351
     351     369     370     352
     352     370     371     353
     353     371     372     354
     354     372     373     355
     355     373     374     356
     356     374     375     357
     357     375     376     358
     358     376     377     359
     359     377     378     360
     360     378     379     361
     361     379     380     362
     362     380     381     363
     363     381     382     364
     364     382      42      43
      21      22     383     365
     365     383     384     366
     366     384     385     367
     367     385     386     368
     368     386     387     369
     369     387     388     370
     370     388     389     371
     371     389     390     372
     372     390     391     373
     373     391     392     374
     374     392     393     375
     375     393     394     376
     376     394     395     377
     377     395     396     378
     378     396     397     379
     379     397     398     380
     380     398     399     381
     381     399     400     382
     382     400      41      42
      22       2      23     383
     383      23      24     384
     384      24      25     385
     385      25      26     386
     386      26      27     387
     387      27      28     388
     388      28      29     389
     389      29      30     390
     390      30      31     391
     391      31      32     392
     392      32      33     393
     393      33      34     394
     394      34      35     395
     395      35      36     396
     396      36      37     397
     397      37      38     398
     398      38      39     399
     399      39      40     400
     400      40       3      41
part       2
MeshLabel_2
bar2
      19
       1       5
       5       6
       6       7
       7       8
       8       9
       9      10
      10      11
      11      12
      12      13
      13      14
      14      15
      15      16
      16      17
      17      18
      18      19
      19      20
      20      21
      21      22
      22       2
part       3
MeshLabel_3
bar2
      19
       2      23
      23      24
      24      25
      25      26
      26      27
      27      28
      28      29
      29      30
      30      31
      31      32
      32      33
      33      34
      34      35
      35      36
      36      37
      37      38
      38      39
      39      40
      40       3
part       4
MeshLabel_4
bar2
      19
       3      41
      41      42
      42      43
      43      44
      44      45
      45      46
      46      47
      47      48
      48      49
      49      50
      50      51
      51      52
      52      53
      53      54
      54      55
      55      56
      56      57
      57      58
      58       4
part       5
MeshLabel_5
bar2
      19
       4      59
      59      60
      60      61
      61      62
      62      63
      63      64
      64      65
      65      66
      66      67
      67      68
      68      69
      69      70
      70      71
      71      72
      72      73
      73      74
      74      75
      75      76
      76       1
