grid solution 
0.000000e+00 0.000000e+00 
5.000000e-01 5.005510e-02 
1.000000e+00 1.267919e-01 
1.500000e+00 2.617907e-01 
2.000000e+00 4.929520e-01 
2.500000e+00 8.588147e-01 
3.000000e+00 1.383483e+00 
3.500000e+00 2.054613e+00 
4.000000e+00 2.804447e+00 
4.500000e+00 3.509189e+00 
5.000000e+00 4.017621e+00 
5.500000e+00 4.203525e+00 
6.000000e+00 4.017561e+00 
6.500000e+00 3.508990e+00 
7.000000e+00 2.803864e+00 
7.500000e+00 2.052990e+00 
8.000000e+00 1.379164e+00 
8.500000e+00 8.478729e-01 
9.000000e+00 4.666756e-01 
9.500000e+00 2.022356e-01 
1.000000e+01 0.000000e+00 
