Geometry file
Geometry file
node id given
element id assign
coordinates
     186
       1 0.00000e+00 0.00000e+00 0.00000e+00
       2 2.00000e-01 0.00000e+00 0.00000e+00
       3 4.00000e-01 0.00000e+00 0.00000e+00
       4 6.00000e-01 0.00000e+00 0.00000e+00
       5 8.00000e-01 0.00000e+00 0.00000e+00
       6 1.00000e+00 0.00000e+00 0.00000e+00
       7 1.20000e+00 0.00000e+00 0.00000e+00
       8 1.40000e+00 0.00000e+00 0.00000e+00
       9 1.60000e+00 0.00000e+00 0.00000e+00
      10 1.80000e+00 0.00000e+00 0.00000e+00
      11 2.00000e+00 0.00000e+00 0.00000e+00
      12 2.20000e+00 0.00000e+00 0.00000e+00
      13 2.40000e+00 0.00000e+00 0.00000e+00
      14 2.60000e+00 0.00000e+00 0.00000e+00
      15 2.80000e+00 0.00000e+00 0.00000e+00
      16 3.00000e+00 0.00000e+00 0.00000e+00
      17 3.20000e+00 0.00000e+00 0.00000e+00
      18 3.40000e+00 0.00000e+00 0.00000e+00
      19 3.60000e+00 0.00000e+00 0.00000e+00
      20 3.80000e+00 0.00000e+00 0.00000e+00
      21 4.00000e+00 0.00000e+00 0.00000e+00
      22 4.20000e+00 0.00000e+00 0.00000e+00
      23 4.40000e+00 0.00000e+00 0.00000e+00
      24 4.60000e+00 0.00000e+00 0.00000e+00
      25 4.80000e+00 0.00000e+00 0.00000e+00
      26 5.00000e+00 0.00000e+00 0.00000e+00
      27 5.20000e+00 0.00000e+00 0.00000e+00
      28 5.40000e+00 0.00000e+00 0.00000e+00
      29 5.60000e+00 0.00000e+00 0.00000e+00
      30 5.80000e+00 0.00000e+00 0.00000e+00
      31 6.00000e+00 0.00000e+00 0.00000e+00
      32 0.00000e+00 2.00000e-01 0.00000e+00
      33 2.00000e-01 2.00000e-01 0.00000e+00
      34 4.00000e-01 2.00000e-01 0.00000e+00
      35 6.00000e-01 2.00000e-01 0.00000e+00
      36 8.00000e-01 2.00000e-01 0.00000e+00
      37 1.00000e+00 2.00000e-01 0.00000e+00
      38 1.20000e+00 2.00000e-01 0.00000e+00
      39 1.40000e+00 2.00000e-01 0.00000e+00
      40 1.60000e+00 2.00000e-01 0.00000e+00
      41 1.80000e+00 2.00000e-01 0.00000e+00
      42 2.00000e+00 2.00000e-01 0.00000e+00
      43 2.20000e+00 2.00000e-01 0.00000e+00
      44 2.40000e+00 2.00000e-01 0.00000e+00
      45 2.60000e+00 2.00000e-01 0.00000e+00
      46 2.80000e+00 2.00000e-01 0.00000e+00
      47 3.00000e+00 2.00000e-01 0.00000e+00
      48 3.20000e+00 2.00000e-01 0.00000e+00
      49 3.40000e+00 2.00000e-01 0.00000e+00
      50 3.60000e+00 2.00000e-01 0.00000e+00
      51 3.80000e+00 2.00000e-01 0.00000e+00
      52 4.00000e+00 2.00000e-01 0.00000e+00
      53 4.20000e+00 2.00000e-01 0.00000e+00
      54 4.40000e+00 2.00000e-01 0.00000e+00
      55 4.60000e+00 2.00000e-01 0.00000e+00
      56 4.80000e+00 2.00000e-01 0.00000e+00
      57 5.00000e+00 2.00000e-01 0.00000e+00
      58 5.20000e+00 2.00000e-01 0.00000e+00
      59 5.40000e+00 2.00000e-01 0.00000e+00
      60 5.60000e+00 2.00000e-01 0.00000e+00
      61 5.80000e+00 2.00000e-01 0.00000e+00
      62 6.00000e+00 2.00000e-01 0.00000e+00
      63 0.00000e+00 4.00000e-01 0.00000e+00
      64 2.00000e-01 4.00000e-01 0.00000e+00
      65 4.00000e-01 4.00000e-01 0.00000e+00
      66 6.00000e-01 4.00000e-01 0.00000e+00
      67 8.00000e-01 4.00000e-01 0.00000e+00
      68 1.00000e+00 4.00000e-01 0.00000e+00
      69 1.20000e+00 4.00000e-01 0.00000e+00
      70 1.40000e+00 4.00000e-01 0.00000e+00
      71 1.60000e+00 4.00000e-01 0.00000e+00
      72 1.80000e+00 4.00000e-01 0.00000e+00
      73 2.00000e+00 4.00000e-01 0.00000e+00
      74 2.20000e+00 4.00000e-01 0.00000e+00
      75 2.40000e+00 4.00000e-01 0.00000e+00
      76 2.60000e+00 4.00000e-01 0.00000e+00
      77 2.80000e+00 4.00000e-01 0.00000e+00
      78 3.00000e+00 4.00000e-01 0.00000e+00
      79 3.20000e+00 4.00000e-01 0.00000e+00
      80 3.40000e+00 4.00000e-01 0.00000e+00
      81 3.60000e+00 4.00000e-01 0.00000e+00
      82 3.80000e+00 4.00000e-01 0.00000e+00
      83 4.00000e+00 4.00000e-01 0.00000e+00
      84 4.20000e+00 4.00000e-01 0.00000e+00
      85 4.40000e+00 4.00000e-01 0.00000e+00
      86 4.60000e+00 4.00000e-01 0.00000e+00
      87 4.80000e+00 4.00000e-01 0.00000e+00
      88 5.00000e+00 4.00000e-01 0.00000e+00
      89 5.20000e+00 4.00000e-01 0.00000e+00
      90 5.40000e+00 4.00000e-01 0.00000e+00
      91 5.60000e+00 4.00000e-01 0.00000e+00
      92 5.80000e+00 4.00000e-01 0.00000e+00
      93 6.00000e+00 4.00000e-01 0.00000e+00
      94 0.00000e+00 6.00000e-01 0.00000e+00
      95 2.00000e-01 6.00000e-01 0.00000e+00
      96 4.00000e-01 6.00000e-01 0.00000e+00
      97 6.00000e-01 6.00000e-01 0.00000e+00
      98 8.00000e-01 6.00000e-01 0.00000e+00
      99 1.00000e+00 6.00000e-01 0.00000e+00
     100 1.20000e+00 6.00000e-01 0.00000e+00
     101 1.40000e+00 6.00000e-01 0.00000e+00
     102 1.60000e+00 6.00000e-01 0.00000e+00
     103 1.80000e+00 6.00000e-01 0.00000e+00
     104 2.00000e+00 6.00000e-01 0.00000e+00
     105 2.20000e+00 6.00000e-01 0.00000e+00
     106 2.40000e+00 6.00000e-01 0.00000e+00
     107 2.60000e+00 6.00000e-01 0.00000e+00
     108 2.80000e+00 6.00000e-01 0.00000e+00
     109 3.00000e+00 6.00000e-01 0.00000e+00
     110 3.20000e+00 6.00000e-01 0.00000e+00
     111 3.40000e+00 6.00000e-01 0.00000e+00
     112 3.60000e+00 6.00000e-01 0.00000e+00
     113 3.80000e+00 6.00000e-01 0.00000e+00
     114 4.00000e+00 6.00000e-01 0.00000e+00
     115 4.20000e+00 6.00000e-01 0.00000e+00
     116 4.40000e+00 6.00000e-01 0.00000e+00
     117 4.60000e+00 6.00000e-01 0.00000e+00
     118 4.80000e+00 6.00000e-01 0.00000e+00
     119 5.00000e+00 6.00000e-01 0.00000e+00
     120 5.20000e+00 6.00000e-01 0.00000e+00
     121 5.40000e+00 6.00000e-01 0.00000e+00
     122 5.60000e+00 6.00000e-01 0.00000e+00
     123 5.80000e+00 6.00000e-01 0.00000e+00
     124 6.00000e+00 6.00000e-01 0.00000e+00
     125 0.00000e+00 8.00000e-01 0.00000e+00
     126 2.00000e-01 8.00000e-01 0.00000e+00
     127 4.00000e-01 8.00000e-01 0.00000e+00
     128 6.00000e-01 8.00000e-01 0.00000e+00
     129 8.00000e-01 8.00000e-01 0.00000e+00
     130 1.00000e+00 8.00000e-01 0.00000e+00
     131 1.20000e+00 8.00000e-01 0.00000e+00
     132 1.40000e+00 8.00000e-01 0.00000e+00
     133 1.60000e+00 8.00000e-01 0.00000e+00
     134 1.80000e+00 8.00000e-01 0.00000e+00
     135 2.00000e+00 8.00000e-01 0.00000e+00
     136 2.20000e+00 8.00000e-01 0.00000e+00
     137 2.40000e+00 8.00000e-01 0.00000e+00
     138 2.60000e+00 8.00000e-01 0.00000e+00
     139 2.80000e+00 8.00000e-01 0.00000e+00
     140 3.00000e+00 8.00000e-01 0.00000e+00
     141 3.20000e+00 8.00000e-01 0.00000e+00
     142 3.40000e+00 8.00000e-01 0.00000e+00
     143 3.60000e+00 8.00000e-01 0.00000e+00
     144 3.80000e+00 8.00000e-01 0.00000e+00
     145 4.00000e+00 8.00000e-01 0.00000e+00
     146 4.20000e+00 8.00000e-01 0.00000e+00
     147 4.40000e+00 8.00000e-01 0.00000e+00
     148 4.60000e+00 8.00000e-01 0.00000e+00
     149 4.80000e+00 8.00000e-01 0.00000e+00
     150 5.00000e+00 8.00000e-01 0.00000e+00
     151 5.20000e+00 8.00000e-01 0.00000e+00
     152 5.40000e+00 8.00000e-01 0.00000e+00
     153 5.60000e+00 8.00000e-01 0.00000e+00
     154 5.80000e+00 8.00000e-01 0.00000e+00
     155 6.00000e+00 8.00000e-01 0.00000e+00
     156 0.00000e+00 1.00000e+00 0.00000e+00
     157 2.00000e-01 1.00000e+00 0.00000e+00
     158 4.00000e-01 1.00000e+00 0.00000e+00
     159 6.00000e-01 1.00000e+00 0.00000e+00
     160 8.00000e-01 1.00000e+00 0.00000e+00
     161 1.00000e+00 1.00000e+00 0.00000e+00
     162 1.20000e+00 1.00000e+00 0.00000e+00
     163 1.40000e+00 1.00000e+00 0.00000e+00
     164 1.60000e+00 1.00000e+00 0.00000e+00
     165 1.80000e+00 1.00000e+00 0.00000e+00
     166 2.00000e+00 1.00000e+00 0.00000e+00
     167 2.20000e+00 1.00000e+00 0.00000e+00
     168 2.40000e+00 1.00000e+00 0.00000e+00
     169 2.60000e+00 1.00000e+00 0.00000e+00
     170 2.80000e+00 1.00000e+00 0.00000e+00
     171 3.00000e+00 1.00000e+00 0.00000e+00
     172 3.20000e+00 1.00000e+00 0.00000e+00
     173 3.40000e+00 1.00000e+00 0.00000e+00
     174 3.60000e+00 1.00000e+00 0.00000e+00
     175 3.80000e+00 1.00000e+00 0.00000e+00
     176 4.00000e+00 1.00000e+00 0.00000e+00
     177 4.20000e+00 1.00000e+00 0.00000e+00
     178 4.40000e+00 1.00000e+00 0.00000e+00
     179 4.60000e+00 1.00000e+00 0.00000e+00
     180 4.80000e+00 1.00000e+00 0.00000e+00
     181 5.00000e+00 1.00000e+00 0.00000e+00
     182 5.20000e+00 1.00000e+00 0.00000e+00
     183 5.40000e+00 1.00000e+00 0.00000e+00
     184 5.60000e+00 1.00000e+00 0.00000e+00
     185 5.80000e+00 1.00000e+00 0.00000e+00
     186 6.00000e+00 1.00000e+00 0.00000e+00
part       1
MeshLabel_0
tria3
     300
       1       2      33
       1      33      32
       2       3      34
       2      34      33
       3       4      35
       3      35      34
       4       5      36
       4      36      35
       5       6      37
       5      37      36
       6       7      38
       6      38      37
       7       8      39
       7      39      38
       8       9      40
       8      40      39
       9      10      41
       9      41      40
      10      11      42
      10      42      41
      11      12      43
      11      43      42
      12      13      44
      12      44      43
      13      14      45
      13      45      44
      14      15      46
      14      46      45
      15      16      47
      15      47      46
      16      17      48
      16      48      47
      17      18      49
      17      49      48
      18      19      50
      18      50      49
      19      20      51
      19      51      50
      20      21      52
      20      52      51
      21      22      53
      21      53      52
      22      23      54
      22      54      53
      23      24      55
      23      55      54
      24      25      56
      24      56      55
      25      26      57
      25      57      56
      26      27      58
      26      58      57
      27      28      59
      27      59      58
      28      29      60
      28      60      59
      29      30      61
      29      61      60
      30      31      62
      30      62      61
      32      33      64
      32      64      63
      33      34      65
      33      65      64
      34      35      66
      34      66      65
      35      36      67
      35      67      66
      36      37      68
      36      68      67
      37      38      69
      37      69      68
      38      39      70
      38      70      69
      39      40      71
      39      71      70
      40      41      72
      40      72      71
      41      42      73
      41      73      72
      42      43      74
      42      74      73
      43      44      75
      43      75      74
      44      45      76
      44      76      75
      45      46      77
      45      77      76
      46      47      78
      46      78      77
      47      48      79
      47      79      78
      48      49      80
      48      80      79
      49      50      81
      49      81      80
      50      51      82
      50      82      81
      51      52      83
      51      83      82
      52      53      84
      52      84      83
      53      54      85
      53      85      84
      54      55      86
      54      86      85
      55      56      87
      55      87      86
      56      57      88
      56      88      87
      57      58      89
      57      89      88
      58      59      90
      58      90      89
      59      60      91
      59      91      90
      60      61      92
      60      92      91
      61      62      93
      61      93      92
      63      64      95
      63      95      94
      64      65      96
      64      96      95
      65      66      97
      65      97      96
      66      67      98
      66      98      97
      67      68      99
      67      99      98
      68      69     100
      68     100      99
      69      70     101
      69     101     100
      70      71     102
      70     102     101
      71      72     103
      71     103     102
      72      73     104
      72     104     103
      73      74     105
      73     105     104
      74      75     106
      74     106     105
      75      76     107
      75     107     106
      76      77     108
      76     108     107
      77      78     109
      77     109     108
      78      79     110
      78     110     109
      79      80     111
      79     111     110
      80      81     112
      80     112     111
      81      82     113
      81     113     112
      82      83     114
      82     114     113
      83      84     115
      83     115     114
      84      85     116
      84     116     115
      85      86     117
      85     117     116
      86      87     118
      86     118     117
      87      88     119
      87     119     118
      88      89     120
      88     120     119
      89      90     121
      89     121     120
      90      91     122
      90     122     121
      91      92     123
      91     123     122
      92      93     124
      92     124     123
      94      95     126
      94     126     125
      95      96     127
      95     127     126
      96      97     128
      96     128     127
      97      98     129
      97     129     128
      98      99     130
      98     130     129
      99     100     131
      99     131     130
     100     101     132
     100     132     131
     101     102     133
     101     133     132
     102     103     134
     102     134     133
     103     104     135
     103     135     134
     104     105     136
     104     136     135
     105     106     137
     105     137     136
     106     107     138
     106     138     137
     107     108     139
     107     139     138
     108     109     140
     108     140     139
     109     110     141
     109     141     140
     110     111     142
     110     142     141
     111     112     143
     111     143     142
     112     113     144
     112     144     143
     113     114     145
     113     145     144
     114     115     146
     114     146     145
     115     116     147
     115     147     146
     116     117     148
     116     148     147
     117     118     149
     117     149     148
     118     119     150
     118     150     149
     119     120     151
     119     151     150
     120     121     152
     120     152     151
     121     122     153
     121     153     152
     122     123     154
     122     154     153
     123     124     155
     123     155     154
     125     126     157
     125     157     156
     126     127     158
     126     158     157
     127     128     159
     127     159     158
     128     129     160
     128     160     159
     129     130     161
     129     161     160
     130     131     162
     130     162     161
     131     132     163
     131     163     162
     132     133     164
     132     164     163
     133     134     165
     133     165     164
     134     135     166
     134     166     165
     135     136     167
     135     167     166
     136     137     168
     136     168     167
     137     138     169
     137     169     168
     138     139     170
     138     170     169
     139     140     171
     139     171     170
     140     141     172
     140     172     171
     141     142     173
     141     173     172
     142     143     174
     142     174     173
     143     144     175
     143     175     174
     144     145     176
     144     176     175
     145     146     177
     145     177     176
     146     147     178
     146     178     177
     147     148     179
     147     179     178
     148     149     180
     148     180     179
     149     150     181
     149     181     180
     150     151     182
     150     182     181
     151     152     183
     151     183     182
     152     153     184
     152     184     183
     153     154     185
     153     185     184
     154     155     186
     154     186     185
part       2
MeshLabel_1
bar2
      30
       1       2
       2       3
       3       4
       4       5
       5       6
       6       7
       7       8
       8       9
       9      10
      10      11
      11      12
      12      13
      13      14
      14      15
      15      16
      16      17
      17      18
      18      19
      19      20
      20      21
      21      22
      22      23
      23      24
      24      25
      25      26
      26      27
      27      28
      28      29
      29      30
      30      31
part       3
MeshLabel_2
bar2
       5
      31      62
      62      93
      93     124
     124     155
     155     186
part       4
MeshLabel_3
bar2
      30
     157     156
     158     157
     159     158
     160     159
     161     160
     162     161
     163     162
     164     163
     165     164
     166     165
     167     166
     168     167
     169     168
     170     169
     171     170
     172     171
     173     172
     174     173
     175     174
     176     175
     177     176
     178     177
     179     178
     180     179
     181     180
     182     181
     183     182
     184     183
     185     184
     186     185
part       5
MeshLabel_4
bar2
       5
      32       1
      63      32
      94      63
     125      94
     156     125
