{
    "FOLDER_PARAMETERS": {
        "platform": "platform_name (not important)",
        "user": "username",
        "project_name": "project_name",
        "exp_name": "demo_experiment",
        "exp_folder": "lab_experiments_folder",
        "usedate": true,
        "automm": false
    },
    "ANALYSIS_SOFTWARE": {
        "module": "C:\\Users\\lifeware\\workspace\\MicroMator\\MicroMator\\ImageAnalysis\\numpy\\analysis_caller.py",
        "parameters": {
            "pixeldat": "mean",
            "background": 0.0
        }
    },
    "MICROFLUIDIC_PARAMETERS": false,
    "MICROMANAGER_PARAMETERS": {
        "mmconfig": "D:\\lifeware\\Documents\\InBio_gamma.cfg",
        "mmsimulator": "D:\\lifeware\\Documents\\simulator_bis.cfg",
        "micromanagerlocation": "C:\\Program Files\\Micro-Manager-2.0gamma_20190603",
        "imageJ": "D:\\lifeware\\Documents\\Fiji\\Fiji.app\\ImageJ-win64.exe",
        "brightfield": "BF",
        "config": "Acquisition",
        "dmdallpixel": false,
        "binning": false,
        "useAFC": true,
        "Simulation": false,
        "useZforpos": false,
        "complexeprotocol": false,
        "_comment": "XYStage ZDrive AutoFocus #double quotes are necessary .... mmversion can be gamma or beta",
        "mmversion": "gamma"
    },
    "EVENTS_PARAMETERS": {
        "creator": "..../demo_experiment/reach_fluorescence_value_event_creator.py"
    },
    "MODEL": false,
    "DISCORD": false
}