<?xml version="1.0" encoding="utf-8" standalone="no"?>
<!DOCTYPE svg PUBLIC "-//W3C//DTD SVG 1.1//EN"
  "http://www.w3.org/Graphics/SVG/1.1/DTD/svg11.dtd">
<!-- Created with matplotlib (https://matplotlib.org/) -->
<svg height="258.9975pt" version="1.1" viewBox="0 0 404.323437 258.9975" width="404.323437pt" xmlns="http://www.w3.org/2000/svg" xmlns:xlink="http://www.w3.org/1999/xlink">
 <metadata>
  <rdf:RDF xmlns:cc="http://creativecommons.org/ns#" xmlns:dc="http://purl.org/dc/elements/1.1/" xmlns:rdf="http://www.w3.org/1999/02/22-rdf-syntax-ns#">
   <cc:Work>
    <dc:type rdf:resource="http://purl.org/dc/dcmitype/StillImage"/>
    <dc:date>2021-06-10T14:02:03.500662</dc:date>
    <dc:format>image/svg+xml</dc:format>
    <dc:creator>
     <cc:Agent>
      <dc:title>Matplotlib v3.3.4, https://matplotlib.org/</dc:title>
     </cc:Agent>
    </dc:creator>
   </cc:Work>
  </rdf:RDF>
 </metadata>
 <defs>
  <style type="text/css">*{stroke-linecap:butt;stroke-linejoin:round;}</style>
 </defs>
 <g id="figure_1">
  <g id="patch_1">
   <path d="M 0 258.9975 
L 404.323437 258.9975 
L 404.323437 0 
L 0 0 
z
" style="fill:none;"/>
  </g>
  <g id="axes_1">
   <g id="patch_2">
    <path d="M 62.323438 229.905 
L 278.958732 229.905 
L 278.958732 12.465 
L 62.323438 12.465 
z
" style="fill:#ffffff;"/>
   </g>
   <g id="patch_3">
    <path clip-path="url(#p6d12c74946)" d="M 67.73932 227.773235 
L 111.066379 227.773235 
L 111.066379 227.498533 
L 67.73932 227.498533 
z
" style="fill:#808080;"/>
   </g>
   <g id="patch_4">
    <path clip-path="url(#p6d12c74946)" d="M 121.898143 227.773235 
L 165.225202 227.773235 
L 165.225202 227.710232 
L 121.898143 227.710232 
z
" style="fill:#808080;"/>
   </g>
   <g id="patch_5">
    <path clip-path="url(#p6d12c74946)" d="M 176.056967 227.773235 
L 219.384026 227.773235 
L 219.384026 227.707496 
L 176.056967 227.707496 
z
" style="fill:#808080;"/>
   </g>
   <g id="patch_6">
    <path clip-path="url(#p6d12c74946)" d="M 230.21579 227.773235 
L 273.542849 227.773235 
L 273.542849 15.237734 
L 230.21579 15.237734 
z
" style="fill:#24ccf2;"/>
   </g>
   <g id="matplotlib.axis_1">
    <g id="xtick_1">
     <g id="line2d_1">
      <path clip-path="url(#p6d12c74946)" d="M 89.402849 229.905 
L 89.402849 12.465 
" style="fill:none;stroke:#b0b0b0;stroke-linecap:square;stroke-width:0.8;"/>
     </g>
     <g id="line2d_2">
      <defs>
       <path d="M 0 0 
L 0 3.5 
" id="m3d5b2c5272" style="stroke:#000000;stroke-width:0.8;"/>
      </defs>
      <g>
       <use style="stroke:#000000;stroke-width:0.8;" x="89.402849" xlink:href="#m3d5b2c5272" y="229.905"/>
      </g>
     </g>
     <g id="text_1">
      <!-- 72h -->
      <g transform="translate(75.641599 248.6875)scale(0.16 -0.16)">
       <defs>
        <path d="M 6 71.828125 
L 53.125 71.828125 
L 53.125 64.65625 
L 20.703125 -1.8125 
L 9.125 3.8125 
L 36.078125 58.984375 
L 6 58.984375 
z
" id="CenturyGothic-Bold-55"/>
        <path d="M 17.4375 48.6875 
L 4.109375 48.6875 
Q 4.640625 60.296875 11.40625 66.96875 
Q 18.171875 73.640625 28.765625 73.640625 
Q 35.296875 73.640625 40.296875 70.875 
Q 45.3125 68.109375 48.3125 62.90625 
Q 51.3125 57.71875 51.3125 52.34375 
Q 51.3125 45.953125 47.671875 38.578125 
Q 44.046875 31.203125 34.375 21.140625 
L 26.3125 12.640625 
L 51.90625 12.640625 
L 51.90625 0 
L 2.15625 0 
L 2.15625 6.546875 
L 24.359375 29.203125 
Q 32.421875 37.359375 35.078125 42.3125 
Q 37.75 47.265625 37.75 51.265625 
Q 37.75 55.421875 34.984375 58.125 
Q 32.234375 60.84375 27.875 60.84375 
Q 23.484375 60.84375 20.546875 57.5625 
Q 17.625 54.296875 17.4375 48.6875 
z
" id="CenturyGothic-Bold-50"/>
        <path d="M 6.78125 73.640625 
L 20.015625 73.640625 
L 20.015625 47.75 
Q 23.921875 51.125 27.875 52.8125 
Q 31.84375 54.5 35.890625 54.5 
Q 43.796875 54.5 49.21875 49.03125 
Q 53.859375 44.28125 53.859375 35.109375 
L 53.859375 0 
L 40.71875 0 
L 40.71875 23.296875 
Q 40.71875 32.515625 39.84375 35.78125 
Q 38.96875 39.0625 36.84375 40.671875 
Q 34.71875 42.28125 31.59375 42.28125 
Q 27.546875 42.28125 24.640625 39.59375 
Q 21.734375 36.921875 20.609375 32.28125 
Q 20.015625 29.890625 20.015625 21.34375 
L 20.015625 0 
L 6.78125 0 
z
" id="CenturyGothic-Bold-104"/>
       </defs>
       <use xlink:href="#CenturyGothic-Bold-55"/>
       <use x="56.005859" xlink:href="#CenturyGothic-Bold-50"/>
       <use x="112.011719" xlink:href="#CenturyGothic-Bold-104"/>
      </g>
     </g>
    </g>
    <g id="xtick_2">
     <g id="line2d_3">
      <path clip-path="url(#p6d12c74946)" d="M 143.561673 229.905 
L 143.561673 12.465 
" style="fill:none;stroke:#b0b0b0;stroke-linecap:square;stroke-width:0.8;"/>
     </g>
     <g id="line2d_4">
      <g>
       <use style="stroke:#000000;stroke-width:0.8;" x="143.561673" xlink:href="#m3d5b2c5272" y="229.905"/>
      </g>
     </g>
     <g id="text_2">
      <!-- 24h -->
      <g transform="translate(129.800423 248.6875)scale(0.16 -0.16)">
       <defs>
        <path d="M 33.109375 73.640625 
L 46.78125 73.640625 
L 46.78125 27.390625 
L 53.171875 27.390625 
L 53.171875 14.75 
L 46.78125 14.75 
L 46.78125 0 
L 33.40625 0 
L 33.40625 14.75 
L 2.046875 14.75 
L 2.046875 27.390625 
z
M 33.40625 27.390625 
L 33.40625 51.46875 
L 17 27.390625 
z
" id="CenturyGothic-Bold-52"/>
       </defs>
       <use xlink:href="#CenturyGothic-Bold-50"/>
       <use x="56.005859" xlink:href="#CenturyGothic-Bold-52"/>
       <use x="112.011719" xlink:href="#CenturyGothic-Bold-104"/>
      </g>
     </g>
    </g>
    <g id="xtick_3">
     <g id="line2d_5">
      <path clip-path="url(#p6d12c74946)" d="M 197.720496 229.905 
L 197.720496 12.465 
" style="fill:none;stroke:#b0b0b0;stroke-linecap:square;stroke-width:0.8;"/>
     </g>
     <g id="line2d_6">
      <g>
       <use style="stroke:#000000;stroke-width:0.8;" x="197.720496" xlink:href="#m3d5b2c5272" y="229.905"/>
      </g>
     </g>
     <g id="text_3">
      <!-- 0h -->
      <g transform="translate(188.439246 248.6875)scale(0.16 -0.16)">
       <defs>
        <path d="M 27.78125 73.640625 
Q 35.640625 73.640625 41.328125 69.78125 
Q 47.015625 65.921875 50.109375 57.984375 
Q 53.21875 50.046875 53.21875 35.890625 
Q 53.21875 21.578125 50.0625 13.625 
Q 46.921875 5.671875 41.59375 1.921875 
Q 36.28125 -1.8125 28.171875 -1.8125 
Q 20.0625 -1.8125 14.546875 1.953125 
Q 9.03125 5.71875 5.90625 13.375 
Q 2.78125 21.046875 2.78125 35.203125 
Q 2.78125 54.984375 8.890625 63.875 
Q 15.671875 73.640625 27.78125 73.640625 
z
M 28.125 60.640625 
Q 24.65625 60.640625 21.96875 58.421875 
Q 19.28125 56.203125 17.859375 50.78125 
Q 16.453125 45.359375 16.453125 34.90625 
Q 16.453125 21.296875 19.703125 16.09375 
Q 22.953125 10.890625 28.125 10.890625 
Q 33.109375 10.890625 36.03125 15.828125 
Q 39.59375 21.78125 39.59375 35.75 
Q 39.59375 49.90625 36.390625 55.265625 
Q 33.203125 60.640625 28.125 60.640625 
z
" id="CenturyGothic-Bold-48"/>
       </defs>
       <use xlink:href="#CenturyGothic-Bold-48"/>
       <use x="56.005859" xlink:href="#CenturyGothic-Bold-104"/>
      </g>
     </g>
    </g>
    <g id="xtick_4">
     <g id="line2d_7">
      <path clip-path="url(#p6d12c74946)" d="M 251.87932 229.905 
L 251.87932 12.465 
" style="fill:none;stroke:#b0b0b0;stroke-linecap:square;stroke-width:0.8;"/>
     </g>
     <g id="line2d_8">
      <g>
       <use style="stroke:#000000;stroke-width:0.8;" x="251.87932" xlink:href="#m3d5b2c5272" y="229.905"/>
      </g>
     </g>
     <g id="text_4">
      <!-- 4h -->
      <g transform="translate(242.59807 248.6875)scale(0.16 -0.16)">
       <use xlink:href="#CenturyGothic-Bold-52"/>
       <use x="56.005859" xlink:href="#CenturyGothic-Bold-104"/>
      </g>
     </g>
    </g>
   </g>
   <g id="matplotlib.axis_2">
    <g id="ytick_1">
     <g id="line2d_9">
      <path clip-path="url(#p6d12c74946)" d="M 62.323438 227.773235 
L 278.958732 227.773235 
" style="fill:none;stroke:#b0b0b0;stroke-linecap:square;stroke-width:0.8;"/>
     </g>
     <g id="line2d_10">
      <defs>
       <path d="M 0 0 
L -3.5 0 
" id="me136df419c" style="stroke:#000000;stroke-width:0.8;"/>
      </defs>
      <g>
       <use style="stroke:#000000;stroke-width:0.8;" x="62.323438" xlink:href="#me136df419c" y="227.773235"/>
      </g>
     </g>
     <g id="text_5">
      <!-- 0 -->
      <g transform="translate(46.363438 233.664485)scale(0.16 -0.16)">
       <use xlink:href="#CenturyGothic-Bold-48"/>
      </g>
     </g>
    </g>
    <g id="ytick_2">
     <g id="line2d_11">
      <path clip-path="url(#p6d12c74946)" d="M 62.323438 174.479118 
L 278.958732 174.479118 
" style="fill:none;stroke:#b0b0b0;stroke-linecap:square;stroke-width:0.8;"/>
     </g>
     <g id="line2d_12">
      <g>
       <use style="stroke:#000000;stroke-width:0.8;" x="62.323438" xlink:href="#me136df419c" y="174.479118"/>
      </g>
     </g>
     <g id="text_6">
      <!-- 25 -->
      <g transform="translate(37.403438 180.370368)scale(0.16 -0.16)">
       <defs>
        <path d="M 16.703125 71.828125 
L 50.34375 71.828125 
L 50.34375 59.234375 
L 26.90625 59.234375 
L 23.96875 46.140625 
Q 25.203125 46.484375 26.375 46.65625 
Q 27.546875 46.828125 28.609375 46.828125 
Q 38.375 46.828125 44.84375 40.15625 
Q 51.3125 33.5 51.3125 23.09375 
Q 51.3125 12.59375 44.15625 5.390625 
Q 37.015625 -1.8125 26.765625 -1.8125 
Q 17.578125 -1.8125 10.984375 3.40625 
Q 4.390625 8.640625 2.34375 17.71875 
L 16.703125 17.71875 
Q 18.359375 14.359375 21.0625 12.625 
Q 23.78125 10.890625 27.046875 10.890625 
Q 31.59375 10.890625 34.765625 14.15625 
Q 37.9375 17.4375 37.9375 22.5625 
Q 37.9375 27.546875 34.984375 30.734375 
Q 32.03125 33.9375 27.828125 33.9375 
Q 25.59375 33.9375 23.40625 32.8125 
Q 21.234375 31.6875 19.140625 29.4375 
L 8.015625 31.9375 
z
" id="CenturyGothic-Bold-53"/>
       </defs>
       <use xlink:href="#CenturyGothic-Bold-50"/>
       <use x="56.005859" xlink:href="#CenturyGothic-Bold-53"/>
      </g>
     </g>
    </g>
    <g id="ytick_3">
     <g id="line2d_13">
      <path clip-path="url(#p6d12c74946)" d="M 62.323438 121.185 
L 278.958732 121.185 
" style="fill:none;stroke:#b0b0b0;stroke-linecap:square;stroke-width:0.8;"/>
     </g>
     <g id="line2d_14">
      <g>
       <use style="stroke:#000000;stroke-width:0.8;" x="62.323438" xlink:href="#me136df419c" y="121.185"/>
      </g>
     </g>
     <g id="text_7">
      <!-- 50 -->
      <g transform="translate(37.403438 127.07625)scale(0.16 -0.16)">
       <use xlink:href="#CenturyGothic-Bold-53"/>
       <use x="56.005859" xlink:href="#CenturyGothic-Bold-48"/>
      </g>
     </g>
    </g>
    <g id="ytick_4">
     <g id="line2d_15">
      <path clip-path="url(#p6d12c74946)" d="M 62.323438 67.890882 
L 278.958732 67.890882 
" style="fill:none;stroke:#b0b0b0;stroke-linecap:square;stroke-width:0.8;"/>
     </g>
     <g id="line2d_16">
      <g>
       <use style="stroke:#000000;stroke-width:0.8;" x="62.323438" xlink:href="#me136df419c" y="67.890882"/>
      </g>
     </g>
     <g id="text_8">
      <!-- 75 -->
      <g transform="translate(37.403438 73.782132)scale(0.16 -0.16)">
       <use xlink:href="#CenturyGothic-Bold-55"/>
       <use x="56.005859" xlink:href="#CenturyGothic-Bold-53"/>
      </g>
     </g>
    </g>
    <g id="ytick_5">
     <g id="line2d_17">
      <path clip-path="url(#p6d12c74946)" d="M 62.323438 14.596765 
L 278.958732 14.596765 
" style="fill:none;stroke:#b0b0b0;stroke-linecap:square;stroke-width:0.8;"/>
     </g>
     <g id="line2d_18">
      <g>
       <use style="stroke:#000000;stroke-width:0.8;" x="62.323438" xlink:href="#me136df419c" y="14.596765"/>
      </g>
     </g>
     <g id="text_9">
      <!-- 100 -->
      <g transform="translate(28.443438 20.488015)scale(0.16 -0.16)">
       <defs>
        <path d="M 16.453125 71.828125 
L 36.921875 71.828125 
L 36.921875 0 
L 23.34375 0 
L 23.34375 58.984375 
L 8.546875 58.984375 
z
" id="CenturyGothic-Bold-49"/>
       </defs>
       <use xlink:href="#CenturyGothic-Bold-49"/>
       <use x="56.005859" xlink:href="#CenturyGothic-Bold-48"/>
       <use x="112.011719" xlink:href="#CenturyGothic-Bold-48"/>
      </g>
     </g>
    </g>
    <g id="text_10">
     <!-- Differentiated Fraction (%) -->
     <g transform="translate(20.7 235.17)rotate(-90)scale(0.18 -0.18)">
      <defs>
       <path d="M 8.734375 0 
L 8.734375 71.828125 
L 23.640625 71.828125 
Q 39.75 71.828125 47.015625 69.234375 
Q 57.46875 65.578125 63.34375 56.546875 
Q 69.234375 47.515625 69.234375 35.015625 
Q 69.234375 24.21875 64.5625 16.015625 
Q 59.90625 7.8125 52.453125 3.90625 
Q 45.015625 0 31.59375 0 
z
M 15.625 6.78125 
L 23.921875 6.78125 
Q 38.8125 6.78125 44.578125 8.640625 
Q 52.6875 11.28125 57.328125 18.140625 
Q 61.96875 25 61.96875 34.90625 
Q 61.96875 45.3125 56.9375 52.6875 
Q 51.90625 60.0625 42.921875 62.796875 
Q 36.1875 64.84375 20.703125 64.84375 
L 15.625 64.84375 
z
" id="CenturyGothic-68"/>
       <path d="M 10.015625 75 
Q 12.359375 75 14.015625 73.34375 
Q 15.671875 71.6875 15.671875 69.34375 
Q 15.671875 67.046875 14.015625 65.375 
Q 12.359375 63.71875 10.015625 63.71875 
Q 7.71875 63.71875 6.046875 65.375 
Q 4.390625 67.046875 4.390625 69.34375 
Q 4.390625 71.6875 6.046875 73.34375 
Q 7.71875 75 10.015625 75 
z
M 6.59375 53.125 
L 13.484375 53.125 
L 13.484375 0 
L 6.59375 0 
z
" id="CenturyGothic-105"/>
       <path d="M 29.5 73.640625 
L 29.5 66.9375 
Q 25.734375 68.5625 23.046875 68.5625 
Q 21.046875 68.5625 19.71875 67.75 
Q 18.40625 66.9375 18.0625 65.890625 
Q 17.71875 64.84375 17.71875 60.296875 
L 17.71875 53.125 
L 28.8125 53.125 
L 28.8125 47.265625 
L 17.671875 47.265625 
L 17.671875 0 
L 10.84375 0 
L 10.84375 47.265625 
L 3.859375 47.265625 
L 3.859375 53.125 
L 10.84375 53.125 
L 10.84375 61.421875 
Q 10.84375 67.140625 11.890625 69.578125 
Q 12.9375 72.015625 15.453125 73.5 
Q 17.96875 75 21.53125 75 
Q 24.859375 75 29.5 73.640625 
z
" id="CenturyGothic-102"/>
       <path d="M 52.34375 17.625 
L 58.109375 14.59375 
Q 55.28125 9.03125 51.5625 5.609375 
Q 47.859375 2.203125 43.21875 0.40625 
Q 38.578125 -1.375 32.71875 -1.375 
Q 19.734375 -1.375 12.40625 7.140625 
Q 5.078125 15.671875 5.078125 26.421875 
Q 5.078125 36.53125 11.28125 44.4375 
Q 19.140625 54.5 32.328125 54.5 
Q 45.90625 54.5 54 44.1875 
Q 59.765625 36.921875 59.859375 26.03125 
L 12.109375 26.03125 
Q 12.3125 16.75 18.015625 10.8125 
Q 23.734375 4.890625 32.125 4.890625 
Q 36.1875 4.890625 40.015625 6.296875 
Q 43.84375 7.71875 46.53125 10.0625 
Q 49.21875 12.40625 52.34375 17.625 
z
M 52.34375 31.9375 
Q 50.984375 37.40625 48.359375 40.671875 
Q 45.75 43.953125 41.453125 45.953125 
Q 37.15625 47.953125 32.421875 47.953125 
Q 24.609375 47.953125 19 42.921875 
Q 14.890625 39.265625 12.796875 31.9375 
z
" id="CenturyGothic-101"/>
       <path d="M 5.03125 53.125 
L 12.015625 53.125 
L 12.015625 45.359375 
Q 15.140625 49.953125 18.609375 52.21875 
Q 22.078125 54.5 25.828125 54.5 
Q 28.65625 54.5 31.890625 52.6875 
L 28.328125 46.921875 
Q 26.171875 47.859375 24.703125 47.859375 
Q 21.296875 47.859375 18.109375 45.046875 
Q 14.9375 42.234375 13.28125 36.328125 
Q 12.015625 31.78125 12.015625 17.96875 
L 12.015625 0 
L 5.03125 0 
z
" id="CenturyGothic-114"/>
       <path d="M 7.625 53.125 
L 14.453125 53.125 
L 14.453125 43.609375 
Q 18.5625 49.078125 23.53125 51.78125 
Q 28.515625 54.5 34.375 54.5 
Q 40.328125 54.5 44.9375 51.46875 
Q 49.5625 48.4375 51.75 43.3125 
Q 53.953125 38.1875 53.953125 27.34375 
L 53.953125 0 
L 47.171875 0 
L 47.171875 25.34375 
Q 47.171875 34.515625 46.390625 37.59375 
Q 45.171875 42.875 41.796875 45.53125 
Q 38.421875 48.1875 33.015625 48.1875 
Q 26.8125 48.1875 21.90625 44.078125 
Q 17 39.984375 15.4375 33.9375 
Q 14.453125 29.984375 14.453125 19.484375 
L 14.453125 0 
L 7.625 0 
z
" id="CenturyGothic-110"/>
       <path d="M 13.578125 72.859375 
L 20.453125 72.859375 
L 20.453125 53.125 
L 31.296875 53.125 
L 31.296875 47.265625 
L 20.453125 47.265625 
L 20.453125 0 
L 13.578125 0 
L 13.578125 47.265625 
L 4.25 47.265625 
L 4.25 53.125 
L 13.578125 53.125 
z
" id="CenturyGothic-116"/>
       <path d="M 60.546875 53.125 
L 60.546875 0 
L 53.8125 0 
L 53.8125 9.125 
Q 49.515625 3.90625 44.15625 1.265625 
Q 38.8125 -1.375 32.46875 -1.375 
Q 21.1875 -1.375 13.203125 6.796875 
Q 5.21875 14.984375 5.21875 26.703125 
Q 5.21875 38.1875 13.28125 46.34375 
Q 21.34375 54.5 32.671875 54.5 
Q 39.203125 54.5 44.5 51.703125 
Q 49.8125 48.921875 53.8125 43.359375 
L 53.8125 53.125 
z
M 33.203125 47.90625 
Q 27.484375 47.90625 22.65625 45.09375 
Q 17.828125 42.28125 14.96875 37.203125 
Q 12.109375 32.125 12.109375 26.46875 
Q 12.109375 20.84375 14.984375 15.71875 
Q 17.875 10.59375 22.734375 7.734375 
Q 27.59375 4.890625 33.15625 4.890625 
Q 38.765625 4.890625 43.796875 7.71875 
Q 48.828125 10.546875 51.53125 15.375 
Q 54.25 20.21875 54.25 26.265625 
Q 54.25 35.5 48.171875 41.703125 
Q 42.09375 47.90625 33.203125 47.90625 
z
" id="CenturyGothic-97"/>
       <path d="M 60.640625 73.640625 
L 60.640625 0 
L 53.90625 0 
L 53.90625 9.125 
Q 49.609375 3.90625 44.265625 1.265625 
Q 38.921875 -1.375 32.5625 -1.375 
Q 21.296875 -1.375 13.3125 6.796875 
Q 5.328125 14.984375 5.328125 26.703125 
Q 5.328125 38.1875 13.375 46.34375 
Q 21.4375 54.5 32.765625 54.5 
Q 39.3125 54.5 44.609375 51.703125 
Q 49.90625 48.921875 53.90625 43.359375 
L 53.90625 73.640625 
z
M 33.296875 47.90625 
Q 27.59375 47.90625 22.75 45.09375 
Q 17.921875 42.28125 15.0625 37.203125 
Q 12.203125 32.125 12.203125 26.46875 
Q 12.203125 20.84375 15.078125 15.71875 
Q 17.96875 10.59375 22.828125 7.734375 
Q 27.6875 4.890625 33.25 4.890625 
Q 38.875 4.890625 43.890625 7.71875 
Q 48.921875 10.546875 51.625 15.375 
Q 54.34375 20.21875 54.34375 26.265625 
Q 54.34375 35.5 48.265625 41.703125 
Q 42.1875 47.90625 33.296875 47.90625 
z
" id="CenturyGothic-100"/>
       <path id="CenturyGothic-32"/>
       <path d="M 8.734375 71.828125 
L 44.734375 71.828125 
L 44.734375 64.75 
L 15.875 64.75 
L 15.875 42.28125 
L 44.734375 42.28125 
L 44.734375 35.203125 
L 15.875 35.203125 
L 15.875 0 
L 8.734375 0 
z
" id="CenturyGothic-70"/>
       <path d="M 59.1875 42.09375 
L 53.765625 38.71875 
Q 46.734375 48.046875 34.578125 48.046875 
Q 24.859375 48.046875 18.4375 41.796875 
Q 12.015625 35.546875 12.015625 26.609375 
Q 12.015625 20.796875 14.96875 15.671875 
Q 17.921875 10.546875 23.0625 7.71875 
Q 28.21875 4.890625 34.625 4.890625 
Q 46.34375 4.890625 53.765625 14.203125 
L 59.1875 10.640625 
Q 55.375 4.9375 48.953125 1.78125 
Q 42.53125 -1.375 34.328125 -1.375 
Q 21.734375 -1.375 13.421875 6.640625 
Q 5.125 14.65625 5.125 26.125 
Q 5.125 33.84375 9 40.453125 
Q 12.890625 47.078125 19.671875 50.78125 
Q 26.46875 54.5 34.859375 54.5 
Q 40.140625 54.5 45.046875 52.875 
Q 49.953125 51.265625 53.359375 48.671875 
Q 56.78125 46.09375 59.1875 42.09375 
z
" id="CenturyGothic-99"/>
       <path d="M 32.765625 54.5 
Q 45.015625 54.5 53.078125 45.609375 
Q 60.40625 37.5 60.40625 26.421875 
Q 60.40625 15.28125 52.65625 6.953125 
Q 44.921875 -1.375 32.765625 -1.375 
Q 20.5625 -1.375 12.8125 6.953125 
Q 5.078125 15.28125 5.078125 26.421875 
Q 5.078125 37.453125 12.40625 45.5625 
Q 20.453125 54.5 32.765625 54.5 
z
M 32.765625 47.796875 
Q 24.265625 47.796875 18.15625 41.5 
Q 12.0625 35.203125 12.0625 26.265625 
Q 12.0625 20.515625 14.84375 15.53125 
Q 17.625 10.546875 22.359375 7.828125 
Q 27.09375 5.125 32.765625 5.125 
Q 38.421875 5.125 43.15625 7.828125 
Q 47.90625 10.546875 50.6875 15.53125 
Q 53.46875 20.515625 53.46875 26.265625 
Q 53.46875 35.203125 47.34375 41.5 
Q 41.21875 47.796875 32.765625 47.796875 
z
" id="CenturyGothic-111"/>
       <path d="M 22.953125 75 
L 30.859375 75 
Q 26.078125 65.1875 23.1875 52.09375 
Q 20.3125 39.015625 20.3125 25.09375 
Q 20.3125 12.203125 22.484375 0.234375 
Q 24.65625 -11.71875 28.46875 -20.796875 
L 20.953125 -20.796875 
Q 17.328125 -12.109375 15.171875 -0.34375 
Q 13.03125 11.421875 13.03125 24.171875 
Q 13.03125 37.890625 15.5625 50.90625 
Q 18.109375 63.921875 22.953125 75 
z
" id="CenturyGothic-40"/>
       <path d="M 67.4375 75 
L 15.09375 -4.984375 
L 8.640625 -4.984375 
L 56.25 67.875 
Q 47.796875 65.828125 35.640625 65.828125 
L 33.015625 65.875 
Q 36.03125 61.671875 36.03125 56.984375 
Q 36.03125 50.296875 31.359375 45.015625 
Q 26.703125 39.75 19 39.75 
Q 11.921875 39.75 7.078125 44.65625 
Q 2.25 49.5625 2.25 56.59375 
Q 2.25 61.28125 4.4375 65.109375 
Q 6.640625 68.953125 10.6875 71.296875 
Q 14.75 73.640625 19 73.640625 
Q 20.796875 73.640625 24.953125 72.75 
Q 31.296875 71.390625 38.71875 71.390625 
Q 44.1875 71.390625 49.046875 72.09375 
Q 53.90625 72.796875 61.671875 75 
z
M 19.140625 67.4375 
Q 14.703125 67.4375 11.578125 64.28125 
Q 8.453125 61.140625 8.453125 56.6875 
Q 8.453125 52.25 11.578125 49.125 
Q 14.703125 46 19.140625 46 
Q 23.578125 46 26.734375 49.125 
Q 29.890625 52.25 29.890625 56.6875 
Q 29.890625 61.140625 26.734375 64.28125 
Q 23.578125 67.4375 19.140625 67.4375 
z
M 58.34375 31.6875 
Q 65.328125 31.6875 70.28125 26.734375 
Q 75.25 21.78125 75.25 14.796875 
Q 75.25 7.8125 70.28125 2.859375 
Q 65.328125 -2.09375 58.34375 -2.09375 
Q 51.375 -2.09375 46.40625 2.859375 
Q 41.453125 7.8125 41.453125 14.796875 
Q 41.453125 21.78125 46.40625 26.734375 
Q 51.375 31.6875 58.34375 31.6875 
z
M 58.34375 25.484375 
Q 53.90625 25.484375 50.78125 22.359375 
Q 47.65625 19.234375 47.65625 14.796875 
Q 47.65625 10.359375 50.78125 7.234375 
Q 53.90625 4.109375 58.34375 4.109375 
Q 62.796875 4.109375 65.9375 7.234375 
Q 69.09375 10.359375 69.09375 14.796875 
Q 69.09375 19.234375 65.9375 22.359375 
Q 62.796875 25.484375 58.34375 25.484375 
z
" id="CenturyGothic-37"/>
       <path d="M 13.96875 -20.796875 
L 6.0625 -20.796875 
Q 10.890625 -10.984375 13.75 2.09375 
Q 16.609375 15.1875 16.609375 29.109375 
Q 16.609375 42 14.421875 53.953125 
Q 12.25 65.921875 8.453125 75 
L 15.96875 75 
Q 19.625 66.3125 21.75 54.515625 
Q 23.875 42.71875 23.875 29.984375 
Q 23.875 16.3125 21.328125 3.296875 
Q 18.796875 -9.71875 13.96875 -20.796875 
z
" id="CenturyGothic-41"/>
      </defs>
      <use xlink:href="#CenturyGothic-68"/>
      <use x="74.414062" xlink:href="#CenturyGothic-105"/>
      <use x="94.433594" xlink:href="#CenturyGothic-102"/>
      <use x="125.830078" xlink:href="#CenturyGothic-102"/>
      <use x="157.226562" xlink:href="#CenturyGothic-101"/>
      <use x="222.216797" xlink:href="#CenturyGothic-114"/>
      <use x="252.294922" xlink:href="#CenturyGothic-101"/>
      <use x="317.285156" xlink:href="#CenturyGothic-110"/>
      <use x="378.271484" xlink:href="#CenturyGothic-116"/>
      <use x="412.158203" xlink:href="#CenturyGothic-105"/>
      <use x="432.177734" xlink:href="#CenturyGothic-97"/>
      <use x="500.488281" xlink:href="#CenturyGothic-116"/>
      <use x="534.375" xlink:href="#CenturyGothic-101"/>
      <use x="599.365234" xlink:href="#CenturyGothic-100"/>
      <use x="667.871094" xlink:href="#CenturyGothic-32"/>
      <use x="695.556641" xlink:href="#CenturyGothic-70"/>
      <use x="744.042969" xlink:href="#CenturyGothic-114"/>
      <use x="774.121094" xlink:href="#CenturyGothic-97"/>
      <use x="842.431641" xlink:href="#CenturyGothic-99"/>
      <use x="907.128906" xlink:href="#CenturyGothic-116"/>
      <use x="941.015625" xlink:href="#CenturyGothic-105"/>
      <use x="961.035156" xlink:href="#CenturyGothic-111"/>
      <use x="1026.513672" xlink:href="#CenturyGothic-110"/>
      <use x="1087.5" xlink:href="#CenturyGothic-32"/>
      <use x="1115.185547" xlink:href="#CenturyGothic-40"/>
      <use x="1152.099609" xlink:href="#CenturyGothic-37"/>
      <use x="1229.589844" xlink:href="#CenturyGothic-41"/>
     </g>
    </g>
   </g>
   <g id="LineCollection_1">
    <path clip-path="url(#p6d12c74946)" d="M 89.402849 227.543757 
L 89.402849 227.453309 
" style="fill:none;stroke:#000000;stroke-width:1.5;"/>
   </g>
   <g id="LineCollection_2">
    <path clip-path="url(#p6d12c74946)" d="M 143.561673 227.724105 
L 143.561673 227.69636 
" style="fill:none;stroke:#000000;stroke-width:1.5;"/>
   </g>
   <g id="LineCollection_3">
    <path clip-path="url(#p6d12c74946)" d="M 197.720496 227.745157 
L 197.720496 227.669836 
" style="fill:none;stroke:#000000;stroke-width:1.5;"/>
   </g>
   <g id="LineCollection_4">
    <path clip-path="url(#p6d12c74946)" d="M 251.87932 15.369109 
L 251.87932 15.10636 
" style="fill:none;stroke:#000000;stroke-width:1.5;"/>
   </g>
   <g id="line2d_19">
    <defs>
     <path d="M 20 0 
L -20 -0 
" id="me49f74d047" style="stroke:#000000;"/>
    </defs>
    <g clip-path="url(#p6d12c74946)">
     <use style="stroke:#000000;" x="89.402849" xlink:href="#me49f74d047" y="227.543757"/>
    </g>
   </g>
   <g id="line2d_20">
    <g clip-path="url(#p6d12c74946)">
     <use style="stroke:#000000;" x="89.402849" xlink:href="#me49f74d047" y="227.453309"/>
    </g>
   </g>
   <g id="line2d_21">
    <g clip-path="url(#p6d12c74946)">
     <use style="stroke:#000000;" x="143.561673" xlink:href="#me49f74d047" y="227.724105"/>
    </g>
   </g>
   <g id="line2d_22">
    <g clip-path="url(#p6d12c74946)">
     <use style="stroke:#000000;" x="143.561673" xlink:href="#me49f74d047" y="227.69636"/>
    </g>
   </g>
   <g id="line2d_23">
    <g clip-path="url(#p6d12c74946)">
     <use style="stroke:#000000;" x="197.720496" xlink:href="#me49f74d047" y="227.745157"/>
    </g>
   </g>
   <g id="line2d_24">
    <g clip-path="url(#p6d12c74946)">
     <use style="stroke:#000000;" x="197.720496" xlink:href="#me49f74d047" y="227.669836"/>
    </g>
   </g>
   <g id="line2d_25">
    <g clip-path="url(#p6d12c74946)">
     <use style="stroke:#000000;" x="251.87932" xlink:href="#me49f74d047" y="15.369109"/>
    </g>
   </g>
   <g id="line2d_26">
    <g clip-path="url(#p6d12c74946)">
     <use style="stroke:#000000;" x="251.87932" xlink:href="#me49f74d047" y="15.10636"/>
    </g>
   </g>
   <g id="patch_7">
    <path d="M 62.323438 229.905 
L 62.323438 12.465 
" style="fill:none;stroke:#000000;stroke-linecap:square;stroke-linejoin:miter;stroke-width:0.8;"/>
   </g>
   <g id="patch_8">
    <path d="M 278.958732 229.905 
L 278.958732 12.465 
" style="fill:none;stroke:#000000;stroke-linecap:square;stroke-linejoin:miter;stroke-width:0.8;"/>
   </g>
   <g id="patch_9">
    <path d="M 62.323438 229.905 
L 278.958732 229.905 
" style="fill:none;stroke:#000000;stroke-linecap:square;stroke-linejoin:miter;stroke-width:0.8;"/>
   </g>
   <g id="patch_10">
    <path d="M 62.323438 12.465 
L 278.958732 12.465 
" style="fill:none;stroke:#000000;stroke-linecap:square;stroke-linejoin:miter;stroke-width:0.8;"/>
   </g>
  </g>
  <g id="axes_2">
   <g id="patch_11">
    <path d="M 332.414194 212.961623 
L 397.123437 212.961623 
L 397.123437 148.012013 
L 332.414194 148.012013 
z
" style="fill:#ffffff;"/>
   </g>
   <g id="patch_12">
    <path clip-path="url(#p83b8d3b106)" d="M 377.710664 210.463561 
L 394.966463 210.463561 
L 394.966463 202.760096 
L 377.710664 202.760096 
z
" style="fill:#808080;"/>
   </g>
   <g id="patch_13">
    <path clip-path="url(#p83b8d3b106)" d="M 334.571169 210.463561 
L 351.826967 210.463561 
L 351.826967 178.273165 
L 334.571169 178.273165 
z
" style="fill:#808080;"/>
   </g>
   <g id="patch_14">
    <path clip-path="url(#p83b8d3b106)" d="M 356.140916 210.463561 
L 373.396715 210.463561 
L 373.396715 203.080715 
L 356.140916 203.080715 
z
" style="fill:#808080;"/>
   </g>
   <g id="patch_15">
    <path clip-path="url(#p83b8d3b106)" d="M 399.280412 210.463561 
L 416.536211 210.463561 
L 416.536211 -24695.045204 
L 399.280412 -24695.045204 
z
" style="fill:#24ccf2;"/>
   </g>
   <g id="matplotlib.axis_3">
    <g id="xtick_5">
     <g id="line2d_27">
      <path clip-path="url(#p83b8d3b106)" d="M 343.199068 212.961623 
L 343.199068 148.012013 
" style="fill:none;stroke:#b0b0b0;stroke-linecap:square;stroke-width:0.8;"/>
     </g>
     <g id="line2d_28">
      <g>
       <use style="stroke:#000000;stroke-width:0.8;" x="343.199068" xlink:href="#m3d5b2c5272" y="212.961623"/>
      </g>
     </g>
     <g id="text_11">
      <!-- 72h -->
      <g transform="translate(332.87813 228.798498)scale(0.12 -0.12)">
       <use xlink:href="#CenturyGothic-Bold-55"/>
       <use x="56.005859" xlink:href="#CenturyGothic-Bold-50"/>
       <use x="112.011719" xlink:href="#CenturyGothic-Bold-104"/>
      </g>
     </g>
    </g>
    <g id="xtick_6">
     <g id="line2d_29">
      <path clip-path="url(#p83b8d3b106)" d="M 364.768816 212.961623 
L 364.768816 148.012013 
" style="fill:none;stroke:#b0b0b0;stroke-linecap:square;stroke-width:0.8;"/>
     </g>
     <g id="line2d_30">
      <g>
       <use style="stroke:#000000;stroke-width:0.8;" x="364.768816" xlink:href="#m3d5b2c5272" y="212.961623"/>
      </g>
     </g>
     <g id="text_12">
      <!-- 24h -->
      <g transform="translate(354.447878 228.798498)scale(0.12 -0.12)">
       <use xlink:href="#CenturyGothic-Bold-50"/>
       <use x="56.005859" xlink:href="#CenturyGothic-Bold-52"/>
       <use x="112.011719" xlink:href="#CenturyGothic-Bold-104"/>
      </g>
     </g>
    </g>
    <g id="xtick_7">
     <g id="line2d_31">
      <path clip-path="url(#p83b8d3b106)" d="M 386.338564 212.961623 
L 386.338564 148.012013 
" style="fill:none;stroke:#b0b0b0;stroke-linecap:square;stroke-width:0.8;"/>
     </g>
     <g id="line2d_32">
      <g>
       <use style="stroke:#000000;stroke-width:0.8;" x="386.338564" xlink:href="#m3d5b2c5272" y="212.961623"/>
      </g>
     </g>
     <g id="text_13">
      <!-- 0h -->
      <g transform="translate(379.377626 228.798498)scale(0.12 -0.12)">
       <use xlink:href="#CenturyGothic-Bold-48"/>
       <use x="56.005859" xlink:href="#CenturyGothic-Bold-104"/>
      </g>
     </g>
    </g>
   </g>
   <g id="matplotlib.axis_4">
    <g id="ytick_6">
     <g id="line2d_33">
      <path clip-path="url(#p83b8d3b106)" d="M 332.414194 210.463561 
L 397.123437 210.463561 
" style="fill:none;stroke:#b0b0b0;stroke-linecap:square;stroke-width:0.8;"/>
     </g>
     <g id="line2d_34">
      <g>
       <use style="stroke:#000000;stroke-width:0.8;" x="332.414194" xlink:href="#me136df419c" y="210.463561"/>
      </g>
     </g>
     <g id="text_14">
      <!-- 0.003 -->
      <g transform="translate(287.616538 215.986608)scale(0.15 -0.15)">
       <defs>
        <path d="M 14.015625 13.921875 
Q 17.1875 13.921875 19.4375 11.6875 
Q 21.6875 9.46875 21.6875 6.296875 
Q 21.6875 3.125 19.4375 0.875 
Q 17.1875 -1.375 14.015625 -1.375 
Q 10.84375 -1.375 8.59375 0.875 
Q 6.34375 3.125 6.34375 6.296875 
Q 6.34375 9.46875 8.59375 11.6875 
Q 10.84375 13.921875 14.015625 13.921875 
z
" id="CenturyGothic-Bold-46"/>
        <path d="M 19 54.109375 
L 5.859375 54.109375 
Q 6.890625 62.0625 11.578125 66.890625 
Q 18.109375 73.640625 28.03125 73.640625 
Q 36.859375 73.640625 42.84375 68.015625 
Q 48.828125 62.40625 48.828125 54.6875 
Q 48.828125 49.90625 46.21875 45.953125 
Q 43.609375 42 38.625 39.546875 
Q 45.171875 37.59375 48.859375 32.734375 
Q 52.546875 27.875 52.546875 21.296875 
Q 52.546875 11.625 45.40625 4.90625 
Q 38.28125 -1.8125 27.25 -1.8125 
Q 16.796875 -1.8125 10.203125 4.515625 
Q 3.609375 10.84375 2.984375 21.734375 
L 16.5 21.734375 
Q 17.390625 16.15625 20.390625 13.453125 
Q 23.390625 10.75 27.984375 10.75 
Q 32.765625 10.75 35.90625 13.8125 
Q 39.0625 16.890625 39.0625 21.34375 
Q 39.0625 26.21875 34.8125 29.578125 
Q 30.5625 32.953125 22.5625 33.0625 
L 22.5625 44.78125 
Q 27.484375 45.171875 29.90625 46.3125 
Q 32.328125 47.46875 33.671875 49.46875 
Q 35.015625 51.46875 35.015625 53.71875 
Q 35.015625 56.640625 32.953125 58.5625 
Q 30.90625 60.5 27.59375 60.5 
Q 24.65625 60.5 22.265625 58.71875 
Q 19.875 56.9375 19 54.109375 
z
" id="CenturyGothic-Bold-51"/>
       </defs>
       <use xlink:href="#CenturyGothic-Bold-48"/>
       <use x="56.005859" xlink:href="#CenturyGothic-Bold-46"/>
       <use x="83.984375" xlink:href="#CenturyGothic-Bold-48"/>
       <use x="139.990234" xlink:href="#CenturyGothic-Bold-48"/>
       <use x="195.996094" xlink:href="#CenturyGothic-Bold-51"/>
      </g>
     </g>
    </g>
    <g id="ytick_7">
     <g id="line2d_35">
      <path clip-path="url(#p83b8d3b106)" d="M 332.414194 197.973252 
L 397.123437 197.973252 
" style="fill:none;stroke:#b0b0b0;stroke-linecap:square;stroke-width:0.8;"/>
     </g>
     <g id="line2d_36">
      <g>
       <use style="stroke:#000000;stroke-width:0.8;" x="332.414194" xlink:href="#me136df419c" y="197.973252"/>
      </g>
     </g>
    </g>
    <g id="ytick_8">
     <g id="line2d_37">
      <path clip-path="url(#p83b8d3b106)" d="M 332.414194 185.482942 
L 397.123437 185.482942 
" style="fill:none;stroke:#b0b0b0;stroke-linecap:square;stroke-width:0.8;"/>
     </g>
     <g id="line2d_38">
      <g>
       <use style="stroke:#000000;stroke-width:0.8;" x="332.414194" xlink:href="#me136df419c" y="185.482942"/>
      </g>
     </g>
     <g id="text_15">
      <!-- 0.1 -->
      <g transform="translate(304.416538 191.005989)scale(0.15 -0.15)">
       <use xlink:href="#CenturyGothic-Bold-48"/>
       <use x="56.005859" xlink:href="#CenturyGothic-Bold-46"/>
       <use x="83.984375" xlink:href="#CenturyGothic-Bold-49"/>
      </g>
     </g>
    </g>
    <g id="ytick_9">
     <g id="line2d_39">
      <path clip-path="url(#p83b8d3b106)" d="M 332.414194 172.992632 
L 397.123437 172.992632 
" style="fill:none;stroke:#b0b0b0;stroke-linecap:square;stroke-width:0.8;"/>
     </g>
     <g id="line2d_40">
      <g>
       <use style="stroke:#000000;stroke-width:0.8;" x="332.414194" xlink:href="#me136df419c" y="172.992632"/>
      </g>
     </g>
    </g>
    <g id="ytick_10">
     <g id="line2d_41">
      <path clip-path="url(#p83b8d3b106)" d="M 332.414194 160.502323 
L 397.123437 160.502323 
" style="fill:none;stroke:#b0b0b0;stroke-linecap:square;stroke-width:0.8;"/>
     </g>
     <g id="line2d_42">
      <g>
       <use style="stroke:#000000;stroke-width:0.8;" x="332.414194" xlink:href="#me136df419c" y="160.502323"/>
      </g>
     </g>
     <g id="text_16">
      <!-- 0.2 -->
      <g transform="translate(304.416538 166.02537)scale(0.15 -0.15)">
       <use xlink:href="#CenturyGothic-Bold-48"/>
       <use x="56.005859" xlink:href="#CenturyGothic-Bold-46"/>
       <use x="83.984375" xlink:href="#CenturyGothic-Bold-50"/>
      </g>
     </g>
    </g>
    <g id="ytick_11">
     <g id="line2d_43">
      <path clip-path="url(#p83b8d3b106)" d="M 332.414194 148.012013 
L 397.123437 148.012013 
" style="fill:none;stroke:#b0b0b0;stroke-linecap:square;stroke-width:0.8;"/>
     </g>
     <g id="line2d_44">
      <g>
       <use style="stroke:#000000;stroke-width:0.8;" x="332.414194" xlink:href="#me136df419c" y="148.012013"/>
      </g>
     </g>
    </g>
   </g>
   <g id="LineCollection_5">
    <path clip-path="url(#p83b8d3b106)" d="M 386.338564 210.403993 
L 386.338564 195.116198 
" style="fill:none;stroke:#000000;stroke-width:1.5;"/>
   </g>
   <g id="LineCollection_6">
    <path clip-path="url(#p83b8d3b106)" d="M 343.199068 187.452139 
L 343.199068 169.094191 
" style="fill:none;stroke:#000000;stroke-width:1.5;"/>
   </g>
   <g id="LineCollection_7">
    <path clip-path="url(#p83b8d3b106)" d="M 364.768816 205.89636 
L 364.768816 200.26507 
" style="fill:none;stroke:#000000;stroke-width:1.5;"/>
   </g>
   <g id="LineCollection_8">
    <path clip-path="url(#p83b8d3b106)" style="fill:none;stroke:#000000;stroke-width:1.5;"/>
   </g>
   <g id="line2d_45">
    <defs>
     <path d="M 10 0 
L -10 -0 
" id="mb170dd5f22" style="stroke:#000000;"/>
    </defs>
    <g clip-path="url(#p83b8d3b106)">
     <use style="stroke:#000000;" x="386.338564" xlink:href="#mb170dd5f22" y="210.403993"/>
    </g>
   </g>
   <g id="line2d_46">
    <g clip-path="url(#p83b8d3b106)">
     <use style="stroke:#000000;" x="386.338564" xlink:href="#mb170dd5f22" y="195.116198"/>
    </g>
   </g>
   <g id="line2d_47">
    <g clip-path="url(#p83b8d3b106)">
     <use style="stroke:#000000;" x="343.199068" xlink:href="#mb170dd5f22" y="187.452139"/>
    </g>
   </g>
   <g id="line2d_48">
    <g clip-path="url(#p83b8d3b106)">
     <use style="stroke:#000000;" x="343.199068" xlink:href="#mb170dd5f22" y="169.094191"/>
    </g>
   </g>
   <g id="line2d_49">
    <g clip-path="url(#p83b8d3b106)">
     <use style="stroke:#000000;" x="364.768816" xlink:href="#mb170dd5f22" y="205.89636"/>
    </g>
   </g>
   <g id="line2d_50">
    <g clip-path="url(#p83b8d3b106)">
     <use style="stroke:#000000;" x="364.768816" xlink:href="#mb170dd5f22" y="200.26507"/>
    </g>
   </g>
   <g id="line2d_51">
    <g clip-path="url(#p83b8d3b106)"/>
   </g>
   <g id="line2d_52">
    <g clip-path="url(#p83b8d3b106)"/>
   </g>
   <g id="patch_16">
    <path d="M 332.414194 212.961623 
L 332.414194 148.012013 
" style="fill:none;stroke:#000000;stroke-linecap:square;stroke-linejoin:miter;stroke-width:0.8;"/>
   </g>
   <g id="patch_17">
    <path d="M 397.123437 212.961623 
L 397.123437 148.012013 
" style="fill:none;stroke:#000000;stroke-linecap:square;stroke-linejoin:miter;stroke-width:0.8;"/>
   </g>
   <g id="patch_18">
    <path d="M 332.414194 212.961623 
L 397.123437 212.961623 
" style="fill:none;stroke:#000000;stroke-linecap:square;stroke-linejoin:miter;stroke-width:0.8;"/>
   </g>
   <g id="patch_19">
    <path d="M 332.414194 148.012013 
L 397.123437 148.012013 
" style="fill:none;stroke:#000000;stroke-linecap:square;stroke-linejoin:miter;stroke-width:0.8;"/>
   </g>
   <g id="PathCollection_1">
    <defs>
     <path d="M 0 1.936492 
C 0.513564 1.936492 1.006162 1.732451 1.369306 1.369306 
C 1.732451 1.006162 1.936492 0.513564 1.936492 0 
C 1.936492 -0.513564 1.732451 -1.006162 1.369306 -1.369306 
C 1.006162 -1.732451 0.513564 -1.936492 0 -1.936492 
C -0.513564 -1.936492 -1.006162 -1.732451 -1.369306 -1.369306 
C -1.732451 -1.006162 -1.936492 -0.513564 -1.936492 0 
C -1.936492 0.513564 -1.732451 1.006162 -1.369306 1.369306 
C -1.006162 1.732451 -0.513564 1.936492 0 1.936492 
z
" id="m5109b88a20" style="stroke:#000000;stroke-width:0.5;"/>
    </defs>
    <g clip-path="url(#p83b8d3b106)">
     <use style="fill:#808080;stroke:#000000;stroke-width:0.5;" x="379.867639" xlink:href="#m5109b88a20" y="187.64692"/>
     <use style="fill:#808080;stroke:#000000;stroke-width:0.5;" x="380.548789" xlink:href="#m5109b88a20" y="208.031766"/>
     <use style="fill:#808080;stroke:#000000;stroke-width:0.5;" x="381.229939" xlink:href="#m5109b88a20" y="199.711501"/>
     <use style="fill:#808080;stroke:#000000;stroke-width:0.5;" x="381.911089" xlink:href="#m5109b88a20" y="196.829205"/>
     <use style="fill:#808080;stroke:#000000;stroke-width:0.5;" x="382.592239" xlink:href="#m5109b88a20" y="181.349978"/>
     <use style="fill:#808080;stroke:#000000;stroke-width:0.5;" x="383.273389" xlink:href="#m5109b88a20" y="200.082545"/>
     <use style="fill:#808080;stroke:#000000;stroke-width:0.5;" x="383.954539" xlink:href="#m5109b88a20" y="205.362873"/>
     <use style="fill:#808080;stroke:#000000;stroke-width:0.5;" x="384.635689" xlink:href="#m5109b88a20" y="206.793719"/>
     <use style="fill:#808080;stroke:#000000;stroke-width:0.5;" x="385.316839" xlink:href="#m5109b88a20" y="209.19196"/>
     <use style="fill:#808080;stroke:#000000;stroke-width:0.5;" x="385.997989" xlink:href="#m5109b88a20" y="206.648367"/>
     <use style="fill:#808080;stroke:#000000;stroke-width:0.5;" x="386.679139" xlink:href="#m5109b88a20" y="203.55826"/>
     <use style="fill:#808080;stroke:#000000;stroke-width:0.5;" x="387.360288" xlink:href="#m5109b88a20" y="207.960995"/>
     <use style="fill:#808080;stroke:#000000;stroke-width:0.5;" x="388.041438" xlink:href="#m5109b88a20" y="207.914128"/>
     <use style="fill:#808080;stroke:#000000;stroke-width:0.5;" x="388.722588" xlink:href="#m5109b88a20" y="210.463561"/>
     <use style="fill:#808080;stroke:#000000;stroke-width:0.5;" x="389.403738" xlink:href="#m5109b88a20" y="207.711634"/>
     <use style="fill:#808080;stroke:#000000;stroke-width:0.5;" x="390.084888" xlink:href="#m5109b88a20" y="204.456294"/>
     <use style="fill:#808080;stroke:#000000;stroke-width:0.5;" x="390.766038" xlink:href="#m5109b88a20" y="209.314922"/>
     <use style="fill:#808080;stroke:#000000;stroke-width:0.5;" x="391.447188" xlink:href="#m5109b88a20" y="192.242832"/>
     <use style="fill:#808080;stroke:#000000;stroke-width:0.5;" x="392.128338" xlink:href="#m5109b88a20" y="201.92151"/>
     <use style="fill:#808080;stroke:#000000;stroke-width:0.5;" x="392.809488" xlink:href="#m5109b88a20" y="208.008946"/>
    </g>
   </g>
   <g id="PathCollection_2">
    <g clip-path="url(#p83b8d3b106)">
     <use style="fill:#808080;stroke:#000000;stroke-width:0.5;" x="336.728143" xlink:href="#m5109b88a20" y="168.916263"/>
     <use style="fill:#808080;stroke:#000000;stroke-width:0.5;" x="337.409293" xlink:href="#m5109b88a20" y="165.500209"/>
     <use style="fill:#808080;stroke:#000000;stroke-width:0.5;" x="338.090443" xlink:href="#m5109b88a20" y="177.198246"/>
     <use style="fill:#808080;stroke:#000000;stroke-width:0.5;" x="338.771593" xlink:href="#m5109b88a20" y="184.387201"/>
     <use style="fill:#808080;stroke:#000000;stroke-width:0.5;" x="339.452743" xlink:href="#m5109b88a20" y="184.865895"/>
     <use style="fill:#808080;stroke:#000000;stroke-width:0.5;" x="340.133893" xlink:href="#m5109b88a20" y="172.390774"/>
     <use style="fill:#808080;stroke:#000000;stroke-width:0.5;" x="340.815043" xlink:href="#m5109b88a20" y="188.084384"/>
     <use style="fill:#808080;stroke:#000000;stroke-width:0.5;" x="341.496193" xlink:href="#m5109b88a20" y="189.472254"/>
     <use style="fill:#808080;stroke:#000000;stroke-width:0.5;" x="342.177343" xlink:href="#m5109b88a20" y="189.125597"/>
     <use style="fill:#808080;stroke:#000000;stroke-width:0.5;" x="342.858493" xlink:href="#m5109b88a20" y="171.267895"/>
     <use style="fill:#808080;stroke:#000000;stroke-width:0.5;" x="343.539643" xlink:href="#m5109b88a20" y="178.381016"/>
     <use style="fill:#808080;stroke:#000000;stroke-width:0.5;" x="344.220793" xlink:href="#m5109b88a20" y="174.735274"/>
     <use style="fill:#808080;stroke:#000000;stroke-width:0.5;" x="344.901943" xlink:href="#m5109b88a20" y="164.276829"/>
     <use style="fill:#808080;stroke:#000000;stroke-width:0.5;" x="345.583093" xlink:href="#m5109b88a20" y="178.797014"/>
     <use style="fill:#808080;stroke:#000000;stroke-width:0.5;" x="346.264242" xlink:href="#m5109b88a20" y="169.822501"/>
     <use style="fill:#808080;stroke:#000000;stroke-width:0.5;" x="346.945392" xlink:href="#m5109b88a20" y="194.251902"/>
     <use style="fill:#808080;stroke:#000000;stroke-width:0.5;" x="347.626542" xlink:href="#m5109b88a20" y="161.651952"/>
     <use style="fill:#808080;stroke:#000000;stroke-width:0.5;" x="348.307692" xlink:href="#m5109b88a20" y="187.109005"/>
     <use style="fill:#808080;stroke:#000000;stroke-width:0.5;" x="348.988842" xlink:href="#m5109b88a20" y="181.672959"/>
     <use style="fill:#808080;stroke:#000000;stroke-width:0.5;" x="349.669992" xlink:href="#m5109b88a20" y="183.556135"/>
    </g>
   </g>
   <g id="PathCollection_3">
    <g clip-path="url(#p83b8d3b106)">
     <use style="fill:#808080;stroke:#000000;stroke-width:0.5;" x="358.297891" xlink:href="#m5109b88a20" y="196.505162"/>
     <use style="fill:#808080;stroke:#000000;stroke-width:0.5;" x="358.979041" xlink:href="#m5109b88a20" y="204.285686"/>
     <use style="fill:#808080;stroke:#000000;stroke-width:0.5;" x="359.660191" xlink:href="#m5109b88a20" y="202.162748"/>
     <use style="fill:#808080;stroke:#000000;stroke-width:0.5;" x="360.341341" xlink:href="#m5109b88a20" y="198.532609"/>
     <use style="fill:#808080;stroke:#000000;stroke-width:0.5;" x="361.022491" xlink:href="#m5109b88a20" y="206.294418"/>
     <use style="fill:#808080;stroke:#000000;stroke-width:0.5;" x="361.703641" xlink:href="#m5109b88a20" y="204.612886"/>
     <use style="fill:#808080;stroke:#000000;stroke-width:0.5;" x="362.384791" xlink:href="#m5109b88a20" y="202.68883"/>
     <use style="fill:#808080;stroke:#000000;stroke-width:0.5;" x="363.065941" xlink:href="#m5109b88a20" y="203.318996"/>
     <use style="fill:#808080;stroke:#000000;stroke-width:0.5;" x="363.747091" xlink:href="#m5109b88a20" y="201.482852"/>
     <use style="fill:#808080;stroke:#000000;stroke-width:0.5;" x="364.428241" xlink:href="#m5109b88a20" y="203.753922"/>
     <use style="fill:#808080;stroke:#000000;stroke-width:0.5;" x="365.109391" xlink:href="#m5109b88a20" y="204.941258"/>
     <use style="fill:#808080;stroke:#000000;stroke-width:0.5;" x="365.790541" xlink:href="#m5109b88a20" y="202.664552"/>
     <use style="fill:#808080;stroke:#000000;stroke-width:0.5;" x="366.47169" xlink:href="#m5109b88a20" y="203.750286"/>
     <use style="fill:#808080;stroke:#000000;stroke-width:0.5;" x="367.15284" xlink:href="#m5109b88a20" y="206.428311"/>
     <use style="fill:#808080;stroke:#000000;stroke-width:0.5;" x="367.83399" xlink:href="#m5109b88a20" y="202.566325"/>
     <use style="fill:#808080;stroke:#000000;stroke-width:0.5;" x="368.51514" xlink:href="#m5109b88a20" y="197.237758"/>
     <use style="fill:#808080;stroke:#000000;stroke-width:0.5;" x="369.19629" xlink:href="#m5109b88a20" y="202.986796"/>
     <use style="fill:#808080;stroke:#000000;stroke-width:0.5;" x="369.87744" xlink:href="#m5109b88a20" y="207.180756"/>
     <use style="fill:#808080;stroke:#000000;stroke-width:0.5;" x="370.55859" xlink:href="#m5109b88a20" y="206.031259"/>
     <use style="fill:#808080;stroke:#000000;stroke-width:0.5;" x="371.23974" xlink:href="#m5109b88a20" y="204.188887"/>
    </g>
   </g>
   <g id="PathCollection_4">
    <defs>
     <path d="M 0 1.936492 
C 0.513564 1.936492 1.006162 1.732451 1.369306 1.369306 
C 1.732451 1.006162 1.936492 0.513564 1.936492 0 
C 1.936492 -0.513564 1.732451 -1.006162 1.369306 -1.369306 
C 1.006162 -1.732451 0.513564 -1.936492 0 -1.936492 
C -0.513564 -1.936492 -1.006162 -1.732451 -1.369306 -1.369306 
C -1.732451 -1.006162 -1.936492 -0.513564 -1.936492 0 
C -1.936492 0.513564 -1.732451 1.006162 -1.369306 1.369306 
C -1.006162 1.732451 -0.513564 1.936492 0 1.936492 
z
" id="m5ae468540b" style="stroke:#000000;stroke-width:0.5;"/>
    </defs>
    <g clip-path="url(#p83b8d3b106)"/>
   </g>
  </g>
  <g id="axes_3">
   <g id="patch_20">
    <path d="M 332.414194 94.357987 
L 397.123437 94.357987 
L 397.123437 29.408377 
L 332.414194 29.408377 
z
" style="fill:#ffffff;"/>
   </g>
   <g id="patch_21">
    <path clip-path="url(#p4c540a425a)" d="M 144.757387 6524.369416 
L 196.524782 6524.369416 
L 196.524782 6515.999913 
L 144.757387 6515.999913 
z
" style="fill:#808080;"/>
   </g>
   <g id="patch_22">
    <path clip-path="url(#p4c540a425a)" d="M 209.466631 6524.369416 
L 261.234026 6524.369416 
L 261.234026 6522.449875 
L 209.466631 6522.449875 
z
" style="fill:#808080;"/>
   </g>
   <g id="patch_23">
    <path clip-path="url(#p4c540a425a)" d="M 274.175874 6524.369416 
L 325.943269 6524.369416 
L 325.943269 6522.366515 
L 274.175874 6522.366515 
z
" style="fill:#808080;"/>
   </g>
   <g id="patch_24">
    <path clip-path="url(#p4c540a425a)" d="M 338.885118 6524.369416 
L 390.652513 6524.369416 
L 390.652513 48.937137 
L 338.885118 48.937137 
z
" style="fill:#24ccf2;"/>
   </g>
   <g id="matplotlib.axis_5">
    <g id="xtick_8">
     <g id="line2d_53">
      <path clip-path="url(#p4c540a425a)" d="M 364.768816 94.357987 
L 364.768816 29.408377 
" style="fill:none;stroke:#b0b0b0;stroke-linecap:square;stroke-width:0.8;"/>
     </g>
     <g id="line2d_54">
      <g>
       <use style="stroke:#000000;stroke-width:0.8;" x="364.768816" xlink:href="#m3d5b2c5272" y="94.357987"/>
      </g>
     </g>
     <g id="text_17">
      <!-- 4h -->
      <g transform="translate(356.647722 111.667675)scale(0.14 -0.14)">
       <use xlink:href="#CenturyGothic-Bold-52"/>
       <use x="56.005859" xlink:href="#CenturyGothic-Bold-104"/>
      </g>
     </g>
    </g>
   </g>
   <g id="matplotlib.axis_6">
    <g id="ytick_12">
     <g id="line2d_55">
      <path clip-path="url(#p4c540a425a)" d="M 332.414194 94.357987 
L 397.123437 94.357987 
" style="fill:none;stroke:#b0b0b0;stroke-linecap:square;stroke-width:0.8;"/>
     </g>
     <g id="line2d_56">
      <g>
       <use style="stroke:#000000;stroke-width:0.8;" x="332.414194" xlink:href="#me136df419c" y="94.357987"/>
      </g>
     </g>
    </g>
    <g id="ytick_13">
     <g id="line2d_57">
      <path clip-path="url(#p4c540a425a)" d="M 332.414194 81.368065 
L 397.123437 81.368065 
" style="fill:none;stroke:#b0b0b0;stroke-linecap:square;stroke-width:0.8;"/>
     </g>
     <g id="line2d_58">
      <g>
       <use style="stroke:#000000;stroke-width:0.8;" x="332.414194" xlink:href="#me136df419c" y="81.368065"/>
      </g>
     </g>
     <g id="text_18">
      <!-- 99.2 -->
      <g transform="translate(296.016538 86.891112)scale(0.15 -0.15)">
       <defs>
        <path d="M 27 -1.8125 
L 15.375 3.953125 
L 27.9375 28.375 
Q 18.796875 28.375 12.390625 34.90625 
Q 6 41.453125 6 51.171875 
Q 6 60.59375 12.5625 67.109375 
Q 19.140625 73.640625 28.421875 73.640625 
Q 38.140625 73.640625 44.609375 66.875 
Q 51.078125 60.109375 51.078125 51.3125 
Q 51.078125 48 50.078125 44.65625 
Q 49.078125 41.3125 45.453125 34.328125 
z
M 28.71875 41.3125 
Q 32.515625 41.3125 35.109375 44.09375 
Q 37.703125 46.875 37.703125 50.984375 
Q 37.703125 55.171875 34.984375 58 
Q 32.28125 60.84375 28.65625 60.84375 
Q 24.859375 60.84375 22.125 58.03125 
Q 19.390625 55.21875 19.390625 51.03125 
Q 19.390625 46.875 22.046875 44.09375 
Q 24.703125 41.3125 28.71875 41.3125 
z
" id="CenturyGothic-Bold-57"/>
       </defs>
       <use xlink:href="#CenturyGothic-Bold-57"/>
       <use x="56.005859" xlink:href="#CenturyGothic-Bold-57"/>
       <use x="112.011719" xlink:href="#CenturyGothic-Bold-46"/>
       <use x="139.990234" xlink:href="#CenturyGothic-Bold-50"/>
      </g>
     </g>
    </g>
    <g id="ytick_14">
     <g id="line2d_59">
      <path clip-path="url(#p4c540a425a)" d="M 332.414194 68.378143 
L 397.123437 68.378143 
" style="fill:none;stroke:#b0b0b0;stroke-linecap:square;stroke-width:0.8;"/>
     </g>
     <g id="line2d_60">
      <g>
       <use style="stroke:#000000;stroke-width:0.8;" x="332.414194" xlink:href="#me136df419c" y="68.378143"/>
      </g>
     </g>
    </g>
    <g id="ytick_15">
     <g id="line2d_61">
      <path clip-path="url(#p4c540a425a)" d="M 332.414194 55.388221 
L 397.123437 55.388221 
" style="fill:none;stroke:#b0b0b0;stroke-linecap:square;stroke-width:0.8;"/>
     </g>
     <g id="line2d_62">
      <g>
       <use style="stroke:#000000;stroke-width:0.8;" x="332.414194" xlink:href="#me136df419c" y="55.388221"/>
      </g>
     </g>
     <g id="text_19">
      <!-- 99.6 -->
      <g transform="translate(296.016538 60.911268)scale(0.15 -0.15)">
       <defs>
        <path d="M 29 73.640625 
L 40.625 67.828125 
L 28.078125 43.40625 
Q 37.203125 43.40625 43.59375 36.859375 
Q 50 30.328125 50 20.609375 
Q 50 11.234375 43.421875 4.703125 
Q 36.859375 -1.8125 27.59375 -1.8125 
Q 17.875 -1.8125 11.40625 4.953125 
Q 4.9375 11.71875 4.9375 20.453125 
Q 4.9375 23.78125 5.9375 27.140625 
Q 6.9375 30.515625 10.546875 37.5 
z
M 27.296875 30.46875 
Q 23.484375 30.46875 20.890625 27.703125 
Q 18.3125 24.953125 18.3125 20.796875 
Q 18.3125 16.65625 21.015625 13.8125 
Q 23.734375 10.984375 27.34375 10.984375 
Q 31.15625 10.984375 33.890625 13.765625 
Q 36.625 16.546875 36.625 20.796875 
Q 36.625 24.953125 33.953125 27.703125 
Q 31.296875 30.46875 27.296875 30.46875 
z
" id="CenturyGothic-Bold-54"/>
       </defs>
       <use xlink:href="#CenturyGothic-Bold-57"/>
       <use x="56.005859" xlink:href="#CenturyGothic-Bold-57"/>
       <use x="112.011719" xlink:href="#CenturyGothic-Bold-46"/>
       <use x="139.990234" xlink:href="#CenturyGothic-Bold-54"/>
      </g>
     </g>
    </g>
    <g id="ytick_16">
     <g id="line2d_63">
      <path clip-path="url(#p4c540a425a)" d="M 332.414194 42.398299 
L 397.123437 42.398299 
" style="fill:none;stroke:#b0b0b0;stroke-linecap:square;stroke-width:0.8;"/>
     </g>
     <g id="line2d_64">
      <g>
       <use style="stroke:#000000;stroke-width:0.8;" x="332.414194" xlink:href="#me136df419c" y="42.398299"/>
      </g>
     </g>
    </g>
    <g id="ytick_17">
     <g id="line2d_65">
      <path clip-path="url(#p4c540a425a)" d="M 332.414194 29.408377 
L 397.123437 29.408377 
" style="fill:none;stroke:#b0b0b0;stroke-linecap:square;stroke-width:0.8;"/>
     </g>
     <g id="line2d_66">
      <g>
       <use style="stroke:#000000;stroke-width:0.8;" x="332.414194" xlink:href="#me136df419c" y="29.408377"/>
      </g>
     </g>
     <g id="text_20">
      <!-- 99.997 -->
      <g transform="translate(279.216538 34.931423)scale(0.15 -0.15)">
       <use xlink:href="#CenturyGothic-Bold-57"/>
       <use x="56.005859" xlink:href="#CenturyGothic-Bold-57"/>
       <use x="112.011719" xlink:href="#CenturyGothic-Bold-46"/>
       <use x="139.990234" xlink:href="#CenturyGothic-Bold-57"/>
       <use x="195.996094" xlink:href="#CenturyGothic-Bold-57"/>
       <use x="252.001953" xlink:href="#CenturyGothic-Bold-55"/>
      </g>
     </g>
    </g>
   </g>
   <g id="LineCollection_9">
    <path clip-path="url(#p4c540a425a)" style="fill:none;stroke:#000000;stroke-width:1.5;"/>
   </g>
   <g id="LineCollection_10">
    <path clip-path="url(#p4c540a425a)" style="fill:none;stroke:#000000;stroke-width:1.5;"/>
   </g>
   <g id="LineCollection_11">
    <path clip-path="url(#p4c540a425a)" style="fill:none;stroke:#000000;stroke-width:1.5;"/>
   </g>
   <g id="LineCollection_12">
    <path clip-path="url(#p4c540a425a)" d="M 364.768816 55.86994 
L 364.768816 42.004333 
" style="fill:none;stroke:#000000;stroke-width:1.5;"/>
   </g>
   <g id="line2d_67">
    <defs>
     <path d="M 25 0 
L -25 -0 
" id="m7d61978b4f" style="stroke:#000000;"/>
    </defs>
    <g clip-path="url(#p4c540a425a)">
     <use style="stroke:#000000;" x="170.641085" xlink:href="#m7d61978b4f" y="6518.386446"/>
    </g>
   </g>
   <g id="line2d_68">
    <g clip-path="url(#p4c540a425a)">
     <use style="stroke:#000000;" x="170.641085" xlink:href="#m7d61978b4f" y="6513.613379"/>
    </g>
   </g>
   <g id="line2d_69">
    <g clip-path="url(#p4c540a425a)">
     <use style="stroke:#000000;" x="235.350328" xlink:href="#m7d61978b4f" y="6523.181943"/>
    </g>
   </g>
   <g id="line2d_70">
    <g clip-path="url(#p4c540a425a)">
     <use style="stroke:#000000;" x="235.350328" xlink:href="#m7d61978b4f" y="6521.717808"/>
    </g>
   </g>
   <g id="line2d_71">
    <g clip-path="url(#p4c540a425a)">
     <use style="stroke:#000000;" x="300.059572" xlink:href="#m7d61978b4f" y="6524.353928"/>
    </g>
   </g>
   <g id="line2d_72">
    <g clip-path="url(#p4c540a425a)">
     <use style="stroke:#000000;" x="300.059572" xlink:href="#m7d61978b4f" y="6520.379101"/>
    </g>
   </g>
   <g id="line2d_73">
    <g clip-path="url(#p4c540a425a)">
     <use style="stroke:#000000;" x="364.768816" xlink:href="#m7d61978b4f" y="55.86994"/>
    </g>
   </g>
   <g id="line2d_74">
    <g clip-path="url(#p4c540a425a)">
     <use style="stroke:#000000;" x="364.768816" xlink:href="#m7d61978b4f" y="42.004333"/>
    </g>
   </g>
   <g id="patch_25">
    <path d="M 332.414194 94.357987 
L 332.414194 29.408377 
" style="fill:none;stroke:#000000;stroke-linecap:square;stroke-linejoin:miter;stroke-width:0.8;"/>
   </g>
   <g id="patch_26">
    <path d="M 397.123437 94.357987 
L 397.123437 29.408377 
" style="fill:none;stroke:#000000;stroke-linecap:square;stroke-linejoin:miter;stroke-width:0.8;"/>
   </g>
   <g id="patch_27">
    <path d="M 332.414194 94.357987 
L 397.123437 94.357987 
" style="fill:none;stroke:#000000;stroke-linecap:square;stroke-linejoin:miter;stroke-width:0.8;"/>
   </g>
   <g id="patch_28">
    <path d="M 332.414194 29.408377 
L 397.123437 29.408377 
" style="fill:none;stroke:#000000;stroke-linecap:square;stroke-linejoin:miter;stroke-width:0.8;"/>
   </g>
   <g id="PathCollection_5">
    <defs>
     <path d="M 0 1.936492 
C 0.513564 1.936492 1.006162 1.732451 1.369306 1.369306 
C 1.732451 1.006162 1.936492 0.513564 1.936492 0 
C 1.936492 -0.513564 1.732451 -1.006162 1.369306 -1.369306 
C 1.006162 -1.732451 0.513564 -1.936492 0 -1.936492 
C -0.513564 -1.936492 -1.006162 -1.732451 -1.369306 -1.369306 
C -1.732451 -1.006162 -1.936492 -0.513564 -1.936492 0 
C -1.936492 0.513564 -1.732451 1.006162 -1.369306 1.369306 
C -1.006162 1.732451 -0.513564 1.936492 0 1.936492 
z
" id="m43ffafac67" style="stroke:#454545;stroke-width:0.5;"/>
    </defs>
    <g clip-path="url(#p4c540a425a)">
     <use style="fill:#808080;stroke:#454545;stroke-width:0.5;" x="151.228311" xlink:href="#m43ffafac67" y="6513.567118"/>
     <use style="fill:#808080;stroke:#454545;stroke-width:0.5;" x="153.271761" xlink:href="#m43ffafac67" y="6512.678944"/>
     <use style="fill:#808080;stroke:#454545;stroke-width:0.5;" x="155.315211" xlink:href="#m43ffafac67" y="6515.720434"/>
     <use style="fill:#808080;stroke:#454545;stroke-width:0.5;" x="157.358661" xlink:href="#m43ffafac67" y="6517.589562"/>
     <use style="fill:#808080;stroke:#454545;stroke-width:0.5;" x="159.402111" xlink:href="#m43ffafac67" y="6517.714022"/>
     <use style="fill:#808080;stroke:#454545;stroke-width:0.5;" x="161.44556" xlink:href="#m43ffafac67" y="6514.470491"/>
     <use style="fill:#808080;stroke:#454545;stroke-width:0.5;" x="163.48901" xlink:href="#m43ffafac67" y="6518.550829"/>
     <use style="fill:#808080;stroke:#454545;stroke-width:0.5;" x="165.53246" xlink:href="#m43ffafac67" y="6518.911676"/>
     <use style="fill:#808080;stroke:#454545;stroke-width:0.5;" x="167.57591" xlink:href="#m43ffafac67" y="6518.821545"/>
     <use style="fill:#808080;stroke:#454545;stroke-width:0.5;" x="169.61936" xlink:href="#m43ffafac67" y="6514.178542"/>
     <use style="fill:#808080;stroke:#454545;stroke-width:0.5;" x="171.662809" xlink:href="#m43ffafac67" y="6516.027954"/>
     <use style="fill:#808080;stroke:#454545;stroke-width:0.5;" x="173.706259" xlink:href="#m43ffafac67" y="6515.080061"/>
     <use style="fill:#808080;stroke:#454545;stroke-width:0.5;" x="175.749709" xlink:href="#m43ffafac67" y="6512.360865"/>
     <use style="fill:#808080;stroke:#454545;stroke-width:0.5;" x="177.793159" xlink:href="#m43ffafac67" y="6516.136113"/>
     <use style="fill:#808080;stroke:#454545;stroke-width:0.5;" x="179.836609" xlink:href="#m43ffafac67" y="6513.80274"/>
     <use style="fill:#808080;stroke:#454545;stroke-width:0.5;" x="181.880058" xlink:href="#m43ffafac67" y="6520.154384"/>
     <use style="fill:#808080;stroke:#454545;stroke-width:0.5;" x="183.923508" xlink:href="#m43ffafac67" y="6511.678397"/>
     <use style="fill:#808080;stroke:#454545;stroke-width:0.5;" x="185.966958" xlink:href="#m43ffafac67" y="6518.297231"/>
     <use style="fill:#808080;stroke:#454545;stroke-width:0.5;" x="188.010408" xlink:href="#m43ffafac67" y="6516.883859"/>
     <use style="fill:#808080;stroke:#454545;stroke-width:0.5;" x="190.053858" xlink:href="#m43ffafac67" y="6517.373485"/>
    </g>
   </g>
   <g id="PathCollection_6">
    <defs>
     <path d="M 0 1.936492 
C 0.513564 1.936492 1.006162 1.732451 1.369306 1.369306 
C 1.732451 1.006162 1.936492 0.513564 1.936492 0 
C 1.936492 -0.513564 1.732451 -1.006162 1.369306 -1.369306 
C 1.006162 -1.732451 0.513564 -1.936492 0 -1.936492 
C -0.513564 -1.936492 -1.006162 -1.732451 -1.369306 -1.369306 
C -1.732451 -1.006162 -1.936492 -0.513564 -1.936492 0 
C -1.936492 0.513564 -1.732451 1.006162 -1.369306 1.369306 
C -1.006162 1.732451 -0.513564 1.936492 0 1.936492 
z
" id="mc777b8f71a" style="stroke:#f2420c;stroke-width:0.5;"/>
    </defs>
    <g clip-path="url(#p4c540a425a)">
     <use style="fill:#808080;stroke:#f2420c;stroke-width:0.5;" x="215.937555" xlink:href="#mc777b8f71a" y="6520.740232"/>
     <use style="fill:#808080;stroke:#f2420c;stroke-width:0.5;" x="217.981005" xlink:href="#mc777b8f71a" y="6522.763168"/>
     <use style="fill:#808080;stroke:#f2420c;stroke-width:0.5;" x="220.024455" xlink:href="#mc777b8f71a" y="6522.211204"/>
     <use style="fill:#808080;stroke:#f2420c;stroke-width:0.5;" x="222.067905" xlink:href="#mc777b8f71a" y="6521.267368"/>
     <use style="fill:#808080;stroke:#f2420c;stroke-width:0.5;" x="224.111354" xlink:href="#mc777b8f71a" y="6523.285438"/>
     <use style="fill:#808080;stroke:#f2420c;stroke-width:0.5;" x="226.154804" xlink:href="#mc777b8f71a" y="6522.84824"/>
     <use style="fill:#808080;stroke:#f2420c;stroke-width:0.5;" x="228.198254" xlink:href="#mc777b8f71a" y="6522.347985"/>
     <use style="fill:#808080;stroke:#f2420c;stroke-width:0.5;" x="230.241704" xlink:href="#mc777b8f71a" y="6522.511829"/>
     <use style="fill:#808080;stroke:#f2420c;stroke-width:0.5;" x="232.285154" xlink:href="#mc777b8f71a" y="6522.034431"/>
     <use style="fill:#808080;stroke:#f2420c;stroke-width:0.5;" x="234.328603" xlink:href="#mc777b8f71a" y="6522.624909"/>
     <use style="fill:#808080;stroke:#f2420c;stroke-width:0.5;" x="236.372053" xlink:href="#mc777b8f71a" y="6522.933617"/>
     <use style="fill:#808080;stroke:#f2420c;stroke-width:0.5;" x="238.415503" xlink:href="#mc777b8f71a" y="6522.341673"/>
     <use style="fill:#808080;stroke:#f2420c;stroke-width:0.5;" x="240.458953" xlink:href="#mc777b8f71a" y="6522.623964"/>
     <use style="fill:#808080;stroke:#f2420c;stroke-width:0.5;" x="242.502403" xlink:href="#mc777b8f71a" y="6523.320251"/>
     <use style="fill:#808080;stroke:#f2420c;stroke-width:0.5;" x="244.545852" xlink:href="#mc777b8f71a" y="6522.316134"/>
     <use style="fill:#808080;stroke:#f2420c;stroke-width:0.5;" x="246.589302" xlink:href="#mc777b8f71a" y="6520.930707"/>
     <use style="fill:#808080;stroke:#f2420c;stroke-width:0.5;" x="248.632752" xlink:href="#mc777b8f71a" y="6522.425456"/>
     <use style="fill:#808080;stroke:#f2420c;stroke-width:0.5;" x="250.676202" xlink:href="#mc777b8f71a" y="6523.515886"/>
     <use style="fill:#808080;stroke:#f2420c;stroke-width:0.5;" x="252.719652" xlink:href="#mc777b8f71a" y="6523.217017"/>
     <use style="fill:#808080;stroke:#f2420c;stroke-width:0.5;" x="254.763101" xlink:href="#mc777b8f71a" y="6522.738"/>
    </g>
   </g>
   <g id="PathCollection_7">
    <g clip-path="url(#p4c540a425a)">
     <use style="fill:#808080;stroke:#f2420c;stroke-width:0.5;" x="280.646799" xlink:href="#mc777b8f71a" y="6518.437089"/>
     <use style="fill:#808080;stroke:#f2420c;stroke-width:0.5;" x="282.690249" xlink:href="#mc777b8f71a" y="6523.737149"/>
     <use style="fill:#808080;stroke:#f2420c;stroke-width:0.5;" x="284.733698" xlink:href="#mc777b8f71a" y="6521.57388"/>
     <use style="fill:#808080;stroke:#f2420c;stroke-width:0.5;" x="286.777148" xlink:href="#mc777b8f71a" y="6520.824483"/>
     <use style="fill:#808080;stroke:#f2420c;stroke-width:0.5;" x="288.820598" xlink:href="#mc777b8f71a" y="6516.799884"/>
     <use style="fill:#808080;stroke:#f2420c;stroke-width:0.5;" x="290.864048" xlink:href="#mc777b8f71a" y="6521.670351"/>
     <use style="fill:#808080;stroke:#f2420c;stroke-width:0.5;" x="292.907498" xlink:href="#mc777b8f71a" y="6523.043237"/>
     <use style="fill:#808080;stroke:#f2420c;stroke-width:0.5;" x="294.950947" xlink:href="#mc777b8f71a" y="6523.415256"/>
     <use style="fill:#808080;stroke:#f2420c;stroke-width:0.5;" x="296.994397" xlink:href="#mc777b8f71a" y="6524.038799"/>
     <use style="fill:#808080;stroke:#f2420c;stroke-width:0.5;" x="299.037847" xlink:href="#mc777b8f71a" y="6523.377465"/>
     <use style="fill:#808080;stroke:#f2420c;stroke-width:0.5;" x="301.081297" xlink:href="#mc777b8f71a" y="6522.574037"/>
     <use style="fill:#808080;stroke:#f2420c;stroke-width:0.5;" x="303.124747" xlink:href="#mc777b8f71a" y="6523.718748"/>
     <use style="fill:#808080;stroke:#f2420c;stroke-width:0.5;" x="305.168196" xlink:href="#mc777b8f71a" y="6523.706563"/>
     <use style="fill:#808080;stroke:#f2420c;stroke-width:0.5;" x="307.211646" xlink:href="#mc777b8f71a" y="6524.369416"/>
     <use style="fill:#808080;stroke:#f2420c;stroke-width:0.5;" x="309.255096" xlink:href="#mc777b8f71a" y="6523.653915"/>
     <use style="fill:#808080;stroke:#f2420c;stroke-width:0.5;" x="311.298546" xlink:href="#mc777b8f71a" y="6522.807526"/>
     <use style="fill:#808080;stroke:#f2420c;stroke-width:0.5;" x="313.341996" xlink:href="#mc777b8f71a" y="6524.070769"/>
     <use style="fill:#808080;stroke:#f2420c;stroke-width:0.5;" x="315.385445" xlink:href="#mc777b8f71a" y="6519.632026"/>
     <use style="fill:#808080;stroke:#f2420c;stroke-width:0.5;" x="317.428895" xlink:href="#mc777b8f71a" y="6522.148482"/>
     <use style="fill:#808080;stroke:#f2420c;stroke-width:0.5;" x="319.472345" xlink:href="#mc777b8f71a" y="6523.731216"/>
    </g>
   </g>
   <g id="PathCollection_8">
    <g clip-path="url(#p4c540a425a)">
     <use style="fill:#24ccf2;stroke:#000000;stroke-width:0.5;" x="345.356043" xlink:href="#m5ae468540b" y="34.972704"/>
     <use style="fill:#24ccf2;stroke:#000000;stroke-width:0.5;" x="347.399492" xlink:href="#m5ae468540b" y="45.533965"/>
     <use style="fill:#24ccf2;stroke:#000000;stroke-width:0.5;" x="349.442942" xlink:href="#m5ae468540b" y="52.977107"/>
     <use style="fill:#24ccf2;stroke:#000000;stroke-width:0.5;" x="351.486392" xlink:href="#m5ae468540b" y="59.23109"/>
     <use style="fill:#24ccf2;stroke:#000000;stroke-width:0.5;" x="353.529842" xlink:href="#m5ae468540b" y="55.90563"/>
     <use style="fill:#24ccf2;stroke:#000000;stroke-width:0.5;" x="355.573292" xlink:href="#m5ae468540b" y="52.870712"/>
     <use style="fill:#24ccf2;stroke:#000000;stroke-width:0.5;" x="357.616741" xlink:href="#m5ae468540b" y="56.257912"/>
     <use style="fill:#24ccf2;stroke:#000000;stroke-width:0.5;" x="359.660191" xlink:href="#m5ae468540b" y="50.718303"/>
     <use style="fill:#24ccf2;stroke:#000000;stroke-width:0.5;" x="361.703641" xlink:href="#m5ae468540b" y="46.543944"/>
     <use style="fill:#24ccf2;stroke:#000000;stroke-width:0.5;" x="363.747091" xlink:href="#m5ae468540b" y="46.341937"/>
     <use style="fill:#24ccf2;stroke:#000000;stroke-width:0.5;" x="365.790541" xlink:href="#m5ae468540b" y="51.943851"/>
     <use style="fill:#24ccf2;stroke:#000000;stroke-width:0.5;" x="367.83399" xlink:href="#m5ae468540b" y="41.970007"/>
     <use style="fill:#24ccf2;stroke:#000000;stroke-width:0.5;" x="369.87744" xlink:href="#m5ae468540b" y="42.813869"/>
     <use style="fill:#24ccf2;stroke:#000000;stroke-width:0.5;" x="371.92089" xlink:href="#m5ae468540b" y="55.837799"/>
     <use style="fill:#24ccf2;stroke:#000000;stroke-width:0.5;" x="373.96434" xlink:href="#m5ae468540b" y="44.976823"/>
     <use style="fill:#24ccf2;stroke:#000000;stroke-width:0.5;" x="376.00779" xlink:href="#m5ae468540b" y="53.393371"/>
     <use style="fill:#24ccf2;stroke:#000000;stroke-width:0.5;" x="378.051239" xlink:href="#m5ae468540b" y="31.903799"/>
     <use style="fill:#24ccf2;stroke:#000000;stroke-width:0.5;" x="380.094689" xlink:href="#m5ae468540b" y="54.180295"/>
     <use style="fill:#24ccf2;stroke:#000000;stroke-width:0.5;" x="382.138139" xlink:href="#m5ae468540b" y="49.898123"/>
     <use style="fill:#24ccf2;stroke:#000000;stroke-width:0.5;" x="384.181589" xlink:href="#m5ae468540b" y="50.471489"/>
    </g>
   </g>
  </g>
 </g>
 <defs>
  <clipPath id="p6d12c74946">
   <rect height="217.44" width="216.635294" x="62.323438" y="12.465"/>
  </clipPath>
  <clipPath id="p83b8d3b106">
   <rect height="64.94961" width="64.709244" x="332.414194" y="148.012013"/>
  </clipPath>
  <clipPath id="p4c540a425a">
   <rect height="64.94961" width="64.709244" x="332.414194" y="29.408377"/>
  </clipPath>
 </defs>
</svg>
