0.569555608568584, -0.204717197243274, 0.274869431980814, 0.0739884834726769, -0.318644423613673, 0.0583105937473585
0.568211084866515, -0.204979486420551, 0.275582605634354, 0.0839077201094704, -0.318418941900668, 0.0697139134406472
0.568361397063481, -0.205989658315259, 0.275768365025466, 0.0934258028593938, -0.32022160723119, 0.0813452988985826
0.569878846737061, -0.207935280239589, 0.275452925624037, 0.102083379928784, -0.324525848142081, 0.0926688698525578
0.57102723368244, -0.209280035424483, 0.275169127686359, 0.106037992645109, -0.327549022937975, 0.0981999893591047
0.573885180372698, -0.212813440258174, 0.274589777560131, 0.113209555667733, -0.334690940659126, 0.109261836954798
0.577597541287127, -0.217402391392166, 0.273733014886897, 0.119549007823911, -0.343017752461265, 0.120495144312118
0.579739301232884, -0.220203136890422, 0.273075087276602, 0.122533838429214, -0.34760184385817, 0.126223965769827
0.584806255796276, -0.226586235322286, 0.27100904108353, 0.128413140614407, -0.357527759708948, 0.137865778733343
0.591273324650471, -0.233825655157216, 0.267550308260304, 0.134487467862016, -0.368363886862491, 0.149730147390235
0.59944104693617, -0.241915018631176, 0.26255645200596, 0.140780610562844, -0.37976318741536, 0.161612364248947
0.604147924629338, -0.246373042921964, 0.259544431269229, 0.144049998548804, -0.385682878194708, 0.167538526078914
0.614881922439329, -0.255910515752442, 0.252396473660275, 0.150785082398934, -0.397606284021233, 0.179353888410878
0.626808463829968, -0.266093404365609, 0.243983618306755, 0.157842616962734, -0.408764168941121, 0.190260911045685
0.632898364767308, -0.27128931948849, 0.239485490766847, 0.16138810597089, -0.413677416398748, 0.195040310331051
0.645738613528682, -0.282229821629688, 0.229754748105289, 0.168466155937747, -0.422645425918588, 0.204022828451376
0.659307564086937, -0.294413082566302, 0.219257857898996, 0.175736156718891, -0.43042896688344, 0.212084258286036
0.673313065454462, -0.307856917489024, 0.208232134529421, 0.183583374566368, -0.436461322514859, 0.218923190655515
0.680253366809445, -0.315301778966867, 0.202585516115471, 0.187711666273689, -0.438784018756804, 0.221677873631652
0.687359192035528, -0.323290199710638, 0.196706789111537, 0.192072125901797, -0.440777207157651, 0.224280643164934
0.694605148456544, -0.331806110915708, 0.190563758746358, 0.19671735595051, -0.442436648872402, 0.226814400128671
0.709388485129341, -0.350373035955648, 0.177440143889809, 0.206731009374071, -0.444878197944213, 0.231623974038349
0.71689094367776, -0.360375638435998, 0.170383103569763, 0.212048229489932, -0.445776422605646, 0.233800534504582
0.731819713071948, -0.382402499366446, 0.155154338836935, 0.223240545644946, -0.446776421792221, 0.237423937830397
0.746370302036517, -0.406494554213586, 0.138863602524991, 0.235521411150305, -0.446116038161668, 0.239807783365334
0.761176228638411, -0.433044871160345, 0.121612546638867, 0.249012676158484, -0.443979590183572, 0.241613618545043
0.76911646219523, -0.447573707146401, 0.112462328365044, 0.256629580517279, -0.442366230350574, 0.242886092915969
0.785845107100381, -0.479393534808293, 0.0933313427448323, 0.273683771480309, -0.438727031833159, 0.246853536124131
0.803277605064238, -0.514857575584938, 0.0734007977886975, 0.292229779246256, -0.435362213039061, 0.253273607016708
0.811928888995612, -0.534072825771633, 0.0631576825927603, 0.301780533820108, -0.433919269724979, 0.256904673105487
0.828231600056745, -0.575968439554606, 0.0424033380399477, 0.320975691500128, -0.430866732512291, 0.263329750938033
0.835613772762475, -0.598713168965722, 0.0317833733585975, 0.33045554044212, -0.429048562643168, 0.265647464933977
0.842319680918621, -0.62222159366354, 0.0210277900927465, 0.339805660563721, -0.426772494582264, 0.266997832186077
0.847979411891008, -0.646020893828647, 0.0103318657330353, 0.349106692838799, -0.423775264160039, 0.267016138285445
0.855758467167342, -0.693207736814468, -0.010524617104273, 0.367830784995941, -0.414326766309464, 0.261798981707614
0.858950805017562, -0.740685479100485, -0.0314887742601286, 0.386726732039326, -0.400094780266791, 0.24940877620836
0.85703319427701, -0.788233183669331, -0.0523824830953998, 0.406135054050704, -0.380166358937945, 0.228673529825701
0.854001871385185, -0.811639935686076, -0.0626545472516889, 0.416328237876888, -0.367833559674423, 0.214939390959846
0.845075568226179, -0.859424364120744, -0.0835729515266962, 0.43773082894054, -0.339537939327389, 0.181614293819384
0.832300655160654, -0.906871454529919, -0.104265931262053, 0.460908381103569, -0.306169436527768, 0.140919348863745
0.815448264419978, -0.952635196299376, -0.123750550188746, 0.486728469409072, -0.267401787400259, 0.0930865787983499
0.805290486223773, -0.974814655823663, -0.132845305087317, 0.500729680660099, -0.245911358985469, 0.0664220529073224
0.793831031991979, -0.996481545947709, -0.141415014920519, 0.515433614693895, -0.223086278660763, 0.0379131757779166
0.78108082327843, -1.01768052557737, -0.14940092514595, 0.530860296122523, -0.198948550111543, 0.00745582178104157
0.751673968573953, -1.05852188152068, -0.16366969644393, 0.563930796995584, -0.147503096192568, -0.058297191677896
0.735123006375355, -1.07744246798824, -0.169581367987708, 0.581590261334475, -0.120406342455751, -0.0929966968031558
0.7173940098623, -1.09506100929933, -0.174515433147997, 0.60004832586113, -0.0926106838557984, -0.128586979625526
0.698654337746011, -1.11151737710035, -0.17854522079591, 0.619215571607517, -0.0644333889996318, -0.164801148873855
0.658564118870465, -1.14180778071602, -0.183759006717872, 0.660004395510502, -0.0073703910570644, -0.239095791216411
0.636833361962391, -1.15490200618195, -0.184420636424988, 0.682012179301182, 0.0217310800991921, -0.277507056044047
0.613793914864813, -1.16658471422514, -0.183629950432248, 0.705145047518012, 0.0512731992776113, -0.31711865953885
0.562805686899837, -1.18553667456946, -0.177632939695955, 0.753825784733619, 0.111934265210848, -0.400881566673441
0.534974281586164, -1.19312128839709, -0.172750878110331, 0.77874031273669, 0.142595862164491, -0.444762011467886
0.505040911391167, -1.19806315346412, -0.165995816148257, 0.803992651711215, 0.173864856654861, -0.490160259737476
0.473163655548282, -1.20059715848524, -0.15747329081047, 0.829337360410805, 0.20550105558383, -0.536744446268211
0.440418517739267, -1.20215450488983, -0.148243453758008, 0.8540648477107, 0.236483237030197, -0.583462556255729
0.407186889510977, -1.20300230963808, -0.138591215210365, 0.877746510981019, 0.266642529159386, -0.630022164541875
0.374060141570253, -1.20347536595702, -0.12886824946113, 0.89993698543184, 0.29567038273641, -0.675717793588847
0.342113076375483, -1.20426383228348, -0.119822497836345, 0.919868308446897, 0.322576724595634, -0.719429414481623
0.311446394233461, -1.20523837495906, -0.111386096009763, 0.93718036792337, 0.347500923926868, -0.76123480660456
0.282825910443451, -1.20715129609368, -0.104210218164041, 0.95145499150933, 0.370140849140709, -0.800526383380823
0.257415614398423, -1.21142466169019, -0.0991015009476673, 0.962440309227121, 0.38960330884573, -0.836588980455891
0.237049750418563, -1.2195094675132, -0.0978219091043555, 0.968592908154552, 0.404770040548629, -0.867041832233155
0.209616769662133, -1.24244698585674, -0.103034498048018, 0.970560377538266, 0.424198630465858, -0.912164476140137
0.202551190506542, -1.25690322369324, -0.109173019824724, 0.967600585833637, 0.428679474276073, -0.926489197932484
0.19964860070157, -1.27275415769779, -0.117243100438532, 0.962760418859567, 0.429818577664832, -0.935118623829688
0.200762697164901, -1.28946509402808, -0.126787793844972, 0.956539707511053, 0.427664678974585, -0.937833330105145
0.212747640918025, -1.32252638823997, -0.148214888047038, 0.9415106611563, 0.414786409692279, -0.926998278530741
0.236617694376886, -1.35592436930577, -0.17303235373918, 0.922836853615602, 0.391066825974682, -0.896668653691613
0.267595394651174, -1.38311012530491, -0.197110208545483, 0.902630506563218, 0.361161543121559, -0.852487682191297
0.284343797088074, -1.39300780951997, -0.207782725005579, 0.892343965588187, 0.345080418097738, -0.827279823712684
0.317394785371629, -1.40300022552437, -0.2240983114711, 0.871945510286968, 0.313145898477038, -0.77514933179315
0.345716381473775, -1.39717545139636, -0.23125609814948, 0.85267118467011, 0.284619432513387, -0.725775920587389
0.357377129987834, -1.38841031878951, -0.231294840598668, 0.843314908231047, 0.272210087176281, -0.703401045929335
0.376828268647848, -1.36334869105442, -0.226778501598975, 0.823565484208671, 0.24939110662567, -0.663059472275629
0.39219664743104, -1.33180372773123, -0.218515830736176, 0.801023446701785, 0.228109436398047, -0.628032182838964
0.405480207367148, -1.29740609627461, -0.208979980437238, 0.775456524453177, 0.206550919811493, -0.596407315315955
0.412533237365608, -1.28067510896905, -0.204717810582095, 0.761308842415584, 0.194535054943995, -0.580517388897693
0.420252188596057, -1.26496436265014, -0.201371425769666, 0.746097931171248, 0.181509367297278, -0.56435926586502
0.428780200404369, -1.25010816051222, -0.198968620010613, 0.730076090398028, 0.167667930724785, -0.547817619938586
0.44763154409571, -1.22307416275715, -0.196839903560442, 0.697091899466082, 0.138430405111401, -0.514224218682137
0.457797876721425, -1.21054028656084, -0.196853097257047, 0.680824832207252, 0.123322540519392, -0.49706860694014
0.480269091125779, -1.1886344038196, -0.199053408183355, 0.649758525628245, 0.0918264730109258, -0.460780737893753
0.505490311687414, -1.17046309189431, -0.202887454166249, 0.619884286828917, 0.0580417628651457, -0.420753263698604
0.531011687529295, -1.15281475862273, -0.205210101403183, 0.59164057898038, 0.0239409854733285, -0.378237269751139
0.543208636711694, -1.14312678604246, -0.205003412306596, 0.578498542400215, 0.00766320891072155, -0.356724190450035
0.565579888837948, -1.12098581821972, -0.201434233626654, 0.554357524668784, -0.0224138068538851, -0.314305704143122
0.583482113803642, -1.09329784884097, -0.192746449694375, 0.53291662632515, -0.0478775470845998, -0.274847965242713
0.59015731103316, -1.07738112137288, -0.186395251380767, 0.523353019550959, -0.0584667794458771, -0.257190670611855
0.599970861524093, -1.04338742076864, -0.170974217441147, 0.505992585465846, -0.0764690045980413, -0.225631032176251
0.606891673735832, -1.00906201770181, -0.153828927507396, 0.489719578599468, -0.0926425848086755, -0.197271409754806
0.611760015333912, -0.97483041580711, -0.135795802777795, 0.474331686645078, -0.107435857729431, -0.172028977753539
0.614155436843132, -0.958265428735358, -0.127025219770517, 0.46695130804222, -0.114800781247012, -0.15999450836829
0.619729917368423, -0.92692487911371, -0.110655896205516, 0.453194891703747, -0.12888044404085, -0.137151436322259
0.625210744145449, -0.897970732423864, -0.0956472570905047, 0.438324149826723, -0.143823586853132, -0.115636288853052
0.627607924535441, -0.883519872067799, -0.0883010355861172, 0.430879024882968, -0.150758896783361, -0.106034325438907
0.630873148728204, -0.853754223704314, -0.0732439564631188, 0.416052196384639, -0.162766767145957, -0.0898779033008313
0.630638019650072, -0.822124809260393, -0.0571595887900498, 0.401329536268513, -0.171549184236832, -0.079048632868789
0.628995422244121, -0.805630616754562, -0.0487492235431713, 0.393946073472813, -0.174725983780486, -0.0758354683379492
0.626321147518592, -0.788744157314975, -0.0401383606402272, 0.386573891622782, -0.177051762883138, -0.0741979112108509
0.622888543322781, -0.771903235389753, -0.0314279246982765, 0.37934794751107, -0.178717640475296, -0.0738730725129813
0.615189626652824, -0.739279990660669, -0.0144930315672101, 0.365872893833779, -0.181520938891138, -0.0752308289263746
0.609543633100211, -0.710963565684211, 0.000317212185263338, 0.353504318645863, -0.186418473025011, -0.0753083649276092
0.608168133972266, -0.698753697704029, 0.00675617537265479, 0.347517381374056, -0.190325531358669, -0.0737912004205565
0.607839902757909, -0.676875368300009, 0.0185049620754979, 0.33607409702718, -0.200754443815435, -0.0674602857482516
0.609966857046178, -0.657072527616019, 0.0293705569977506, 0.32553678897771, -0.213619019593934, -0.0580691737040984
0.611544262311406, -0.647771950298407, 0.0345740156812745, 0.320521215380867, -0.220507548616757, -0.0526708590275861
0.614762787476862, -0.629956222534634, 0.0446640771692806, 0.31061475087398, -0.234194592195113, -0.0416102848908858
0.616262797536782, -0.621656275558553, 0.049587516976942, 0.305498984794265, -0.240712103319745, -0.0364193076573787
0.617461376104335, -0.613552065216067, 0.0546050884600828, 0.300193964464182, -0.246679825681394, -0.0319623153717001
0.61821909096776, -0.605488323756319, 0.0597371731092638, 0.294644417968251, -0.252015769630341, -0.0283701852945386
0.61860850953944, -0.597436791844843, 0.0650123371517666, 0.288840111591147, -0.256751315712241, -0.0256631118350715
0.618643838389873, -0.58945108858126, 0.0703389616928928, 0.282794206692576, -0.26094471081586, -0.0238503602229717
0.618327458212422, -0.581353739002303, 0.0757498824657518, 0.276440934224767, -0.264685942836329, -0.0229758999886398
0.617717554589454, -0.573218726587597, 0.0812239879920318, 0.26983163970593, -0.267878102047003, -0.0229662859479394
0.616822577528954, -0.565112696625876, 0.0866921914007639, 0.263031252102034, -0.270507498229112, -0.0237358243602411
0.615583019990989, -0.556911377591562, 0.0920996220159045, 0.256135399865783, -0.27267334275044, -0.0252849440564392
0.614077609496544, -0.548689658265874, 0.0974433342215017, 0.249264686810249, -0.274499187629379, -0.0273266202096374
0.612567491093797, -0.540697831261939, 0.102551067369577, 0.242513867347235, -0.276303512092533, -0.0295090230914182
0.611188925592478, -0.532995738465009, 0.107375947023873, 0.235924549749123, -0.278256997000224, -0.0315496300685277
0.609184015025177, -0.518473845703693, 0.11644157262982, 0.223164041546708, -0.282846919198733, -0.0345226636743504
0.608439569877242, -0.511670377881309, 0.120671551637024, 0.217072830204782, -0.285637454978528, -0.0353321316172257
0.607185144880215, -0.499161680162339, 0.128474988179155, 0.205640885074747, -0.291965727938992, -0.0357512429022271
0.606564797943482, -0.493576487665517, 0.132029345244999, 0.200266338332585, -0.295249335401342, -0.0356127455479896
0.605824138248318, -0.488349959288408, 0.135420608326971, 0.195090502679344, -0.298463396997778, -0.0354369374178259
0.603688531926314, -0.47868827455462, 0.142138588938208, 0.185349309090158, -0.304198773916614, -0.035198307821245
0.602273703675642, -0.474127548524564, 0.145414962653612, 0.180660782804917, -0.306584776313057, -0.0351306023131207
0.600644561917812, -0.469594196588718, 0.148633730532614, 0.176026800362723, -0.308684031326559, -0.0351245655664828
0.59864013063893, -0.464908549350999, 0.151849278775682, 0.171513855372585, -0.310484526442068, -0.0351806356258181
0.596332842050011, -0.460140726058596, 0.154877542557981, 0.166853826516575, -0.311903230944141, -0.0355316650148768
0.593713908402676, -0.455270830506603, 0.157716654803972, 0.162164010868315, -0.313112417912382, -0.0359820646253538
0.590975888338518, -0.450402421557392, 0.160326892439337, 0.157473629722003, -0.314256763637874, -0.0364472849131416
0.585619230111916, -0.441037925169932, 0.165073864267334, 0.148235974639572, -0.316683764043269, -0.0371000129177041
0.583026171847016, -0.436601173758572, 0.167360802369366, 0.143738008750004, -0.317911587813788, -0.0372501023303186
0.58048533083893, -0.432288352691214, 0.169638577684738, 0.139406078593919, -0.319028602455994, -0.0373782707373186
0.575595385532449, -0.424248916405172, 0.174157009233642, 0.131386797681726, -0.321131704707493, -0.0378270517257095
0.573217164042014, -0.420473718843281, 0.176370778816802, 0.127791325758132, -0.322141237896399, -0.03825559254467
0.570964335071638, -0.416815995521188, 0.178538730228584, 0.124504712879904, -0.323109645123197, -0.0387966744823629
0.568823168831898, -0.413363970951698, 0.180673864170189, 0.121532430007428, -0.323998514193292, -0.0394111327719975
0.564702413131384, -0.407033726151693, 0.184966179678054, 0.116411994295004, -0.32524550191083, -0.0408844354759744
0.560597583326601, -0.401627203436109, 0.189392300264318, 0.111995251567128, -0.325938943106153, -0.0427700720651347
0.558495949890666, -0.399378032036747, 0.19158466511602, 0.109876442423383, -0.326117003907224, -0.0439183824401942
0.556299566250487, -0.397432640563022, 0.193714153332424, 0.10777049064843, -0.326272453500642, -0.0452435828753557
0.554054774827893, -0.395752490183131, 0.195695095432927, 0.105703610437488, -0.32655857119093, -0.0466994485115567
0.549633343549596, -0.392982108107351, 0.199396432436126, 0.101553599663163, -0.327352030939735, -0.0496283674296275
0.545682687942835, -0.390757749616221, 0.202891372691763, 0.0972214151594544, -0.328536990430128, -0.0523479963729271
0.543919234756391, -0.389804277933437, 0.204537569498822, 0.0950013267660621, -0.329344052099871, -0.0536528655440041
0.540755089347831, -0.387946668037498, 0.207466554911723, 0.0905785859448031, -0.331082362081726, -0.0559843826573955
0.537916546415559, -0.385906775762661, 0.209813200973199, 0.0863767727922069, -0.332680638206935, -0.0579565411148662
0.536609829817844, -0.3848740799886, 0.210806354497134, 0.0844410822738212, -0.333388958485014, -0.0587732739818423
0.534215863187348, -0.382881920225836, 0.212512317660672, 0.0810286092911768, -0.334774118543269, -0.0599647185079654
0.532006380213639, -0.381026816618903, 0.21404023818456, 0.0781602347567263, -0.336375332221436, -0.0604588638722216
0.529828315317784, -0.379161701437624, 0.215583207228607, 0.075655015075472, -0.337750385140077, -0.0600637436751722
0.528713269870389, -0.378212744754441, 0.21641496075129, 0.0745304393767892, -0.338172631099252, -0.0596766957196096
0.527574502674799, -0.377264791317333, 0.217290757674454, 0.0734497696819064, -0.338539065408297, -0.0592304917152868
0.526392683884062, -0.376286674680609, 0.21818383549352, 0.0724173743898899, -0.338934097205237, -0.05871800626646
0.525137716307825, -0.375321242828369, 0.219142691050558, 0.0713539886416166, -0.339308982684627, -0.0581636096204736
0.523843971806389, -0.374398988518966, 0.220234013066052, 0.0701045931525489, -0.339582516387172, -0.0576352358864337
0.522555458920108, -0.373585678394272, 0.221427569082677, 0.0686440670955287, -0.339723447356468, -0.057191051319725
0.52019189022863, -0.372442008617855, 0.223676051895691, 0.0653310518994652, -0.339928460201799, -0.0566698508149162
0.519068079029587, -0.372061482354465, 0.224603536174837, 0.0636197346710323, -0.340197930199857, -0.0567469653637438
0.518041092620933, -0.371771454057937, 0.225451360279749, 0.0618356801317511, -0.340506581297748, -0.0570496424876296
0.516386888473227, -0.371390890526497, 0.226826610367988, 0.0581892240354471, -0.341413956087816, -0.0580175862541186
0.515818884325203, -0.371329786322852, 0.227336300739269, 0.0563406695155715, -0.341997225599379, -0.0586953961157315
0.515430627543986, -0.371408342655789, 0.228146603130082, 0.0524446959173776, -0.343209091617233, -0.0602612026630346
0.515642243411973, -0.371501986214276, 0.2285135013624, 0.0504662840452632, -0.34385318358037, -0.0609815451199013
0.516029338907108, -0.371636564793615, 0.228952708115805, 0.0484786794346149, -0.344576852515721, -0.0615852823715406
0.516575333109126, -0.371726218243348, 0.229443852531598, 0.0464925331908324, -0.345331611624251, -0.0621487543225493
0.517236483483596, -0.371801180240541, 0.22997962987315, 0.0445105907505956, -0.346042516332639, -0.0626555090820377
0.517966546021134, -0.37180639373611, 0.230591329575127, 0.0425285857197711, -0.346679526707642, -0.0631494529174973
0.518742391458972, -0.371752570167177, 0.231281084642944, 0.0405742165935182, -0.34720922233848, -0.0635680410031198
0.519508926460466, -0.371634780885032, 0.232009091610998, 0.0386911006822933, -0.347645248348354, -0.0639503395615384
0.520246961749114, -0.371452773286965, 0.232733709785191, 0.0368915693459281, -0.348036701603097, -0.0642836488719395
0.521723645972249, -0.37076936826678, 0.234165662280627, 0.0335309162199306, -0.348757544080886, -0.0650121396838173
0.522462401698457, -0.370204521998639, 0.23490685163434, 0.0319105714881621, -0.349045796081538, -0.0654365098666191
0.523155662474501, -0.369479066502523, 0.235707780374595, 0.0302852910991683, -0.349253334910721, -0.0659198692818908
0.523769425258571, -0.368628623431149, 0.236577850237444, 0.0286867435168882, -0.349351622436206, -0.0664562206261042
0.52427839542159, -0.367689141831551, 0.237436616509048, 0.0271414823542765, -0.349415402934138, -0.0670088845184403
0.524663953637645, -0.366720833022607, 0.238261024103128, 0.0256621549241, -0.349472729996881, -0.0676276527553662
0.524962693927388, -0.364604869135232, 0.239830899077937, 0.0228242040388081, -0.349635164579756, -0.069238586796231
0.524800909099883, -0.362425346829558, 0.241183616774599, 0.019957280658233, -0.349734708687981, -0.0713512180674833
0.524386437937236, -0.360266340654912, 0.242371257626419, 0.016808031920895, -0.349591630447397, -0.0739050465643177
0.524125109929223, -0.359197957704941, 0.242897696712987, 0.0151514701395299, -0.349515089156558, -0.0752792159243063
0.523847255834708, -0.35815829703404, 0.243371350920177, 0.0134783615411975, -0.349472790869547, -0.0766424223752276
0.523519845111882, -0.35716266441827, 0.243768477420734, 0.011782635624875, -0.349519066801559, -0.0779870699687503
0.522791693618741, -0.355191459296707, 0.244248422533574, 0.00846402231905471, -0.34987332869457, -0.0807731053800899
0.522440978079032, -0.354177170360599, 0.244427318845765, 0.00690089233823049, -0.350182909945396, -0.0822219916682487
0.521685818680739, -0.352029181484568, 0.244679405107654, 0.0039950809471248, -0.35111133155507, -0.0851232822874689
0.520857764201093, -0.349665182734469, 0.244667850916524, 0.00151777029311259, -0.352379481005496, -0.0877770958015036
0.519855375635692, -0.347049284525902, 0.244360131886615, -0.000472539920761847, -0.353801736482855, -0.0899854422201996
0.519298305311952, -0.3456654042881, 0.244190971831607, -0.00125318626546704, -0.354546129709567, -0.0908833470131974
0.518126202239706, -0.342864041272887, 0.243931329523451, -0.00247399296656439, -0.356067577108693, -0.0922309221487093
0.516826725617027, -0.340179945530392, 0.243778387411719, -0.00337244881192876, -0.357535173246909, -0.0932901615608878
0.51623425288215, -0.338964343207269, 0.243650704443274, -0.00369923686582142, -0.358293974137836, -0.0937397086414484
0.515259779839282, -0.336812579187357, 0.243059670735747, -0.00417757394030291, -0.360099651399624, -0.0945225925096343