0.513444496721852, -0.340904128989528, 0.0963086096067876, 0.040409458069938, -0.285329550713416, 0.100511748259128
0.517213576503412, -0.348139454440874, 0.0877772233419616, 0.0413589194539652, -0.293470262528182, 0.11088948604455
0.519641374082517, -0.351918907617866, 0.0836141231441912, 0.0416095331002286, -0.297631689928425, 0.115740158097291
0.522391711381338, -0.355790045110865, 0.0795378463969477, 0.0417415991147027, -0.301696774109951, 0.120283854415713
0.5289248836657, -0.363804326569858, 0.0714258161406749, 0.041864378337661, -0.309650655806202, 0.128825577743379
0.532889775730341, -0.368024617181553, 0.0672603122906273, 0.0419764183884631, -0.313648703922657, 0.13306085384063
0.537495429539959, -0.372490909719152, 0.0629533243098344, 0.0421730441391993, -0.317793315713758, 0.137467062931109
0.542738518546786, -0.377188202496489, 0.058508925950571, 0.0424744713182561, -0.322031522326098, 0.142084134610939
0.548420387477183, -0.381991673997744, 0.0540357998454917, 0.0428832729929759, -0.326165916170383, 0.146694869916966
0.554348538418048, -0.386808455146858, 0.0496204184092154, 0.0433415801331327, -0.330052790606798, 0.151065810458511
0.566615427281279, -0.396421452885704, 0.0411566163427008, 0.0446688030267307, -0.337039159213555, 0.159043063172138
0.573335167608652, -0.401444087298585, 0.0368290200618493, 0.0456194558613624, -0.340480651007225, 0.163107083137709
0.580434036759794, -0.406744090558119, 0.0324140456032789, 0.0468223702213281, -0.343897814838758, 0.167063302563642
0.58804037886447, -0.412423163995623, 0.0278140729442089, 0.0482754237870776, -0.347359205036954, 0.171080650908831
0.596057081012131, -0.418457581188441, 0.0229782157168559, 0.0499372627500054, -0.35064740997335, 0.174914693102774
0.60457921068534, -0.424860979986908, 0.0178282219605182, 0.0517515295778092, -0.353837363733022, 0.178676123857688
0.622516986194925, -0.438930174771866, 0.00646085740435449, 0.0558191248885044, -0.359351774498469, 0.185226753656548
0.64168568975929, -0.454583861245529, -0.00615641405886708, 0.0605610383490004, -0.363968869680467, 0.190797101976455
0.651472091949643, -0.462851946976771, -0.0128333091747645, 0.0632795693811123, -0.365856142977873, 0.193311121222872
0.661444894657376, -0.471620876476986, -0.019859791588845, 0.0661616446995355, -0.367560444257493, 0.19576368418076
0.671657970186018, -0.480855719752551, -0.0272192753176136, 0.0693929504785087, -0.368991173838095, 0.198351502566888
0.682020874154397, -0.490336647176208, -0.0348845135649145, 0.0730597788135921, -0.370074608782781, 0.200981920569888
0.692518426434399, -0.499945488461025, -0.0427968341801615, 0.0772953068074425, -0.370768006885388, 0.203664651203225
0.714011571188447, -0.51972974650848, -0.0593263669261121, 0.0875363302390103, -0.370871687442774, 0.209152991131927
0.736434749062307, -0.540246120522495, -0.0768717258202121, 0.100298619312232, -0.369250604464881, 0.214724779927937
0.747957902798198, -0.550800965269113, -0.0860053114287045, 0.10779333928616, -0.367861004148814, 0.217735321891527
0.771426541920388, -0.573032683091368, -0.104821821663952, 0.125032321001509, -0.363856069897871, 0.223931037105027
0.783194183077347, -0.584930208170688, -0.114492810222045, 0.13480821217642, -0.361348841764483, 0.227180486915942
0.806850543639883, -0.610690848711865, -0.134477658968197, 0.156243085258844, -0.355778416168322, 0.234782266995466
0.83017987355562, -0.639006605237668, -0.154866781309229, 0.179800784089011, -0.349816374523845, 0.243334927453544
0.841071383977887, -0.653819128103607, -0.16490605567381, 0.192128013263599, -0.346467308429086, 0.247148765431929
0.851215724376889, -0.669150035502824, -0.174901589184318, 0.20454232421013, -0.342840666243921, 0.250378510760553
0.860546546080167, -0.684943845274573, -0.184814858663088, 0.216942889839673, -0.338891361420557, 0.252828143399153
0.876335677986511, -0.717952426210932, -0.204454361408842, 0.241395426937858, -0.329764038435503, 0.254808246426992
0.882652389990034, -0.73520556345711, -0.214220457460685, 0.253314144824242, -0.324241378786585, 0.254054470226343
0.891127692575377, -0.770263120627763, -0.233158910487984, 0.276823575002896, -0.310431373515783, 0.247212420824626
0.894035801598345, -0.805674052608631, -0.251348052887042, 0.300168300672902, -0.291874674614189, 0.23220410050526
0.893287600432958, -0.823358657712821, -0.26019922378039, 0.311883404117608, -0.28060138744719, 0.2212385358067
0.891035620405064, -0.841011754575181, -0.268920665008558, 0.323636566503734, -0.267962496461693, 0.207830191057338
0.887358447986903, -0.858626778888611, -0.277459236727064, 0.335514079062218, -0.254071838132973, 0.19223245296343
0.882448662820579, -0.876032715326299, -0.285692387784152, 0.347662798094453, -0.238950492999521, 0.174536919952649
0.876482218820174, -0.893364750933784, -0.293557279594497, 0.360277218427236, -0.222629776807577, 0.154948200367703
0.862295867473314, -0.927684010060799, -0.308054937220354, 0.387393365052778, -0.187262520159377, 0.111080378871026
0.845837372315839, -0.962358201216948, -0.321344300076644, 0.417003642747541, -0.149907696347262, 0.0625290836933692
0.82747263132777, -0.998303945453443, -0.333760302029394, 0.44841780466976, -0.111846085071503, 0.0102732821068751
0.817582191371527, -1.01704031174819, -0.339583092749352, 0.464710935015109, -0.0926887671236512, -0.0170324324049723
0.795544408749723, -1.05545136387861, -0.350025623584676, 0.499038128089876, -0.0525767693152631, -0.0750338957571391
0.783272860686411, -1.07457357776352, -0.354525690394389, 0.517095854134324, -0.0314433685022006, -0.105821125263917
0.756733139455866, -1.11300667575971, -0.362505944472714, 0.554634621429476, 0.0120107822904754, -0.1702442183954
0.743351386146271, -1.13348120099171, -0.366547890880403, 0.573713919644158, 0.0335018661763395, -0.202944493657769
0.716429379589558, -1.17740008407015, -0.374827590539634, 0.612902316611339, 0.0761655918948286, -0.269075546565115
0.702433250779543, -1.19989187926667, -0.37859538366789, 0.633223039448906, 0.0978057027836655, -0.302880313681653
0.687950960429324, -1.22241114168272, -0.382151351437824, 0.653784552534556, 0.119652787072954, -0.337144827369887
0.673145531138192, -1.24500653321782, -0.385677203383363, 0.674000502334474, 0.141365903475249, -0.371529436702877
0.658369428035038, -1.26797362522871, -0.389517668924952, 0.693339319385224, 0.162398349997598, -0.405537193669621
0.643576240132226, -1.29086645809977, -0.393482480743139, 0.711750233791904, 0.182906094272109, -0.4390675948863
0.628369341019089, -1.3130087741586, -0.397205964284518, 0.729354570690371, 0.20317300648331, -0.472410520095688
0.613206874143459, -1.33471463565914, -0.400705109816634, 0.746491878870585, 0.222764003489294, -0.504915013828564
0.582301576011919, -1.37413243675335, -0.405504694121569, 0.781008097287892, 0.261042441518579, -0.567353183802957
0.546309312243557, -1.39913738159513, -0.402560661235646, 0.819254519263825, 0.302568795959245, -0.629633161892366
0.506825587801556, -1.41036085145261, -0.393742824096566, 0.85769441714878, 0.345820981082082, -0.690516810140856
0.487075815458853, -1.41299875904384, -0.388704899660215, 0.875298575095098, 0.366910886107767, -0.719663220593067
0.466939637334251, -1.41302735820458, -0.383009038771957, 0.891442574529365, 0.387960902204986, -0.748435231750952
0.446425391355993, -1.41070059672456, -0.376829836569021, 0.905695004494201, 0.40897993960227, -0.7771269825768
0.4266328333951, -1.40762649351767, -0.371004437866411, 0.917536370202145, 0.428931870048962, -0.804815102866963
0.409125540481539, -1.40599631010604, -0.366746438794326, 0.926527956033442, 0.446345993247038, -0.829807991108815
0.395334974922329, -1.40767696236365, -0.36505100193274, 0.932425787384877, 0.459788705566294, -0.850279324846634
0.386566689889314, -1.41405604494429, -0.366673631746902, 0.935092994039451, 0.467997550726419, -0.864455471791202
0.382549271341055, -1.42402435873728, -0.370947878795279, 0.93504532515954, 0.471182758158042, -0.872062781781842
0.382956745755441, -1.43682796817452, -0.377388566071542, 0.932593688074662, 0.469637086909558, -0.873223110176306
0.387392802710745, -1.4516872553754, -0.385594851578311, 0.92791741384324, 0.463733688557456, -0.86825625516279
0.39440183359098, -1.46622025736715, -0.394172804003235, 0.92181767931033, 0.454950189056159, -0.858648706631457
0.403321807819323, -1.47951578192627, -0.402469575015086, 0.91481632636959, 0.444007809204642, -0.845198273490372
0.425538749221477, -1.501000805851, -0.417326915868654, 0.899250046522949, 0.417379931023438, -0.809278056620196
0.4378121229315, -1.50841419897845, -0.423379704897333, 0.890918303716365, 0.402700269732744, -0.788378537049256
0.462636654275494, -1.51560111206197, -0.431922660013898, 0.873847831315952, 0.372923906541278, -0.744680473197456
0.485342198148633, -1.51206825886904, -0.435095684223953, 0.856760715675888, 0.344801457869649, -0.703025528281052
0.495283326381572, -1.50680832117449, -0.434787993489845, 0.847894116725838, 0.331797042671716, -0.684179556605757
0.504462111639747, -1.49998055697639, -0.433622389516803, 0.838530221367816, 0.319124196275571, -0.666514654621947
0.512811019289409, -1.49180655193126, -0.431676441505044, 0.828502328315372, 0.306773989339164, -0.649992001322009
0.520558386819044, -1.48258374610039, -0.429332025317781, 0.817665584490514, 0.294541173093188, -0.634389455265887
0.527700497734804, -1.47216791795026, -0.426616464933009, 0.806126223272185, 0.2825592238023, -0.619615983818443
0.540599251631705, -1.44804255675004, -0.420048698469067, 0.781445707378388, 0.259530036232101, -0.592486474438549
0.546051433936326, -1.43391760182077, -0.416028739178302, 0.76881508298798, 0.249088111100291, -0.580512074909242
0.550755682451418, -1.41845158314116, -0.411501008030998, 0.756381890878981, 0.239778454416385, -0.569701310827631
0.556345130072428, -1.40197294775325, -0.407801787735982, 0.745465764762761, 0.232616203421051, -0.55964414198368
0.565712936770321, -1.36891453767898, -0.398700585097571, 0.721303491387815, 0.216603887286317, -0.539132302416733
0.570652143467166, -1.35247329286583, -0.394379343262177, 0.709428976246849, 0.208868139399702, -0.528573567097638
0.581504681825266, -1.31998983896412, -0.385792927720281, 0.686143761942421, 0.193068684623408, -0.505558740759418
0.586740356465395, -1.30343204438405, -0.380836440372136, 0.6752472662065, 0.185349175810279, -0.493611389237121
0.595906453194185, -1.26936490566068, -0.36885235260865, 0.655441136781933, 0.170685496503568, -0.469468250647999
0.599671902947785, -1.25193465041301, -0.361825792337941, 0.646569736064168, 0.163674106428029, -0.45734329308388
0.602991180667433, -1.23452911229276, -0.354356949147359, 0.638149308452123, 0.15662179797558, -0.445105642130573
0.606157043417084, -1.21761807213653, -0.34677034267237, 0.629838753239702, 0.149222069065607, -0.432560527664554
0.609249484304147, -1.20128722586239, -0.339166713359356, 0.621508989759977, 0.14139093400508, -0.419687461520843
0.612324160230967, -1.1852938000303, -0.331482398092326, 0.613096316698521, 0.133197996295485, -0.406574873732128
0.6151719309316, -1.16950285770231, -0.323612155865429, 0.604649883634615, 0.124797005766772, -0.393423409698074
0.617589280316982, -1.15370714848423, -0.315479977718954, 0.596256398558917, 0.11646698288867, -0.380493481318387
0.619542702884157, -1.13791915012864, -0.307192612623575, 0.587895412199541, 0.108373749167047, -0.367927703424212
0.62216787095424, -1.10647790252966, -0.290666000550335, 0.570951871667259, 0.0929412033369887, -0.344220823229506
0.622720069417386, -1.09087043453588, -0.282467678332319, 0.562298940919624, 0.0856518567207283, -0.333350523885824
0.623004406517716, -1.07544918608766, -0.274387677284027, 0.553425610465528, 0.0785984439866581, -0.323066159631091
0.623185521567361, -1.06033054678692, -0.266502831174491, 0.544397910727513, 0.0717266617397555, -0.31334669540126
0.623166588837637, -1.03076626228949, -0.251235037438328, 0.52641261278995, 0.0588607496696809, -0.295894716841219
0.623467572691041, -1.00251782345827, -0.237209302111608, 0.508862312703324, 0.0468457027333536, -0.280129523445244
0.623900735116497, -0.988824606904454, -0.230601868181721, 0.500333214748871, 0.0410097734858313, -0.27264822459144
0.624564821854694, -0.97536949120336, -0.224187374353223, 0.491930737048757, 0.0350478199427912, -0.265183117436173
0.625851370837003, -0.948331827729869, -0.211089495006148, 0.475535380275573, 0.0229094909162432, -0.250401509958263
0.626658508234421, -0.920764947637701, -0.197097538302583, 0.459777411195595, 0.0105337167931762, -0.236130971456912
0.627305430340938, -0.907260780717096, -0.189928005640844, 0.452214795116594, 0.00399775265685255, -0.228785519392282
0.628609689151304, -0.88022964537224, -0.174900087328865, 0.437870151061096, -0.00949742728993487, -0.21410432743736
0.628971629955133, -0.866345070368842, -0.166772527295096, 0.431143905465478, -0.01619504693691, -0.207236260757766
0.629088029229244, -0.852282334877287, -0.158242088120202, 0.424594168024218, -0.0227302152735423, -0.20077310442314
0.628563728364172, -0.824425645282729, -0.140643997999097, 0.41147337975846, -0.0355275379819232, -0.189223940928412
0.628047098772882, -0.811036284991581, -0.131897524314975, 0.404833038416421, -0.0419242126170358, -0.184113300944811
0.626266242886947, -0.785202253503152, -0.114605961337081, 0.3913921999069, -0.0547254609794238, -0.175383201963937
0.625036665934957, -0.772796627203698, -0.106230705750158, 0.38440368390543, -0.0613709646047852, -0.171576274715909
0.623773051811058, -0.761113350780192, -0.0982328997954729, 0.377137546469323, -0.0684038883107915, -0.16786311832626
0.622638611430996, -0.750239237380138, -0.0906967880912239, 0.369618336045712, -0.075948150132247, -0.164093231707249
0.621658067725328, -0.7400898016673, -0.0835345813312751, 0.361848735888849, -0.0840210148283006, -0.160200877446956
0.620891516768202, -0.730177341272255, -0.0768973053254753, 0.354266196655703, -0.0918767566765616, -0.156553366020106
0.620013577029074, -0.720794958304608, -0.0701450709897716, 0.346099455893912, -0.100250338656875, -0.152879697534278
0.618954914303212, -0.711311962454169, -0.0634099176219068, 0.337859651558165, -0.108344095589499, -0.149561218990496
0.617575595956251, -0.701640857975112, -0.0565890835775983, 0.329655252646688, -0.115993018659091, -0.146676707698806
0.615954002946202, -0.691686397350548, -0.0496845229044732, 0.321466478320834, -0.123251578104404, -0.144066095986184
0.614160731127283, -0.681686221273326, -0.0427031107532802, 0.313473333163807, -0.130134446798883, -0.141594881141062
0.612339416385038, -0.671762121102842, -0.035749995663759, 0.305701689338072, -0.136769389402066, -0.139132092467555
0.610453533476359, -0.661705876204384, -0.0288110324333205, 0.298202047328643, -0.143168328490336, -0.136673742125252
0.6084041401729, -0.651359519482706, -0.0217616741888455, 0.291023563308831, -0.149172435235314, -0.134318486598911
0.60615402775328, -0.640863895673897, -0.0146225060458633, 0.284106063613207, -0.154809555155063, -0.132166532929765
0.60388132741209, -0.630673642486095, -0.00751972969235376, 0.277369910365783, -0.160274969521959, -0.13011757832069
0.599380450537115, -0.611442194990947, 0.00662140138348894, 0.264600606373492, -0.170877381931507, -0.126076424359219
0.597197437253115, -0.602302051926011, 0.0137012326235352, 0.258515892706425, -0.176212542043038, -0.123981300808616
0.595129452890044, -0.593395518806684, 0.0207296890302264, 0.252517188885524, -0.181710611982845, -0.121685025021084
0.593213547783865, -0.584718635317505, 0.0276456652678511, 0.246575212674872, -0.187450364968394, -0.11909334785974
0.591496078088066, -0.57636903673822, 0.0343439587900905, 0.24058652151527, -0.193430409432841, -0.116230067834067
0.589911311081113, -0.568341911354478, 0.0407621576439768, 0.234512582711123, -0.199561234873951, -0.113126722130817
0.587055047579246, -0.553247553804758, 0.0525981904899192, 0.222133853880806, -0.212305106034667, -0.106338420490561
0.585590404014699, -0.546084860585465, 0.0580340542751707, 0.215790636133806, -0.218706981660495, -0.102891118539137
0.582205573352252, -0.532574703892334, 0.0684869068550702, 0.202700140745721, -0.231466778325763, -0.0961084005131107
0.577518480221064, -0.519565890474241, 0.0786396421226466, 0.189358058013001, -0.243749782959457, -0.0899888063041966
0.574608890638257, -0.513193812570941, 0.0835868050932613, 0.182630230218104, -0.249472225986718, -0.0874260255297088
0.571499887709547, -0.507062874126293, 0.0883447029726544, 0.175875122032664, -0.254876451912246, -0.0851556465201317
0.568263348290549, -0.501096973391778, 0.0929320711562217, 0.16907220781322, -0.259895699502531, -0.0832193112277085
0.564923984195173, -0.495163496319195, 0.0973393130091781, 0.162256800881765, -0.26450374245424, -0.0815240006434804
0.561538811861622, -0.489141827656783, 0.101667317102235, 0.15538031983631, -0.268668118911135, -0.0800191731790189
0.558096190797256, -0.482863081621699, 0.105916978478376, 0.148561337854189, -0.272342255424238, -0.0787653128357154
0.554696619344628, -0.476245011714939, 0.110068065885617, 0.141882403953976, -0.275407048606141, -0.0778191797878554
0.54795384447871, -0.462106164368962, 0.118088614259791, 0.128982673444853, -0.280056906995433, -0.0765227728360912
0.544841520140371, -0.454910050784913, 0.121865818767339, 0.122836484650777, -0.281918630589164, -0.0758337957710342
0.542148006636566, -0.447947876532433, 0.125402255690146, 0.116894936972019, -0.283718245028555, -0.0748226175928847
0.539850551149688, -0.441301221558358, 0.128713555274278, 0.111236949201607, -0.285496710480238, -0.0733775050520779
0.537887528038502, -0.434867746857522, 0.131896343385041, 0.105837464371227, -0.287276851299909, -0.0715023778679304
0.534548023138607, -0.422503238761687, 0.138041709861922, 0.0960220121574213, -0.290859715328249, -0.0668725180198275
0.531558698432918, -0.410547225620032, 0.144303171836948, 0.0874827674859471, -0.294260804305828, -0.0619356983581809
0.529016491692552, -0.398877555590098, 0.150867229670756, 0.0803556822432044, -0.297336592441774, -0.0568490899814578
0.527182564551708, -0.38764886624566, 0.157608282539594, 0.0743045695907923, -0.300181920540604, -0.0517520710008738
0.526194892835961, -0.377831911038849, 0.164059494341519, 0.0689335061323903, -0.302880722944341, -0.0467200478270318
0.525604496584389, -0.369037782923695, 0.170052823005751, 0.0636492743965854, -0.305251878151603, -0.0421940875837992
0.525312799337381, -0.364878300465993, 0.172938100565566, 0.0608067455769427, -0.306112361002316, -0.0405459057448663
0.524779537389557, -0.356921559878281, 0.178558572334781, 0.0545019807975363, -0.307359556072627, -0.0383997108226041
0.524541784851885, -0.353153331085397, 0.181311555567723, 0.0510662897698918, -0.307668041241615, -0.0378386720756731
0.524390391485076, -0.346592253600572, 0.186446953016693, 0.0435459799958855, -0.307799302030925, -0.0374742534344412
0.52454321667944, -0.343845714412112, 0.188685491698108, 0.0394749807386854, -0.30766093366305, -0.0376150527648111
0.524836140200342, -0.341352160552461, 0.190696267243421, 0.0352597219353504, -0.307398596876481, -0.0379884435442355
0.525197642890108, -0.339013882010921, 0.192526793869385, 0.030961071854831, -0.306904348640724, -0.0385646736876948
0.525632791110115, -0.336805181708563, 0.19423788166466, 0.0266344562377472, -0.306226503951992, -0.0393209473617691
0.526119668157076, -0.334698973201283, 0.195803328902851, 0.0223552381475351, -0.305455521850206, -0.0402081178360224
0.526758981872363, -0.33265358729742, 0.197277682490912, 0.0181744475821651, -0.304665715531062, -0.0411637454001713
0.527546242768721, -0.330615870096983, 0.198658780129276, 0.0141614854614011, -0.303888228985725, -0.0421015242128238
0.528503188269404, -0.328518479573053, 0.199947251572665, 0.0103788683390846, -0.303245253203203, -0.0429580307469182
0.530964156852169, -0.323978141650875, 0.202325635353215, 0.00385869835427067, -0.302349376860467, -0.0443343799650133
0.532382139143454, -0.32149086011838, 0.203439626178495, 0.00118163602492973, -0.302107117610506, -0.044817472169131
0.533856043530934, -0.31880674108289, 0.204495245477014, -0.00108081052886477, -0.30196113985311, -0.0452322824443122
0.535299061580286, -0.315939470541585, 0.20552217223003, -0.0029333562549217, -0.301922667379945, -0.0456595939605003
0.53794231407031, -0.309896923337217, 0.207541869937745, -0.00562451958166989, -0.301968187941222, -0.0465478675183619
0.540225875117216, -0.30359981114347, 0.20947357956576, -0.00710999895808274, -0.302167110152557, -0.0473327776824525
0.541228094105476, -0.300431950324839, 0.210503977606614, -0.00751301394451555, -0.302273192393342, -0.0476984152897845
0.542107728443954, -0.297292903279233, 0.211574810043054, -0.00775794402966003, -0.302382788319945, -0.0480628310294018
0.54284856402073, -0.294281167339085, 0.212656545804227, -0.00789792497108939, -0.302538150278324, -0.0483299746023297
0.543522078018557, -0.291480176307814, 0.213731785806148, -0.00801134438848577, -0.302940439162403, -0.0484709579985114
0.544562290653373, -0.286626928099254, 0.216060127313259, -0.00841196846865059, -0.304223594722196, -0.0482845708017161
0.545408003502067, -0.282888644266036, 0.218455888298867, -0.00904962723708658, -0.30593656022529, -0.0478621679447863
0.545841474324166, -0.281447557328527, 0.219624523570554, -0.00943335028001948, -0.306835207987203, -0.0476025253851927
0.546324027785035, -0.28023371472367, 0.220745512476113, -0.00982349205689846, -0.307780100705874, -0.0473876652245644
0.546847418697354, -0.27922180720155, 0.221826230230647, -0.0101936071122698, -0.308738648888965, -0.0472459405451648