0.497891639861646, -0.262996038371203, 0.264789058496699, 0.0169038701233822, -0.233036517029976, -0.0620156977244924
0.468557951593278, -0.267203485548524, 0.280262540630882, 0.0208392571140878, -0.20459469997891, -0.0494516717552656
0.462761554960661, -0.268078206049695, 0.283523103907245, 0.0216187198136403, -0.198696239479776, -0.0468038873895118
0.451810735383788, -0.270343708218907, 0.289598216215496, 0.0232372763016647, -0.187225445137874, -0.0411763447989316
0.441304511952275, -0.272502258311012, 0.295116514997009, 0.0251751701803291, -0.176229334549014, -0.0354912457123911
0.431645637850602, -0.274475784263775, 0.299707293438557, 0.0276023343340884, -0.166115876531433, -0.0292938036396936
0.423272161256356, -0.276512943772472, 0.303009870674532, 0.0304432834269556, -0.157277748892851, -0.0220851821073833
0.416161585649637, -0.278224397195282, 0.305075377945008, 0.0337811259997863, -0.150015469141815, -0.0136601885401315
0.410270703033413, -0.279782164482743, 0.306332222703145, 0.0373208957213076, -0.144547481873376, -0.00424813440550481
0.407878922006243, -0.280592688262276, 0.306624961146039, 0.0391022037220873, -0.142601622688057, 0.000648977668233534
0.404226040010744, -0.282543250045303, 0.306497957827951, 0.0425842365214807, -0.140430070320272, 0.0106039247924183
0.401828520853024, -0.285100372964401, 0.305772281084818, 0.0458411946137497, -0.139935012536477, 0.0208260784474728
0.401078729234089, -0.286638970768119, 0.305219068094194, 0.0472612034045509, -0.14025476428485, 0.0259954037686027
0.400559588719516, -0.288367562351297, 0.304539056093239, 0.0484275256697016, -0.140828376008171, 0.03118131169518
0.400304547235432, -0.290262251708029, 0.303734201054556, 0.0492537599972494, -0.141606529891059, 0.0363085097883386
0.400187587131169, -0.2924026987789, 0.302880752629249, 0.0497313639470054, -0.142463811423638, 0.0413595715053285
0.401944227805465, -0.308871175131181, 0.296211031558142, 0.0479389651883438, -0.149641003583644, 0.0653836516829464
0.402866784658538, -0.313710743498952, 0.293941302559173, 0.047022235296644, -0.15198975429465, 0.0699036295803719
0.403977448554642, -0.319047730778418, 0.291254503314855, 0.0461305058187837, -0.154752455264727, 0.0743186666064055
0.40532321197232, -0.324960660180548, 0.288105184010804, 0.0452843035865933, -0.157840107780892, 0.0785824206000325
0.406920580969186, -0.331554270548609, 0.284429188629043, 0.0444825502360483, -0.161292807014307, 0.0828280641737196
0.408837253756021, -0.33892184913347, 0.280164046941268, 0.0437658174948327, -0.16518996388047, 0.0870700223006109
0.411002360529076, -0.347005531946726, 0.275390517262956, 0.0431874913956898, -0.169445850303006, 0.0912724659226495
0.413407956619004, -0.355846478503394, 0.27011376652903, 0.0426874169921495, -0.174003296939822, 0.0955075895186742
0.416168480332704, -0.365408386057858, 0.264275664586036, 0.0422269488293586, -0.178866666650165, 0.0997786565969138
0.419315054945213, -0.375794196775661, 0.257956527443755, 0.0417127357908115, -0.183998958934834, 0.104135939844014
0.422903429170625, -0.387017104879296, 0.251134729875976, 0.0410549195236209, -0.189573084511837, 0.108679216621146
0.426895967185729, -0.399096215600877, 0.2437811337369, 0.0402433996919422, -0.195571646901647, 0.113455050463942
0.431312110978782, -0.411928541483201, 0.236010935859771, 0.0392710958626938, -0.202090692619612, 0.118463471595013
0.436327200098067, -0.425565279742201, 0.227742743795904, 0.0381679351925503, -0.209302865734234, 0.123632766295762
0.442059089086046, -0.44002769444173, 0.219026302602906, 0.0369570530774961, -0.21735277935955, 0.129054006964985
0.448434288592805, -0.455250980225645, 0.209824027199185, 0.0356056112173652, -0.226340108609651, 0.134805367542934
0.455330487006044, -0.471147741907616, 0.200266675477579, 0.0340890982829542, -0.236097330155311, 0.140670710211073
0.462857048768719, -0.487673748992381, 0.190446498345621, 0.0324401633587959, -0.246798585050055, 0.146616852423081
0.47961410357787, -0.523222392833761, 0.169862196192475, 0.0285361234049482, -0.271018341777584, 0.158879018185284
0.488791465183749, -0.542353616737067, 0.159077890539643, 0.0261060588900412, -0.284458924876978, 0.165682731122089
0.498443566519262, -0.562935860356503, 0.14792809725534, 0.0233256348840343, -0.29857430391467, 0.1729000505071
0.508450361344394, -0.585427461440559, 0.13621777956088, 0.0202168680749383, -0.313217125132898, 0.18066857684955
0.518734819785866, -0.60994896548413, 0.123749218570065, 0.0166713868591863, -0.328497905896505, 0.189174282118596
0.529273132975248, -0.636375031335913, 0.110547891415874, 0.0126133771137957, -0.34467422510794, 0.198343944936525
0.540114112285369, -0.664392408195526, 0.0966512935236583, 0.00811890316791193, -0.362047504034969, 0.20822296878805
0.551359616027621, -0.693728426268129, 0.0821063221592504, 0.00327012467681956, -0.380707623883506, 0.218827834838797
0.563076914900438, -0.724612392199109, 0.0667133550562764, -0.00198160618807295, -0.4005633311467, 0.230341954105361
0.574974678775427, -0.756293258984937, 0.0506840566061692, -0.00760979657055873, -0.421396129187347, 0.242454005609953
0.586710239909001, -0.787716403630861, 0.0344650936752569, -0.0132204531045905, -0.442737929450418, 0.254623086105558
0.609028291132098, -0.848221409762408, 0.00208524101428475, -0.0237902424353563, -0.485537980980881, 0.278218755895592
0.619632043624126, -0.876789739865588, -0.0139213979377214, -0.0283969924733551, -0.506513233066575, 0.289582619169666
0.629904131966793, -0.903685137732497, -0.0296828942284378, -0.0323908312229701, -0.526982895921528, 0.300765507439546
0.63962657285775, -0.928791364392822, -0.0451659388134063, -0.0355750553084704, -0.546602491865926, 0.311340915951651
0.648926170594029, -0.952591724476545, -0.0605395266282515, -0.0380155779955956, -0.565346321260207, 0.321227625524647
0.657586286475258, -0.974772530766102, -0.0755386512250712, -0.039388815930059, -0.582513526465125, 0.329873997619788
0.665629494765553, -0.995112587394338, -0.0900677934112826, -0.0395197483957659, -0.597851758880602, 0.337208526976717
0.673247171139529, -1.0130594767605, -0.102256565039329, -0.0380862968975792, -0.61202607801346, 0.346157455793549
0.680398271755042, -1.03156078370599, -0.116274690979641, -0.0358194629581173, -0.623686114721714, 0.351527496322987
0.687334064831242, -1.0493549782302, -0.130350094173691, -0.0321635550209166, -0.633237731986174, 0.355581078354834
0.701179385589612, -1.08385741586905, -0.158645968919921, -0.0210848166473662, -0.645880427786655, 0.360438812414696
0.707721876384657, -1.10145277413373, -0.172857046790809, -0.0141338156600629, -0.649227148734082, 0.360897680989985
0.713399469515098, -1.11912260085192, -0.186825708864039, -0.00624699259630074, -0.649998457187947, 0.359404315869004
0.717851949646523, -1.13644680362781, -0.200124607365776, 0.00267144921255762, -0.648109095814942, 0.355691001272441
0.721159040269662, -1.15386001883815, -0.212855203133916, 0.0123680204213665, -0.643899082306957, 0.349781580658136
0.724135992187031, -1.18877168567887, -0.234323005032742, 0.0333719426869162, -0.62918490206458, 0.331898367771741
0.723443873085304, -1.20668798736362, -0.242468045746765, 0.0443205382201229, -0.619329638408557, 0.320347409609525
0.721164279656888, -1.22513421760504, -0.248847822473, 0.0553989285995803, -0.608194021700053, 0.307195088789584
0.717657294305905, -1.2441201306552, -0.253768854807186, 0.0665146531429101, -0.596157479545172, 0.29290111720296
0.713256421353094, -1.2635701261648, -0.257458698801797, 0.077470695378871, -0.583644269014767, 0.278128361085845
0.708283366676342, -1.28357700861982, -0.260075557604264, 0.0880943327649585, -0.570659604525174, 0.263101884696505
0.698171822004228, -1.32561923999449, -0.263334809862206, 0.107718544353634, -0.544138913264547, 0.233375302239456
0.693164305766825, -1.34708247937653, -0.264153024363913, 0.116819875830567, -0.530076807770626, 0.218452500693438
0.687978883710397, -1.36815966112779, -0.264637209133995, 0.125686388702328, -0.515198087830657, 0.203158539629332
0.682695812885681, -1.3885113882082, -0.265100564446387, 0.134479843257616, -0.49950095444807, 0.187621695099484
0.677316769811696, -1.40756392764859, -0.265575606695893, 0.143587624399322, -0.482728315319404, 0.171773302889665
0.672096263239287, -1.42535075910277, -0.266445139104348, 0.15328705802424, -0.465182728647753, 0.156165537806135
0.667588431707583, -1.44262176779609, -0.268457017362892, 0.163602933177067, -0.447471494362175, 0.141338622139924
0.66429941795044, -1.46007249679243, -0.272172521775273, 0.174494188334904, -0.430159084465635, 0.127856971918339
0.662432089561477, -1.47795518897678, -0.277718919925514, 0.185928830350724, -0.413250146460722, 0.115910270403028
0.662313712611915, -1.4969921318595, -0.285180053056818, 0.197684231296036, -0.396982189077654, 0.10560354781935
0.666348435114414, -1.53926128974048, -0.304799916459613, 0.2219849760097, -0.366850307026008, 0.0889911152273047
0.669249089583167, -1.56147756166742, -0.316024352430427, 0.234268794755302, -0.352251847008683, 0.0819143896143562
0.672181673053982, -1.58382656216879, -0.327988734980352, 0.246500411466948, -0.337401711821646, 0.0749074506451305
0.675029257143525, -1.6070930181466, -0.340789517107304, 0.258182773715132, -0.322177047939153, 0.0675758210113221
0.67528516734263, -1.64953513669012, -0.364420353534468, 0.281038798449861, -0.285360673217803, 0.0460273054416704
0.671928095211297, -1.66660934240617, -0.373972303078206, 0.29294858675592, -0.262314138446871, 0.0300588029237017
0.666105640446639, -1.6803310271344, -0.381568007479154, 0.305026393530428, -0.236732058213609, 0.0111339520674096
0.658737190582685, -1.69337133944519, -0.388210491872253, 0.316920594601514, -0.209545873975737, -0.0103348965836778
0.65091048750197, -1.70720571154522, -0.394712519638041, 0.328393402039776, -0.181963437918139, -0.0333045607402588
0.635872997306352, -1.73814044924987, -0.407917702187745, 0.350087568245693, -0.128779093364444, -0.0795058472355338
0.622976369527597, -1.74427435969966, -0.408430526444749, 0.364106787109907, -0.0974991906373958, -0.10738402506806
0.585663160036237, -1.73406132959219, -0.394705825964674, 0.398672433477202, -0.0274923808371823, -0.16965953410795
0.566179030632396, -1.7266297112753, -0.385466190202726, 0.415572046944423, 0.00421092234696987, -0.197942257911139
0.544117582231441, -1.71395421380216, -0.372962925619689, 0.432596355706852, 0.0347907165337647, -0.225965528418069
0.483446692576259, -1.6607135467928, -0.3312953577706, 0.469730835614749, 0.101336946420489, -0.291336346432103
0.41995508868803, -1.59831141040759, -0.285882789704292, 0.506163174382273, 0.16126534001887, -0.352385816592879
0.38939939899702, -1.57840623271843, -0.267881468426434, 0.530442775723791, 0.187130818490108, -0.375227094856799
0.377658896909142, -1.57834645916366, -0.265648539990135, 0.548155020789932, 0.196726212979986, -0.377118682295012
0.36345095950089, -1.56356635650396, -0.260240443657185, 0.566492191322732, 0.211742889948433, -0.380796175527405
0.338895921942186, -1.52378304110951, -0.24601902046104, 0.585245036768671, 0.23877365583673, -0.39488118109291
0.320209830308499, -1.4850062430392, -0.236904905566996, 0.595900833182258, 0.261269981501813, -0.403866197045069
0.318724558139608, -1.47467564629378, -0.238020351999083, 0.597877736217602, 0.266026862848439, -0.400912360980879
0.321101288540727, -1.4705969184071, -0.242389108099225, 0.598090289450777, 0.267541813798388, -0.395211862730655
0.325312977359831, -1.46869891127173, -0.246675901205067, 0.597321757869123, 0.267329435360671, -0.387382860286874
0.329784432897193, -1.46739657927585, -0.250413548137, 0.596236813582843, 0.26685594826965, -0.380150973403252
0.33423136831183, -1.46608122831322, -0.253129609000304, 0.594806676462794, 0.26612297573258, -0.373585500395031
0.338748274422221, -1.46514755149347, -0.254886708379841, 0.592893336293141, 0.26492465706261, -0.367628466088915
0.344134093960567, -1.46544762965404, -0.256305292336947, 0.590259673115948, 0.262628886188307, -0.361477223405181
0.351119078925139, -1.46782723877809, -0.258007600129769, 0.586841571749981, 0.258930826069312, -0.354423504489361
0.359856324243088, -1.47287158970626, -0.260343301916455, 0.582846458106556, 0.253478880254961, -0.346131703178455
0.370193220891892, -1.48043373957445, -0.263244783336997, 0.578242866462542, 0.246416194278968, -0.336547275768358
0.381398519094334, -1.4898999025643, -0.266512845190346, 0.573122732990715, 0.238212353747913, -0.32617249255351
0.392835105138154, -1.50045415256063, -0.269847341270224, 0.56741251486634, 0.22931292209744, -0.315406230817454
0.413720122075814, -1.52142209034068, -0.275247115292688, 0.555180818580644, 0.21151384502877, -0.295938590144302
0.422785249280048, -1.53077300211909, -0.277180939343256, 0.548466805865362, 0.20302040369911, -0.287831579539717
0.436781596770704, -1.54473244961451, -0.279207165525883, 0.534792585097566, 0.18872417398297, -0.27614910822697
0.442316549232808, -1.54988541789469, -0.279935768923743, 0.527715227652222, 0.182720381236778, -0.271800670121344
0.447294459610648, -1.5543284490354, -0.280773220151985, 0.520416541024814, 0.177135905528729, -0.267873715085242
0.452318614857027, -1.55867025451704, -0.282030417473758, 0.512833980556076, 0.17156962186783, -0.263808486222981
0.457915542566835, -1.56345806369132, -0.284004102438043, 0.504956139394619, 0.165702973380997, -0.25914074612837
0.464224738386041, -1.56861941431878, -0.28673892222406, 0.496960395850143, 0.159600289565515, -0.253788624834264
0.471085354444902, -1.57366725338306, -0.290010371936788, 0.489097673591085, 0.153605951683169, -0.247988913260108
0.478580899365195, -1.5785336588328, -0.293790944644802, 0.481486768749939, 0.147688690961978, -0.241765408544012
0.486099326469061, -1.58220608951598, -0.297448457305817, 0.47450902919035, 0.142408424079058, -0.235760415081771
0.493301540217392, -1.58441652178225, -0.300544982657704, 0.468238698815098, 0.137895986204182, -0.23028618168756
0.500099350989223, -1.58547503070601, -0.303034037700481, 0.462575318108283, 0.134114141292332, -0.225577793502878
0.506189633285933, -1.58518309018388, -0.304604632939983, 0.457576531335317, 0.131144621064133, -0.221757771507167
0.51137736139193, -1.58365637244521, -0.305169369333304, 0.453179657233941, 0.12899104044819, -0.219049622437569
0.515718647594564, -1.58121945075221, -0.304736373897295, 0.449326670182667, 0.127386398586832, -0.217307439929019
0.519157555240404, -1.5780468579383, -0.303302268195542, 0.445967658743141, 0.126252092046773, -0.216406574349572
0.521795697682577, -1.57446552172834, -0.301139075589396, 0.442945821339226, 0.12540642998435, -0.216185336654219
0.523919350799491, -1.57090117948136, -0.298563958656211, 0.440162292578459, 0.124467521987865, -0.21630541441522
0.525675368921633, -1.56743593705212, -0.295667491795805, 0.437562513252418, 0.123322159882418, -0.216684622371135
0.52727260260467, -1.56444826229604, -0.292610439772592, 0.434910007027405, 0.121757463874245, -0.217012405678986
0.529802489544265, -1.55999025737486, -0.286117306697277, 0.429269394990645, 0.117171082171646, -0.217302697199823
0.530423260110649, -1.55794266474004, -0.282513704767726, 0.426385415235665, 0.114409611896599, -0.217333091465573
0.530621978286087, -1.55606062217632, -0.278877609956572, 0.423466874805201, 0.111355509026457, -0.217223492726415
0.530320081399932, -1.55414771497543, -0.275240483170844, 0.420616540349152, 0.108094712863875, -0.217096326575655
0.52991727285459, -1.55228676500126, -0.271671709370856, 0.418181849417028, 0.104921775255565, -0.216750234571651
0.528810399181244, -1.55021633612945, -0.2681803896568, 0.415705433476124, 0.1015083123538, -0.216657687555111
0.527512089982892, -1.54826758773215, -0.265020863715904, 0.413349970497211, 0.097919508977159, -0.216388547029066
0.52599089159364, -1.54643741305467, -0.262188441817718, 0.411155948016528, 0.0942298571905096, -0.215932192660777
0.524295661303356, -1.5446906941525, -0.259721622376859, 0.409103769160815, 0.0904152177231352, -0.21529067529376
0.522530823086995, -1.54303707980822, -0.257657138693031, 0.407158394098518, 0.0864018861867139, -0.214467517554565
0.520736121716569, -1.54145673613296, -0.25600411951762, 0.405335147750989, 0.0822482177929771, -0.213587065598917
0.518929371824454, -1.53988154833912, -0.254612227813881, 0.403639979770295, 0.0780434703765507, -0.212678777701431
0.51702315662401, -1.53809581989998, -0.253204385765066, 0.402094107073805, 0.0739235066200813, -0.211861140818267
0.515025239581916, -1.53618440694271, -0.251643306525107, 0.400620539155895, 0.0697567136153353, -0.211101877298106
0.513051378005573, -1.53410529082787, -0.249979370969161, 0.399385416820809, 0.0657275002040809, -0.210521158752266
0.5111079815345, -1.53196360296652, -0.24819336479093, 0.398262963764384, 0.0616716317938948, -0.210090154062167
0.507050095828785, -1.52739501733934, -0.243889535042004, 0.396090682564498, 0.0532949953529266, -0.209750139577622
0.502346202577592, -1.52185459933324, -0.238603500510866, 0.394074528786255, 0.0450878867845311, -0.210297274216359
0.499950581725093, -1.51882639757121, -0.235955351188491, 0.393140204611226, 0.0410513045184535, -0.210672834894509
0.497597696915647, -1.5156248461324, -0.233442625303222, 0.392274966300596, 0.0371142017524327, -0.211012911044222
0.495224624256181, -1.51211624006442, -0.231031307263609, 0.391485731762882, 0.0334486948922823, -0.211365504381173
0.490532974548559, -1.50392051033735, -0.226512579078836, 0.39019489181842, 0.0269184862606074, -0.212215904685178
0.486322273038907, -1.49419194209166, -0.222098094290001, 0.389316401296003, 0.0216528142053398, -0.213218208977627
0.484535586504061, -1.48886841715225, -0.219914965772558, 0.389065669922841, 0.0194283206031358, -0.213779700601331
0.483078899186349, -1.48341079838813, -0.217771487935218, 0.388835319719393, 0.0172766938663905, -0.21432040755276
0.48188808796865, -1.47781828661639, -0.215638021102346, 0.388618521142774, 0.0151294849402026, -0.214853986580354
0.480129918861496, -1.46630655889327, -0.211092727504402, 0.388199961880109, 0.0108268839162904, -0.215949514384593
0.479529258103599, -1.46032959271872, -0.208653534761642, 0.38793414387225, 0.00866022617895738, -0.216513769306562
0.479140960503157, -1.4542561468488, -0.206199195147131, 0.387629884909072, 0.00646548467842177, -0.217021074914997
0.478836733337787, -1.44801748184505, -0.203734298205899, 0.387274385466534, 0.00425289021842893, -0.217464067612206
0.478506465004477, -1.44155184605763, -0.201279700082864, 0.386949095255806, 0.00212525541415278, -0.217900966803803
0.478004068619283, -1.43469490536101, -0.198760085628932, 0.386696219668911, 0.000229461298580724, -0.218418390948488
0.477281575238865, -1.42735619456035, -0.196031491641512, 0.386499941002994, -0.00128707568371301, -0.219109000005105
0.476339609570302, -1.41952080448131, -0.193045423985621, 0.386444931893095, -0.00236602075570215, -0.220020974454041
0.475278371006932, -1.41128944670323, -0.189830342414152, 0.386476303557426, -0.00303431028084796, -0.221109988441581
0.474251211818665, -1.4028386778072, -0.186482495903126, 0.386539321032581, -0.00341724200810528, -0.222241212018502
0.473392119933304, -1.3942789596729, -0.183073745320306, 0.386615535598447, -0.00365491895338482, -0.223360585519683
0.472746091378878, -1.38566659080552, -0.179692161209032, 0.386700495430056, -0.00393976285490755, -0.224429367044607
0.47232341031468, -1.37691789991123, -0.176402794698763, 0.386790686908307, -0.00432147002129508, -0.225472596845306
0.472032363917411, -1.35887990585744, -0.170009036083212, 0.386743735470518, -0.00532400698678685, -0.227560296917312
0.472018732377218, -1.34944851951861, -0.166856299876655, 0.386629073220339, -0.00579157847599091, -0.228777386328104
0.47196543626131, -1.33972277522222, -0.163639390733781, 0.386567305095576, -0.00613070918709394, -0.230175126281833
0.471765249550053, -1.32967773821955, -0.160291720390645, 0.386563697250271, -0.00632607299364702, -0.231772335538932
0.471084823358375, -1.30881155301871, -0.153155284570346, 0.386681656977856, -0.0062937789315644, -0.235139566625396
0.470147794841342, -1.2978208231194, -0.149214186265691, 0.386580283027259, -0.00612668188855862, -0.237255750126341
0.468715506187035, -1.28624107587935, -0.14485702876293, 0.386387536594672, -0.00565523833528336, -0.239765544460156
0.466832201632489, -1.27403979997977, -0.139974810628171, 0.386025560696567, -0.00487548515783289, -0.242631221627606
0.464668031579791, -1.26136743956294, -0.134556244693539, 0.385478480893012, -0.00387149553066397, -0.245713930842572
0.462509412305231, -1.24874491135458, -0.128894304660121, 0.384610141646066, -0.00298260855846365, -0.248718891888655
0.46030870011177, -1.23613822440587, -0.122928428581784, 0.383500670757649, -0.00225434904095953, -0.251690423516649
0.458229581583906, -1.22376677895227, -0.116853335515618, 0.382088983719864, -0.0018765357357457, -0.254518929348513