0.326227081411471, -0.455673415894351, 0.143342730164366, 0.134638531634834, -0.29109423699989, 0.190079479410657
0.327260403288954, -0.46074664166305, 0.140420144629847, 0.137052264024143, -0.297292690164903, 0.198470170691084
0.330853624544766, -0.471989240359726, 0.135061726373842, 0.140855931764903, -0.309216144211125, 0.214507789297265
0.336057213668478, -0.48430707047548, 0.129560283319683, 0.143641621494863, -0.320127290561922, 0.229077247392818
0.339109556873355, -0.490645407880302, 0.126392910835329, 0.144838018977838, -0.325209963616475, 0.235730987096726
0.346186349196751, -0.503233236738792, 0.118967467821078, 0.147050627700108, -0.334189213251589, 0.247077977188877
0.35563444837518, -0.516272250530965, 0.109973273371288, 0.149197925004738, -0.341831521360659, 0.25554784138565
0.368106807038657, -0.530590259827634, 0.0994383665919088, 0.151463360911316, -0.347792388400313, 0.260330940853991
0.383024134585188, -0.54611063370475, 0.0876463974317702, 0.153916771971813, -0.351801872223245, 0.260309831971115
0.391384463383169, -0.554165433743727, 0.0812486992806202, 0.15542086260051, -0.353279960684184, 0.258483683601162
0.400388420391927, -0.562407000288475, 0.0745536307454146, 0.157277856514292, -0.354608350235315, 0.255714552503033
0.42006198247393, -0.579644733250863, 0.0604249634220252, 0.162444605562247, -0.356861249160224, 0.247994176437246
0.441671702191046, -0.599036098847568, 0.0456659674832645, 0.170079913343932, -0.358438736820095, 0.238978114213052
0.453003993881461, -0.609693567011852, 0.0382020585408269, 0.175108382896791, -0.358972858255751, 0.234484491579019
0.464684175968387, -0.620962867030031, 0.0308571851969409, 0.181061111182131, -0.359313205393774, 0.230200094927314
0.490267614819413, -0.646167256676222, 0.0160821238527279, 0.196094585488417, -0.360156415662036, 0.223719973218458
0.519059398978887, -0.674652226296104, 0.00102263961124629, 0.215198086477957, -0.361684312203233, 0.220943177819626
0.534395699860199, -0.690076246495969, -0.00673548292512112, 0.225914292228692, -0.362539003278622, 0.220775703799437
0.565784852312426, -0.723603890931305, -0.0227164343977991, 0.249316115394666, -0.363755038112578, 0.221690537406541
0.597096500995664, -0.760566985485631, -0.0396987719264705, 0.274670572372259, -0.363903647034923, 0.223811731431461
0.626913015061443, -0.8007731341715, -0.0579976083496984, 0.300523800329705, -0.3622412640031, 0.225262844247744
0.652981996334766, -0.842179580022798, -0.0768291767567657, 0.325850660183663, -0.356584681326564, 0.222640478338888
0.663848302586366, -0.863196310339423, -0.086231640463863, 0.338370755492201, -0.350915862344163, 0.21821699040108
0.672620312548838, -0.88401288338591, -0.0952917610828154, 0.35108505224535, -0.342689820554221, 0.210861822373271
0.678988514630399, -0.904164397637312, -0.103793995378198, 0.364194156375161, -0.331820402147427, 0.200176620436106
0.683923680973758, -0.943190971163019, -0.119389751285168, 0.392221671635693, -0.302266475778556, 0.168205442884523
0.682520708564127, -0.962167913881127, -0.126428319219666, 0.407394444042245, -0.283671281542847, 0.146906376855884
0.672318423817105, -0.999679721878135, -0.138314298661246, 0.440056175015816, -0.240572390656761, 0.0952668594483973
0.664644480602611, -1.01794440809365, -0.144001176270141, 0.458222531292711, -0.21572180515209, 0.0657540727583071
0.655499721128588, -1.03604355613813, -0.149506302969229, 0.477185806092537, -0.18967198324234, 0.0345737067275306
0.634647218140851, -1.07324776645893, -0.1608477305014, 0.516810602858689, -0.137340612224615, -0.0291451043890851
0.610959741510942, -1.11285176523598, -0.172654523438099, 0.559388452606165, -0.0848514960612369, -0.0946147195388871
0.597784947093309, -1.13335866117628, -0.178136683089577, 0.582053837313418, -0.0579840445872625, -0.128580555532911
0.566975454458851, -1.17336836515016, -0.186385192665268, 0.6306912770647, -0.0011888725084967, -0.201179411207144
0.531824299200294, -1.21289252351325, -0.192162614732414, 0.682605595989506, 0.0568490398345046, -0.27713778930431
0.493646535077431, -1.25360196455514, -0.198150776884032, 0.733794022952859, 0.113907897483436, -0.355418357293343
0.450444234790471, -1.29066097650145, -0.202531077553967, 0.783898345410472, 0.17251197971932, -0.437927277716531
0.403215389048534, -1.32256305325782, -0.20522760443716, 0.833499292299011, 0.233188360978981, -0.52382980009156
0.361545882742378, -1.3599949891897, -0.213677884424518, 0.876687155549653, 0.287325302998585, -0.604473387861478
0.332958366301641, -1.40288217803143, -0.230373060186286, 0.906060057150122, 0.327461168943311, -0.667930216288571
0.31548777581858, -1.44323003571192, -0.250368947098303, 0.925211295591023, 0.356894409240459, -0.714253911864808
0.322578376307542, -1.5037754439555, -0.286530434923879, 0.93043776216903, 0.362850150438906, -0.729559672678618
0.330328712111194, -1.53359222338579, -0.306424210492693, 0.929465609731042, 0.361519350081986, -0.729947361642065
0.334742961053815, -1.55229686874825, -0.321554013284541, 0.928677263631169, 0.3634108174419, -0.731109703635581
0.336341134410433, -1.55990796319526, -0.331817472123746, 0.928278977305214, 0.367839511424282, -0.732025582372582
0.347273952009105, -1.5682084914247, -0.351256163386126, 0.92520591939997, 0.367433409804889, -0.714929707703631
0.37036649987872, -1.57889631058086, -0.374125219004125, 0.916623263749137, 0.352819818919077, -0.677466176996177
0.401322805205917, -1.5904878781487, -0.398089269585839, 0.902779683940158, 0.327998752997329, -0.628510126819464
0.43014150499878, -1.58491124297186, -0.412565458040862, 0.890800358536144, 0.303775931578918, -0.578663677993007
0.45583996127507, -1.56354226667618, -0.418158393068846, 0.879623366659754, 0.282164866233228, -0.531671798615026
0.488415658948073, -1.51691170530008, -0.416790824353595, 0.854002441344726, 0.249850554387208, -0.46905508378505
0.496340890573716, -1.49793223623112, -0.412988759619895, 0.843014588905591, 0.239249716282473, -0.450956272375068
0.502668571725529, -1.47740015404548, -0.407457156474516, 0.830930615756139, 0.228886085373594, -0.4340320393034
0.507682803978979, -1.45618327795842, -0.400798893577815, 0.817667291236045, 0.218568229563161, -0.418298008900841
0.511804086926442, -1.43498101611985, -0.393522896533788, 0.803628587702106, 0.208010875452246, -0.403503018643292
0.520574633645359, -1.39649007588248, -0.379825260366048, 0.772380535786508, 0.184660946099477, -0.374921703002406
0.54704563588016, -1.33855887840541, -0.359933309463238, 0.705407261835011, 0.12813047566937, -0.312506054821179
0.565446255077571, -1.31316356977454, -0.351922920579057, 0.674262483881579, 0.0987034416911016, -0.277078794695909
0.582784101750308, -1.28526127439016, -0.342109001179784, 0.646288913458814, 0.071975187344838, -0.243143403823484
0.598281076120347, -1.2547003182675, -0.330105999171982, 0.620550713682382, 0.0471947193951062, -0.211120943456707
0.610770323628628, -1.22116323436447, -0.315215200011827, 0.596519949249487, 0.0249159762113594, -0.182024488679157
0.615688236392503, -1.20337264326783, -0.306614429348905, 0.585077084927451, 0.0148521254151612, -0.168776599641615
0.622741446643145, -1.16642090176339, -0.287591545899812, 0.562903647828225, -0.00396716669100193, -0.144821815243049
0.625400844361421, -1.12770278237727, -0.266322686959866, 0.541267487896482, -0.0205537608462275, -0.125596208560035
0.627471664307751, -1.09217418167896, -0.245761781787675, 0.52014898874418, -0.0378840864786177, -0.108160754661153
0.631877444133817, -1.0620055326651, -0.22838876635836, 0.49926355178642, -0.058231879380295, -0.0898837089721333
0.639172438557582, -1.03599204640383, -0.214152689636495, 0.479135204777723, -0.0818335542664999, -0.070137292304922
0.649234155414946, -1.0129837894436, -0.202781086967852, 0.46038410877906, -0.108014304421, -0.048454622359467
0.655092356627832, -1.0020541695383, -0.197970520454786, 0.451680256400934, -0.121572464030763, -0.0370909609601081
0.661099596682638, -0.991109424562752, -0.193519264585819, 0.443274528822092, -0.135049237952645, -0.0258473570599625
0.666714322023647, -0.979510876438399, -0.188887662772508, 0.435153352151828, -0.147736307047871, -0.0153689144003692
0.675530908803995, -0.953500186681609, -0.17791032655305, 0.419908692493574, -0.169964172737097, 0.00181750846077656
0.678220826170753, -0.93907522487679, -0.171139794201264, 0.412729164518253, -0.179336901488308, 0.00795105649773037
0.679703692941919, -0.908086078110865, -0.154881838684415, 0.398705248612001, -0.194785105012857, 0.0145281447069715
0.676263517118971, -0.875518079627815, -0.135321129227198, 0.384308993414616, -0.207051655100745, 0.0143043851405668
0.662685703394637, -0.813812126349433, -0.0916688633957054, 0.35280072068017, -0.232447440633612, 0.0058278019184944
0.659451387544286, -0.800146249131681, -0.080766957801152, 0.344604504515727, -0.239984453035021, 0.00433199707297103
0.65477219758905, -0.776115847918147, -0.0603117112680892, 0.328566085282323, -0.257201112437641, 0.00429532073321938
0.652999578250293, -0.755881079590366, -0.04197736388858, 0.313335768459489, -0.277018139732234, 0.00859382438701418
0.652866427615143, -0.74660915369413, -0.0334970644192368, 0.30610441822549, -0.287401517313218, 0.0119208824557481
0.653034498914133, -0.737575791804158, -0.0254492096930151, 0.299188815018482, -0.297773776215582, 0.0157685061002316
0.65333877819434, -0.728644135019815, -0.0178351286687233, 0.292601428408944, -0.307881311079136, 0.0198359013677639
0.652568298744173, -0.710671008364309, -0.00311246549843781, 0.280161041373937, -0.326248611534555, 0.0264418734446544
0.651666722048718, -0.701216023513703, 0.00351001594908379, 0.274354337477681, -0.333355675244068, 0.0284930876872795
0.648072564943261, -0.681811328254752, 0.0160881189904905, 0.263402203905843, -0.34334713174052, 0.0293218286149891
0.645450757465118, -0.671720625073178, 0.0223304508345667, 0.258221756255575, -0.346273917799196, 0.028400643088778
0.638332442489365, -0.650685976257814, 0.0349678722951388, 0.247733748795978, -0.348864141599134, 0.0248425663513915
0.633836670841624, -0.640218721470659, 0.0411632338620021, 0.242303542094351, -0.349119756039978, 0.0225516596091909
0.628910231796942, -0.63022685404068, 0.0471276993140211, 0.236758285286118, -0.349002713954987, 0.0203899515185109
0.623668718969766, -0.62103632543798, 0.0527491123174907, 0.231175923186737, -0.348773537044923, 0.018694207149976
0.618296822005714, -0.612799334022894, 0.0580047296227825, 0.225767717754042, -0.348559803460351, 0.0177022157670283
0.612813964867488, -0.605384309772229, 0.0630029671701185, 0.220739192489143, -0.348392068031369, 0.0175239770746004
0.601871820907078, -0.592795408235716, 0.0726342368674846, 0.21164583797766, -0.348033208668723, 0.0199700697445536
0.590418257727342, -0.582540744901991, 0.0821581520972661, 0.204173319083015, -0.347242023436003, 0.0253021793711773
0.577249672125192, -0.573441040180308, 0.0921382839564989, 0.198094918448607, -0.34487307944743, 0.0313460635501268
0.569811601934407, -0.569211641689789, 0.097335572146624, 0.195610082934907, -0.342971481753011, 0.034185930230745
0.55414326673481, -0.561292682707867, 0.107827172498971, 0.191754607423593, -0.338078625705266, 0.0392295735235329