0.47361997853974, -0.168842646026276, 0.137939297894195, -0.0202541586367787, -0.12932271408344, -0.0476896205254391
0.457588942315074, -0.17187719338131, 0.143440057985204, -0.0214066324050149, -0.114109687617545, -0.0389172630258587
0.448011208123582, -0.174837865580226, 0.145736540253762, -0.0221550472028411, -0.105748787195628, -0.0329574083347605
0.443578446875423, -0.176619327989042, 0.146628113770848, -0.0224079338211837, -0.102029706753912, -0.029994791950572
0.435311093314111, -0.180719352253844, 0.148172514347506, -0.0224929427408571, -0.0954532129146913, -0.0238958358527504
0.428072225250811, -0.185628426697847, 0.149087089328079, -0.0219115909013769, -0.0907764179731466, -0.0174255057003467
0.424956035570899, -0.188554832710575, 0.149282566624532, -0.0214173642577841, -0.0891760353170462, -0.0139253309779127
0.422324638447821, -0.191887366750231, 0.149205011586447, -0.0207320365403093, -0.0882607319275237, -0.0103335993673472
0.420154782390974, -0.195754837021153, 0.148804569279205, -0.0198902053881855, -0.0879970289896182, -0.00652038561479681
0.417092726780823, -0.204998263645146, 0.147136545397552, -0.0176568228247284, -0.0895193721173752, 0.00202711844728529
0.416034681263123, -0.216114971577163, 0.144269956976448, -0.0146799020152758, -0.0941591580330586, 0.0121609441554018
0.416355293733212, -0.222470211001121, 0.142262089677434, -0.0130435518508333, -0.0977020401679161, 0.0178660667710641
0.418515455952874, -0.236824605567809, 0.137170140096439, -0.009925316261497, -0.106828814314771, 0.0304860334893526
0.420337549084424, -0.244854348967181, 0.134080513371603, -0.00844211640922985, -0.112181737208083, 0.0373155491593529
0.4226653620409, -0.253664823892126, 0.130548177501145, -0.00699888114564006, -0.118034941387672, 0.0445615608354856
0.429002665381717, -0.273760064461914, 0.121972345325946, -0.004493716944848, -0.131253310407527, 0.0603983261830887
0.432906273506633, -0.285087518905698, 0.117106142169014, -0.00351686225663082, -0.1384956851751, 0.0689634656046799
0.441987761656127, -0.310318411445748, 0.106480431397651, -0.00247645928063319, -0.154185408500924, 0.0871146722232651
0.447075935897799, -0.324241812687013, 0.100656354808716, -0.00243187638854664, -0.162646449807759, 0.0965867506166207
0.452819409863617, -0.339114201501177, 0.0943364474834205, -0.00274734367619175, -0.171781945608006, 0.106308291094214
0.466517120457346, -0.371295880420977, 0.0803658374080446, -0.00446621646787098, -0.191924020983461, 0.12643218540396
0.474490801508495, -0.388545446953012, 0.0727617566364117, -0.00592579850306607, -0.202753093736507, 0.13657959793303
0.492312150294297, -0.425444943911591, 0.0561805737251889, -0.010134799309452, -0.225722301929082, 0.156813364686978
0.502154655178496, -0.444821649968558, 0.0471526539561603, -0.0128913448738317, -0.237897097266949, 0.166641375948951
0.512664773235024, -0.465073742762946, 0.0375056238100315, -0.016057448355627, -0.250658901867713, 0.176386278222603
0.523955856369635, -0.486081465923506, 0.027210639203511, -0.0196461117492265, -0.263940392620473, 0.186215123300272
0.535838999374819, -0.507571753197152, 0.0163205605087378, -0.0234952321724546, -0.277571834443914, 0.196055309415958
0.548170928506581, -0.529461322066508, 0.00481403113180066, -0.0275028845998442, -0.291456794246252, 0.20591990701634
0.574134528706686, -0.574330059297235, -0.0198657436441614, -0.0357408698747977, -0.319697052587942, 0.225800084931183
0.600860268633295, -0.619049966144333, -0.0462011463163764, -0.0433303189735633, -0.34738948165153, 0.245503183282934
0.614571016842152, -0.641352924505589, -0.0600668598261471, -0.0467457832261412, -0.361027189362534, 0.255360731591865
0.628310116093763, -0.663380108447009, -0.0741711538175793, -0.0497831548522273, -0.3741906865093, 0.265007833038243
0.641873580095014, -0.685038864275383, -0.0883814168915297, -0.0522786880771105, -0.38665075798733, 0.274183163702768
0.65510594900001, -0.706229609523546, -0.102573993210182, -0.0543206433810468, -0.398241876271011, 0.282646354336477
0.667768260425548, -0.72696795105581, -0.116777737060782, -0.0560078175469995, -0.408729462549914, 0.290215098801966
0.679883621678433, -0.747211831985704, -0.130985803527747, -0.0573613901534879, -0.418209076514911, 0.296751891645235
0.691493473679473, -0.766984748968455, -0.145006546463399, -0.058245949378157, -0.426644521426847, 0.302150375775481
0.702881388832126, -0.786742792229657, -0.159111799291896, -0.0587851728148066, -0.434400436098493, 0.306885264394815
0.714139054127004, -0.806927942465345, -0.173476334101804, -0.0591218143519915, -0.441727042497516, 0.311275259633032
0.725108131842321, -0.827241561538116, -0.18787642412449, -0.0590798520163643, -0.448289274423948, 0.315089110513253
0.735672813306727, -0.847278083085854, -0.202039637052546, -0.0585550967752426, -0.453824803540732, 0.318232357527754
0.746092115322539, -0.867725270210523, -0.216122719891929, -0.0576372855027482, -0.458502777640088, 0.320744934798423
0.765741480544969, -0.909306005405976, -0.243507834518942, -0.0543159809449545, -0.464912294331284, 0.323432706762066
0.774564768000862, -0.92964866070398, -0.256572848425387, -0.0517680763149171, -0.466374108171469, 0.32351554212782
0.782954553501642, -0.950139204706968, -0.269375565748999, -0.0488571898304554, -0.466947427218118, 0.32315694852136
0.790856669186305, -0.970752094129746, -0.281949752549681, -0.0456089626563809, -0.46650652097443, 0.322311309414645
0.798195364100319, -0.991559774729444, -0.294241398811886, -0.04202412907616, -0.465009661318262, 0.320852828917207
0.8107414321858, -1.03336199143099, -0.317655954526421, -0.0336238529376697, -0.458945619425648, 0.315929413310611
0.815745897216147, -1.05400411748914, -0.32846638606068, -0.0286688282458292, -0.454461214620243, 0.312398932350165
0.819947528461784, -1.07465984873943, -0.338700003009197, -0.0232420548599467, -0.449169530246536, 0.308381871715869
0.825438936043918, -1.11547952391486, -0.357107463340878, -0.010781848476953, -0.435794680126586, 0.298918377546322
0.826827547896654, -1.13572407714837, -0.365202591014234, -0.00375682969521668, -0.427746314420654, 0.293537205948845
0.827458776255274, -1.15575479284392, -0.372438219137216, 0.00370122446227286, -0.418987011717953, 0.287652393659299
0.827256069996519, -1.17517482344248, -0.377858075729449, 0.0116241650386198, -0.409879753490503, 0.282561618846255
0.82650359214402, -1.19494225821882, -0.383421298735787, 0.0197746485908003, -0.400099332754622, 0.276490472520638
0.825502328323191, -1.21470484184185, -0.388840821849209, 0.0282981302703246, -0.390061304912443, 0.270486421295334
0.822819342722281, -1.25433454520396, -0.399622865102551, 0.0460114122005274, -0.369692266820968, 0.258988185965881
0.820883230677354, -1.27364378387057, -0.404759996346868, 0.0551403627709543, -0.358811462212889, 0.252772647828457
0.818367269320353, -1.29266068149619, -0.40971651556359, 0.0643751240061822, -0.347314902643416, 0.246379054787054
0.815162305025083, -1.31129291547046, -0.414541252696422, 0.0736340401102713, -0.335259437264944, 0.239622164135296
0.811202180428954, -1.32950640569421, -0.419019889550651, 0.0830496536002882, -0.322304115763101, 0.232357407955864
0.806452415239696, -1.34734629072236, -0.423093415171624, 0.0926089971068876, -0.308539841627539, 0.22460517220481
0.801244443224117, -1.3648878665061, -0.426910566544572, 0.102242414800431, -0.294063001462867, 0.216586748376473
0.795438751832973, -1.38219407608335, -0.430715643242371, 0.112171379470518, -0.279035603618738, 0.208023248910315
0.789355981679189, -1.39956580140428, -0.434679631944851, 0.122294200920103, -0.263543150544071, 0.199001598780648
0.783196022967225, -1.41715219107509, -0.438875455889702, 0.132468978721616, -0.24748401797348, 0.189358546920537
0.77637451856132, -1.43416170115292, -0.442863249179878, 0.142975575091623, -0.230332326528772, 0.178583843843652
0.768539126358549, -1.45024012518907, -0.446526657424566, 0.153978173145369, -0.211750202328484, 0.166409150233935
0.759961690378408, -1.46555604151213, -0.450055786545868, 0.16544025568995, -0.19220652144196, 0.15308617612876
0.75058713014538, -1.47975036195432, -0.453469948622455, 0.177218386621861, -0.171730867181279, 0.138619499421747
0.739966774101373, -1.49216579140833, -0.456495778546588, 0.189391373939398, -0.150058729934888, 0.122661831599518
0.715280782358883, -1.51118973989907, -0.461275193018178, 0.214358241175686, -0.102600043816986, 0.0860693573123765
0.701621398664001, -1.51773164716692, -0.463079703172154, 0.227152691117942, -0.0770072952106235, 0.0649821232620404
0.687924744508091, -1.52305825281141, -0.464908258519606, 0.240048934077094, -0.0509811021057937, 0.0425284498137594
0.674378586827032, -1.52684228109133, -0.466333428587224, 0.253363348807734, -0.024908675650852, 0.0191835977769859
0.661418488037106, -1.5296878338983, -0.467292543964212, 0.267075894881057, 0.000428612085140119, -0.00413453168109817
0.650045316247001, -1.53341263350637, -0.468548925344119, 0.280840781812557, 0.023822286530666, -0.0263173058244046
0.640862254431686, -1.53945120400185, -0.470734279286742, 0.293978837334274, 0.0443260097890397, -0.0462495928215611
0.631199257071602, -1.54376080004939, -0.471298217258351, 0.30764459266817, 0.064614053628345, -0.0662689169931756
0.617382627739816, -1.54100946384987, -0.466909695426281, 0.323692011897533, 0.0884551031741349, -0.089680043383427
0.598808925701073, -1.52981724081837, -0.456652561805904, 0.342509670681212, 0.116311632575635, -0.116903422147451
0.577187945609716, -1.51315194872484, -0.442188130225312, 0.3629461405336, 0.145952412323882, -0.145956506917312
0.555076014693339, -1.49540654953524, -0.426287183047291, 0.383018501589401, 0.174300871998008, -0.174321530085231
0.533436557782147, -1.4777561229303, -0.410140683279538, 0.4013639798024, 0.199828507056945, -0.200713111534271
0.511238452980767, -1.45834501661919, -0.39304758971304, 0.418129841713446, 0.223550559082928, -0.225848535383629
0.488456800188142, -1.43708675717446, -0.375091879787805, 0.433399788605096, 0.24587129347309, -0.249629524829538
0.443724097389547, -1.39354502064052, -0.339142452744146, 0.459014809693369, 0.285923359535851, -0.291249729613129
0.400833322016334, -1.35074716008981, -0.304331286810139, 0.479581079110929, 0.319929517633831, -0.325294177003943
0.368166024568708, -1.32108742088596, -0.278587644949516, 0.495290661262952, 0.340917014472063, -0.345538562665649
0.35341118809883, -1.30712951715887, -0.266955056396701, 0.502420560695318, 0.349234276040983, -0.353532426359932
0.338798951575156, -1.29198459248319, -0.255316676760157, 0.50914348512889, 0.357427578468131, -0.361442462536478
0.325138093271409, -1.27675092875114, -0.244543190596022, 0.514636882475688, 0.364779586517567, -0.368592782579582
0.313933717098477, -1.2634039076991, -0.236083925096316, 0.518213966360525, 0.370018199363155, -0.373593584659357
0.30609470621992, -1.25291715863742, -0.230584813916087, 0.519896413767814, 0.372582358679249, -0.375731456023301
0.29900843420613, -1.23950561918704, -0.226663233898646, 0.520796790259372, 0.373000966086123, -0.373366265578723
0.29854112219177, -1.23099068934749, -0.227932230344553, 0.520747069179223, 0.371415097091858, -0.366898845876323
0.299643486226283, -1.22808850698627, -0.229617881099974, 0.520072351018033, 0.369879386555662, -0.363110025936004
0.301287760550279, -1.22588945273857, -0.23162714988025, 0.518751720886819, 0.367648599698677, -0.35929022714556
0.303075930994668, -1.2241655335752, -0.233450692720523, 0.51681895393431, 0.36481067922029, -0.355626531838262
0.307872406509702, -1.22387378531665, -0.236440698478115, 0.510830367515131, 0.356345881308102, -0.34791601082859
0.311305514753882, -1.22593546632508, -0.237891612515033, 0.506857119245216, 0.350483716969686, -0.343348384382672
0.31486147662834, -1.22879941835756, -0.238989029771693, 0.503067359470623, 0.344673856425579, -0.339177928622302
0.326166495143584, -1.24060076019745, -0.243434770674569, 0.49249198333541, 0.328600676849037, -0.326402961582212
0.332866294145163, -1.24813557802953, -0.246055465348337, 0.486613812422222, 0.319813422749361, -0.319176762083035
0.339844881381204, -1.25605606066899, -0.248813343685548, 0.480504629038303, 0.310943394824712, -0.311798487656718
0.346898540600501, -1.26411721275065, -0.251627902633262, 0.474234981928745, 0.302264396882904, -0.304484769926348
0.353699908681679, -1.27186370238325, -0.254355019387927, 0.467957508469911, 0.294159416595319, -0.297530299342807
0.360204976012253, -1.27931555817237, -0.257023776966459, 0.461629914212759, 0.28660695426849, -0.290895945679935
0.366655339603796, -1.28669235497904, -0.259773517290528, 0.455175431105484, 0.279402479808894, -0.284366388354759
0.373331801128895, -1.29432806763525, -0.26281086701323, 0.448601906809171, 0.272271082723801, -0.277673356186046
0.380368944842321, -1.30228874094712, -0.266270781028742, 0.441914464822804, 0.265093672975727, -0.270642312816818
0.387726632667551, -1.31041030382748, -0.270102260062165, 0.43513888920814, 0.257797194969748, -0.263262871099917
0.395183653734885, -1.31850714753361, -0.274178783466753, 0.428313572616975, 0.250459330370761, -0.255597231770873
0.410969875191129, -1.33515567112414, -0.283533337457971, 0.414257917927514, 0.234913772395755, -0.238732681608965
0.419195886921756, -1.34348870175833, -0.288702751989255, 0.407073203789222, 0.226822168015005, -0.229717054185711
0.427425694519408, -1.35147641595426, -0.293947241174928, 0.399903756150957, 0.218763983498442, -0.220598630995947
0.443631515044684, -1.36589683513864, -0.304362976684765, 0.386115022937558, 0.203242006702648, -0.20234545752913
0.451417821367081, -1.37206938716463, -0.3093119555188, 0.379705184632178, 0.195931489688328, -0.193445212447223
0.46605150780397, -1.38223032643619, -0.318386088309965, 0.368152955356876, 0.182275647431826, -0.17641869928697
0.472935487098023, -1.38634350518517, -0.322550137443539, 0.36302792540315, 0.175829881390512, -0.168246076652148
0.479429572368007, -1.38979897366586, -0.326379187782153, 0.35833905670727, 0.169608633954495, -0.160329529238962
0.485620612273752, -1.39267567699248, -0.329873843265643, 0.354093640225073, 0.163553146410251, -0.152595480203283
0.491579992565555, -1.39513532595125, -0.333138971340569, 0.350226587680171, 0.157643836093742, -0.144936582902042
0.502518918670274, -1.39846274586986, -0.338526939294775, 0.343431646202684, 0.146124025768693, -0.130111173997912
0.507397784998843, -1.399157828334, -0.340473506502023, 0.340440647150393, 0.140575333540998, -0.123122753559055
0.511942897719123, -1.39922407159273, -0.341910540155792, 0.337675878060214, 0.135134843096474, -0.116434556626527
0.516183289400121, -1.39872750086562, -0.342908093079795, 0.335063855125291, 0.129764167726823, -0.110025561067012
0.520042321835413, -1.39767968367506, -0.343445495099143, 0.332585623564118, 0.124456699884731, -0.103971512708153
0.523518373807778, -1.39617803209356, -0.343635935212451, 0.330159698950911, 0.119217838533718, -0.0982430685140433
0.526497237786546, -1.39404148474557, -0.343412687274713, 0.327825010004104, 0.114157192732912, -0.0930243585575773
0.529114924966678, -1.39131759634716, -0.34277328097969, 0.325502248549303, 0.109201534160028, -0.0880581319319378
0.531319155368847, -1.38808488020262, -0.341751430273611, 0.323098275855069, 0.10439267937296, -0.0835133363011815
0.5332640159308, -1.38446723365982, -0.340391208514998, 0.32060976651477, 0.0995865271269578, -0.0791822217380033
0.535014014013391, -1.38045011931069, -0.338764375804474, 0.318042017219052, 0.0947828357527404, -0.0750193194077178
0.536557678679718, -1.37609952100662, -0.336970282544266, 0.315425682383467, 0.0900210983362761, -0.0710691718735556
0.538090247061222, -1.37139100850543, -0.335095791082489, 0.312730956469951, 0.0852419109632198, -0.0671439181008136
0.539587745747667, -1.36634748691287, -0.333137334141136, 0.310029450304454, 0.0805130616923814, -0.0633099894100278
0.541141796782505, -1.36096856636068, -0.331137943860613, 0.30730038537121, 0.0758548199605204, -0.0594271003139034
0.542766763757354, -1.35525580956778, -0.329119487064134, 0.304571056606756, 0.0712844089454938, -0.0555016297706033
0.544460561401057, -1.34916659244554, -0.327042701277391, 0.301814133711742, 0.0668154499568148, -0.0515964655110887
0.54620007321289, -1.3427783467534, -0.324939488836254, 0.299028412955045, 0.0623944356001727, -0.0476496409999317
0.551481447467064, -1.32191985841324, -0.318577998809102, 0.291122643528634, 0.0496830544535144, -0.0356134119904942
0.553007810191756, -1.31434103182404, -0.316129941966339, 0.288554659834793, 0.0456236210532152, -0.0317892996966818