0.608237640023754, -0.441980520763846, 0.0662955603452432, 0.179307839069518, -0.284675311904045, 0.0496288125962173
0.63071700845577, -0.489760600946209, 0.0534614462990414, 0.215343775942438, -0.288798883165946, 0.0628333975884885
0.634525246559026, -0.498829045445846, 0.0510450796796877, 0.221241174118292, -0.290039606410685, 0.064811382960834
0.642193542660191, -0.51819364316257, 0.0466078323049312, 0.233039873634092, -0.293322888442475, 0.0690068932647664
0.646045994730338, -0.52855686246428, 0.0445960232018177, 0.239060293550989, -0.295411924173334, 0.0713729719538584
0.654007918489482, -0.550607591771372, 0.0405859768178627, 0.251571727524566, -0.30017517880834, 0.0768165239730397
0.658107379402271, -0.562092951867726, 0.0383556198902488, 0.257995616661014, -0.302772021827367, 0.0799916549910671
0.66622426143264, -0.585545435998364, 0.0332535697937471, 0.271122273570348, -0.3079214398978, 0.0868936775364342
0.670386917876971, -0.597703730037343, 0.030196116264763, 0.277865159683843, -0.310423870863531, 0.0905456930984254
0.674835817817266, -0.610376671850702, 0.0266393803109904, 0.284793425864596, -0.312842737437414, 0.094350171827813
0.679627787713455, -0.623824048277884, 0.022552186111243, 0.29189311436448, -0.315246901793815, 0.0984050207220175
0.684791693223879, -0.638149886305301, 0.0179816479249424, 0.299122221629564, -0.317700788373751, 0.102672734693132
0.695895967438225, -0.669095073154667, 0.00729067929705417, 0.31381732409714, -0.322502907586891, 0.11154727045949
0.707384235160497, -0.703052086551135, -0.00508456567547469, 0.328613735643432, -0.326965161259084, 0.119562355951109
0.71345554017941, -0.721137562150884, -0.0121462409711335, 0.336211981961695, -0.328631974805012, 0.123097311626238
0.719604703746108, -0.739494583386454, -0.0195777732408245, 0.34413639470281, -0.329611051704365, 0.125960835720799
0.725672763722244, -0.758038309118344, -0.0273346103047382, 0.352354066620376, -0.32986085167895, 0.12801243249346
0.731552082460296, -0.776593690711175, -0.0354331915978881, 0.360861795928365, -0.329225139837227, 0.128944802602968
0.736984340435845, -0.795188043368229, -0.0438315120240932, 0.369623939168614, -0.32762027490201, 0.128550012272531
0.74174221195956, -0.81375588671565, -0.0523801813109961, 0.378649412792429, -0.324950790225269, 0.126669731861572
0.745594057674243, -0.832335992965338, -0.0609707731774941, 0.387991003035417, -0.321114072806908, 0.123083348648542
0.748408356303256, -0.85098239890423, -0.0694261003586413, 0.397678382552125, -0.316045267116847, 0.117653524898571
0.750675395396876, -0.887781601710495, -0.085828937050322, 0.418222659391109, -0.301500235450174, 0.100571925173081
0.74761473205213, -0.922989810194049, -0.10103979333891, 0.44051153148333, -0.28100829721234, 0.0748826150746422
0.744265181946024, -0.940186512160724, -0.108368492595377, 0.452413905226652, -0.268869343416907, 0.0589341267838062
0.733840296269946, -0.97368004323693, -0.121937105850609, 0.478252619144387, -0.241323220834806, 0.0213125987053633
0.726817175514504, -0.990253638647771, -0.128113677927043, 0.492441353950492, -0.225989021020616, -0.000155029337418817
0.718523362570552, -1.00658683326557, -0.133673908370841, 0.507476863177002, -0.2095779778727, -0.0233825419510499
0.708940401111009, -1.02246906680896, -0.138491157758106, 0.52343674225353, -0.192097042738097, -0.0483312354824436
0.672104502431022, -1.0667260556487, -0.147144704033759, 0.577044117256396, -0.132987670429026, -0.132992607934817
0.641447258439163, -1.09337205768517, -0.14767831330394, 0.617388364989091, -0.0887073010556645, -0.196164642223224
0.624066884894237, -1.10537645332687, -0.146161133665141, 0.638793408470374, -0.0652057145088225, -0.229564695046003
0.585608633814386, -1.12642673881499, -0.140068810306115, 0.683919340910682, -0.0158956623215578, -0.299291439716302
0.542275834798208, -1.14350286498893, -0.130778349196616, 0.731362507936534, 0.0363282665819845, -0.372524584927698
0.518594085285538, -1.15031928765914, -0.124996606961761, 0.755789088057696, 0.063761224364345, -0.410783850286846
0.493648740969233, -1.15588031818634, -0.11860652304173, 0.780645067278058, 0.0919633308722927, -0.450067029272048
0.467972359519858, -1.16078497332484, -0.111887452739194, 0.805707459824565, 0.120489866990917, -0.490099052648452
0.44163569696471, -1.16485336940747, -0.104874988544182, 0.83068392988404, 0.14923459792757, -0.530776171994972
0.414757712529269, -1.16817119697477, -0.0977712922128929, 0.855299407877337, 0.178077880001068, -0.572048056555239
0.388018020923765, -1.17167366730724, -0.0911334152399831, 0.878970227513667, 0.206407553917182, -0.613291549271501
0.361464302008379, -1.17522347793239, -0.0848948054298078, 0.901631687068783, 0.234203869388178, -0.654406417545114
0.334651951793908, -1.17792517682185, -0.0786014596926074, 0.923685895581212, 0.261974343819343, -0.695877748665581
0.278490033062811, -1.1767248874217, -0.0633009674671314, 0.967255243482062, 0.319162349774924, -0.780668408726042
0.248596297943644, -1.17146017058192, -0.0534826972404501, 0.988962585932589, 0.348730625864627, -0.823979129684424
0.185981872843595, -1.15299613768076, -0.0302875661118942, 1.03120051599399, 0.408672885586467, -0.911434592599241
0.155496430743313, -1.14253186606108, -0.0185579334447618, 1.05031673635344, 0.436830139342167, -0.953153157057603
0.10269013089413, -1.12755588560937, -0.000618566696838199, 1.08091673944919, 0.483690653856906, -1.02668134876737
0.0644596427156401, -1.12616908801017, 0.00619548496384675, 1.09831261488573, 0.516042065710146, -1.08511037875672
0.0419669964617356, -1.13781417847236, 0.00265335785954289, 1.10414938298352, 0.533911450633266, -1.12607049727044
0.0332102657547134, -1.15615402224111, -0.00589105890500337, 1.10336954146817, 0.538623668619078, -1.14803459500153
0.0397924434743615, -1.18024486369348, -0.0205673337165852, 1.09635374076005, 0.529623020620909, -1.14668475672267
0.04880370730119, -1.19506938443259, -0.0302392565528445, 1.09007298989086, 0.519769795369438, -1.13748938515123
0.0608002011352112, -1.21074672335092, -0.0408327824267038, 1.082306596535, 0.507203066733226, -1.12381344275833
0.0897885692283796, -1.23942622513166, -0.0614327839060927, 1.0647909728494, 0.477685647710573, -1.08727864149363
0.122581602091638, -1.26018203306677, -0.0786784223172446, 1.0470704452083, 0.445489434883706, -1.04224823187846
0.157846084396544, -1.27148222799496, -0.0921279060744696, 1.02999873813455, 0.412100976885326, -0.991148495530178
0.175922862129952, -1.27365841795353, -0.0976186784401287, 1.02136425995885, 0.395374986621817, -0.964368225531329
0.193836461243466, -1.27376700009511, -0.102322399022824, 1.01239982104001, 0.378895840509735, -0.93758006233731
0.211538719188277, -1.27237859682648, -0.106540889350525, 1.00263568938261, 0.362546901158789, -0.91113057080796
0.228797599310895, -1.26987624539609, -0.110441600943366, 0.991776414516629, 0.346316338961252, -0.885388351450592
0.24568343696859, -1.26653672190108, -0.113938357811379, 0.979881421396222, 0.330036606422509, -0.86020005246334
0.261920995960352, -1.26240207779436, -0.116969553869106, 0.96728575728707, 0.31385272423242, -0.835769899059703
0.277325907632542, -1.25723900553177, -0.119323709343441, 0.953959466338172, 0.297994598438532, -0.812227777308811
0.291577237684074, -1.25135990163113, -0.121114692059407, 0.940095110769276, 0.282616955767644, -0.790121512960409
0.304855922442828, -1.24408125910483, -0.122124068837196, 0.925788272592086, 0.267665595578817, -0.768808446856881
0.317381753644809, -1.23581657022352, -0.122748581550663, 0.911038369547592, 0.252934613155439, -0.748125590874021
0.329708589061631, -1.22765432301574, -0.123607195821032, 0.89559805644699, 0.238189123575318, -0.72789698762586
0.341964608503822, -1.21986078662354, -0.124967283668295, 0.87942971131819, 0.223346038119156, -0.707950905739039
0.354314711643746, -1.21243170674549, -0.126927654652927, 0.862585929179037, 0.208342812951477, -0.688084475425399
0.366361446084101, -1.20492549208967, -0.129174955181298, 0.845451316816943, 0.193642880103841, -0.66869873064727
0.389409794850632, -1.18868771001511, -0.1340668324592, 0.811369314033178, 0.165556301939467, -0.631183581734372
0.401194477643746, -1.18057760264643, -0.13712015543138, 0.794408733897312, 0.151462290511839, -0.611906600122282
0.413142231882411, -1.17266174583369, -0.140516392578584, 0.777840609104588, 0.137351491548718, -0.592286023507521
0.425714605881432, -1.16532836764136, -0.144602180150871, 0.761509556099974, 0.122823666758297, -0.5718510351588
0.438793320863282, -1.15864243553077, -0.149284407002797, 0.745512511852403, 0.107945334417784, -0.550893487674134
0.451786919848909, -1.15165040285961, -0.153895922817564, 0.730384734581735, 0.0932462082919023, -0.529836704037508
0.464416147880179, -1.14382123327415, -0.157979956834838, 0.716354079803415, 0.0789745894627697, -0.508715669715272
0.476678990508557, -1.13510028679024, -0.161399923281801, 0.703375769530293, 0.0651933171871622, -0.487570396762117
0.488415231390528, -1.12528053622926, -0.163985100462244, 0.691397961284095, 0.0519828465826856, -0.466597131463803
0.499440994075615, -1.11436099646395, -0.165648967423085, 0.680260787412237, 0.0393637034723657, -0.446001790615015
0.519448532349645, -1.08983128976766, -0.166232738069581, 0.659761626879499, 0.0155236418124193, -0.406135745706528
0.528411186930903, -1.07645458678993, -0.165196969343516, 0.650406485751257, 0.0042901999692647, -0.386986691830652
0.54425427612066, -1.04787719569361, -0.160518811204525, 0.633136685157078, -0.0168135501680515, -0.350454708593347
0.55102970708907, -1.03262587657326, -0.156887447035115, 0.625064064502599, -0.0264505847618152, -0.333421806691524
0.557059609877073, -1.01696288812913, -0.152584950414743, 0.617263209418053, -0.0353893796848618, -0.317385202913121
0.562483831574579, -1.00109696406897, -0.147739263074705, 0.60963060907063, -0.0436666761848583, -0.302315510918356
0.567387871424159, -0.985169234706565, -0.142480380082504, 0.602083573987146, -0.0512971622478474, -0.28820324920076
0.571607275961349, -0.968843381200007, -0.136676997686208, 0.594663423071081, -0.0580661017717874, -0.275257814158961
0.574912884189716, -0.952035209416104, -0.130255749242478, 0.587485849940751, -0.0637496168878742, -0.26386243277955
0.577417841587792, -0.934956397522537, -0.123392320631887, 0.580604135871836, -0.0683984174744334, -0.254065139340443
0.579251520076785, -0.917945681057737, -0.116341938630084, 0.574009767158453, -0.0723207924084483, -0.24567962704064
0.580691099446629, -0.901204683258521, -0.10932099976157, 0.567558999216975, -0.0758314819613928, -0.238359094580484
0.581829458773473, -0.885570903209033, -0.101964572346935, 0.561165628793466, -0.0794939711372151, -0.232199003752254
0.583364682831781, -0.870658159800641, -0.0957593607449864, 0.554352555627781, -0.0834859758346962, -0.225771240183304
0.585045895913746, -0.856517328427587, -0.090054344791275, 0.547287536943237, -0.087963136645432, -0.219321097033308
0.588944893748504, -0.829924553538345, -0.0791321854651472, 0.532393398567182, -0.0984280040499087, -0.205872884400883
0.591091060501288, -0.817275235384231, -0.0737116153042751, 0.524635308947194, -0.104243252052359, -0.198814815241882
0.595844518426027, -0.793067869661674, -0.0630847927978637, 0.508907034050208, -0.116556875857965, -0.183905576319618
0.60096483300093, -0.769734246163967, -0.0526522374690537, 0.493643315358882, -0.128644148336951, -0.168509039299858
0.603587929988412, -0.758157357038918, -0.0474826181642562, 0.486425643200703, -0.134186939964843, -0.160829542135451
0.608731142441186, -0.734587835955607, -0.0373192762210421, 0.47308425165744, -0.143774712409576, -0.145945282714893
0.610797504811552, -0.722138746322203, -0.0320728492257472, 0.466992894530441, -0.147364138203397, -0.139367066945726
0.612513438949943, -0.709237091609941, -0.0267459763481522, 0.461156747345007, -0.150138191217648, -0.1335410933937
0.614083549093143, -0.696544371114032, -0.0215659606824567, 0.455354320313174, -0.152360589206574, -0.128326818469763
0.615597092940046, -0.684474116806293, -0.016550317192685, 0.449553991337689, -0.154099606436109, -0.123818984008716
0.617161753935869, -0.673056424844393, -0.0116955011477915, 0.443775692551153, -0.15557004494343, -0.119896272565805
0.618737279066884, -0.662113935835914, -0.00679009416392122, 0.438124608913647, -0.156826641354939, -0.116539114371283
0.620214119621695, -0.651416428395423, -0.00179794334562099, 0.432496123812306, -0.157993874934725, -0.113665956098472
0.624070395395731, -0.620910896887397, 0.0134541100469649, 0.414784742668747, -0.162422217103151, -0.106712344305008
0.625588250108884, -0.61139292754249, 0.0184138486370126, 0.408567851417822, -0.164801541880523, -0.103871626794418
0.629365421918391, -0.592808307097752, 0.0280628734797318, 0.396272206634954, -0.171461166870605, -0.0961201648621381
0.634252206779283, -0.57445369696619, 0.0373976608269375, 0.384755920639116, -0.180275272411354, -0.0853429032928501
0.636865857453593, -0.565153510268169, 0.0420763640944658, 0.379371985036018, -0.185018067357908, -0.0792878082383134
0.639386487602536, -0.55572271423787, 0.0467950904944014, 0.374320606454977, -0.189702038718915, -0.0731097202085046
0.641778701085534, -0.546209518717551, 0.0515320972571818, 0.369639696276146, -0.194128751667559, -0.067028897125806
0.644006208279909, -0.536658839176115, 0.056152393415353, 0.36530602871987, -0.19825633955719, -0.0612251812300681
0.647751146384215, -0.517483575297049, 0.0647298343342841, 0.357322318256866, -0.205457605083535, -0.050886997459608
0.649876179553649, -0.497469363155347, 0.0729721102481779, 0.349441368905567, -0.210447332754617, -0.0432793167852423
0.650216364263568, -0.48695779571992, 0.0770809498731628, 0.345313018165403, -0.211973142059509, -0.0407269379483258
0.65021841529633, -0.476239475009979, 0.0811627619595629, 0.340922276036562, -0.212988155213414, -0.0388847819781055
0.649909593135693, -0.465375323462272, 0.0852506527874309, 0.336229752578576, -0.213582580438142, -0.0376530675718127
0.649444588361437, -0.454536275057848, 0.0892769881609606, 0.331227648486502, -0.213917132441028, -0.0367539370614347
0.64904379987395, -0.443980244883414, 0.0931917525461747, 0.325847937659896, -0.214125233947543, -0.0359673691734832
0.648830792664663, -0.433800793371477, 0.0969922504028698, 0.320102298132917, -0.214412848040303, -0.0351025004297715
0.648813934612519, -0.423962589252302, 0.100668824297791, 0.314008168476405, -0.21485567353751, -0.0341077814768832
0.648884853246567, -0.414481384006415, 0.104386455233412, 0.30762656944372, -0.215793046943327, -0.0326814995584505
0.649407298861855, -0.405422794097733, 0.107742126511624, 0.301230168354686, -0.21665732025339, -0.0308914413976054
0.650244393699317, -0.396793441436926, 0.111055701043727, 0.294836692235216, -0.217710263693366, -0.0286745097462019
0.651278803480023, -0.388497184219653, 0.114357225935243, 0.288547506744064, -0.219014349669818, -0.0260327210391184
0.65241584855989, -0.380407450198521, 0.117683044827905, 0.282409253978332, -0.220554248333861, -0.0229618649138879
0.653672619377183, -0.372575953078755, 0.12110730988667, 0.276474869060232, -0.222237647882121, -0.0194784250925099
0.655068609852331, -0.365086333351901, 0.124549684177166, 0.270828996391669, -0.224069468806093, -0.0155193649015046
0.656722990661604, -0.35798306387778, 0.12792225757283, 0.265583686858855, -0.226015451810251, -0.0110349603139496
0.658622150843331, -0.351289434529829, 0.131170831909122, 0.260729889319996, -0.228090752495516, -0.00599770851068535
0.660573905160396, -0.344930978291031, 0.13425759907716, 0.256199060695896, -0.23017282997675, -0.000569799419054971
0.662314233157966, -0.338750770217465, 0.137123530968315, 0.251949671405746, -0.232134936435928, 0.00495483654656704
0.663605119934111, -0.332551864829078, 0.139787017634962, 0.247986681237467, -0.233894597823149, 0.0103855806439384
0.664454813413896, -0.326244703816232, 0.142264341582156, 0.24419043618702, -0.235472209084782, 0.0155292553914487
0.664776320735546, -0.319786239831779, 0.144513730555511, 0.240537116526522, -0.236921345528119, 0.0203238900737779
0.664568502794222, -0.313227038075075, 0.146558751047075, 0.236938046827731, -0.238183800142867, 0.0246653920289891
0.663842494599731, -0.30661431088642, 0.148463552211766, 0.233305036637066, -0.239198286654459, 0.0285146922134726
0.66260342074569, -0.29996374491571, 0.150332439492298, 0.229460007971906, -0.239928382328575, 0.0318046878950423
0.660764098901961, -0.293208176161543, 0.152222081589814, 0.225476531493221, -0.240324222850048, 0.0345667293741871
0.658446803453362, -0.286315750316277, 0.154137146476766, 0.221429692688164, -0.240302040986872, 0.0368237927359445
0.655756586547326, -0.279350244585091, 0.156063836639094, 0.217260730269989, -0.239911019053097, 0.0385822909093636
0.652728126915621, -0.272349678856572, 0.157937050409137, 0.212940531353321, -0.239305234668173, 0.0399514071217232
0.646050144099289, -0.258509270903155, 0.16141128266634, 0.204196831153751, -0.237653316970422, 0.0418858298174595
0.6425521812949, -0.251846136724137, 0.163031650293364, 0.199989279001027, -0.23682097717573, 0.0427142426048247
0.639046793823909, -0.245478916078253, 0.16461050500316, 0.195985403489905, -0.236079880750874, 0.0435697612536497
0.635532594221009, -0.239457294118872, 0.166128557653959, 0.192244565688052, -0.235450098095761, 0.044506805044745
0.632104220037296, -0.233788325015004, 0.16757944917967, 0.188838914389394, -0.234875809733198, 0.0455553914823317
0.62874220186903, -0.228398792744585, 0.16897536893545, 0.18578350709019, -0.234288036724062, 0.0466737736875315
0.625438865353388, -0.223270369739924, 0.17028693267811, 0.18308962970087, -0.233737246390096, 0.0478679370597567
0.622158836977704, -0.21831458693838, 0.17149083966775, 0.18075413218226, -0.233210000169399, 0.0491014921447517
0.618901472425373, -0.213445860404014, 0.172667170146451, 0.178713937484293, -0.232655596903623, 0.0503192311496422
0.615651214148608, -0.208670184055976, 0.173873665185762, 0.176914161170657, -0.231994864522891, 0.0514312973711767
0.612457202287771, -0.204008853907676, 0.175130683992078, 0.175326756938425, -0.231268198794028, 0.0524646704949502
0.609391531181079, -0.199440752816564, 0.176361113261112, 0.173902219156711, -0.230485205079823, 0.0533662627225909
0.606497301103971, -0.195053260399559, 0.177582800858769, 0.172571344196012, -0.229748800929502, 0.0540785878525876
0.603778708097867, -0.190805092789284, 0.178735611640236, 0.171301833718157, -0.228949845300919, 0.0545301241154928
0.601187566865855, -0.186644015904162, 0.179823382701538, 0.170032432898972, -0.228028209058089, 0.0547052391720182
0.598673818841298, -0.182509382949675, 0.180838538633713, 0.168756608946611, -0.227014875590092, 0.0546515016482751
0.59621166475225, -0.178416634188995, 0.181767965726361, 0.167404795329554, -0.226010537280098, 0.0544345096049556
0.593832573499638, -0.174392213381956, 0.182605265003935, 0.165953142470528, -0.225027653463442, 0.0540690319486636
0.591479875448952, -0.170453070312067, 0.183336582013059, 0.164361035688281, -0.224109240603869, 0.053581012772244
0.586869154747376, -0.163049873478684, 0.184662693909749, 0.160680445295654, -0.222810619973764, 0.0520683980849894
0.58463986322907, -0.159629512658937, 0.185289179022623, 0.15863661044976, -0.222485335395689, 0.0510144595135888
0.582467263759738, -0.156368216424875, 0.185882334872961, 0.156499426153555, -0.222297300547782, 0.0497647313149902
0.580378096753644, -0.153209006843892, 0.186497144376668, 0.154259177793224, -0.222312220724661, 0.0483897320697791
0.578451954098539, -0.150164795165036, 0.187113821518128, 0.151963474142392, -0.22249527736954, 0.0469778057652905
0.576765414839142, -0.147222646934631, 0.187707298803291, 0.1496786230315, -0.222800165704353, 0.0455430926927203
0.575252959416961, -0.144380065528836, 0.188260892393542, 0.147412920195078, -0.223166825148859, 0.0440700644507722
0.574001175938525, -0.141432423793027, 0.188610175367219, 0.145271736006629, -0.223335440411644, 0.0427064455917952
0.572791904009242, -0.138774356937489, 0.189106593534146, 0.143099016144725, -0.223616682562343, 0.0410290802523226
0.571740745653293, -0.136236042894571, 0.189515152022601, 0.141040400632525, -0.223839470422728, 0.0392760377505851
0.570903444324533, -0.133786031125163, 0.189830375014463, 0.139073692696316, -0.224034715026949, 0.0374754660104419
0.570215145667942, -0.131417124367974, 0.190108904164465, 0.137165130650819, -0.224185348734398, 0.035632421051339
0.569649557194948, -0.129121184338498, 0.190354588598821, 0.135342517152377, -0.224311081386254, 0.0337436982421402
0.568935053206269, -0.124621953570809, 0.190766366037463, 0.131941577277594, -0.22450946063517, 0.029874006955457
0.568816326808248, -0.122397043691012, 0.190943974812144, 0.130351879479445, -0.22470447626944, 0.0279955513186626
0.568878292067458, -0.120274301133308, 0.191141746434466, 0.12880698776599, -0.225041362723554, 0.0262037523506807
0.569141972027813, -0.118280819387017, 0.191339651404813, 0.127291922915686, -0.225500055681657, 0.0245527569351595
0.569590746597369, -0.11648445963262, 0.191542137302532, 0.125778419354793, -0.226121651405724, 0.0230462485336031
0.570190077081507, -0.114870630211787, 0.191724056934817, 0.124250603237863, -0.22686919432117, 0.0216374198955729
0.570882645769776, -0.113432222181239, 0.191871582651696, 0.122723706204453, -0.227759287663372, 0.0202768302952071
0.571637901247762, -0.112182655221598, 0.192023547466514, 0.121176972547681, -0.228791921629847, 0.0189497880029922
0.572475171685525, -0.111119696207525, 0.192135725271388, 0.119607834643431, -0.229963764638973, 0.0176327788550073
0.573334075040098, -0.110265492296815, 0.192245584153652, 0.118022649529963, -0.231276999537059, 0.0163087864180428
0.574210431560548, -0.109611037107096, 0.192355769178378, 0.116401705012417, -0.232738096906437, 0.0149849464660169
0.575036156519194, -0.109142124512239, 0.192440223369534, 0.114781778577827, -0.234356894801469, 0.0136249722937141
0.575806641247419, -0.108813185990271, 0.192535297898157, 0.113145272630006, -0.236146485568685, 0.0121798049074768
0.576524507185031, -0.108648601117973, 0.192642108424681, 0.111519491739336, -0.238064193473408, 0.0106883897393918
0.57723158026594, -0.108604257878028, 0.192747224535749, 0.109896639604642, -0.24010288254893, 0.00917112830161136
0.577955913890779, -0.108681957891101, 0.192850909833076, 0.108294608093447, -0.242210622905305, 0.00765078397369216
0.578706570644515, -0.108822176982997, 0.192902482508897, 0.106741930781371, -0.244322737669551, 0.0061502521455199
0.580264681503004, -0.109117657583265, 0.192904381919948, 0.103809164413837, -0.248316921929079, 0.00314798553873645
0.581005537139968, -0.109239550211373, 0.192842163330484, 0.102413433892616, -0.250140661931163, 0.00163020548410902
0.582534095278562, -0.109533088344642, 0.192633406715151, 0.0998200109292632, -0.253532204792451, -0.00124439194176809
0.583382808377847, -0.109727966526474, 0.192494752644708, 0.0986336839967713, -0.255164475029765, -0.00251714366134434
0.584319538283559, -0.109934755249914, 0.192339527875503, 0.0975181946316531, -0.25677042137759, -0.00367008437838558