"Dstat 0.9.10 CSV output"
"Author:","Dag Wieers <dag@wieers.com>",,,,"URL:","http://dag.wieers.com/home-made/dstat/"
"Host:","node-a8-103",,,,"User:","root"
"Cmdline:","dstat -m -c -n -o /tmp/dstat-provlake.csv",,,,"Date:","09 Jan 2023 15:28:28 CET"
"memory usage",,,,"total cpu usage",,,,,"net/total",
"used","free","buff","cach","usr","sys","idl","wai","stl","recv","send"
22765568,122220544,0,97542144,8.165,1.515,90.294,0.027,0,0,0
22798336,122187776,0,97542144,1.980,0.990,97.030,0,0,374,1098
22798336,122187776,0,97542144,2,0,98,0,0,246,410
22765568,122220544,0,97542144,2,0,98,0,0,126,350
22765568,122220544,0,97542144,2,0,98,0,0,246,410
22765568,122220544,0,97542144,1.980,0,98.020,0,0,186,350
22765568,122220544,0,97542144,2,0,98,0,0,606,410
22798336,122187776,0,97542144,2,0,98,0,0,546,350
22798336,122187776,0,97542144,2,0,98,0,0,306,350
23773184,121212928,0,97542144,8,3,89,0,0,2742,2348
26107904,118878208,0,97542144,77,19,4,0,0,20636,20108
27402240,117526528,0,97591296,76.471,12.745,8.824,1.961,0,37918,48748
28368896,116379648,0,97771520,76.596,17.021,6.383,0,0,180930,42128
29011968,115580928,0,97923072,89,7,3,1,0,133296,24474
30064640,113586176,0,98848768,63,24,8,5,0,838620,74852
31584256,111833088,0,99078144,80.769,12.500,5.769,0.962,0,237414,39488
32841728,110575616,0,99078144,82.292,13.542,4.167,0,0,21124,20484
33800192,109252608,0,99438592,81,13,5,1,0,296772,37968
34725888,107954176,0,99790848,69.697,16.162,12.121,2.020,0,306282,60723
34725888,107954176,0,99790848,11.881,0,88.119,0,0,2622,2667
34725888,107954176,0,99790848,18.812,0.990,80.198,0,0,2640,4054
34725888,107954176,0,99790848,18,0,82,0,0,2640,4053
34758656,107921408,0,99790848,13.131,0,86.869,0,0,1336,3105
34725888,107954176,0,99790848,6,1,93,0,0,890,1363
34725888,107954176,0,99790848,17.172,0,82.828,0,0,2594,4497
34758656,107921408,0,99790848,17.347,0,82.653,0,0,2580,4047
34725888,107954176,0,99790848,15.464,0,84.536,0,0,2014,3965
34725888,107954176,0,99790848,3,0,97,0,0,1082,594
34725888,107954176,0,99790848,17,1,82,0,0,2880,4162
34758656,107921408,0,99790848,18.182,0,81.818,0,0,2460,4324
34725888,107954176,0,99790848,16.667,2.941,80.392,0,0,2040,4050
34725888,107954176,0,99790848,6.061,0,93.939,0,0,4180,1630
34725888,107954176,0,99790848,12,2,86,0,0,2006,3058
34725888,107954176,0,99790848,18,1,81,0,0,6390,6365
34758656,107921408,0,99790848,17.347,1.020,81.633,0,0,10346,4135
34725888,107954176,0,99790848,11,0,89,0,0,958,2937
34725888,107954176,0,99790848,8,1,91,0,0,1268,1538
34758656,107921408,0,99790848,17.347,0,82.653,0,0,2100,4053
34758656,107921408,0,99790848,17.172,0,82.828,0,0,2040,4115
34758656,107921408,0,99790848,16.162,0,83.838,0,0,1678,4072
34725888,107954176,0,99790848,3.030,0,96.970,0,0,710,530
34725888,107954176,0,99790848,16,2,82,0,0,1986,4164
34758656,107921408,0,99790848,17.347,0,82.653,0,0,1980,4557
34758656,107921408,0,99790848,17.172,0,82.828,0,0,2100,4057
34725888,107954176,0,99790848,6,0,94,0,0,382,1699
34725888,107954176,0,99790848,13.265,0,86.735,0,0,1886,2938
34758656,107921408,0,99790848,17.172,0,82.828,0,0,2040,4116
34758656,107921408,0,99790848,17.347,0,82.653,0,0,1980,4057
34725888,107954176,0,99790848,11,0,89,0,0,838,2877
34725888,107954176,0,99790848,8.081,0,91.919,0,0,1328,1538
34725888,107954176,0,99790848,17.172,0,82.828,0,0,2040,4057
34758656,107921408,0,99790848,17.347,0,82.653,0,0,1980,4057
34758656,107921408,0,99790848,16.162,0,83.838,0,0,1576,4001
34725888,107954176,0,99790848,2.970,0.990,96.040,0,0,984,800
34725888,107954176,0,99790848,18.182,0,81.818,0,0,2142,4297
34758656,107921408,0,99790848,17,1,82,0,0,1980,4055
34758656,107921408,0,99790848,16.327,1.020,82.653,0,0,2134,4214
34725888,107954176,0,99790848,6,0,94,0,0,340,1694
34725888,107954176,0,99790848,14,0,86,0,0,1886,2901
34758656,107921408,0,99790848,16.495,0,83.505,0,0,2082,4183
34758656,107921408,0,99790848,19.417,0.971,79.612,0,0,2288,4433
34725888,107954176,0,99790848,10.101,1.010,88.889,0,0,1146,3193
34725888,107954176,0,99790848,8.081,0,91.919,0,0,1448,1598
34758656,107921408,0,99790848,17.172,0,82.828,0,0,1980,4151
34758656,107921408,0,99790848,18.182,0,81.818,0,0,2100,4114
34758656,107921408,0,99790848,17.476,1.942,80.583,0,0,1516,3944
34758656,107921408,0,99790848,3,0,97,0,0,1070,530
34725888,107954176,0,99790848,17.172,1.010,81.818,0,0,2460,4049
34758656,107921408,0,99790848,19.608,0,80.392,0,0,2280,4057
34725888,107954176,0,99790848,18.812,0.990,80.198,0,0,2502,4248
34758656,107921408,0,99790848,5.941,0.990,93.069,0,0,1540,1573
34725888,107954176,0,99790848,15,0,85,0,0,5366,2837
34758656,107921408,0,99790848,18.182,0,81.818,0,0,6026,4193
34758656,107921408,0,99790848,16.162,1.010,82.828,0,0,3120,4057
34758656,107921408,0,99790848,11.111,0,88.889,0,0,1480,3002
34725888,107954176,0,99790848,8.081,0,91.919,0,0,2708,1597
34758656,107921408,0,99790848,17.347,0,82.653,0,0,3600,4056
34725888,107954176,0,99790848,17.172,0,82.828,0,0,3018,4143
34758656,107921408,0,99790848,16.832,0.990,82.178,0,0,2116,3881
34725888,107954176,0,99790848,3.030,0,96.970,0,0,1910,530
34725888,107954176,0,99790848,18,0,82,0,0,2640,4055
34758656,107921408,0,99790848,17.347,0,82.653,0,0,2520,4116
34725888,107954176,0,99790848,17,1,82,0,0,2166,4234
34725888,107954176,0,99790848,5.051,1.010,93.939,0,0,340,2134
34758656,107921408,0,99790848,14,0,86,0,0,2168,3033
34758656,107921408,0,99790848,19.802,0,80.198,0,0,2700,4142
34725888,107954176,0,99790848,16.832,1.980,81.188,0,0,2220,4117
34725888,107954176,0,99790848,11.881,0.990,87.129,0,0,1558,2937
34758656,107921408,0,99790848,8,1,91,0,0,2048,1598
34725888,107954176,0,99790848,16,2,82,0,0,2442,4181
34758656,107921408,0,99790848,16.832,2.970,80.198,0,0,1980,4209
34758656,107921408,0,99790848,16.832,0.990,82.178,0,0,4336,3878
34758656,107921408,0,99790848,3.030,0,96.970,0,0,1730,590
34758656,107921408,0,99790848,17.347,0,82.653,0,0,6544,6579
34725888,107954176,0,99790848,17.822,1.980,80.198,0,0,10380,4249
34758656,107921408,0,99790848,19,0,81,0,0,1980,4047
34758656,107921408,0,99790848,5,1,94,0,0,280,1570
34758656,107921408,0,99790848,13.131,0,86.869,0,0,1826,2841
34725888,107954176,0,99790848,18,0,82,0,0,2040,4116
34725888,107954176,0,99790848,17.172,1.010,81.818,0,0,2142,4308
34758656,107921408,0,99790848,11,0,89,0,0,838,2877
34758656,107921408,0,99790848,8.911,0.990,90.099,0,0,1388,1597
34758656,107921408,0,99790848,18.627,0.980,80.392,0,0,1920,4052
34725888,107954176,0,99790848,19,0,81,0,0,1920,4055
34725888,107954176,0,99790848,16.832,0.990,82.178,0,0,2056,4239
34725888,107954176,0,99790848,3,0,97,0,0,272,358
34758656,107921408,0,99790848,18,0,82,0,0,2040,4045
34758656,107921408,0,99790848,18.812,0.990,80.198,0,0,1980,4056
34725888,107954176,0,99790848,16,2,82,0,0,2040,4056
34725888,107954176,0,99790848,6.931,0,93.069,0,0,718,1805
34725888,107954176,0,99790848,13.861,0.990,85.149,0,0,1388,2669
34758656,107921408,0,99790848,17.647,1.961,80.392,0,0,2100,4117
34725888,107954176,0,99790848,17,2,81,0,0,2100,4177
34758656,107921408,0,99790848,11,0,89,0,0,1430,3110
34725888,107954176,0,99790848,8.081,0,91.919,0,0,932,1642
34758656,107921408,0,99790848,19,0,81,0,0,2100,4115
34725888,107954176,0,99790848,17.822,0.990,81.188,0,0,2194,4275
34758656,107921408,0,99790848,16.505,2.913,80.583,0,0,1894,4031
34725888,107954176,0,99790848,2,1,97,0,0,152,444
34758656,107921408,0,99790848,18.182,0,81.818,0,0,2142,4232
34758656,107921408,0,99790848,16.832,1.980,81.188,0,0,2288,4371
34725888,107954176,0,99790848,18.182,0,81.818,0,0,2434,4510
34725888,107954176,0,99790848,5.941,0.990,93.069,0,0,220,1574
34758656,107921408,0,99790848,14.851,0,85.149,0,0,2072,3211
34758656,107921408,0,99790848,17,2,81,0,0,1980,4495
34725888,107954176,0,99790848,17.822,0.990,81.188,0,0,2160,4115
34725888,107954176,0,99790848,11.111,0,88.889,0,0,1276,2963
34725888,107954176,0,99790848,8,0,92,0,0,1748,1537
34758656,107921408,0,99790848,18.182,0,81.818,0,0,2160,4055
34725888,107954176,0,99790848,17,1,82,0,0,2442,4240
34758656,107921408,0,99790848,17.822,0.990,81.188,0,0,2896,3937
34725888,107954176,0,99790848,3,0,97,0,0,3976,608
34725888,107954176,0,99790848,17.347,0,82.653,0,0,6000,4055
34758656,107921408,0,99790848,15.842,2.970,81.188,0,0,3360,4057
34758656,107921408,0,99790848,17.172,1.010,81.818,0,0,2682,4243
34787328,107892736,0,99799040,6.931,0,93.069,0,0,1420,1574
34820096,107859968,0,99799040,14,1,85,0,0,3566,2841
34820096,107859968,0,99799040,17.822,0.990,81.188,0,0,3000,4155
34820096,107859968,0,99799040,17.822,1.980,80.198,0,0,2640,4117
34787328,107892736,0,99799040,11.765,0.980,87.255,0,0,1918,2876
34787328,107892736,0,99799040,9,0,91,0,0,2048,1538
34820096,107859968,0,99799040,18,1,81,0,0,2700,4236
34787328,107892736,0,99799040,16.832,1.980,81.188,0,0,2040,4057
34787328,107892736,0,99799040,17,0,83,0,0,1894,3970
34820096,107859968,0,99799040,3,0,97,0,0,392,504
34820096,107859968,0,99799040,18.182,0,81.818,0,0,2982,4299
34787328,107892736,0,99799040,18.812,0,81.188,0,0,2160,4116
34820096,107859968,0,99799040,17.822,1.980,80.198,0,0,2580,4057
34787328,107892736,0,99799040,6,0,94,0,0,640,1574
34787328,107892736,0,99799040,14,0,86,0,0,2708,3028
34820096,107859968,0,99799040,16.162,2.020,81.818,0,0,2040,4118
34787328,107892736,0,99799040,18,0,82,0,0,2640,4059
34787328,107892736,0,99799040,12.745,0.980,86.275,0,0,4636,3109
34820096,107859968,0,99799040,8.911,0.990,90.099,0,0,5454,3888
34787328,107892736,0,99799040,19.802,0.990,79.208,0,0,10200,4056
34787328,107892736,0,99799040,18,0,82,0,0,2040,4060
34820096,107859968,0,99799040,16.832,0.990,82.178,0,0,1756,3977
34787328,107892736,0,99799040,3,0,97,0,0,590,530
34787328,107892736,0,99799040,19,0,81,0,0,2100,4102
34820096,107859968,0,99799040,16.832,1.980,81.188,0,0,2040,4058
34820096,107859968,0,99799040,16.327,1.020,82.653,0,0,2142,4310
34787328,107892736,0,99799040,5.941,0.990,93.069,0,0,220,1574
34787328,107892736,0,99799040,13.131,0,86.869,0,0,1946,2839
34787328,107892736,0,99799040,17.172,0,82.828,0,0,2100,4118
34820096,107859968,0,99799040,18,1,81,0,0,2082,4398
34787328,107892736,0,99799040,11.765,0.980,87.255,0,0,880,3383
34787328,107892736,0,99799040,8,1,91,0,0,1268,1637
34787328,107892736,0,99799040,19.608,0,80.392,0,0,2040,4119
34787328,107892736,0,99799040,19,0,81,0,0,1980,4055
34787328,107892736,0,99799040,16.162,0,83.838,0,0,1954,4048
34820096,107859968,0,99799040,3,0,97,0,0,272,418
34779136,107900928,0,99799040,17.347,0,82.653,0,0,2246,4241
34779136,107900928,0,99799040,18,0,82,0,0,1980,4057
34811904,107868160,0,99799040,15.686,3.922,80.392,0,0,2194,4206
34779136,107900928,0,99799040,5.941,0.990,93.069,0,0,340,1692
34779136,107900928,0,99799040,13.131,1.010,85.859,0,0,2048,3086
34811904,107868160,0,99799040,17.822,0.990,81.188,0,0,2212,4294
34811904,107868160,0,99799040,18,1,81,0,0,2040,4052
34779136,107900928,0,99799040,11.881,0,88.119,0,0,838,2874
34779136,107900928,0,99799040,8.911,0.990,90.099,0,0,1328,1596
34779136,107900928,0,99799040,19.608,0,80.392,0,0,2142,4239
34811904,107868160,0,99799040,17.172,1.010,81.818,0,0,2682,4823
34811904,107868160,0,99799040,16,1,83,0,0,1516,3882
34787328,107892736,0,99799040,3,0,97,0,0,590,530
34787328,107892736,0,99799040,17.822,0.990,81.188,0,0,2040,4045
34820096,107859968,0,99799040,18,1,81,0,0,2040,4052
34787328,107892736,0,99799040,17.647,1.961,80.392,0,0,2460,4112
34787328,107892736,0,99799040,6,0,94,0,0,1198,1743
34787328,107892736,0,99799040,13.861,0.990,85.149,0,0,1568,2755
34820096,107859968,0,99799040,18.812,0,81.188,0,0,2220,4052
34787328,107892736,0,99799040,19,0,81,0,0,3222,4306
34820096,107859968,0,99799040,9.091,2.020,88.889,0,0,4396,3047
34820096,107859968,0,99799040,8.081,0,91.919,0,0,5150,1423
34787328,107892736,0,99799040,18.182,0,81.818,0,0,3420,4054
34820096,107859968,0,99799040,17,1,82,0,0,2580,4052
34787328,107892736,0,99799040,17.822,0,82.178,0,0,3196,4095
34791424,107884544,0,99799040,3.030,0,96.970,0,0,2012,504
34791424,107884544,0,99799040,18.182,0,81.818,0,0,3000,4057
34791424,107884544,0,99799040,18,0,82,0,0,2640,4057
34816000,107859968,0,99799040,18.812,0,81.188,0,0,3180,4117
34816000,107859968,0,99799040,7,0,93,0,0,1120,1693
34783232,107892736,0,99799040,14,0,86,0,0,2426,2841
34816000,107859968,0,99799040,18.812,0,81.188,0,0,2160,4053
34816000,107859968,0,99799040,18.182,0,81.818,0,0,2100,4159
34816000,107859968,0,99799040,10.891,0.990,88.119,0,0,898,2867
34783232,107892736,0,99799040,8.081,0,91.919,0,0,2216,1905
34783232,107892736,0,99799040,17,2,81,0,0,2100,4494
34783232,107892736,0,99799040,18.627,0.980,80.392,0,0,2640,4111
34783232,107892736,0,99799040,18.627,0,81.373,0,0,1636,3879
34783232,107892736,0,99799040,3.030,0,96.970,0,0,1370,530
34816000,107859968,0,99799040,18,0,82,0,0,2262,4240
34783232,107892736,0,99799040,17.822,0.990,81.188,0,0,2040,4116
34783232,107892736,0,99799040,16,3,81,0,0,5880,4052
34783232,107892736,0,99799040,6.931,0,93.069,0,0,2518,1908
34783232,107892736,0,99799040,13.265,1.020,85.714,0,0,12372,5125
34816000,107859968,0,99799040,16.495,0,83.505,0,0,1980,4057
34816000,107859968,0,99799040,17.822,0.990,81.188,0,0,1980,4057
34783232,107892736,0,99799040,11,0,89,0,0,838,1925
34783232,107892736,0,99799040,9,0,91,0,0,1268,2485
34783232,107892736,0,99799040,17,2,81,0,0,2160,4174
34816000,107859968,0,99799040,18.812,0,81.188,0,0,2108,4326
34783232,107892736,0,99799040,17,0,83,0,0,1396,3229
34783232,107892736,0,99799040,2,1,97,0,0,830,1246
34783232,107892736,0,99799040,18.182,0,81.818,0,0,2040,4047
34816000,107859968,0,99799040,18.812,0,81.188,0,0,1980,4057
34816000,107859968,0,99799040,17,1,82,0,0,2280,4325
34783232,107892736,0,99799040,4.040,1.010,94.949,0,0,220,1572
34783232,107892736,0,99799040,15,0,85,0,0,1886,2840
34783232,107892736,0,99799040,17.822,0.990,81.188,0,0,1980,4056
34816000,107859968,0,99799040,17.647,1.961,80.392,0,0,2100,4275
34783232,107892736,0,99799040,10.101,1.010,88.889,0,0,924,3011
34783232,107892736,0,99799040,9,0,91,0,0,1268,1534
34783232,107892736,0,99799040,17.822,0.990,81.188,0,0,2100,4172
34816000,107859968,0,99799040,17,1,82,0,0,2134,4206
34783232,107892736,0,99799040,15.306,0,84.694,0,0,1456,3227
34783232,107892736,0,99799040,3.030,0,96.970,0,0,932,1435
34783232,107892736,0,99799040,17,1,82,0,0,2254,4370
34816000,107859968,0,99799040,18,0,82,0,0,2040,4057
34816000,107859968,0,99799040,19,0,81,0,0,1980,4056
34783232,107892736,0,99799040,4.950,0.990,94.059,0,0,340,598
34783232,107892736,0,99799040,14,1,85,0,0,1988,3991
34816000,107859968,0,99799040,17.172,0,82.828,0,0,2656,4844
34816000,107859968,0,99799040,18,1,81,0,0,1920,4056
34783232,107892736,0,99799040,10,1,89,0,0,778,2876
34783232,107892736,0,99799040,9,0,91,0,0,1328,1537
34816000,107859968,0,99799040,18.812,0,81.188,0,0,2160,4056
34783232,107892736,0,99799040,17.647,1.961,80.392,0,0,2346,4235
34816000,107859968,0,99799040,16,1,83,0,0,2056,3669
34783232,107892736,0,99799040,2.020,1.010,96.970,0,0,950,1246
34816000,107859968,0,99799040,18.447,1.942,79.612,0,0,2280,4047
34783232,107892736,0,99799040,19.802,0,80.198,0,0,3162,4346
34783232,107892736,0,99799040,18.812,0,81.188,0,0,4920,4116
34816000,107859968,0,99799040,6.061,0,93.939,0,0,4730,1573
34783232,107892736,0,99799040,13.725,1.961,84.314,0,0,3266,2841
34783232,107892736,0,99799040,18,1,81,0,0,2640,4116
34783232,107892736,0,99799040,16.327,0,83.673,0,0,3222,4182
34783232,107892736,0,99799040,11.111,0,88.889,0,0,2518,2877
34783232,107892736,0,99799040,8,1,91,0,0,2468,1537
34816000,107859968,0,99799040,17.647,1.961,80.392,0,0,2940,4114
34816000,107859968,0,99799040,19,0,81,0,0,3000,4116
34816000,107859968,0,99799040,16,1,83,0,0,2536,3945
34816000,107859968,0,99799040,3.960,0,96.040,0,0,1190,590
34816000,107859968,0,99799040,17.822,0.990,81.188,0,0,2100,4109
34783232,107892736,0,99799040,18,1,81,0,0,2100,4056
34783232,107892736,0,99799040,17.172,0,82.828,0,0,2160,4116
34816000,107859968,0,99799040,6,0,94,0,0,1102,704
34816000,107859968,0,99799040,14,0,86,0,0,2006,3951
34816000,107859968,0,99799040,17.172,1.010,81.818,0,0,2580,4055
34816000,107859968,0,99799040,18,0,82,0,0,2100,4055
34783232,107892736,0,99799040,11,0,89,0,0,2004,2063
34783232,107892736,0,99799040,8,1,91,0,0,1490,2674
34816000,107859968,0,99799040,18,0,82,0,0,1920,4054
34816000,107859968,0,99799040,17,2,81,0,0,5880,4055
34783232,107892736,0,99799040,17,0,83,0,0,3376,3885
34783232,107892736,0,99799040,3.061,0,96.939,0,0,11652,3140
34783232,107892736,0,99799040,18,0,82,0,0,1980,4057
34783232,107892736,0,99799040,18,0,82,0,0,1980,4052
34816000,107859968,0,99807232,17,1,82,0,0,2100,4200
34816000,107859968,0,99807232,6,0,94,0,0,280,538
34783232,107892736,0,99807232,14.141,0,85.859,0,0,2006,3929
34816000,107859968,0,99807232,17.822,0.990,81.188,0,0,2228,4384
34816000,107859968,0,99807232,18,0,82,0,0,2040,4055
34783232,107892736,0,99807232,11.111,0,88.889,0,0,838,1926
34783232,107892736,0,99807232,8.911,0.990,90.099,0,0,1478,2695
34783232,107892736,0,99807232,18.812,0,81.188,0,0,1920,4054
34816000,107859968,0,99807232,18,0,82,0,0,2082,4179
34816000,107859968,0,99807232,15.306,0,84.694,0,0,1516,3227
34783232,107892736,0,99807232,3,0,97,0,0,776,1304
34783232,107892736,0,99807232,18.182,0,81.818,0,0,2100,4676
34816000,107859968,0,99807232,18.627,0.980,80.392,0,0,2100,4116
34816000,107859968,0,99807232,18.627,0.980,80.392,0,0,1980,4057
34783232,107892736,0,99807232,6,0,94,0,0,280,1634
34783232,107892736,0,99807232,13,1,86,0,0,1946,2900
34783232,107892736,0,99807232,17.347,0,82.653,0,0,2074,4206
34816000,107859968,0,99807232,18,0,82,0,0,2160,4173
34816000,107859968,0,99807232,11,1,88,0,0,1120,2464
34783232,107892736,0,99807232,9,0,91,0,0,1422,2295
34816000,107859968,0,99807232,18,0,82,0,0,1980,4053
34816000,107859968,0,99807232,18.812,0,81.188,0,0,1980,4055
34816000,107859968,0,99807232,15,2,83,0,0,1636,4005
34783232,107892736,0,99807232,3,0,97,0,0,692,656
34816000,107859968,0,99807232,19,0,81,0,0,2348,4361
34816000,107859968,0,99807232,18,0,82,0,0,2288,4371
34783232,107892736,0,99807232,17.822,0.990,81.188,0,0,2100,4057
34783232,107892736,0,99807232,6,0,94,0,0,280,1574
34816000,107859968,0,99807232,14.851,0.990,84.158,0,0,1946,2843
34816000,107859968,0,99807232,17.822,0.990,81.188,0,0,2220,4179
34816000,107859968,0,99807232,17.172,0,82.828,0,0,2640,4059
34816000,107859968,0,99807232,12,0,88,0,0,1078,2879
34783232,107892736,0,99807232,8.911,0,91.089,0,0,1448,1539
34816000,107859968,0,99807232,16.832,2.970,80.198,0,0,3162,4311
34783232,107892736,0,99807232,16.162,1.010,82.828,0,0,4320,4157
34783232,107892736,0,99807232,17,1,82,0,0,6496,3947
34816000,107859968,0,99807232,3,0,97,0,0,1850,530
34783232,107892736,0,99807232,17.822,0.990,81.188,0,0,2700,4055
34816000,107859968,0,99807232,19,0,81,0,0,3042,4184
34816000,107859968,0,99807232,18,0,82,0,0,3780,4050
34783232,107892736,0,99807232,6.061,0,93.939,0,0,1660,1689
34775040,107900928,0,99807232,13,1,86,0,0,3026,2903
34775040,107900928,0,99807232,17.822,0.990,81.188,0,0,2786,4138
34807808,107868160,0,99807232,18.182,0,81.818,0,0,3180,4116
34807808,107868160,0,99807232,11,0,89,0,0,1876,3023
34807808,107868160,0,99807232,7.071,1.010,91.919,0,0,890,1453
34807808,107868160,0,99807232,16.832,1.980,81.188,0,0,2040,4180
34775040,107900928,0,99807232,17.822,0.990,81.188,0,0,2118,4146
34807808,107868160,0,99807232,17.172,0,82.828,0,0,2776,4252
34807808,107868160,0,99807232,2.970,0.990,96.040,0,0,452,358
34775040,107900928,0,99807232,18,0,82,0,0,2580,4052
34807808,107868160,0,99807232,18.812,0,81.188,0,0,2166,4237
34775040,107900928,0,99807232,19.802,0,80.198,0,0,3206,4633
34775040,107900928,0,99807232,6,0,94,0,0,820,1867
34775040,107900928,0,99807232,14.851,0,85.149,0,0,1388,2667
34775040,107900928,0,99807232,17.347,0,82.653,0,0,5880,4054
34775040,107900928,0,99807232,17,2,81,0,0,3780,4053
34775040,107900928,0,99807232,11,1,88,0,0,12320,5570
34775040,107900928,0,99807232,9,0,91,0,0,950,1424
34775040,107900928,0,99807232,17.822,0.990,81.188,0,0,1920,4051
34775040,107900928,0,99807232,17.822,0.990,81.188,0,0,1980,4050
34775040,107900928,0,99807232,15.842,1.980,82.178,0,0,1954,4027
34807808,107868160,0,99807232,2.041,0,97.959,0,0,212,444
34807808,107868160,0,99807232,17.172,0,82.828,0,0,2022,4238
34775040,107900928,0,99807232,17,1,82,0,0,2040,4111
34775040,107900928,0,99807232,16.832,1.980,81.188,0,0,2040,4052
34807808,107868160,0,99807232,5,1,94,0,0,658,1745
34807808,107868160,0,99807232,14.141,0,85.859,0,0,1388,2665
34807808,107868160,0,99807232,18.627,0.980,80.392,0,0,2142,4279
34775040,107900928,0,99807232,17,1,82,0,0,2040,4116
34807808,107868160,0,99807232,11.111,0,88.889,0,0,1516,3082
34807808,107868160,0,99807232,7.071,0,92.929,0,0,950,1452
34775040,107900928,0,99807232,19,0,81,0,0,2040,4113
34775040,107900928,0,99807232,18.812,0,81.188,0,0,1980,4115
34775040,107900928,0,99807232,17,0,83,0,0,1954,3971
34807808,107868160,0,99807232,2.020,0,97.980,0,0,272,444
34775040,107900928,0,99807232,18,0,82,0,0,2476,4385
34775040,107900928,0,99807232,18.182,0,81.818,0,0,1920,4057
34775040,107900928,0,99807232,18.812,0,81.188,0,0,2022,4249
34807808,107868160,0,99807232,5.051,0,94.949,0,0,752,1818
34807808,107868160,0,99807232,14.851,0,85.149,0,0,1508,2815
34775040,107900928,0,99807232,18,0,82,0,0,2100,4177
34775040,107900928,0,99807232,17.172,1.010,81.818,0,0,1980,4057
34807808,107868160,0,99807232,11,0,89,0,0,1216,3047
34807808,107868160,0,99807232,8,1,91,0,0,1198,1680
34807808,107868160,0,99807232,19.608,0,80.392,0,0,2040,4149
34775040,107900928,0,99807232,17,2,81,0,0,2408,4431
34775040,107900928,0,99807232,16.832,0.990,82.178,0,0,1894,4055
34807808,107868160,0,99807232,2,1,97,0,0,272,358
34775040,107900928,0,99807232,18,0,82,0,0,2160,4142
34807808,107868160,0,99807232,18,1,81,0,0,2726,4227
34775040,107900928,0,99807232,16,2,82,0,0,2382,4241
34807808,107868160,0,99807232,5,1,94,0,0,964,1777
34775040,107900928,0,99807232,13,2,85,0,0,2690,3447
34775040,107900928,0,99807232,16.327,0,83.673,0,0,3900,4141
34807808,107868160,0,99807232,17.172,1.010,81.818,0,0,7398,4142
34775040,107900928,0,99807232,11.111,0,88.889,0,0,1978,2876
34775040,107900928,0,99807232,8.081,0,91.919,0,0,2108,1538
34775040,107900928,0,99807232,17.172,0,82.828,0,0,3060,4117
34775040,107900928,0,99807232,18.182,0,81.818,0,0,3840,4112
34775040,107900928,0,99807232,16.832,0.990,82.178,0,0,2656,3998
34807808,107868160,0,99807232,3,0,97,0,0,1610,530
34775040,107900928,0,99807232,18.182,0,81.818,0,0,2640,4114
34775040,107900928,0,99807232,18.812,0,81.188,0,0,3360,4057
34807808,107868160,0,99807232,18.812,0,81.188,0,0,2520,4052
34775040,107900928,0,99807232,5,2,93,0,0,460,1631
34775040,107900928,0,99807232,14,0,86,0,0,2048,3027
34807808,107868160,0,99807232,16.832,1.980,81.188,0,0,2040,4057
34807808,107868160,0,99807232,18.627,0.980,80.392,0,0,2862,4249
34775040,107900928,0,99807232,9,3,88,0,0,1456,3193
34807808,107868160,0,99807232,8,1,91,0,0,1430,1364
34807808,107868160,0,99807232,18.627,0.980,80.392,0,0,1980,4115
34775040,107900928,0,99807232,16.832,1.980,81.188,0,0,3000,4053
34807808,107868160,0,99807232,17,0,83,0,0,1834,3968
34775040,107900928,0,99807232,2.041,0,97.959,0,0,212,444
34775040,107900928,0,99807232,19.608,0,80.392,0,0,5940,4047
34775040,107900928,0,99807232,17.172,1.010,81.818,0,0,4020,4116
34807808,107868160,0,99807232,18,1,81,0,0,12784,6581
34807808,107868160,0,99807232,6,0,94,0,0,220,1574
34775040,107900928,0,99807232,13,1,86,0,0,1946,2837
34775040,107900928,0,99807232,18.182,0,81.818,0,0,2040,4115
34807808,107868160,0,99807232,17,1,82,0,0,2022,4183
34775040,107900928,0,99807232,12.745,0,87.255,0,0,1456,3082
34775040,107900928,0,99807232,8.081,0,91.919,0,0,932,1642
34775040,107900928,0,99807232,18.812,0,81.188,0,0,1980,4055
34775040,107900928,0,99807232,18.182,0,81.818,0,0,2040,4057
34775040,107900928,0,99807232,17,0,83,0,0,1954,3971
34807808,107868160,0,99807232,2.020,0,97.980,0,0,272,504
34775040,107900928,0,99807232,17,1,82,0,0,2280,4108
34807808,107868160,0,99807232,17.822,0.990,81.188,0,0,2040,4116
34807808,107868160,0,99807232,19,0,81,0,0,1980,4115
34775040,107900928,0,99807232,6,0,94,0,0,778,1804
34775040,107900928,0,99807232,14,0,86,0,0,1448,2665
34775040,107900928,0,99807232,18.812,0,81.188,0,0,2046,4173
34807808,107868160,0,99807232,18,1,81,0,0,1980,4557
34775040,107900928,0,99807232,10.891,0.990,88.119,0,0,1482,3184
34775040,107900928,0,99807232,8,1,91,0,0,1146,1639
34775040,107900928,0,99807232,17.822,0.990,81.188,0,0,1980,4054
34807808,107868160,0,99807232,17.172,1.010,81.818,0,0,2142,4305
34807808,107868160,0,99807232,16.667,1.961,81.373,0,0,1988,4213
34775040,107900928,0,99807232,3,0,97,0,0,350,504
34775040,107900928,0,99807232,17,1,82,0,0,2040,4049
34807808,107868160,0,99807232,19,0,81,0,0,2160,4057
34775040,107900928,0,99807232,17,1,82,0,0,2100,4057
34775040,107900928,0,99815424,5,1,94,0,0,648,1889
34807808,107868160,0,99815424,14.851,0,85.149,0,0,1946,2837
34775040,107900928,0,99815424,19,0,81,0,0,2434,4508
34775040,107900928,0,99815424,18.812,0,81.188,0,0,1980,4056
34807808,107868160,0,99815424,11,1,88,0,0,1396,3049
34807808,107868160,0,99815424,8.911,0,91.089,0,0,950,1366
34807808,107868160,0,99815424,20.588,0,79.412,0,0,2820,4117
34775040,107900928,0,99815424,17.822,0.990,81.188,0,0,2262,4242
34775040,107900928,0,99815424,17,0,83,0,0,2014,3970
34807808,107868160,0,99815424,2.020,0,97.980,0,0,1514,636
34807808,107868160,0,99815424,18.182,0,81.818,0,0,3780,4057
34807808,107868160,0,99815424,18,1,81,0,0,7740,4056
34807808,107868160,0,99815424,18,0,82,0,0,3060,4117
34807808,107868160,0,99815424,6,0,94,0,0,1120,1574
34807808,107868160,0,99815424,13.131,1.010,85.859,0,0,2906,2961
34807808,107868160,0,99815424,18.627,0.980,80.392,0,0,3720,4056
34775040,107900928,0,99815424,18,0,82,0,0,3120,4113
34807808,107868160,0,99815424,11.111,0,88.889,0,0,2236,3107
34775040,107900928,0,99815424,6.122,1.020,92.857,0,0,1550,1366
34807808,107868160,0,99815424,18,0,82,0,0,3420,4113
34775040,107900928,0,99815424,19,0,81,0,0,2580,4111
34807808,107868160,0,99815424,14.141,2.020,83.838,0,0,2134,3965
34807808,107868160,0,99815424,3,0,97,0,0,254,570
34775040,107900928,0,99815424,17.172,0,82.828,0,0,2040,4047
34775040,107900928,0,99815424,19,0,81,0,0,2802,4309
34807808,107868160,0,99815424,18.627,0.980,80.392,0,0,2220,4117
34807808,107868160,0,99815424,5,1,94,0,0,340,1574
34775040,107900928,0,99815424,14,0,86,0,0,2426,2841
34807808,107868160,0,99815424,19,0,81,0,0,3000,4056
34807808,107868160,0,99815424,18,0,82,0,0,2040,4056
34807808,107868160,0,99815424,10,2,88,0,0,1402,3225
34775040,107900928,0,99815424,8,1,91,0,0,4730,1804
34807808,107868160,0,99815424,18,0,82,0,0,4680,4148
34775040,107900928,0,99815424,19.802,0.990,79.208,0,0,11884,6579
34775040,107900928,0,99815424,15.842,1.980,82.178,0,0,1576,3979
34807808,107868160,0,99815424,3,0,97,0,0,770,590
34775040,107900928,0,99815424,18,0,82,0,0,2040,4107
34775040,107900928,0,99815424,18,1,81,0,0,2288,4261
34807808,107868160,0,99815424,17.822,0.990,81.188,0,0,2040,4116
34775040,107900928,0,99815424,6,0,94,0,0,760,1937
34775040,107900928,0,99815424,13.131,0,86.869,0,0,1448,2671
34775040,107900928,0,99815424,18.812,0,81.188,0,0,2040,4060
34807808,107868160,0,99815424,17,2,81,0,0,2118,4205
34775040,107900928,0,99815424,12.745,0,87.255,0,0,1396,3171
34775040,107900928,0,99815424,8,1,91,0,0,890,1367
34775040,107900928,0,99815424,16.832,1.980,81.188,0,0,2100,4210
34807808,107868160,0,99815424,17,1,82,0,0,2040,4111
34807808,107868160,0,99815424,17,0,83,0,0,1980,4045
34775040,107900928,0,99815424,3,0,97,0,0,272,504
34775040,107900928,0,99815424,18.812,0,81.188,0,0,2040,4050
34807808,107868160,0,99815424,17.172,0,82.828,0,0,2040,4211
34807808,107868160,0,99815424,17.822,0.990,81.188,0,0,1920,4053
34775040,107900928,0,99815424,6,0,94,0,0,854,1934
34775040,107900928,0,99815424,12,2,86,0,0,1448,2757
34775040,107900928,0,99815424,16.832,1.980,81.188,0,0,2202,4372
34807808,107868160,0,99815424,16.327,1.020,82.653,0,0,2194,4312
34775040,107900928,0,99815424,11.765,0.980,87.255,0,0,1216,3047
34807808,107868160,0,99815424,7,2,91,0,0,830,1365
34775040,107900928,0,99815424,17,1,82,0,0,1920,4058
34775040,107900928,0,99815424,17,1,82,0,0,1920,4150
34807808,107868160,0,99815424,18.627,0,81.373,0,0,2382,4342
34807808,107868160,0,99815424,3,0,97,0,0,272,444
34766848,107909120,0,99815424,18,0,82,0,0,2100,4148
34766848,107909120,0,99815424,17,1,82,0,0,2348,4376
34799616,107876352,0,99815424,17,1,82,0,0,2160,4120
34766848,107909120,0,99815424,6,0,94,0,0,958,1721
34766848,107909120,0,99815424,13.265,0,86.735,0,0,2108,2752
34766848,107909120,0,99815424,17,1,82,0,0,2262,4174
34799616,107876352,0,99815424,15.152,2.020,82.828,0,0,2160,4051
34766848,107909120,0,99815424,12,0,88,0,0,2398,3152
34799616,107876352,0,99815424,8.081,0,91.919,0,0,2570,1451
34766848,107909120,0,99815424,16,2,82,0,0,7326,4231
34799616,107876352,0,99815424,18,1,81,0,0,3480,4548
34799616,107876352,0,99815424,15,2,83,0,0,2914,4106
34775040,107900928,0,99815424,3,0,97,0,0,1352,418
34783232,107892736,0,99815424,18.182,0,81.818,0,0,3720,4104
34783232,107892736,0,99815424,17.822,0.990,81.188,0,0,3120,4050
34816000,107859968,0,99815424,18,0,82,0,0,2940,4114
34775040,107900928,0,99815424,5.941,0.990,93.069,0,0,1378,1658
34807808,107868160,0,99815424,12.371,0,87.629,0,0,2768,2755
34807808,107868160,0,99815424,18,0,82,0,0,2760,4111
34775040,107900928,0,99815424,17.172,0,82.828,0,0,2306,4126
34807808,107868160,0,99815424,12.621,0.971,86.408,0,0,1438,3143
34807808,107868160,0,99815424,6.061,2.020,91.919,0,0,890,1450
34807808,107868160,0,99815424,19,0,81,0,0,2862,4306
34775040,107900928,0,99815424,17,1,82,0,0,2040,4056
34775040,107900928,0,99815424,18.447,0,81.553,0,0,2032,4057
34807808,107868160,0,99815424,1.010,2.020,96.970,0,0,752,444
34775040,107900928,0,99815424,18.627,0.980,80.392,0,0,2940,4044
34775040,107900928,0,99815424,17,1,82,0,0,2040,4054
34807808,107868160,0,99815424,18,0,82,0,0,2040,4117
34807808,107868160,0,99815424,6,0,94,0,0,4558,1660
34807808,107868160,0,99815424,13.861,0.990,85.149,0,0,4388,2755
34807808,107868160,0,99815424,19,1,80,0,0,11644,6575
34775040,107900928,0,99815424,17,1,82,0,0,2160,4175
34807808,107868160,0,99815424,12,0,88,0,0,1276,2963
34775040,107900928,0,99815424,8,0,92,0,0,770,1452
34807808,107868160,0,99815424,15.842,2.970,81.188,0,0,2082,4183
34807808,107868160,0,99815424,16.327,0,83.673,0,0,2040,4117
34807808,107868160,0,99815424,16,1,83,0,0,1996,4163
34775040,107900928,0,99815424,3,0,97,0,0,272,504
34775040,107900928,0,99815424,15.842,2.970,81.188,0,0,2040,4168
34807808,107868160,0,99815424,16.327,0,83.673,0,0,2160,4056
34775040,107900928,0,99815424,19,0,81,0,0,2160,4116
34807808,107868160,0,99815424,6,0,94,0,0,838,1806
34807808,107868160,0,99815424,14.851,0,85.149,0,0,1448,2668
34807808,107868160,0,99815424,18,0,82,0,0,1920,4052
34807808,107868160,0,99815424,18,0,82,0,0,2040,4115
34807808,107868160,0,99815424,10,1,89,0,0,1396,3022
34775040,107900928,0,99815424,8,1,91,0,0,830,1452
34807808,107868160,0,99815424,18.812,0,81.188,0,0,2040,4056
34807808,107868160,0,99815424,16.832,1.980,81.188,0,0,1980,4056
34807808,107868160,0,99815424,17.822,0,82.178,0,0,2210,4506
34775040,107900928,0,99815424,3.960,0.990,95.050,0,0,212,858
34807808,107868160,0,99815424,15,3,82,0,0,2142,4239
34807808,107868160,0,99815424,18,0,82,0,0,2254,4211
34775040,107900928,0,99815424,16.832,1.980,81.188,0,0,1980,4055
34775040,107900928,0,99815424,5,1,94,0,0,718,1746
34775040,107900928,0,99815424,14,0,86,0,0,1550,2727
34807808,107868160,0,99815424,17,1,82,0,0,2100,4211
34775040,107900928,0,99815424,15,3,82,0,0,2288,4373
34807808,107868160,0,99815424,12.871,0,87.129,0,0,1396,3061
34807808,107868160,0,99815424,8,1,91,0,0,1040,1662
34775040,107900928,0,99815424,17.822,0.990,81.188,0,0,2254,4367
34775040,107900928,0,99815424,18.812,0,81.188,0,0,2254,4209
34775040,107900928,0,99815424,17,0,83,0,0,2014,3965
34775040,107900928,0,99815424,2.020,0,97.980,0,0,932,444
34807808,107868160,0,99815424,18,0,82,0,0,2186,4283
34775040,107900928,0,99815424,17.347,0,82.653,0,0,2160,4052
34775040,107900928,0,99815424,17,1,82,0,0,3042,4302
34775040,107900928,0,99815424,5.882,1.961,92.157,0,0,2158,1658
34775040,107900928,0,99815424,15.842,0,84.158,0,0,6908,2875
34775040,107900928,0,99815424,18,0,82,0,0,3678,4201
34807808,107868160,0,99815424,16.162,1.010,82.828,0,0,3162,4179
34775040,107900928,0,99815424,12.871,0,87.129,0,0,2356,3107
34807808,107868160,0,99815424,9.901,0,90.099,0,0,2630,1366
34775040,107900928,0,99815424,19.608,0,80.392,0,0,3120,4117
34775040,107900928,0,99815424,16.162,1.010,82.828,0,0,2966,4133
34807808,107868160,0,99815424,16.832,0.990,82.178,0,0,2494,4029
34775040,107900928,0,99815424,2,1,97,0,0,1532,444
34775040,107900928,0,99815424,17,2,81,0,0,2580,4153
34807808,107868160,0,99815424,18,0,82,0,0,2280,4115
34807808,107868160,0,99815424,17.172,0,82.828,0,0,2100,4155
34775040,107900928,0,99815424,6.931,0,93.069,0,0,838,1720
34775040,107900928,0,99815424,11,3,86,0,0,2210,3045
34775040,107900928,0,99815424,17.172,0,82.828,0,0,2040,4057
34807808,107868160,0,99823616,17.172,0,82.828,0,0,2220,4056
34807808,107868160,0,99823616,12,0,88,0,0,1816,2963
34807808,107868160,0,99823616,6.931,1.980,91.089,0,0,1952,1638
34807808,107868160,0,99823616,19,0,81,0,0,1980,4056
34807808,107868160,0,99823616,17,1,82,0,0,2040,4055
34807808,107868160,0,99823616,16.162,0,83.838,0,0,5914,3970
34775040,107900928,0,99823616,3,0,97,0,0,3572,504
34775040,107900928,0,99823616,17.347,1.020,81.633,0,0,11410,6758
34807808,107868160,0,99823616,16,2,82,0,0,1980,4595
34807808,107868160,0,99823616,17.172,1.010,81.818,0,0,1980,4057
34807808,107868160,0,99823616,5,1,94,0,0,658,1746
34775040,107900928,0,99823616,14.851,0,85.149,0,0,1448,2766
34775040,107900928,0,99823616,17.822,0.990,81.188,0,0,2040,4201
34807808,107868160,0,99823616,18,0,82,0,0,2262,4308
34775040,107900928,0,99823616,11.881,0,88.119,0,0,1336,3022
34775040,107900928,0,99823616,8.081,0,91.919,0,0,890,1572
34775040,107900928,0,99823616,19.608,0,80.392,0,0,2040,4056
34807808,107868160,0,99823616,17,1,82,0,0,2142,4240
34807808,107868160,0,99823616,17,0,83,0,0,1894,4154
34807808,107868160,0,99823616,2,1,97,0,0,212,358
34775040,107900928,0,99823616,17.172,1.010,81.818,0,0,2040,4207
34775040,107900928,0,99823616,17.172,0,82.828,0,0,2040,4117
34807808,107868160,0,99823616,17.172,0,82.828,0,0,1980,4056
34807808,107868160,0,99823616,5.941,0.990,93.069,0,0,658,1744
34807808,107868160,0,99823616,11,3,86,0,0,1508,2729
34775040,107900928,0,99823616,17.172,0,82.828,0,0,1980,4053
34775040,107900928,0,99823616,16.162,1.010,82.828,0,0,2220,4283
34807808,107868160,0,99823616,11.881,0,88.119,0,0,1276,3023
34807808,107868160,0,99823616,7,2,91,0,0,872,1742
34807808,107868160,0,99823616,17.822,0.990,81.188,0,0,2134,4215
34775040,107900928,0,99823616,17.172,0,82.828,0,0,2040,4056
34775040,107900928,0,99823616,17,0,83,0,0,2092,4117
34807808,107868160,0,99823616,3.030,0,96.970,0,0,374,570
34807808,107868160,0,99823616,17,1,82,0,0,1920,4048
34775040,107900928,0,99823616,17,1,82,0,0,2348,4371
34807808,107868160,0,99823616,18,0,82,0,0,2100,4056
34775040,107900928,0,99823616,6,0,94,0,0,864,1772
34775040,107900928,0,99823616,12,2,86,0,0,1448,2841
34775040,107900928,0,99823616,17.822,0.990,81.188,0,0,2408,4372
34807808,107868160,0,99823616,16.162,1.010,82.828,0,0,2100,4057
34807808,107868160,0,99823616,12.745,0.980,86.275,0,0,1996,2962
34807808,107868160,0,99823616,7,1,92,0,0,950,1451
34775040,107900928,0,99823616,19,0,81,0,0,2280,4214
34775040,107900928,0,99823616,18,0,82,0,0,2922,4308
34807808,107868160,0,99823616,16.832,0.990,82.178,0,0,3454,4128
34807808,107868160,0,99823616,2.041,0,97.959,0,0,5012,504
34775040,107900928,0,99823616,18,0,82,0,0,4080,4155
34775040,107900928,0,99823616,17.822,0.990,81.188,0,0,3162,4243
34807808,107868160,0,99823616,18,1,81,0,0,3006,4174
34775040,107900928,0,99823616,6,0,94,0,0,2398,2342
34807808,107868160,0,99823616,12.121,1.010,86.869,0,0,2588,2829
34807808,107868160,0,99823616,18.182,0,81.818,0,0,2940,4052
34807808,107868160,0,99823616,16,2,82,0,0,2640,4052
34807808,107868160,0,99823616,11,1,88,0,0,2656,3119
34807808,107868160,0,99823616,8,0,92,0,0,1370,1451
34775040,107900928,0,99823616,18.812,0,81.188,0,0,2220,4057
34807808,107868160,0,99823616,17.172,1.010,81.818,0,0,2100,4119
34775040,107900928,0,99823616,15.842,0.990,83.168,0,0,1954,4059
34775040,107900928,0,99823616,2.020,1.010,96.970,0,0,794,550
34807808,107868160,0,99823616,18,0,82,0,0,2340,4051
34775040,107900928,0,99823616,18,0,82,0,0,2220,4116
34775040,107900928,0,99823616,17,1,82,0,0,2640,4056
34775040,107900928,0,99823616,6,0,94,0,0,1720,1871
34775040,107900928,0,99823616,13,1,86,0,0,1388,2670
34807808,107868160,0,99823616,16,2,82,0,0,1980,4059
34775040,107900928,0,99823616,18,0,82,0,0,2700,4180
34807808,107868160,0,99823616,13,0,87,0,0,8356,3050
34775040,107900928,0,99823616,6.931,2.970,90.099,0,0,9774,3891
34775040,107900928,0,99823616,19.608,0,80.392,0,0,1980,4060
34775040,107900928,0,99823616,17,1,82,0,0,1920,4055
34775040,107900928,0,99823616,17,0,83,0,0,1980,3964
34807808,107868160,0,99823616,3,1,96,0,0,332,590
34775040,107900928,0,99823616,17.822,0.990,81.188,0,0,2100,4172
34775040,107900928,0,99823616,17.172,0,82.828,0,0,2142,4311
34775040,107900928,0,99823616,16.162,1.010,82.828,0,0,1920,4059
34807808,107868160,0,99823616,6,0,94,0,0,856,1807
34775040,107900928,0,99823616,11.881,2.970,85.149,0,0,1508,2813
34775040,107900928,0,99823616,15.152,2.020,82.828,0,0,2082,4180
34775040,107900928,0,99823616,18,0,82,0,0,1920,4054
34775040,107900928,0,99823616,12,0,88,0,0,1336,3021
34807808,107868160,0,99823616,8,0,92,0,0,890,1511
34807808,107868160,0,99823616,15.842,2.970,81.188,0,0,1980,4050
34775040,107900928,0,99823616,16.162,1.010,82.828,0,0,1980,4112
34775040,107900928,0,99823616,16.832,0.990,82.178,0,0,2014,3967
34807808,107868160,0,99823616,2,1,97,0,0,212,444
34807808,107868160,0,99823616,17,1,82,0,0,2100,4102
34775040,107900928,0,99823616,17.172,1.010,81.818,0,0,2134,4199
34775040,107900928,0,99823616,17.172,0,82.828,0,0,2040,4048
34807808,107868160,0,99823616,6.863,0.980,92.157,0,0,820,1849
34807808,107868160,0,99823616,14,0,86,0,0,1728,3027
34775040,107900928,0,99823616,16.832,1.980,81.188,0,0,2040,4554
34775040,107900928,0,99823616,17,1,82,0,0,1920,4057
34807808,107868160,0,99823616,10.891,1.980,87.129,0,0,1378,3175
34807808,107868160,0,99823616,9,0,91,0,0,890,1425
34807808,107868160,0,99823616,17.822,0.990,81.188,0,0,2288,4372
34775040,107900928,0,99823616,17.822,0.990,81.188,0,0,2100,4112
34775040,107900928,0,99823616,17,0,83,0,0,1954,4054
34807808,107868160,0,99823616,2,1,97,0,0,212,358
34807808,107868160,0,99823616,17.822,0.990,81.188,0,0,2194,4205
34807808,107868160,0,99823616,17.647,1.961,80.392,0,0,2554,4335
34775040,107900928,0,99823616,18.182,0,81.818,0,0,2700,4055
34807808,107868160,0,99823616,5.051,0,94.949,0,0,864,1797
34775040,107900928,0,99823616,14,0,86,0,0,1808,2754
34775040,107900928,0,99823616,18.812,0,81.188,0,0,2862,4308
34807808,107868160,0,99823616,17.172,1.010,81.818,0,0,3540,4056
34807808,107868160,0,99823616,12.745,0.980,86.275,0,0,5776,3105
34775040,107900928,0,99823616,8.081,0,91.919,0,0,3668,1510
34807808,107868160,0,99823616,18.812,0,81.188,0,0,2982,4180
34775040,107900928,0,99823616,18.627,0.980,80.392,0,0,2760,4055
34775040,107900928,0,99823616,16.162,0,83.838,0,0,3634,4116
34807808,107868160,0,99823616,3.030,0,96.970,0,0,1652,478
34775040,107900928,0,99823616,18,0,82,0,0,3060,4052
34807808,107868160,0,99823616,17.172,0,82.828,0,0,2726,4133
34775040,107900928,0,99823616,16,2,82,0,0,3300,4057
34775040,107900928,0,99823616,7,0,93,0,0,1258,1805
34807808,107868160,0,99823616,14,0,86,0,0,1748,2669
34807808,107868160,0,99823616,17.172,0,82.828,0,0,1980,4053
34775040,107900928,0,99823616,17,1,82,0,0,2040,4055
34775040,107900928,0,99823616,10.784,1.961,87.255,0,0,1798,3155
34775040,107900928,0,99823616,6.931,2.970,90.099,0,0,1190,1450
34807808,107868160,0,99823616,17,1,82,0,0,2160,4212
34775040,107900928,0,99823616,15,3,82,0,0,2580,4057
34775040,107900928,0,99823616,17,0,83,0,0,3016,4183
34807808,107868160,0,99823616,2.020,1.010,96.970,0,0,212,418
34807808,107868160,0,99823616,18,0,82,0,0,2040,4109
34775040,107900928,0,99823616,17.172,0,82.828,0,0,1920,4053
34807808,107868160,0,99823616,16.495,0,83.505,0,0,9960,4149
34775040,107900928,0,99823616,6,1,93,0,0,9182,4182
34775040,107900928,0,99823616,13.131,0,86.869,0,0,1508,2811
34775040,107900928,0,99823616,18,0,82,0,0,1980,4055
34807808,107868160,0,99823616,17,1,82,0,0,1986,4175
34775040,107900928,0,99823616,12.745,0.980,86.275,0,0,1396,3461
34775040,107900928,0,99823616,8.081,0,91.919,0,0,950,1510
34807808,107868160,0,99823616,18.812,0,81.188,0,0,2288,4445
34807808,107868160,0,99823616,18,0,82,0,0,1920,4057
34807808,107868160,0,99823616,17,0,83,0,0,2014,4112
34775040,107900928,0,99823616,2,1,97,0,0,212,358
34775040,107900928,0,99823616,18,0,82,0,0,2082,4172
34807808,107868160,0,99823616,14.851,3.960,81.188,0,0,2058,4197
34807808,107868160,0,99823616,17,1,82,0,0,2040,4173
34775040,107900928,0,99823616,7.843,0,92.157,0,0,718,1660
34775040,107900928,0,99823616,13.131,0,86.869,0,0,1448,2755
34775040,107900928,0,99823616,17,2,81,0,0,2040,4057
34807808,107868160,0,99831808,17,1,82,0,0,2126,4195
34775040,107900928,0,99831808,11.765,0.980,87.255,0,0,1396,3049
34775040,107900928,0,99831808,8,1,91,0,0,830,1366
34775040,107900928,0,99831808,18.812,0,81.188,0,0,2134,4206
34775040,107900928,0,99831808,17,1,82,0,0,1920,4052
34807808,107868160,0,99831808,17,0,83,0,0,2056,4161
34807808,107868160,0,99831808,2.970,0.990,96.040,0,0,366,602
34775040,107900928,0,99831808,18.812,0,81.188,0,0,2040,4109
34775040,107900928,0,99831808,17,1,82,0,0,1920,4051
34775040,107900928,0,99831808,17.647,1.961,80.392,0,0,2022,4176
34807808,107868160,0,99831808,6,0,94,0,0,778,1691
34775040,107900928,0,99831808,14.851,0,85.149,0,0,1816,3156
34775040,107900928,0,99831808,17.172,1.010,81.818,0,0,2100,4051
34807808,107868160,0,99831808,17,1,82,0,0,2040,4053
34775040,107900928,0,99831808,10.891,0.990,88.119,0,0,1216,2962
34807808,107868160,0,99831808,7.921,0.990,91.089,0,0,890,1512
34775040,107900928,0,99831808,17.347,0,82.653,0,0,2194,4275
34775040,107900928,0,99831808,17,1,82,0,0,3076,4280
34775040,107900928,0,99831808,16,1,83,0,0,2074,4116
34775040,107900928,0,99831808,3,0,97,0,0,632,418
34775040,107900928,0,99831808,17.822,0.990,81.188,0,0,2948,4371
34807808,107868160,0,99831808,18,1,81,0,0,3540,4113
34775040,107900928,0,99831808,17.822,0.990,81.188,0,0,6000,4057
34775040,107900928,0,99831808,6.061,0,93.939,0,0,3598,1659
34775040,107900928,0,99831808,13.131,0,86.869,0,0,2588,2815
34775040,107900928,0,99831808,18.812,0,81.188,0,0,2820,4177
34775040,107900928,0,99831808,17,1,82,0,0,3660,4057
34807808,107868160,0,99831808,11,1,88,0,0,2656,2960
34807808,107868160,0,99831808,8.081,0,91.919,0,0,1916,1568
34807808,107868160,0,99831808,18.627,0.980,80.392,0,0,2640,4554
34775040,107900928,0,99831808,17.822,1.980,80.198,0,0,3240,4055
34775040,107900928,0,99831808,15,2,83,0,0,2494,3966
34775040,107900928,0,99831808,2,1,97,0,0,674,570
34807808,107868160,0,99831808,18,0,82,0,0,2100,4046
34807808,107868160,0,99831808,17.822,0.990,81.188,0,0,2040,4057
34775040,107900928,0,99831808,16,2,82,0,0,2382,4249
34775040,107900928,0,99831808,6.931,0,93.069,0,0,1198,1720
34775040,107900928,0,99831808,13.265,0,86.735,0,0,1628,2755
34775040,107900928,0,99831808,17,1,82,0,0,2640,4056
34775040,107900928,0,99831808,16,2,82,0,0,3000,4116
34775040,107900928,0,99831808,11,1,88,0,0,1396,3023
34807808,107868160,0,99831808,8,0,92,0,0,890,1451
34775040,107900928,0,99831808,18.812,0,81.188,0,0,2100,4055
34807808,107868160,0,99831808,16.327,1.020,82.653,0,0,9480,4116
34807808,107868160,0,99831808,17.822,0.990,81.188,0,0,10838,6579
34775040,107900928,0,99831808,3,0,97,0,0,152,358
34775040,107900928,0,99831808,20.388,0,79.612,0,0,2040,4109
34807808,107868160,0,99831808,18,0,82,0,0,2082,4183
34807808,107868160,0,99831808,17,1,82,0,0,2040,4117
34775040,107900928,0,99831808,6,0,94,0,0,658,1720
34775040,107900928,0,99831808,13,1,86,0,0,1610,3003
34807808,107868160,0,99831808,17,2,81,0,0,2126,4193
34807808,107868160,0,99831808,18,0,82,0,0,1980,4057
34807808,107868160,0,99831808,11,0,89,0,0,1336,3023
34775040,107900928,0,99831808,8,1,91,0,0,950,1512
34807808,107868160,0,99831808,18.627,0.980,80.392,0,0,2040,4117
34807808,107868160,0,99831808,15.842,2.970,81.188,0,0,2118,4139
34807808,107868160,0,99831808,17.822,0,82.178,0,0,1954,3881
34775040,107900928,0,99831808,2,1,97,0,0,212,590
34775040,107900928,0,99831808,19.608,0,80.392,0,0,2100,4043
34807808,107868160,0,99831808,17,1,82,0,0,1920,4053
34807808,107868160,0,99831808,17,1,82,0,0,2066,4134
34775040,107900928,0,99831808,6,0,94,0,0,760,1784
34775040,107900928,0,99831808,13,1,86,0,0,1542,2903
34775040,107900928,0,99831808,17,2,81,0,0,1980,4057
34807808,107868160,0,99831808,17.172,0,82.828,0,0,2202,4306
34775040,107900928,0,99831808,10.891,0.990,88.119,0,0,1430,3121
34775040,107900928,0,99831808,8.081,0,91.919,0,0,830,1453
34775040,107900928,0,99831808,18.812,0,81.188,0,0,2040,4120
34807808,107868160,0,99831808,18,0,82,0,0,2166,4238
34775040,107900928,0,99831808,17,0,83,0,0,1834,4593
34807808,107868160,0,99831808,2,2,96,0,0,460,674
34775040,107900928,0,99831808,18,0,82,0,0,2100,4049
34807808,107868160,0,99831808,14.851,3.960,81.188,0,0,2220,4115
34807808,107868160,0,99831808,17.172,0,82.828,0,0,1980,4058
34775040,107900928,0,99831808,6.863,0.980,92.157,0,0,658,1661
34775040,107900928,0,99831808,12.871,1.980,85.149,0,0,1782,3035
34775040,107900928,0,99831808,18.182,0,81.818,0,0,2836,4404
34807808,107868160,0,99831808,17.172,0,82.828,0,0,2340,4146
34775040,107900928,0,99831808,11,0,89,0,0,1456,3025
34807808,107868160,0,99831808,8.081,0,91.919,0,0,1592,1645
34807808,107868160,0,99831808,17.822,0.990,81.188,0,0,3566,4197
34807808,107868160,0,99831808,17.172,1.010,81.818,0,0,6000,4120
34807808,107868160,0,99831808,15,2,83,0,0,5134,4120
34775040,107900928,0,99831808,3.030,0,96.970,0,0,1292,358
34775040,107900928,0,99831808,18,0,82,0,0,2700,4115
34775040,107900928,0,99831808,18.812,0,81.188,0,0,3738,4142
34807808,107868160,0,99831808,16.327,1.020,82.653,0,0,3360,4059
34807808,107868160,0,99831808,5.941,0.990,93.069,0,0,1678,1819
23183360,119492608,0,99835904,43.434,2.020,54.545,0,0,878,570
23150592,119525376,0,99835904,2,0,98,0,0,1386,358
23183360,119492608,0,99835904,2,0,98,0,0,786,358
23183360,119492608,0,99835904,2,0,98,0,0,708,476
23121920,119554048,0,99835904,2,0,98,0,0,126,350
23121920,119554048,0,99835904,2,0,98,0,0,276,500
23093248,119586816,0,99835904,1.961,0.980,97.059,0,0,426,410
23093248,119586816,0,99835904,1,1,98,0,0,726,350
23101440,119578624,0,99835904,2,0,98,0,0,306,410
23101440,119578624,0,99835904,2,0,98,0,0,726,410
23101440,119578624,0,99835904,2,0,98,0,0,1146,410
23101440,119578624,0,99835904,2,0,98,0,0,246,350
23134208,119545856,0,99835904,1,1,98,0,0,126,350
23134208,119545856,0,99835904,2,0,98,0,0,246,410
23101440,119578624,0,99835904,1.980,0.990,97.030,0,0,7866,350
23134208,119545856,0,99835904,2.020,0,97.980,0,0,8998,3074
23134208,119545856,0,99835904,2,0,98,0,0,186,418
23101440,119578624,0,99835904,2,0,98,0,0,126,410
23101440,119578624,0,99835904,2,0,98,0,0,228,476
23101440,119578624,0,99835904,1.980,0.990,97.030,0,0,186,410
23134208,119545856,0,99835904,2,0,98,0,0,186,410
23134208,119545856,0,99835904,1.980,0,98.020,0,0,192,528
23101440,119578624,0,99835904,2.020,0,97.980,0,0,246,798
23101440,119578624,0,99835904,1.980,0,98.020,0,0,246,470
23101440,119578624,0,99835904,2,0,98,0,0,126,350
23134208,119545856,0,99835904,2,0,98,0,0,246,410
23134208,119545856,0,99835904,2,0,98,0,0,186,350
23134208,119545856,0,99835904,2,0,98,0,0,66,350
23101440,119578624,0,99835904,2,0,98,0,0,186,410
23101440,119578624,0,99835904,1.980,0,98.020,0,0,126,350
23101440,119578624,0,99835904,1.980,0.990,97.030,0,0,228,542
23101440,119578624,0,99835904,2,0,98,0,0,126,350
23134208,119545856,0,99835904,1.980,0.990,97.030,0,0,126,350
23134208,119545856,0,99835904,2,0,98,0,0,288,476
23101440,119578624,0,99835904,2,0,98,0,0,340,500
23101440,119578624,0,99835904,2.970,0,97.030,0,0,246,350
23101440,119578624,0,99835904,2,0,98,0,0,246,410
23134208,119545856,0,99835904,1.980,0,98.020,0,0,280,568
23134208,119545856,0,99835904,2,0,98,0,0,186,410
23101440,119578624,0,99835904,2,0,98,0,0,186,350
23101440,119578624,0,99835904,2,0,98,0,0,126,350
23101440,119578624,0,99835904,2,0,98,0,0,126,350
23101440,119578624,0,99835904,2,0,98,0,0,434,726
23134208,119545856,0,99835904,2,0,98,0,0,126,350
23134208,119545856,0,99835904,1.980,0,98.020,0,0,306,350
23101440,119578624,0,99835904,2,0,98,0,0,288,602
23101440,119578624,0,99835904,2,0,98,0,0,246,410
23134208,119545856,0,99835904,1.980,0.990,97.030,0,0,246,470
23101440,119578624,0,99835904,1,1,98,0,0,768,476
23134208,119545856,0,99835904,2,0,98,0,0,366,350
23134208,119545856,0,99835904,2,0,98,0,0,246,350
23134208,119545856,0,99835904,1.980,0.990,97.030,0,0,906,410
23101440,119578624,0,99835904,2.970,0,97.030,0,0,1566,470
23134208,119545856,0,99835904,2.970,0,97.030,0,0,3786,358
23134208,119545856,0,99835904,3.922,0,96.078,0,0,3726,418
23134208,119545856,0,99835904,2,0,98,0,0,1326,358
23134208,119545856,0,99835904,2,0,98,0,0,846,358
