172.16.97.1  : 0.20 0.18 0.20 0.19 0.18 0.20 0.18 0.20 0.14 0.20
172.16.97.16 : 0.21 0.10 0.19 0.19 0.19 0.16 0.15 0.18 0.17 0.19
172.16.97.27 : 0.04 0.02 0.01 0.03 0.03 0.03 0.01 0.03 0.03 0.03
172.16.97.6  : 0.23 0.13 0.16 0.13 0.17 0.16 0.20 0.21 0.19 0.13
172.16.97.7  : - 10.29 10.19 10.25 10.26 10.26 10.25 10.23 10.26 10.28
172.16.97.9  : 10.33 10.23 10.30 10.26 10.30 10.29 10.30 - 10.29 10.31

       6 targets
       6 alive
       0 unreachable
       0 unknown addresses

       2 timeouts (waiting for response)
      60 ICMP Echos sent
      58 ICMP Echo Replies received
       0 other ICMP received

 0.01 ms (min round trip time)
 3.28 ms (avg round trip time)
 10.3 ms (max round trip time)
       10.064 sec (elapsed real time)

