"Dstat 0.7.3 CSV output"
"Author:","Dag Wieers <dag@wieers.com>",,,,"URL:","http://dag.wieers.com/home-made/dstat/"
"Host:","parasilo-16.rennes.grid5000.fr",,,,"User:","root"
"Cmdline:","dstat -m -c -n -o dstat.csv",,,,"Date:","22 Jun 2020 22:27:22 CEST"
"memory usage",,,,"total cpu usage",,,,,"net/total",
"used","free","buff","cach","usr","sys","idl","wai","stl","recv","send"
1359364096,131822211072,73986048,1524473856,0.034,0.015,99.935,0.015,0,0,0
1359544320,131822153728,73998336,1524367360,0.031,0.031,99.906,0.031,0,1928,1032
1359290368,131822395392,74010624,1524367360,0.031,0.063,99.844,0.063,0,3870,5020
1359290368,131822395392,74010624,1524367360,0.062,0.062,99.875,0,0,3350,1852
1359339520,131822346240,74010624,1524367360,0,0.031,99.969,0,0,103280,2748
1359101952,131822325760,74010624,1524625408,0.031,0.031,99.937,0,0,278832,6852
1361272832,131819966464,74022912,1524801536,0.938,0.688,98.031,0.344,0,6504,21462
1359974400,131821682688,74022912,1524367360,0.062,0.094,99.844,0,0,3046,3764
1359814656,131821842432,74022912,1524367360,0.031,0,99.969,0,0,2650,1652
1359708160,131821850624,74022912,1524465664,0.062,0.062,99.875,0,0,379148,7760
1363664896,131817721856,74039296,1524621312,0.094,0.031,99.812,0.063,0,3370,2268
1358741504,131822608384,74063872,1524633600,0.907,0.532,98.498,0.063,0,4232,16270
1359048704,131822559232,74063872,1524375552,0.031,0,99.969,0,0,3080,3396
1358839808,131822768128,74063872,1524375552,0.031,0,99.719,0.250,0,1970,1416
1358667776,131822743552,74063872,1524572160,0.062,0.031,99.906,0,0,328856,6652
1384599552,131796561920,74063872,1524822016,0.688,0.375,98.936,0,0,55438,5930
1366896640,131814699008,74076160,1524375552,0.718,0.187,99.064,0.031,0,4328,17304
1366859776,131814723584,74088448,1524375552,0,0,99.969,0.031,0,2006,0
1366859776,131814723584,74088448,1524375552,0.031,0.031,99.625,0.312,0,1544,0
1366908928,131814674432,74088448,1524375552,0.031,0.031,99.937,0,0,2716,2600
1365798912,131815784448,74088448,1524375552,0.094,0.031,99.875,0,0,5110,4780
1365880832,131815534592,74100736,1524527104,0.031,0.062,99.844,0.062,0,304340,6188
1364758528,131816550400,74100736,1524633600,0,0,100,0,0,78364,3456
1373106176,131808174080,74113024,1524645888,0.968,0.687,98.157,0.187,0,4938,14690
1372823552,131808714752,74113024,1524387840,0,0.063,99.937,0,0,1002,828
1372024832,131809513472,74113024,1524387840,0,0.031,99.969,0,0,2432,2600
1371553792,131809873920,74113024,1524498432,0.094,0.031,99.875,0,0,165256,10530
1369997312,131811540992,74113024,1524387840,0.281,0.125,99.593,0,0,289336,25212
1369952256,131811573760,74137600,1524375552,0.031,0.031,99.187,0.750,0,1574,1656
1370112000,131811401728,74137600,1524387840,0.063,0.094,99.844,0,0,5222,5060
1369870336,131811643392,74137600,1524387840,0.031,0.031,99.937,0,0,1872,1224
1370124288,131811127296,74137600,1524645888,0,0.063,99.937,0,0,379204,7332
1374363648,131806699520,74137600,1524834304,1.031,0.594,98.375,0,0,5090,16522
1373614080,131807883264,74162176,1524375552,0.031,0.031,99.406,0.531,0,2338,1164
1373011968,131808440320,74162176,1524387840,0.031,0.031,99.937,0,0,3506,3512
1372721152,131808698368,74162176,1524420608,0,0.031,99.969,0,0,102030,2132
1372688384,131808698368,74162176,1524453376,0.062,0.062,99.875,0,0,279618,11304
1418907648,131762073600,74178560,1524842496,0.563,0.250,99.155,0.031,0,4628,3650
1375232000,131806195712,74203136,1524371456,0.406,0.469,98.594,0.531,0,3792,13880
1374765056,131806605312,74203136,1524428800,0.031,0.031,99.719,0.219,0,53880,4144
1374625792,131806613504,74203136,1524559872,0.031,0.031,99.937,0,0,226698,4056
1383112704,131798032384,74219520,1524637696,0.125,0.031,99.812,0.031,0,104892,4644
1373220864,131808157696,74219520,1524404224,0.782,0.688,98.530,0,0,4814,14446
1373007872,131808370688,74219520,1524404224,0.094,0.031,99.875,0,0,3178,3344
1372585984,131808669696,74244096,1524502528,0.031,0,99.344,0.625,0,205844,4792
1403789312,131777417216,74244096,1524547584,0.719,0.125,99.156,0,0,15846,2808
1372299264,131809046528,74244096,1524404224,1.187,0.062,98.750,0,0,3332,7488
1371512832,131809828864,74244096,1524408320,0,0.063,99.937,0,0,2928,3004
1371373568,131809853440,74244096,1524523008,0.031,0.031,99.937,0,0,166262,5544
1371533312,131809681408,74268672,1524510720,0.250,0.094,99.218,0.438,0,3004,3828
1370873856,131810213888,74268672,1524637696,0.031,0.062,99.906,0,0,174372,5460
1371738112,131809574912,74268672,1524412416,0.250,0.031,99.718,0,0,3054,3904
1371049984,131810263040,74268672,1524412416,0.031,0.031,99.937,0,0,3036,2872
1370689536,131810590720,74268672,1524445184,0,0.062,99.938,0,0,78310,2284
1378729984,131802382336,74293248,1524588544,0.250,0.031,98.499,1.220,0,89990,6168
1377923072,131803172864,74293248,1524604928,0,0.031,99.969,0,0,2002,1960
1377148928,131803947008,74293248,1524604928,0.031,0.031,99.937,0,0,5202,7774
1377026048,131804069888,74293248,1524604928,0,0.031,99.969,0,0,1820,1960
1376509952,131804585984,74293248,1524604928,0,0,100,0,0,1850,1946
1376481280,131804585984,74313728,1524613120,0.031,0.031,99.438,0.500,0,2350,2380
1376223232,131804844032,74313728,1524613120,0.031,0,99.969,0,0,2372,2128
1379586048,131801481216,74313728,1524613120,0.094,0.031,99.875,0,0,3130,2752
1379328000,131801739264,74313728,1524613120,0.031,0,99.969,0,0,2162,2976
1379328000,131801739264,74313728,1524613120,0.031,0,99.969,0,0,1638,1764
1371635712,131809431552,74330112,1524596736,0.063,0.031,99.719,0.188,0,470,1268
1371279360,131809845248,74330112,1524539392,0,0.031,99.875,0.094,0,3472,3700
1371324416,131809910784,74330112,1524428800,0.031,0.062,99.906,0,0,4174,6612
1371213824,131809910784,74330112,1524539392,0.031,0.031,99.938,0,0,164140,3320
1371791360,131809251328,74330112,1524621312,0.281,0.063,99.656,0,0,4288,3584
1371852800,131809271808,74330112,1524539392,0.031,0,99.969,0,0,2310,2840
1370927104,131810295808,74354688,1524416512,0.031,0.031,99.562,0.375,0,1002,828
1370972160,131810238464,74354688,1524428800,0,0.062,99.938,0,0,782,0
1370972160,131810238464,74354688,1524428800,0,0.031,99.969,0,0,288,0
1370972160,131810238464,74354688,1524428800,0,0.031,99.969,0,0,114,0
1370714112,131810496512,74354688,1524428800,0.031,0,99.969,0,0,340,0
1370435584,131810754560,74375168,1524428800,0.031,0.031,99.375,0.562,0,0,0
1369919488,131811270656,74375168,1524428800,0.125,0.031,99.844,0,0,1756,5220
1369911296,131811278848,74375168,1524428800,0.031,0.031,99.937,0,0,468,0
1370734592,131810447360,74375168,1524436992,1.411,0.282,98.307,0,0,895756,46796
1633284096,131536965632,74375168,1533792256,34.567,2.941,62.492,0,0,20549132,926426
1701163008,131469021184,74383360,1533812736,10.805,0.971,87.911,0.313,0,349674,694912
1711898624,131458277376,74391552,1533812736,1.939,0.375,97.655,0.031,0,256750,577128
1726754816,131443404800,74391552,1533829120,3.282,0.438,96.280,0,0,257552,582342
1738235904,131431919616,74391552,1533833216,6.410,0.469,93.121,0,0,258864,581550
1749487616,131420659712,74391552,1533841408,2.782,0.531,96.686,0,0,236582,572874
1757917184,131412230144,74399744,1533833216,1.475,0.314,98.180,0.031,0,257094,593694
1767018496,131403108352,74399744,1533853696,2.508,0.188,97.304,0,0,257670,585656
1778008064,131392106496,74407936,1533857792,3.349,0.250,96.369,0.031,0,262592,600828
1816682496,131353423872,74407936,1533865984,10.028,0.962,89.010,0,0,805438,1014738
1842425856,131327676416,74407936,1533870080,3.918,0.470,95.611,0,0,916488,953946
1879351296,131290734592,74416128,1533878272,5.895,0.690,93.352,0.063,0,977552,977928
1880408064,131289636864,74416128,1533886464,11.205,0.499,88.296,0,0,1345754,1175132
1879887872,131290152960,74416128,1533890560,2.094,0.438,97.468,0,0,1202364,1084272
1858846720,131311185920,74424320,1533890560,3.821,0.595,95.553,0.031,0,1598200,1269088
1858179072,131311841280,74424320,1533902848,6.316,0.716,92.968,0,0,1794452,1373096
1859461120,131310551040,74424320,1533911040,2.449,0.502,96.892,0.157,0,1855056,1412516
1877524480,131292483584,74424320,1533915136,2.313,0.750,96.937,0,0,1841746,1386834
1921814528,131248185344,74432512,1533915136,1.097,0.627,98.245,0.031,0,1950626,1435752
1981845504,131188142080,74432512,1533927424,2.030,0.656,97.314,0,0,2015832,1578736
1982054400,131187916800,74440704,1533935616,2.783,0.719,96.467,0.031,0,2241574,1567110
1982922752,131186962432,74440704,1533947904,5.536,0.907,93.494,0.063,0,2115482,1485248
1983176704,131186704384,74440704,1533952000,1.657,0.719,97.624,0,0,2221736,1546992
1983430656,131186446336,74448896,1533947904,1.847,0.532,97.590,0.031,0,2163842,1510558
1982640128,131187220480,74448896,1533964288,1.596,0.532,97.872,0,0,2207624,1542486
1991147520,131178704896,74448896,1533972480,2.629,0.469,96.901,0,0,2057158,1447158
1993228288,131176607744,74457088,1533980672,1.566,0.470,97.901,0.063,0,2103074,1460494
2046726144,131123105792,74457088,1533984768,1.907,0.625,97.436,0.031,0,1993666,1413568
2047967232,131121856512,74457088,1533992960,1.901,0.623,97.475,0,0,2153148,1504412
2048253952,131121557504,74465280,1533997056,1.192,0.596,98.149,0.063,0,2146904,1625970
2048987136,131120824320,74465280,1533997056,1.375,0.688,97.938,0,0,2044692,1442952
2048995328,131120803840,74465280,1534009344,1.655,0.656,97.689,0,0,2168866,1492276
2049216512,131120566272,74473472,1534017536,2.350,0.564,97.055,0.031,0,2123658,1488626
2048954368,131120824320,74473472,1534021632,1.411,0.502,98.088,0,0,2187394,1509146
2049171456,131120599040,74481664,1534021632,3.124,0.562,96.251,0.062,0,2122252,1480708
2050228224,131119534080,74481664,1534029824,5.243,0.718,94.039,0,0,2104158,1446142
2075254784,131094470656,74481664,1534033920,1.934,0.624,97.441,0,0,2181758,1506792
2076741632,131092992000,74481664,1534042112,1.410,0.627,97.964,0,0,2089872,1452636
2050838528,131118882816,74489856,1534046208,1.283,0.563,98.091,0.063,0,2111486,1478314
2041532416,131128172544,74498048,1534054400,2.161,0.407,97.401,0.031,0,2003566,1535538
2041528320,131128172544,74498048,1534058496,1.756,0.533,97.711,0,0,2163376,1496708
2041716736,131127980032,74498048,1534062592,1.845,0.532,97.624,0,0,2097146,1444386
2040922112,131128762368,74498048,1534074880,1.222,0.345,98.434,0,0,1986400,1411768
2042277888,131127406592,74498048,1534074880,1.691,0.532,97.777,0,0,2066806,1419484
2041991168,131127664640,74514432,1534087168,1.721,0.689,97.527,0.063,0,2149326,1502820
2043056128,131126599680,74514432,1534087168,4.870,0.874,94.255,0,0,2063722,1438122
2042916864,131126734848,74514432,1534091264,2.036,0.564,97.400,0,0,2155398,1467328
2043039744,131126599680,74514432,1534103552,1.190,0.438,98.371,0,0,2087460,1478014
2042773504,131126857728,74514432,1534111744,1.252,0.595,98.153,0,0,2162054,1507028
2042314752,131127308288,74514432,1534119936,1.466,0.624,97.911,0,0,2079512,1596889
2042245120,131127373824,74522624,1534115840,1.003,0.533,98.401,0.063,0,2093566,1461019
2042515456,131127083008,74530816,1534128128,1.881,0.502,97.617,0,0,2057040,1407760
2042433536,131127156736,74530816,1534136320,1.189,0.595,97.903,0.313,0,2108486,1477126
2042425344,131127156736,74530816,1534144512,1.188,0.688,98.124,0,0,2179154,1491990
2042167296,131127414784,74530816,1534144512,1.596,0.595,97.809,0,0,2186434,1506566
2041896960,131127672832,74530816,1534156800,1.345,0.594,98.060,0,0,2160854,1494256
2040840192,131128705024,74551296,1534160896,0.908,0.595,98.403,0.094,0,2097248,1449704
2040840192,131128705024,74551296,1534160896,3.755,0.626,95.557,0.063,0,2011184,1415832
2041896960,131127640064,74551296,1534169088,4.696,0.501,94.803,0,0,2081412,1429282
2041114624,131128414208,74551296,1534177280,2.131,0.689,97.180,0,0,1977026,1516278
2039812096,131129704448,74551296,1534189568,1.945,0.690,97.334,0.031,0,2165798,1498366
2039025664,131130478592,74559488,1534193664,0.909,0.439,98.620,0.031,0,2018006,1385940
2038239232,131131252736,74567680,1534197760,1.407,0.563,97.967,0.063,0,2177612,1506904
2037997568,131131490304,74567680,1534201856,1.752,0.469,97.778,0,0,2067814,1412138
2037190656,131132284928,74567680,1534214144,1.317,0.502,98.182,0,0,2147596,1498284
2036994048,131132481536,74567680,1534214144,1.624,0.562,97.813,0,0,2163030,1510184
2035761152,131133693952,74575872,1534226432,1.159,0.501,98.277,0.063,0,2151396,1485622
2036019200,131133435904,74575872,1534226432,4.442,0.719,94.839,0,0,2116414,1473076
2036256768,131133177856,74584064,1534238720,2.413,0.501,97.054,0.031,0,2100314,1465102
2036350976,131133079552,74584064,1534242816,1.502,0.532,97.966,0,0,2074108,1447784
2036502528,131132919808,74584064,1534251008,1.878,0.532,97.590,0,0,2131120,1628478
2037248000,131132170240,74592256,1534246912,1.724,0.408,97.806,0.063,0,2058266,1429447
2037997568,131131396096,74592256,1534271488,1.753,0.626,97.621,0,0,2055078,1420561
2038251520,131131138048,74592256,1534275584,1.535,0.533,97.932,0,0,2070356,1440230
2038243328,131131138048,74600448,1534275584,1.720,0.688,97.530,0.063,0,2128146,1472922
2038489088,131130880000,74600448,1534287872,1.378,0.627,97.995,0,0,2101596,1460739
2039504896,131129847808,74608640,1534296064,2.098,0.532,97.307,0.063,0,2123528,1477555
2039533568,131129815040,74608640,1534300160,1.373,0.780,97.846,0,0,2098644,1473220
2040131584,131129217024,74608640,1534300160,2.598,0.532,96.870,0,0,2070392,1440612
2040307712,131128991744,74608640,1534308352,1.442,0.439,98.119,0,0,2026696,1410998
2044039168,131125239808,74616832,1534320640,2.631,0.501,96.837,0.031,0,2194106,1670294
2044030976,131125239808,74625024,1534320640,2.536,0.626,96.807,0.031,0,2141454,1479820
2043019264,131126239232,74625024,1534332928,0.908,0.657,98.435,0,0,2074078,1462858
2042978304,131126272000,74625024,1534341120,0.971,0.532,98.497,0,0,2069248,1456814
2042167296,131127078912,74625024,1534345216,1.313,0.625,98.061,0,0,2067962,1436654
2041384960,131127853056,74625024,1534353408,2.124,0.562,97.313,0,0,2068898,1428556
2047049728,131122176000,74633216,1534357504,2.928,0.841,96.168,0.062,0,2195620,1534876
2047033344,131122176000,74641408,1534365696,2.317,0.564,97.120,0,0,2213032,1539582
2046767104,131122434048,74641408,1534373888,1.035,0.502,98.463,0,0,2219492,1550118
2041348096,131127853056,74641408,1534373888,0.970,0.751,98.280,0,0,2205034,1528854
2040889344,131128303616,74641408,1534382080,1.096,0.501,98.403,0,0,2139260,1625746
2040561664,131128627200,74641408,1534386176,0.908,0.626,98.466,0,0,2133354,1496146
2039758848,131129401344,74657792,1534398464,0.847,0.502,98.526,0.125,0,2108930,1470380
2038206464,131130949632,74657792,1534402560,1.658,0.532,97.810,0,0,2143140,1492898
2030714880,131138433024,74657792,1534410752,0.973,0.502,98.525,0,0,2084562,1460536
2030448640,131138691072,74657792,1534418944,1.342,0.562,98.096,0,0,2110820,1483312
2030186496,131138949120,74657792,1534423040,1.285,0.376,98.339,0,0,2115448,1469564
2030170112,131138949120,74665984,1534431232,1.065,0.595,98.308,0.031,0,2207974,1525698
2029899776,131139207168,74674176,1534435328,1.283,0.657,98.028,0.031,0,2132606,1511622
2029899776,131139207168,74674176,1534435328,1.033,0.407,98.560,0,0,1993774,1391496
2029371392,131139723264,74674176,1534447616,1.094,0.688,98.219,0,0,2207120,1659652
2028785664,131140308992,74674176,1534447616,1.689,0.500,97.810,0,0,2049382,1404852
2031439872,131137638400,74674176,1534464000,2.027,0.686,97.286,0,0,2134018,1491418
2030665728,131138412544,74682368,1534455808,1.410,0.470,98.088,0.031,0,2063334,1430636
2030637056,131138412544,74690560,1534476288,1.127,0.532,98.278,0.063,0,2129314,1489382
2037821440,131131224064,74690560,1534480384,3.064,0.563,96.373,0,0,2100028,1455600
2039394304,131129643008,74690560,1534488576,2.753,0.657,96.591,0,0,2207294,1535712
2039136256,131129901056,74690560,1534488576,0.722,0.533,98.745,0,0,1980226,1397190
2038349824,131130675200,74690560,1534500864,0.971,0.595,98.434,0,0,2108356,1464618
2033627136,131135393792,74698752,1534496768,0.816,0.533,98.620,0.031,0,2098770,1459636
2033610752,131135385600,74706944,1534513152,1.657,0.532,97.780,0.031,0,2006022,1547482
2032640000,131136352256,74706944,1534517248,1.033,0.532,98.436,0,0,2127308,1464158
2031341568,131137642496,74706944,1534525440,1.064,0.501,98.435,0,0,2172044,1509564
2031083520,131137900544,74706944,1534525440,1.158,0.564,98.278,0,0,2131342,1481050
2030559232,131138416640,74715136,1534525440,1.065,0.501,98.371,0.063,0,2125304,1469508
2029502464,131139452928,74715136,1534545920,1.034,0.564,98.402,0,0,2147110,1480574
2034905088,131134033920,74723328,1534554112,1.846,0.532,97.559,0.063,0,2089044,1474310
2034905088,131134033920,74723328,1534554112,0.909,0.470,98.621,0,0,2113384,1471976
2045222912,131123707904,74723328,1534562304,1.691,0.720,97.588,0,0,2107976,1472470
2045394944,131123515392,74731520,1534574592,1.788,0.376,97.804,0.031,0,2125320,1479128
2045067264,131123834880,74731520,1534582784,0.908,0.595,98.497,0,0,2077490,1599264
2045067264,131123834880,74731520,1534582784,0.815,0.596,98.589,0,0,2126006,1481646
2044751872,131124129792,74739712,1534595072,0.816,0.502,98.650,0.031,0,2012498,1407786
2044395520,131124486144,74739712,1534595072,1.034,0.595,98.371,0,0,2121982,1449716
2045149184,131123712000,74747904,1534607360,1.003,0.470,98.464,0.063,0,2143644,1495189
2045145088,131123712000,74747904,1534611456,0.939,0.532,98.529,0,0,2029480,1420931
2044878848,131123974144,74747904,1534615552,0.785,0.408,98.807,0,0,2005814,1414412
2050543616,131118297088,74747904,1534627840,1.406,0.969,97.625,0,0,2148876,1498682
2052661248,131116167168,74756096,1534631936,0.909,0.658,98.402,0.031,0,2162526,1499574
2048258048,131120553984,74764288,1534640128,1.033,0.564,98.341,0.063,0,2171952,1508932
2048196608,131120607232,74764288,1534648320,1.219,0.500,98.281,0,0,2083010,1574478
2047913984,131120885760,74764288,1534652416,0.938,0.656,98.406,0,0,2021009,1410902
2047905792,131120885760,74764288,1534660608,0.908,0.501,98.591,0,0,2057471,1428533
2047946752,131120844800,74764288,1534660608,1.409,0.532,98.058,0,0,2086395,1440565
2047545344,131121225728,74780672,1534664704,1.001,0.625,98.280,0.094,0,2152431,1497894
2058797056,131109965824,74780672,1534672896,1.407,0.719,97.874,0,0,2016588,1412748
2058297344,131110453248,74780672,1534685184,0.971,0.595,98.435,0,0,2022492,1433558
2058289152,131110453248,74780672,1534693376,1.031,0.656,98.313,0,0,2143598,1488214
2058063872,131110678528,74780672,1534693376,1.031,0.687,98.282,0,0,2149662,1500288
2058002432,131110735872,74788864,1534689280,0.941,0.502,98.463,0.094,0,2165476,1488972
2057388032,131111321600,74797056,1534709760,0.939,0.689,98.341,0.031,0,2217254,1686118
2056863744,131111837696,74797056,1534717952,1.250,0.500,98.249,0,0,2129404,1471988
2056601600,131112095744,74797056,1534722048,0.846,0.501,98.653,0,0,2028910,1411762
2056081408,131112611840,74797056,1534726144,1.156,0.531,98.313,0,0,2030278,1422478
2061836288,131106836480,74805248,1534738432,1.410,0.345,98.183,0.063,0,2081284,1447076
2061611008,131107057664,74805248,1534742528,1.095,0.469,98.436,0,0,2063792,1440204
2060566528,131108093952,74813440,1534742528,0.971,0.407,98.590,0.031,0,2001918,1412618
2060525568,131108122624,74813440,1534754816,0.877,0.689,98.434,0,0,2087672,1473512
2060419072,131108220928,74813440,1534763008,1.034,0.470,98.497,0,0,2156580,1497564
2060161024,131108478976,74821632,1534754816,1.064,0.626,98.248,0.063,0,2195910,1523006
2059370496,131109253120,74821632,1534771200,1.002,0.626,98.372,0,0,2099938,1610540
2059456512,131109154816,74821632,1534783488,0.879,0.440,98.681,0,0,2064200,1427653
2058629120,131109969920,74829824,1534787584,0.940,0.564,98.434,0.063,0,2161068,1495169
2060460032,131108130816,74829824,1534795776,1.131,0.345,98.524,0,0,2045996,1444062
2059677696,131108904960,74838016,1534795776,0.815,0.564,98.621,0,0,2073578,1440998
2058928128,131109646336,74838016,1534803968,1.033,0.501,98.467,0,0,2074352,1440588
2058317824,131110248448,74838016,1534812160,0.972,0.408,98.621,0,0,2047234,1412204
2058313728,131110248448,74838016,1534816256,0.908,0.595,98.497,0,0,2114522,1472398
2058256384,131110289408,74846208,1534824448,1.124,0.593,98.220,0.062,0,2102302,1468514
2057650176,131110891520,74854400,1534820352,0.909,0.533,98.527,0.031,0,2189718,1516754
2057371648,131111149568,74854400,1534840832,1.127,0.626,98.246,0,0,2237296,1686688
2057367552,131111149568,74854400,1534844928,1.157,0.594,98.248,0,0,2150776,1485132
2058141696,131110375424,74854400,1534844928,1.407,0.657,97.936,0,0,2199030,1516546
2058645504,131109859328,74854400,1534857216,1.435,0.561,98.004,0,0,2158304,1484948
2058231808,131110248448,74870784,1534865408,0.847,0.439,98.652,0.063,0,2054250,1422252
2058223616,131110248448,74870784,1534873600,1.032,0.750,98.218,0,0,2264770,1558316
2057961472,131110506496,74870784,1534877696,0.970,0.594,98.436,0,0,1985764,1415962
2057797632,131110666240,74870784,1534881792,1.126,0.594,98.280,0,0,2206578,1526338
2058297344,131110154240,74870784,1534894080,1.253,0.501,98.246,0,0,2135948,1494032
2058297344,131110154240,74870784,1534894080,1.095,0.438,98.466,0,0,2109606,1470360
2058854400,131109572608,74887168,1534902272,0.970,0.595,98.341,0.094,0,2143774,1643264
2058276864,131110137856,74887168,1534914560,1.034,0.596,98.370,0,0,2055104,1448746
2059116544,131109216256,74887168,1534922752,1.063,0.626,98.311,0,0,2080282,1469020
2059370496,131108958208,74887168,1534926848,1.063,0.563,98.374,0,0,2098956,1446014
2059329536,131108999168,74887168,1534926848,1.282,0.469,98.249,0,0,2176056,1520298
2060853248,131107454976,74895360,1534939136,1.066,0.408,98.495,0.031,0,2112126,1463390
2060836864,131107454976,74903552,1534947328,0.908,0.470,98.559,0.063,0,2080882,1431054
2060836864,131107454976,74903552,1534947328,0.907,0.626,98.467,0,0,2076718,1431676
2060288000,131107995648,74903552,1534955520,1.127,0.595,98.279,0,0,2139282,1490576
2060124160,131108155392,74903552,1534959616,1.125,0.594,98.281,0,0,2157656,1495208
2062102528,131106156544,74911744,1534971904,1.098,0.471,98.369,0.063,0,2095838,1596054
2062352384,131105898496,74911744,1534980096,1.033,0.564,98.403,0,0,2140682,1487730
2061824000,131106414592,74919936,1534984192,1.062,0.688,98.219,0.031,0,2100822,1457880
2062340096,131105898496,74919936,1534984192,1.125,0.625,98.249,0,0,2221348,1540062
2062458880,131105767424,74919936,1534996480,1.033,0.563,98.404,0,0,2176636,1512436
2062184448,131106025472,74928128,1535004672,1.157,0.563,98.248,0.031,0,2224704,1528738
2062184448,131106025472,74928128,1535004672,0.782,0.626,98.592,0,0,1960610,1377866
2062176256,131106025472,74928128,1535012864,1.032,0.563,98.405,0,0,2056430,1437564
2061385728,131106795520,74936320,1535025152,0.908,0.564,98.465,0.063,0,2113644,1487560
2061127680,131107053568,74936320,1535025152,1.034,0.595,98.371,0,0,2138716,1484344
2061381632,131106795520,74936320,1535029248,0.846,0.501,98.652,0,0,2051602,1572994
2061385728,131106762752,74944512,1535045632,1.126,0.532,98.311,0.031,0,2204405,1509116
2061381632,131106762752,74944512,1535049728,0.846,0.627,98.527,0,0,2085955,1450330
2060853248,131107282944,74944512,1535057920,0.971,0.501,98.527,0,0,2068028,1444432
2060742656,131107381248,74952704,1535062016,1.004,0.502,98.463,0.031,0,2160516,1481904
2060324864,131107799040,74952704,1535062016,0.911,0.440,98.649,0,0,2181418,1505864
2060562432,131107540992,74960896,1535074304,1.034,0.439,98.464,0.063,0,2059670,1424362
2059784192,131108315136,74960896,1535078400,1.128,0.533,98.339,0,0,2167814,1481702
2059513856,131108573184,74960896,1535090688,1.439,0.563,97.998,0,0,2189562,1510922
2060029952,131108057088,74960896,1535090688,0.971,0.564,98.465,0,0,2155960,1477266
2059751424,131108315136,74969088,1535102976,1.003,0.501,98.464,0.031,0,1997690,1536146
2059747328,131108315136,74969088,1535107072,1.252,0.438,98.310,0,0,2044044,1419040
2059747328,131108315136,74977280,1535098880,1.158,0.626,98.185,0.031,0,2104548,1436848
2059452416,131108589568,74977280,1535119360,1.192,0.502,98.307,0,0,2109776,1457726
2059616256,131108417536,74977280,1535127552,1.472,0.470,98.058,0,0,2117582,1475764
2059608064,131108417536,74977280,1535135744,0.940,0.501,98.559,0,0,2027468,1443010
2058924032,131109093376,74985472,1535135744,1.125,0.500,98.188,0.187,0,2051412,1423802
2069794816,131098210304,74993664,1535139840,1.850,0.439,97.680,0.031,0,2093580,1448496
2069159936,131098832896,74993664,1535152128,1.003,0.470,98.528,0,0,2081866,1482194
2069159936,131098832896,74993664,1535152128,0.909,0.533,98.559,0,0,2144776,1481376
2061688832,131106295808,74993664,1535160320,0.879,0.439,98.682,0,0,2129840,1624368
2061905920,131106066432,74993664,1535172608,1.097,0.439,98.464,0,0,2184634,1515304
2060939264,131106934784,75010048,1535180800,1.156,0.562,98.188,0.094,0,2068320,1445030
2060939264,131106934784,75010048,1535180800,0.971,0.564,98.465,0,0,2097426,1457232
2060910592,131106951168,75010048,1535193088,0.847,0.502,98.652,0,0,2106390,1461914
2060873728,131106983936,75010048,1535197184,0.909,0.564,98.528,0,0,2151330,1498896
2062925824,131104919552,75010048,1535209472,1.218,0.718,98.064,0,0,2038070,1426286
2062925824,131104919552,75010048,1535209472,0.939,0.563,98.498,0,0,2111136,1469514
2062647296,131105177600,75026432,1535213568,1.095,0.469,98.342,0.094,0,2117900,1465902
2062372864,131105435648,75026432,1535229952,0.939,0.595,98.466,0,0,2103494,1483236
2062110720,131105693696,75026432,1535234048,0.877,0.564,98.559,0,0,2049246,1569338
2062102528,131105693696,75026432,1535242240,1.096,0.470,98.435,0,0,2164542,1498222
2061840384,131105955840,75026432,1535242240,1.157,0.532,98.311,0,0,2151672,1494376
2061807616,131105968128,75034624,1535254528,1.001,0.626,98.311,0.063,0,2112580,1494448
2061537280,131106226176,75042816,1535258624,0.784,0.471,98.714,0.031,0,2110656,1466128
2061598720,131106160640,75042816,1535262720,1.158,0.501,98.342,0,0,2053992,1417034
2061529088,131106226176,75042816,1535266816,0.971,0.407,98.621,0,0,2066106,1443778
2061516800,131106226176,75059200,1535262720,0.970,0.657,98.186,0.188,0,2038814,1412776
2061234176,131106476032,75067392,1535287296,1.251,0.407,98.280,0.063,0,1925512,1359484
2061234176,131106476032,75067392,1535287296,1.094,0.688,98.218,0,0,2117128,1465798
2060967936,131106734080,75067392,1535295488,0.878,0.502,98.620,0,0,2139574,1634456
2060705792,131106992128,75067392,1535299584,0.876,0.595,98.529,0,0,2098596,1440890
2060177408,131107508224,75067392,1535311872,0.784,0.533,98.683,0,0,2035864,1438440
2059718656,131107942400,75083776,1535320064,1.094,0.531,98.125,0.250,0,2057902,1431206
2059878400,131107782656,75083776,1535320064,1.126,0.563,98.311,0,0,1996632,1418454
2059538432,131108110336,75083776,1535332352,1.249,0.718,98.033,0,0,2103298,1464916
2059792384,131107852288,75083776,1535336448,1.189,0.469,98.342,0,0,2158710,1497638
2060042240,131107594240,75083776,1535344640,1.063,0.563,98.373,0,0,2105294,1474404
2060333056,131107303424,75091968,1535336448,1.160,0.376,98.432,0.031,0,2129706,1495888
2060546048,131107065856,75100160,1535352832,0.971,0.532,98.434,0.063,0,2111916,1456794
2059862016,131107737600,75100160,1535365120,1.033,0.501,98.466,0,0,2129896,1627750
2059853824,131107741696,75100160,1535369216,0.940,0.408,98.652,0,0,2025218,1421892
2059825152,131107762176,75100160,1535377408,1.001,0.532,98.467,0,0,2114698,1479666
2059825152,131107762176,75108352,1535369216,0.908,0.626,98.404,0.063,0,2098494,1474398
2059640832,131107926016,75108352,1535389696,1.345,0.532,98.123,0,0,2177494,1519694
2059788288,131107766272,75116544,1535393792,1.127,0.407,98.404,0.063,0,2125410,1478560
2059370496,131108184064,75116544,1535393792,1.002,0.595,98.403,0,0,2110644,1466668
2059358208,131108184064,75116544,1535406080,1.158,0.407,98.436,0,0,2101112,1462170
2059255808,131108270080,75124736,1535414272,0.847,0.376,98.714,0.063,0,1983392,1393852
2059182080,131108335616,75124736,1535422464,1.095,0.594,98.311,0,0,2225006,1540326
2059182080,131108335616,75124736,1535422464,1.062,0.625,98.314,0,0,2037932,1576530
2058973184,131108528128,75132928,1535430656,0.940,0.501,98.497,0.063,0,2126268,1471198
2058194944,131109298176,75132928,1535438848,0.752,0.596,98.652,0,0,2031934,1423922
2057928704,131109556224,75132928,1535447040,1.034,0.470,98.496,0,0,1907246,1388154
2058182656,131109298176,75141120,1535442944,0.845,0.532,98.623,0,0,1747024,1312512
2058039296,131109429248,75141120,1535455232,0.877,0.501,98.622,0,0,1773102,1321972
2057895936,131109560320,75141120,1535467520,0.970,0.375,98.655,0,0,1478074,1186956
2057891840,131109560320,75149312,1535463424,0.720,0.532,98.686,0.063,0,1307614,1101460
2057891840,131109548032,75149312,1535475712,0.750,0.407,98.843,0,0,1291236,1098608
2059878400,131107545088,75165696,1535483904,0.471,0.282,99.153,0.094,0,899134,916962
2064793600,131102228480,75165696,1535500288,0.594,0.407,98.999,0,0,856102,1024850
2064973824,131101634560,75165696,1535766528,0.501,0.376,99.123,0,0,1209628,864388
2111905792,131054284800,75165696,1535766528,1.284,0.627,98.089,0,0,476792,703730
2096934912,131068190720,75165696,1535520768,0.500,0.281,99.219,0,0,531844,609144
2096394240,131068706816,75177984,1535528960,0.125,0.094,99.749,0.031,0,243080,569954
2096074752,131069022208,75190272,1535520768,0.250,0.250,99.438,0.062,0,247084,574094
