"Dstat 0.7.3 CSV output"
"Author:","Dag Wieers <dag@wieers.com>",,,,"URL:","http://dag.wieers.com/home-made/dstat/"
"Host:","grisou-32.nancy.grid5000.fr",,,,"User:","root"
"Cmdline:","dstat -m -c -n -o dstat.csv",,,,"Date:","27 May 2020 10:57:51 CEST"
"memory usage",,,,"total cpu usage",,,,,"net/total",
"used","free","buff","cach","usr","sys","idl","wai","stl","recv","send"
1209880576,132331773952,58093568,1197047808,1.375,0.146,98.426,0.053,0,0,0
1223077888,132318208000,58105856,1197432832,0.655,0.156,99.126,0.062,0,390764,14938
1213661184,132328091648,58105856,1196965888,0.375,0.563,98.686,0.375,0,19610,15888
1229656064,132311633920,58105856,1197416448,0.719,0.531,98.750,0,0,393278,12910
1210904576,132330819584,58118144,1196969984,0.406,0.156,99.406,0.031,0,9628,13944
1225359360,132315951104,58118144,1197383680,0.594,0.188,99.218,0,0,391442,13522
1213116416,132328574976,58130432,1196974080,0.500,0.531,98.938,0.031,0,6348,16374
1212612608,132329078784,58130432,1196974080,0,0,99.656,0.344,0,5988,220
1212612608,132329078784,58130432,1196974080,0.031,0.031,99.031,0.907,0,10994,0
1212600320,132329078784,58142720,1196974080,0,0,99.969,0.031,0,8154,0
1212342272,132329336832,58142720,1196974080,0,0,100,0,0,21146,0
1212084224,132329594880,58142720,1196974080,0,0,100,0,0,18070,84
1211817984,132329852928,58150912,1196974080,0.031,0.031,99.875,0.063,0,10462,0
1211809792,132329861120,58150912,1196974080,0,0,100,0,0,20502,496
1211572224,132330098688,58150912,1196974080,0,0,100,0,0,45820,0
1211572224,132330098688,58150912,1196974080,0,0,100,0,0,52162,0
1211314176,132330356736,58150912,1196974080,0,0,100,0,0,23150,0
1210798080,132330872832,58150912,1196974080,0,0,100,0,0,17386,0
1210572800,132331089920,58159104,1196974080,0,0,99.969,0.031,0,14356,0
1229697024,132311707648,58159104,1197232128,0.656,0.250,99.094,0,0,399562,15078
1216241664,132325416960,58159104,1196974080,0.375,0.563,99.062,0,0,9818,15792
1218002944,132323463168,58159104,1197166592,0.375,0.344,99.282,0,0,180240,15642
1224167424,132317212672,58159104,1197248512,0.281,0.094,99.625,0,0,402666,14500
1218875392,132322574336,58159104,1197178880,0.781,0.688,98.531,0,0,19346,16806
1217646592,132323966976,58183680,1196990464,0,0,99.875,0.125,0,14016,0
1218850816,132322308096,58183680,1197441024,0.969,0.812,98.219,0,0,414104,27054
1217064960,132324540416,58183680,1196994560,0,0,100,0,0,73944,84
1217945600,132323643392,58183680,1196994560,1.340,0.686,97.974,0,0,444706,27058
1216667648,132324917248,58183680,1196998656,0,0.031,99.969,0,0,23062,0
1216409600,132325175296,58183680,1196998656,0,0,99.500,0.500,0,10044,0
1219186688,132322091008,58208256,1197248512,1.594,0.281,98,0.125,0,225262,11004
1217646592,132323880960,58208256,1196998656,0,0,100,0,0,5912,2784
1217388544,132324139008,58208256,1196998656,0.031,0,99.969,0,0,7202,0
1216356352,132325171200,58208256,1196998656,0,0.031,99.969,0,0,2148,0
1215496192,132326064128,58208256,1196965888,0.407,0.156,99.437,0,0,343330,14832
1222696960,132318625792,58232832,1197178880,0.219,0.125,99.280,0.375,0,186114,20230
1222152192,132319158272,58232832,1197191168,0,0,100,0,0,15502,13328
1221779456,132319531008,58232832,1197191168,0,0.031,99.969,0,0,16220,13230
1221521408,132319789056,58232832,1197191168,0,0,100,0,0,13844,13760
1221521408,132319789056,58232832,1197191168,0,0,100,0,0,36940,13230
1221382144,132319920128,58253312,1197178880,0,0,99.312,0.688,0,19778,18872
1221103616,132320178176,58253312,1197199360,0,0,100,0,0,30998,13496
1220829184,132320452608,58253312,1197199360,0.031,0.031,99.937,0,0,15338,13328
1220296704,132320985088,58253312,1197199360,0,0,100,0,0,17504,13632
1219780608,132321501184,58253312,1197199360,0,0,100,0,0,26034,13686
1212366848,132328878080,58261504,1197195264,0,0.031,99.812,0.156,0,3774,5164
1212194816,132329115648,58261504,1197129728,0.313,0.031,99.656,0,0,172530,14268
1212272640,132329144320,58261504,1197023232,0,0,100,0,0,6694,220
1212014592,132329402368,58261504,1197023232,0,0.031,99.969,0,0,15344,0
1211498496,132329918464,58261504,1197023232,0,0,100,0,0,4558,0
1211232256,132330184704,58273792,1197010944,0,0,99.687,0.313,0,3878,1008
1210429440,132330967040,58286080,1197019136,0,0,99.969,0.031,0,22678,0
1210400768,132330983424,58286080,1197031424,0,0,100,0,0,1638,0
1220599808,132320784384,58286080,1197031424,0.281,0.125,99.593,0,0,398032,14368
1214091264,132327100416,58286080,1197219840,0.720,0.563,98.717,0,0,10998,17038
1212141568,132329238528,58286080,1197031424,0,0.031,99.969,0,0,13508,84
1242230784,132299096064,58298368,1197072384,0.531,0.281,98.688,0.500,0,372188,13536
1364639744,132176412672,58298368,1197338624,2.687,0.219,97.095,0,0,13100,696
1363595264,132178235392,58298368,1196584960,0.031,0,99.969,0,0,12614,0
1363079168,132178751488,58310656,1196572672,0,0,99.969,0.031,0,10466,252
1363066880,132178751488,58310656,1196584960,0,0,100,0,0,3836,0
1362305024,132179492864,58322944,1196593152,0,0,99.656,0.344,0,4632,0
1438670848,132103127040,58322944,1196593152,3.153,0.312,96.410,0.125,0,14896,84
1476538368,132065259520,58322944,1196593152,3.947,0.031,96.022,0,0,7866,0
1509879808,132031918080,58322944,1196593152,3.515,0.280,96.205,0,0,346,0
1563107328,131978690560,58322944,1196593152,3.609,0.249,96.142,0,0,20630,0
1622138880,131919650816,58331136,1196593152,4.002,0.093,95.842,0.062,0,13984,0
1668878336,131872903168,58339328,1196593152,3.759,0.186,95.806,0.249,0,3806,1508
1702559744,131839221760,58339328,1196593152,3.545,0.218,96.238,0,0,2258,0
1737953280,131803828224,58339328,1196593152,3.515,0.218,96.267,0,0,20630,0
1794609152,131747172352,58339328,1196593152,3.730,0.155,96.114,0,0,13638,0
1849135104,131692646400,58347520,1196584960,3.730,0.124,96.083,0.062,0,1256,420
1884794880,131656974336,58355712,1196589056,3.999,0.155,95.660,0.186,0,2940,1680
1917079552,131624681472,58355712,1196597248,3.520,0.187,96.293,0,0,4580,2176
1962680320,131579039744,58355712,1196597248,3.551,0.093,96.355,0,0,3688,1680
1998364672,131543355392,58355712,1196597248,3.771,0.125,96.105,0,0,4242,1750
2007486464,131534225408,58363904,1196597248,3.988,0.187,95.763,0.062,0,405818,8170
2042941440,131498717184,58372096,1196601344,8.652,0.249,91.005,0.093,0,8444430,133966
2066534400,131474989056,58372096,1196609536,10.705,0.312,88.983,0,0,20213380,594070
2073391104,131468099584,58372096,1196609536,8.432,0.344,91.224,0,0,33960002,967912
2109001728,131432407040,58372096,1196609536,9.518,0.529,89.953,0,0,42997164,1240528
2112655360,131428700160,58380288,1196605440,8.401,0.375,91.162,0.062,0,53906638,1492638
2230374400,131310964736,58388480,1196613632,9.119,1.843,88.695,0.344,0,66574998,1793182
2235600896,131305738240,58388480,1196613632,10.534,0.839,88.626,0,0,78849046,2038605
2311049216,131230281728,58388480,1196621824,11.417,1.095,87.488,0,0,90036004,2465816
2334322688,131207004160,58388480,1196625920,10.571,1.098,88.331,0,0,101494896,2676736
2400530432,131140788224,58396672,1196625920,10.979,1.497,87.492,0.031,0,117335756,2994122
2443751424,131097554944,58404864,1196630016,12.203,1.311,86.080,0.406,0,118925244,3108022
2444898304,131096403968,58404864,1196634112,11.291,0.842,87.867,0,0,122236484,3077666
2458161152,131083137024,58404864,1196638208,11.933,1.336,86.731,0,0,113842556,3068720
2477789184,131063504896,58404864,1196642304,11.578,0.809,87.613,0,0,115956254,3216372
2486874112,131054411776,58413056,1196642304,10.840,0.875,88.254,0.031,0,107745550,3036062
2486714368,131054555136,58421248,1196650496,12.149,0.999,86.321,0.531,0,116741378,3273494
2488700928,131052564480,58421248,1196654592,11.080,0.910,88.010,0,0,116495740,3168592
2715742208,130825523200,58421248,1196654592,11.097,1.191,87.680,0.031,0,111564770,3389756
2724364288,130816897024,58421248,1196658688,11.743,0.652,87.605,0,0,112191736,3289186
2993184768,130548064256,58429440,1196662784,12.869,1.088,85.981,0.062,0,122496182,3442690
2996498432,130544746496,58429440,1196666880,11.282,0.815,87.903,0,0,115181026,3400908
3316592640,130224644096,58437632,1196666880,11.215,0.966,87.477,0.343,0,112459374,3248144
3321856000,130219376640,58437632,1196670976,11.330,0.905,87.734,0.031,0,117251462,3532747
3329544192,130211684352,58437632,1196675072,11.042,0.902,88.025,0.031,0,111753738,3319344
3713589248,129827622912,58445824,1196679168,11.333,1.155,87.387,0.125,0,108955484,3345014
3720548352,129820659712,58445824,1196683264,10.867,1.005,88.128,0,0,110552764,3221894
3724722176,129816469504,58454016,1196691456,10.432,0.846,88.283,0.439,0,114976904,3460355
4046180352,129495011328,58454016,1196691456,10.926,0.785,88.289,0,0,113272204,3487756
4184477696,129356705792,58454016,1196699648,11.076,0.905,88.019,0,0,113412450,3433363
4191141888,129350029312,58462208,1196703744,11.404,0.815,87.719,0.063,0,117301280,3636982
4190126080,129351041024,58462208,1196707840,11.017,0.811,88.171,0,0,112194058,3529238
4190638080,129350516736,58470400,1196711936,11.198,0.873,87.617,0.312,0,113864832,3561782
4194639872,129346510848,58470400,1196716032,11.042,0.717,88.241,0,0,112614828,3582134
4192542720,129348608000,58470400,1196716032,11.194,0.967,87.808,0.031,0,114065436,3620123
4193701888,129347436544,58478592,1196720128,11.308,0.872,87.757,0.062,0,118263084,3711057
4195004416,129346125824,58478592,1196728320,11.412,0.964,87.624,0,0,108641208,3561924
4197367808,129343750144,58486784,1196732416,11.198,0.811,87.648,0.343,0,120754934,3810604
4199301120,129341816832,58486784,1196732416,11.461,1.339,87.169,0.031,0,113951532,3659671
4201320448,129339789312,58486784,1196740608,11.634,0.873,87.492,0,0,113249686,3734692
4201070592,129339998208,58494976,1196732416,11.518,0.745,87.706,0.031,0,123031818,3769696
4201119744,129339928576,58494976,1196748800,11.993,0.837,87.171,0,0,110147418,3672396
4228583424,129312456704,58503168,1196748800,12.060,0.841,86.507,0.592,0,125035394,4008263
4205146112,129335873536,58503168,1196765184,12.858,0.841,86.301,0,0,125809646,3977474
4204003328,129337012224,58503168,1196769280,12.181,0.963,86.855,0,0,120817044,3888210
4203892736,129337114624,58507264,1196773376,11.986,0.934,87.049,0.031,0,111825910,3766606
4618813440,128922189824,58511360,1196773376,12.090,1.608,86.271,0.031,0,112042472,3723138
4668489728,128872501248,58519552,1196777472,10.646,1.499,86.762,1.093,0,111495110,3799956
4998672384,128542314496,58519552,1196781568,11.094,0.935,87.971,0,0,107677752,3773908
5330145280,128210837504,58519552,1196785664,11.104,1.216,87.679,0,0,116427468,3860472
5338652672,128202452992,58519552,1196785664,11.759,0.780,87.461,0,0,114308470,3858352
5340524544,128200572928,58527744,1196785664,11.391,0.778,87.800,0.031,0,119635446,3973618
5339664384,128201416704,58535936,1196789760,11.584,0.994,86.708,0.714,0,112274464,3931128
5340196864,128200880128,58535936,1196793856,10.940,0.596,88.464,0,0,119305954,4022440
5339246592,128201830400,58535936,1196793856,11.410,0.719,87.871,0,0,112138828,3950558
5353881600,128187187200,58535936,1196802048,12.859,0.905,86.236,0,0,112127916,3944240
5388918784,128152133632,58544128,1196810240,11.402,1.184,87.352,0.062,0,112703574,3854980
5430063104,128110977024,58552320,1196814336,11.382,1.251,86.898,0.469,0,110898828,3880600
5429170176,128111865856,58552320,1196818432,10.490,0.848,88.662,0,0,116318692,4049882
5432909824,128108085248,58552320,1196818432,12.071,0.851,87.078,0,0,114970224,4029164
5432532992,128108457984,58552320,1196822528,11.667,1.533,86.738,0.063,0,119147082,4127040
5434392576,128106586112,58560512,1196826624,11.257,0.907,87.774,0.063,0,118542304,4056265
5439000576,128101961728,58568704,1196834816,12.156,0.906,86.781,0.156,0,124175322,4205674
5438701568,128102256640,58568704,1196838912,11.146,0.911,87.692,0.251,0,118067504,4103530
5437755392,128103202816,58568704,1196838912,12.936,0.904,86.160,0,0,112800960,3932506
5447335936,128093618176,58568704,1196843008,14.134,0.903,84.963,0,0,118379078,4340806
5441519616,128099422208,58576896,1196847104,12.379,0.907,86.621,0.094,0,116788016,4161769
5442187264,128098750464,58576896,1196851200,12.367,0.720,86.913,0,0,115038974,4171706
5441658880,128099262464,58585088,1196859392,12.246,0.843,86.098,0.812,0,116477924,4196008
5440167936,128100749312,58585088,1196863488,13.283,0.811,85.906,0,0,120009156,4220106
5441064960,128099848192,58585088,1196867584,13.084,0.779,86.137,0,0,119471628,4272796
5438734336,128102170624,58593280,1196867584,12.998,0.871,86.039,0.093,0,113654672,4182878
5453447168,128087445504,58593280,1196879872,13.206,0.812,85.982,0,0,114308766,4171197
5607673856,127933206528,58601472,1196883968,13.146,1.589,84.829,0.436,0,117376122,4284445
5908148224,127632723968,58601472,1196892160,11.536,2.114,86.350,0,0,116779646,4241300
5911003136,127629864960,58601472,1196896256,11.673,0.780,87.547,0,0,116351248,4214696
5909016576,127631839232,58609664,1196900352,12.203,0.845,86.890,0.063,0,117715306,4478172
6470287360,127070568448,58609664,1196900352,11.073,1.161,87.767,0,0,113575818,4218522
6710534144,126830309376,58617856,1196904448,11.312,1.870,86.538,0.280,0,115119214,4185578
6777421824,126763413504,58617856,1196912640,13.801,1.340,84.860,0,0,118629712,4333226
6845079552,126695751680,58617856,1196916736,11.971,1.504,86.525,0,0,112805926,4234758
7062691840,126477996032,58626048,1197051904,11.080,1.092,87.734,0.094,0,116398346,4365888
7736987648,125803700224,58626048,1197051904,10.724,1.057,88.219,0,0,111220362,4168866
7972618240,125568065536,58626048,1197056000,11.838,1.558,86.604,0,0,111882916,4158688
8106573824,125434093568,58634240,1197064192,11.254,1.938,86.777,0.031,0,117510386,4253740
8106065920,125434597376,58634240,1197068288,10.684,0.875,88.441,0,0,123471488,4841810
8215580672,125325070336,58642432,1197072384,12.235,1.463,86.208,0.093,0,112613276,4249620
8215928832,125324718080,58642432,1197076480,10.241,0.689,89.070,0,0,109623408,4318814
8234160128,125306486784,58642432,1197076480,11.426,1.152,87.422,0,0,112567726,4307572
8240562176,125300002816,58642432,1197084672,13.689,1.123,85.189,0,0,114828956,4397400
8259796992,125280763904,58642432,1197088768,15.456,0.869,83.675,0,0,117000600,4350888
8251277312,125289279488,58650624,1197084672,11.468,1.028,87.410,0.093,0,111691754,4349450
8250974208,125289570304,58650624,1197096960,10.669,0.653,88.678,0,0,111638976,4309272
8252506112,125288034304,58650624,1197101056,12.293,0.780,86.615,0.312,0,115468646,4505784
8294653952,125245882368,58650624,1197105152,10.817,1.590,87.594,0,0,110313324,4198888
8293437440,125247094784,58650624,1197109248,10.050,0.783,89.167,0,0,110785774,4422746
8371838976,125168680960,58658816,1197113344,11.911,1.840,86.186,0.062,0,117135594,4627780
8438820864,125101690880,58658816,1197117440,11.498,1.492,87.011,0,0,114950972,4509058
8442638336,125097857024,58667008,1197125632,12.445,0.876,86.366,0.313,0,124875402,4685180
8442888192,125097607168,58667008,1197125632,11.482,0.936,87.520,0.062,0,119852000,4545102
8446885888,125093605376,58667008,1197129728,12.636,1.089,86.275,0,0,114035238,4285260
8447053824,125093425152,58675200,1197133824,11.504,0.656,87.746,0.094,0,118164110,4471326
8447373312,125093105664,58675200,1197133824,11.961,0.812,87.227,0,0,119346698,4497262
8447025152,125093433344,58683392,1197146112,10.920,0.905,88.144,0.031,0,112339644,4353908
8448188416,125092265984,58683392,1197150208,11.531,0.719,87.750,0,0,110310176,4416536
8446590976,125093859328,58683392,1197154304,10.927,0.687,88.386,0,0,118083416,4325726
8447770624,125092667392,58691584,1197158400,12.258,0.811,86.900,0.031,0,120032980,4595486
8450965504,125089472512,58691584,1197158400,12.527,0.779,86.694,0,0,121417192,4653862
8446623744,125093806080,58691584,1197166592,11.525,0.877,87.598,0,0,119242790,4606590
8448569344,125091860480,58691584,1197166592,12.009,0.842,86.931,0.218,0,113487682,4379286
8447328256,125093093376,58691584,1197174784,11.920,0.753,87.327,0,0,112219440,4535434
8447156224,125093257216,58699776,1197174784,12.730,0.716,86.492,0.062,0,120127350,4476422
8447246336,125093163008,58699776,1197178880,11.774,0.722,87.504,0,0,114824676,4640488
8448729088,125091672064,58699776,1197187072,12.469,0.689,86.842,0,0,115354640,4413747
8448700416,125091692544,58707968,1197187072,12.219,1.031,86.281,0.469,0,110422846,4364670
8449548288,125090836480,58707968,1197195264,11.776,0.846,87.379,0,0,115707722,4604369
8449429504,125090942976,58716160,1197199360,11.871,0.843,87.223,0.062,0,115855012,4430346
8448069632,125092298752,58716160,1197203456,12.256,0.597,87.146,0,0,113586720,4376646
8450375680,125089988608,58716160,1197207552,11.593,0.754,87.653,0,0,118913988,4350146
8449896448,125090447360,58728448,1197215744,11.814,0.783,87.057,0.345,0,115678520,4644532
8451485696,125088854016,58728448,1197219840,12.024,0.843,87.133,0,0,114645222,4281334
8451772416,125088555008,58736640,1197219840,14.081,0.937,84.920,0.062,0,118624968,4789897
8451076096,125089239040,58736640,1197232128,11.930,0.937,87.133,0,0,116563516,4566933
8487981056,125052329984,58736640,1197236224,12.318,1.179,86.503,0,0,111382288,4369660
8571047936,124969263104,58744832,1197228032,11.680,1.874,86.415,0.031,0,116578380,4373962
8627773440,124912525312,58744832,1197240320,11.986,1.619,86.395,0,0,117670132,4781264
8681975808,124858310656,58753024,1197244416,11.702,1.126,87.109,0.063,0,113414056,4385318
8738054144,124802224128,58753024,1197252608,11.755,1.003,87.241,0,0,117845904,4395726
8797028352,124743245824,58753024,1197256704,11.794,1.310,86.895,0,0,113463746,4783917
8846254080,124694016000,58753024,1197260800,12.858,1.040,86.101,0,0,117991284,4508731
8903946240,124636323840,58753024,1197260800,11.826,0.972,87.202,0,0,115673194,4312366
8959832064,124580425728,58761216,1197264896,11.886,1.556,86.465,0.093,0,108795970,4245872
9019998208,124520251392,58761216,1197273088,12.080,1.463,86.457,0,0,116367578,4674570
9082458112,124457787392,58761216,1197277184,11.715,1.406,86.879,0,0,112485664,4428006
9132560384,124407681024,58761216,1197281280,11.562,1.562,86.875,0,0,114194320,4402440
9194385408,124345851904,58761216,1197285376,11.463,1.503,87.034,0,0,115067668,4622474
9256837120,124283383808,58769408,1197293568,12.356,1.058,86.492,0.093,0,117164062,4519676
9309515776,124230705152,58769408,1197293568,12.010,1.317,86.673,0,0,125267550,4292388
9372676096,124167540736,58769408,1197297664,11.875,1.562,86.562,0,0,117094544,4929116
9435488256,124104724480,58769408,1197301760,12.527,0.658,86.815,0,0,112939802,4469486
9493770240,124046438400,58769408,1197305856,12.212,1.371,86.417,0,0,116898446,4480889
9553891328,123986296832,58777600,1197314048,11.921,1.345,86.671,0.063,0,116662858,4556858
9605623808,123934564352,58777600,1197314048,11.971,1.097,86.932,0,0,113909772,4523234
9666916352,123873267712,58777600,1197318144,11.595,1.160,87.245,0,0,110509458,4450208
9727651840,123812528128,58777600,1197322240,11.972,1.094,86.933,0,0,116530708,4553854
9794662400,123745513472,58777600,1197326336,11.464,1.351,87.155,0.031,0,117360574,4170122
9859727360,123680432128,58785792,1197334528,12.123,1.319,86.464,0.094,0,119671156,4857496
9928503296,123611652096,58785792,1197338624,12.659,1.400,85.941,0,0,120808312,4770122
9991639040,123548512256,58785792,1197342720,12.039,1.626,86.335,0,0,113535960,4331438
10061303808,123478843392,58785792,1197346816,11.469,1.969,86.562,0,0,114521390,4521392
10128715776,123411427328,58785792,1197350912,12.748,1.272,85.701,0.279,0,114820766,4467038
10162548736,123377586176,58793984,1197350912,10.735,1.086,88.117,0.062,0,109470550,4269030
10233298944,123306815488,58793984,1197363200,12.347,1.504,86.149,0,0,119002648,4215122
10290266112,123249844224,58793984,1197367296,12.278,2.181,85.541,0,0,113415252,4867689
10345467904,123194638336,58793984,1197371392,11.865,1.931,86.204,0,0,119956906,4579064
10412949504,123127156736,58793984,1197371392,12.547,1.335,86.118,0,0,115238872,4247338
10447667200,123092414464,58810368,1197379584,12.473,1.462,85.941,0.124,0,112580010,4704678
10518675456,123021402112,58810368,1197383680,13.485,1.539,84.975,0,0,117853552,4348964
10592088064,122947743744,58810368,1197629440,12.768,1.709,85.523,0,0,121444482,4846467
10663346176,122876719104,58810368,1197395968,12.722,1.154,86.124,0,0,112955482,4401766
10690801664,122849259520,58810368,1197400064,11.021,1.090,87.889,0,0,115263986,4187170
10765078528,122774974464,58818560,1197400064,11.873,1.660,86.404,0.063,0,113127808,4623876
10839408640,122700640256,58818560,1197404160,12.898,1.918,85.184,0,0,118431598,4431598
10909913088,122630131712,58818560,1197408256,12.605,1.373,86.022,0,0,115514628,4556478
10945507328,122594529280,58818560,1197416448,12.984,1.092,85.924,0,0,117626478,4515663
11001368576,122538663936,58818560,1197420544,12.285,1.316,86.399,0,0,112203046,4458050
11067629568,122472349696,58826752,1197432832,12.609,1.217,86.111,0.062,0,114476520,3983702
11106385920,122433593344,58826752,1197432832,10.858,1.030,88.112,0,0,113285784,4892313
11182563328,122357411840,58826752,1197436928,12.520,1.342,86.138,0,0,116635790,3774352
11258564608,122281402368,58826752,1197445120,12.987,1.339,85.674,0,0,118555690,5406440
11293487104,122246475776,58826752,1197449216,11.921,1.314,86.765,0,0,113760512,4526459
11370741760,122169204736,58834944,1197453312,11.577,2.096,86.264,0.063,0,114882362,4493372
11407659008,122132287488,58834944,1197453312,10.681,1.124,88.195,0,0,116906474,4525316
11485011968,122054930432,58834944,1197457408,11.971,1.316,86.713,0,0,111499726,4298838
11563311104,121976623104,58834944,1197465600,12.155,1.256,86.589,0,0,116746118,4559208
11603722240,121936207872,58834944,1197469696,12.188,1.531,86.281,0,0,121640952,4310944
11656830976,121883086848,58843136,1197473792,12.281,1.410,86.247,0.063,0,124813944,4760516
11733770240,121806143488,58843136,1197477888,10.640,1.654,87.707,0,0,116174552,4302732
11777462272,121762443264,58843136,1197486080,12.935,1.337,85.728,0,0,123278412,4439174
11853094912,121686810624,58843136,1197486080,13.368,1.210,85.422,0,0,116638488,4829649
11896090624,121643810816,58843136,1197490176,12.826,1.366,85.807,0,0,112777228,4444947
11979403264,121560485888,58851328,1197494272,12.162,2.022,85.754,0.062,0,113216982,4516692
12018163712,121521721344,58851328,1197498368,10.338,1.096,88.565,0,0,115501568,4488109
12097851392,121442025472,58851328,1197506560,12.882,1.653,85.465,0,0,114912442,4530826
12143714304,121396158464,58851328,1197510656,12.850,1.431,85.719,0,0,120747992,4592602
12222898176,121316974592,58851328,1197510656,13.080,1.433,85.176,0.311,0,111704054,4445396
12240805888,121299046400,58867712,1197514752,10.910,0.935,88.061,0.094,0,112625512,4420167
12324315136,121215533056,58867712,1197518848,13.636,2.055,84.309,0,0,117364102,4568545
12363472896,121176367104,58867712,1197527040,12.825,1.063,86.112,0,0,119303736,4433930
12448256000,121091579904,58867712,1197531136,12.927,1.492,85.581,0,0,116254054,4547910
12490956800,121048875008,58867712,1197535232,11.007,1.345,87.649,0,0,116424808,4518354
12586938368,120952647680,58875904,1197772800,15.483,1.713,82.741,0.062,0,114677080,4555500
12628336640,120911478784,58875904,1197543424,11.877,1.379,86.744,0,0,114805760,4321554
12671160320,120868651008,58875904,1197547520,10.472,1.063,88.465,0,0,112319138,4485886
12759302144,120780505088,58875904,1197551616,11.720,1.912,86.368,0,0,116881624,4708658
12803051520,120736751616,58875904,1197555712,13.615,1.346,85.039,0,0,111286694,4371298
12884914176,120654876672,58884096,1197559808,12.535,2.126,85.277,0.063,0,117053360,4441554
12911026176,120628760576,58884096,1197563904,10.240,1.405,88.355,0,0,112888226,4530042
12955635712,120584146944,58884096,1197568000,13.419,1.282,85.299,0,0,115592936,4528152
13043879936,120495898624,58884096,1197572096,12.578,1.863,85.559,0,0,112240378,4444100
13087109120,120452665344,58884096,1197576192,10.364,1.005,88.631,0,0,119967658,4472946
13179568128,120360194048,58892288,1197580288,13.112,1.922,84.873,0.093,0,116611306,4659268
13229658112,120310095872,58892288,1197588480,12.196,1.061,86.744,0,0,105675208,4361034
13273079808,120266674176,58892288,1197588480,10.911,0.964,88.126,0,0,110347096,4373220
13361770496,120177979392,58892288,1197592576,13.634,1.615,84.752,0,0,119765844,4582370
13411635200,120128110592,58908672,1197580288,12.174,1.318,86.225,0.282,0,118673506,4498521
13453508608,120086208512,58916864,1197600768,10.858,0.842,88.268,0.031,0,111628612,4293843
13524336640,120015372288,58916864,1197608960,12.966,1.493,85.541,0,0,116806202,4341331
13572046848,119967657984,58916864,1197613056,13.029,1.368,85.603,0,0,114191438,4296568
13614198784,119925506048,58916864,1197613056,11.273,0.963,87.764,0,0,115387644,4553408
13710876672,119828824064,58916864,1197617152,12.800,1.806,85.394,0,0,116916206,4503818
13760036864,119779647488,58925056,1197625344,12.445,1.097,86.426,0.031,0,113742552,4505500
13803200512,119736471552,58925056,1197633536,10.713,1.339,87.948,0,0,116656482,4414974
13851820032,119687847936,58925056,1197637632,13.076,1.121,85.803,0,0,113650068,4244808
13949329408,119590334464,58925056,1197641728,12.392,1.921,85.688,0,0,108874270,4651952
13998182400,119541477376,58925056,1197645824,11.288,1.407,87.305,0,0,116898454,4494359
14045802496,119493836800,58941440,1197649920,12.574,1.214,86.026,0.187,0,111075592,4270378
14095736832,119443898368,58941440,1197654016,11.039,1.088,87.873,0,0,114520034,4387222
14171123712,119368507392,58941440,1197658112,12.849,1.567,85.584,0,0,109177378,4373872
14217752576,119321874432,58941440,1197662208,12.758,1.220,86.023,0,0,118582336,4210268
14267113472,119272509440,58941440,1197666304,10.288,1.220,88.493,0,0,106729260,4112830
14316920832,119222448128,58949632,1197912064,12.825,1.239,85.905,0.031,0,97430090,4585490
14364704768,119174897664,58949632,1197678592,9.267,1.127,89.606,0,0,83775272,3584642
14411567104,119128031232,58949632,1197682688,11.181,0.968,87.851,0,0,70441404,4003592
14437900288,119101698048,58949632,1197682688,9.119,0.529,90.352,0,0,63281216,3182402
14460686336,119078899712,58957824,1197686784,8.432,0.591,90.946,0.031,0,48008176,2694846
14459346944,119080226816,58966016,1197690880,7.596,0.406,91.966,0.031,0,37530472,3076496
14507163648,119032410112,58966016,1197690880,9.891,0.998,89.111,0,0,23805836,2799736
14506856448,119032467456,58966016,1197940736,6.842,0.156,93.002,0,0,12215742,2338606
14506680320,119032889344,58966016,1197694976,6.504,0.031,93.465,0,0,2114332,2225460
14507233280,119032328192,58974208,1197694976,6.438,0.062,93.438,0.062,0,89910,1928914
14509432832,119030116352,58982400,1197699072,6.500,0.062,93.438,0,0,67514,2236220
14511034368,119028514816,58982400,1197699072,6.523,0.125,93.352,0,0,60686,1821394
14513053696,119026495488,58982400,1197699072,6.556,0.062,93.381,0,0,97410,2472616
14514634752,119024914432,58982400,1197699072,6.412,0.063,93.525,0,0,91974,1947882
14516838400,119022460928,58982400,1197948928,6.640,0.094,93.267,0,0,91052,2114311
14520692736,119018852352,58990592,1197694976,6.588,0,93.350,0.062,0,50964,2220338
14525153280,119014383616,58990592,1197703168,6.525,0.094,93.381,0,0,43794,2022602
14529064960,119010471936,58990592,1197703168,6.583,0.062,93.354,0,0,47916,2035550
14536560640,119002730496,58990592,1197948928,6.983,0.312,92.706,0,0,41850,1246859
14539776000,118999756800,58990592,1197707264,6.704,0.094,93.202,0,0,89890,3057546
14542929920,118996594688,58998784,1197707264,6.473,0.031,93.465,0.031,0,74092,1934999
14545686528,118993592320,58998784,1197953024,6.735,0.031,93.234,0,0,118394,2104492
14546124800,118993399808,58998784,1197707264,6.646,0.031,93.323,0,0,84678,2153388
14547673088,118991851520,58998784,1197707264,6.702,0.062,93.236,0,0,83078,2042878
14550061056,118989459456,58998784,1197711360,6.731,0.062,93.207,0,0,92586,2136298
1193115648,132346396672,59006976,1197711360,0.939,0.188,98.842,0.031,0,77146,385436
1184423936,132355309568,59006976,1197490176,0.031,0.031,99.937,0,0,98308,0
1184153600,132355567616,59015168,1197490176,0,0,99.969,0.031,0,66258,0
1183985664,132355735552,59015168,1197490176,0,0,100,0,0,48442,2380
1183985664,132355735552,59015168,1197490176,0,0,100,0,0,34932,0
1183977472,132355743744,59015168,1197490176,0,0,100,0,0,5584,1508
1183940608,132355768320,59027456,1197490176,0,0,99.719,0.281,0,71940,0
1183907840,132355801088,59027456,1197490176,0,0,100,0,0,158300,0
1183633408,132356075520,59027456,1197490176,0.031,0.031,99.938,0,0,146874,0
1183420416,132356288512,59027456,1197490176,0,0,100,0,0,27422,0
1183420416,132356288512,59027456,1197490176,0,0,100,0,0,68092,0
1183338496,132356370432,59043840,1197473792,0,0,99.906,0.094,0,6060,0
1183322112,132356370432,59043840,1197490176,0,0,100,0,0,74892,0
1183322112,132356370432,59043840,1197490176,0,0,100,0,0,32390,0
1183322112,132356370432,59043840,1197490176,0,0,100,0,0,74776,0
1183322112,132356370432,59043840,1197490176,0,0,100,0,0,15120,0
1183322112,132356370432,59043840,1197490176,0,0,100,0,0,2570,0
1183313920,132356370432,59052032,1197490176,0.031,0,99.906,0.063,0,13222,0
1204834304,132334452736,59052032,1197686784,0.813,0.219,98.968,0,0,462555,22246
1211691008,132325572608,59052032,1197502464,0.532,0.625,98.843,0,0,147000,29186
