172.16.97.1  : 0.28 0.21 0.19 0.19 0.18 0.18 0.17 0.17 0.18 0.17
172.16.97.16 : 0.04 0.01 0.03 0.03 0.01 0.01 0.03 0.01 0.03 0.01
172.16.97.23 : 15.92 10.27 10.28 10.25 10.27 10.26 10.19 10.24 - -
172.16.97.24 : 12.25 10.29 10.21 10.28 10.20 10.16 10.24 10.25 10.25 10.23
172.16.97.25 : 11.63 10.28 10.26 10.25 10.29 10.28 10.24 10.21 10.25 10.21
172.16.97.26 : 11.59 10.24 10.21 10.26 - 10.25 10.28 10.19 10.21 10.20
172.16.97.27 : 23.96 4.26 4.23 4.28 4.26 4.26 4.27 4.29 4.24 4.29
172.16.97.28 : 8.69 4.28 4.24 4.24 4.26 4.26 4.27 4.25 4.28 4.28
172.16.97.3  : 8.67 4.26 4.31 4.25 4.29 4.27 4.28 4.28 4.24 4.22
172.16.97.4  : 8.52 4.26 4.25 4.21 4.25 4.26 4.30 4.18 4.18 4.27
172.16.97.5  : 8.56 4.23 4.28 4.28 4.23 4.28 4.26 4.27 4.29 4.28
172.16.97.6  : 23.65 4.27 4.26 4.29 4.26 4.27 4.27 4.26 4.28 4.30
172.16.97.7  : 19.65 4.26 4.27 4.29 4.26 4.23 4.29 4.27 4.26 4.23
172.16.97.8  : 4.22 4.22 4.26 4.22 4.29 4.29 4.29 4.23 4.29 4.24
172.16.97.9  : 11.61 4.22 4.29 4.29 4.23 4.29 4.33 4.28 4.28 4.23

      15 targets
      15 alive
       0 unreachable
       0 unknown addresses

       2 timeouts (waiting for response)
     150 ICMP Echos sent
     147 ICMP Echo Replies received
       0 other ICMP received

 0.01 ms (min round trip time)
 5.81 ms (avg round trip time)
 23.9 ms (max round trip time)
       10.068 sec (elapsed real time)

