"Dstat 0.7.3 CSV output"
"Author:","Dag Wieers <dag@wieers.com>",,,,"URL:","http://dag.wieers.com/home-made/dstat/"
"Host:","grisou-7.nancy.grid5000.fr",,,,"User:","root"
"Cmdline:","dstat -m -c -n -o dstat.csv",,,,"Date:","24 May 2020 18:19:52 CEST"
"memory usage",,,,"total cpu usage",,,,,"net/total",
"used","free","buff","cach","usr","sys","idl","wai","stl","recv","send"
1000087552,133037330432,48324608,749711360,0.768,0.224,98.880,0.128,0,0,0
1017401344,133019652096,48324608,750051328,0.687,0.406,98.907,0,0,389456,17690
1008508928,133028728832,48324608,749862912,0.625,0.312,99.063,0,0,386168,25160
999223296,133038272512,48324608,749604864,0.531,0.563,98.906,0,0,5614,15556
999182336,133038288896,48340992,749613056,0,0.031,99.219,0.750,0,1148,1324
1011814400,133025189888,48353280,750063616,0.625,0.188,99.125,0.063,0,383798,11136
999034880,133038415872,48353280,749617152,0.406,0.562,99.032,0,0,4780,15028
999010304,133038440448,48353280,749617152,0,0,100,0,0,2002,0
998494208,133038956544,48353280,749617152,0,0,100,0,0,874,0
998211584,133039239168,48353280,749617152,0,0,100,0,0,1606,0
998187008,133039239168,48377856,749617152,0,0,99.875,0.125,0,1156,2096
997928960,133039497216,48377856,749617152,0.031,0,99.969,0,0,4650,0
997404672,133040021504,48377856,749617152,0,0,100,0,0,3514,872
997396480,133040029696,48377856,749617152,0,0,100,0,0,858,0
997396480,133040029696,48377856,749617152,0,0,100,0,0,858,0
997138432,133040287744,48377856,749617152,0,0,100,0,0,3958,0
996872192,133040545792,48386048,749617152,0,0,99.969,0.031,0,1550,0
996614144,133040803840,48386048,749617152,0,0,100,0,0,1058,0
996605952,133040812032,48386048,749617152,0,0,100,0,0,1654,0
992964608,133044404224,48386048,749621248,0.969,0.657,98.374,0,0,391612,30216
992956416,133044412416,48386048,749621248,0,0,100,0,0,1038,0
994541568,133042720768,48386048,749637632,0.499,0.281,99.220,0,0,170594,12502
999559168,133037203456,48398336,750084096,1.401,0.592,97.945,0.062,0,391204,30368
998580224,133038628864,48398336,749637632,0,0,100,0,0,1596,132
1010278400,133026471936,48410624,750084096,0.532,0.156,99.218,0.094,0,383650,11632
997343232,133039820800,48410624,749637632,0.281,0.625,98.093,1.000,0,11248,15028
1006596096,133030117376,48410624,750088192,0.407,0.250,99.343,0,0,383948,11400
999911424,133037219840,48422912,749641728,0.375,0.469,99.093,0.063,0,10580,15028
999206912,133037916160,48422912,749641728,0,0,100,0,0,932,0
999198720,133037924352,48422912,749641728,0,0.031,99.969,0,0,8070,0
1000325120,133036716032,48435200,749645824,1.718,0.219,98.032,0.031,0,223348,11136
999219200,133037821952,48435200,749645824,0.062,0.031,99.625,0.281,0,9616,2652
999182336,133037846528,48447488,749645824,0,0,99.938,0.062,0,766,220
1005981696,133031047168,48447488,749645824,0.125,0.031,99.844,0,0,166630,5640
998559744,133038460928,48447488,749654016,0.344,0.031,99.625,0,0,264542,13584
1007202304,133029588992,48459776,749838336,0.312,0.062,99.563,0.062,0,244122,24132
1006678016,133030113280,48459776,749838336,0,0.031,99.969,0,0,10872,13328
1006407680,133030371328,48463872,749846528,0.031,0.031,99.469,0.469,0,11292,13328
1005879296,133030887424,48476160,749846528,0,0.031,99.906,0.063,0,11128,13328
1005871104,133030895616,48476160,749846528,0.031,0.031,99.938,0,0,11840,13832
1005088768,133031669760,48484352,749846528,0.031,0,99.937,0.031,0,15764,15680
1005088768,133031669760,48484352,749846528,0,0,100,0,0,13522,13328
1005088768,133031669760,48484352,749846528,0,0.031,99.969,0,0,12784,13328
1005088768,133031669760,48484352,749846528,0.031,0,99.875,0.094,0,14174,13328
997396480,133039505408,48492544,749662208,0,0.031,99.906,0.063,0,12342,13604
997388288,133039513600,48492544,749662208,0,0,100,0,0,2586,1512
999006208,133037854720,48492544,749662208,0.250,0.156,99.594,0,0,173900,15364
998998016,133037862912,48492544,749662208,0,0,100,0,0,1430,0
998731776,133038129152,48492544,749662208,0,0,100,0,0,1160,0
998182912,133038653440,48517120,749662208,0,0,99.594,0.406,0,1038,0
997150720,133039685632,48517120,749662208,0,0,100,0,0,6734,1288
996892672,133039943680,48517120,749662208,0,0,100,0,0,1552,0
996749312,133040082944,48517120,749666304,0,0,100,0,0,686,220
996749312,133040082944,48517120,749666304,0,0,100,0,0,1430,0
996474880,133040357376,48517120,749666304,0,0,99.875,0.125,0,1296,662
995995648,133040828416,48525312,749666304,0,0,99.969,0.031,0,1084,0
995479552,133041344512,48525312,749666304,0,0,100,0,0,12150,0
995479552,133041344512,48525312,749666304,0,0,100,0,0,5614,476
1006948352,133029421056,48525312,750112768,0.469,0.156,99.375,0,0,389408,14780
1009508352,133026861056,48525312,750112768,0.094,0.125,99.781,0,0,2338,596
996462592,133040340992,48529408,749674496,0.469,0.500,98.750,0.281,0,7976,20674
996442112,133040349184,48541696,749674496,0,0,99.969,0.031,0,6286,742
996450304,133040324608,48558080,749674496,0,0,99.562,0.438,0,2640,168
996192256,133040582656,48558080,749674496,0,0,100,0,0,1684,742
996179968,133040582656,48570368,749674496,0,0,99.969,0.031,0,858,0
996179968,133040582656,48570368,749674496,0,0,99.906,0.094,0,844,84
995663872,133041098752,48570368,749674496,0,0,100,0,0,1738,0
995147776,133041614848,48570368,749674496,0,0,100,0,0,3248,610
995139584,133041614848,48578560,749674496,0,0,99.938,0.062,0,2384,0
995139584,133041614848,48578560,749674496,0,0,100,0,0,2670,0
995131392,133041623040,48578560,749674496,0,0.031,99.969,0,0,7996,0
995131392,133041623040,48578560,749674496,0,0,100,0,0,2282,0
994873344,133041881088,48578560,749674496,0,0,100,0,0,926,1508
994615296,133042139136,48578560,749674496,0,0,100,0,0,1038,0
994349056,133042397184,48586752,749674496,0.031,0,99.937,0.031,0,3552,610
994091008,133042655232,48586752,749674496,0,0.031,99.969,0,0,1144,0
993832960,133042913280,48586752,749674496,0,0,100,0,0,1100,0
993574912,133043171328,48586752,749674496,0,0,100,0,0,678,0
993316864,133043429376,48586752,749674496,0,0,100,0,0,1582,0
993316864,133043429376,48586752,749674496,0,0,100,0,0,1984,0
993308672,133043429376,48594944,749674496,0,0,99.938,0.062,0,926,0
993308672,133043429376,48594944,749674496,0,0,100,0,0,1708,0
993308672,133043429376,48594944,749674496,0,0,100,0,0,8468,0
992534528,133044203520,48594944,749674496,0,0,100,0,0,14280,0
992010240,133044727808,48594944,749674496,0,0,100,0,0,4654,364
991494144,133045243904,48594944,749674496,0.031,0.031,99.938,0,0,7702,132
991485952,133045243904,48603136,749674496,0,0,99.938,0.062,0,4530,0
991485952,133045243904,48603136,749674496,0,0,100,0,0,2062,0
1016446976,133021192192,48611328,748695552,0.625,0.156,99.156,0.062,0,504492,23118
3517624320,130518278144,48619520,750309376,23.689,9.800,66.292,0.218,0,1650930,65802
6700191744,127334367232,48619520,751624192,34.992,13.584,51.393,0.031,0,1486326,61704
9652232192,124380520448,48619520,753238016,32.853,12.821,54.263,0.063,0,1324522,55870
12835995648,121195139072,48619520,754712576,35.652,13.256,50.967,0.125,0,1322948,56410
15774752768,118254706688,48640000,756285440,33.764,12.421,53.594,0.221,0,1324762,57186
18936549376,115091107840,48730112,757837824,38.624,12.496,47.681,1.199,0,1659078,1064765
22154346496,111872053248,48738304,758976512,40.645,13.267,45.995,0.094,0,1448592,16874308
25172758528,108851924992,48758784,760512512,41.828,13.163,44.853,0.156,0,1634110,39461642
27970301952,106052857856,48779264,761880576,41.927,14.080,43.867,0.125,0,1791198,59377757
30564827136,103457591296,48787456,762544128,38.937,11.405,49.410,0.249,0,693220,81210433
30795599872,103226720256,48799744,762621952,14.437,1.746,79.451,4.365,0,792826,101415877
30966476800,103055794176,48799744,762671104,18.190,2.340,71.076,8.393,0,999044,123481667
31154335744,102867832832,48799744,762769408,19.837,2.222,77.628,0.313,0,1158598,144387011
31368892416,102653169664,48799744,762871808,23.872,2.600,73.246,0.282,0,1293868,164345325
31542317056,102479642624,48807936,762966016,24.844,2.899,71.696,0.561,0,1478588,184123601
31728259072,102293573632,48807936,763088896,27.751,3.520,67.935,0.793,0,1656554,201081795
31819186176,102202531840,48807936,763203584,24.553,3.418,70.492,1.537,0,1631338,202010048
31884365824,102137229312,48807936,763322368,22.483,3.096,73.984,0.438,0,1611556,202136059
31996571648,102024908800,48807936,763437056,18.890,4.302,75.904,0.904,0,1623990,202000388
32067084288,101954277376,48816128,763543552,22.037,3.207,73.908,0.849,0,1612904,202317228
32066183168,101955043328,48816128,763674624,13.474,2.356,83.763,0.408,0,1522590,201793607
32076451840,101944520704,48881664,763863040,13.693,3.119,80.630,2.558,0,1539302,202166263
32104677376,101915975680,48881664,764182528,11.224,2.350,85.529,0.897,0,1529528,202148053
32104562688,101915971584,48881664,764301312,10.877,3.049,85.382,0.692,0,1566816,202297757
32108339200,101912047616,48889856,764440576,10.202,2.986,85.816,0.995,0,1500114,202065775
32109510656,101910761472,48889856,764555264,8.560,2.624,88.316,0.500,0,1358464,202072558
32099016704,101921148928,48889856,764661760,8.072,1.979,89.636,0.314,0,1490178,202251014
32098689024,101921325056,48898048,764792832,7.675,1.919,90.028,0.377,0,1477050,202118411
32115118080,101904777216,48898048,764911616,7.134,1.989,90.720,0.158,0,1484194,201941781
32149835776,101869932544,48906240,765030400,6.700,1.580,90.992,0.727,0,1464316,202166632
32162783232,101856866304,48906240,765149184,8.084,2.091,89.513,0.312,0,1469914,201974906
32174215168,101845291008,48906240,765280256,6.782,1.695,91.209,0.314,0,1511962,202224291
32196177920,101823188992,48906240,765411328,6.623,1.766,89.688,1.924,0,1479894,202249274
32215330816,101803925504,48906240,765513728,6.305,1.362,92.015,0.317,0,1436686,202002580
32240263168,101778870272,48914432,765628416,6.484,1.668,91.124,0.724,0,1292326,202052542
32247726080,101771325440,48914432,765755392,6.509,2.264,90.943,0.283,0,1475980,201933536
32266801152,101752127488,48914432,765874176,6.232,1.993,91.332,0.443,0,1479714,202092846
32274952192,101743853568,48922624,765980672,7.750,2.165,88.045,2.040,0,1448808,202003429
32293195776,101725470720,48922624,766111744,7.282,1.828,90.385,0.504,0,1479168,201803691
32303587328,101714952192,48930816,766230528,7.712,2.248,89.510,0.531,0,1401578,202400853
32324382720,101694017536,48930816,766361600,7.501,2.647,89.222,0.630,0,1490456,202113098
32339574784,101678669824,48930816,766476288,7.447,2.177,89.965,0.410,0,1475790,202204488
32349306880,101668679680,48930816,766734336,7.695,1.884,89.102,1.319,0,1491144,201867807
32388337664,101629517824,48930816,766861312,6.956,2.339,90.393,0.312,0,1366254,202362172
32417075200,101600661504,48939008,766967808,6.788,2.596,89.709,0.907,0,1505539,202128910
32441257984,101576343552,48939008,767098880,7.154,2.730,89.583,0.533,0,1489426,201881573
32444112896,101573369856,48939008,767213568,6.342,2.530,90.722,0.406,0,1490348,202175455
32448696320,101568663552,48939008,767332352,7.461,2.696,89.498,0.345,0,1473924,201839823
32449159168,101568081920,48939008,767451136,5.197,1.606,92.252,0.945,0,1477406,202410976
32450789376,101566324736,48947200,767565824,6.129,1.970,90.994,0.907,0,1446420,202050773
32461352960,101555613696,48947200,767705088,5.253,1.876,92.558,0.313,0,1452546,201808538
32478687232,101538160640,48947200,767823872,5.535,2.453,91.698,0.314,0,1488418,201921985
32494387200,101522350080,48947200,767934464,5.451,2.048,92.218,0.284,0,1482082,202103878
32495284224,101521317888,48955392,768057344,5.057,1.822,92.714,0.408,0,1487580,202043320
32504745984,101511720960,48963584,768184320,5.177,1.673,92.677,0.473,0,1424716,202337421
32509136896,101507203072,48963584,768307200,4.887,1.671,93.127,0.315,0,1471336,201856075
32509624320,101506588672,48963584,768434176,5.288,2.159,92.115,0.438,0,1466600,201984277
32509374464,101506732032,48963584,768540672,4.689,1.743,93.283,0.285,0,1455550,201975964
32509919232,101506052096,48971776,768667648,5.545,2.016,90.611,1.827,0,1471498,202172715
32511062016,101504778240,48979968,768790528,6.755,1.831,90.688,0.726,0,1475980,201818132
32514592768,101501120512,48979968,768913408,7.261,1.377,91.080,0.282,0,1537190,202276024
32528220160,101487374336,48979968,769028096,9.791,2.183,87.652,0.374,0,1523456,201953457
32542978048,101472350208,48979968,769294336,9.947,2.158,87.551,0.344,0,1531606,202199748
32541876224,101473345536,48979968,769400832,6.998,1.900,89.804,1.298,0,1507544,202139053
32550461440,101464637440,48988160,769515520,9.772,2.092,87.512,0.624,0,1524276,202059885
32552869888,101462089728,48988160,769650688,9.445,2.089,88.123,0.343,0,1538382,202188983
32564113408,101450711040,48988160,769773568,7.929,2.037,89.784,0.251,0,1493796,202087164
32573186048,101441515520,48988160,769892352,8.090,1.976,89.715,0.220,0,1496530,202045859
32574160896,101440397312,48988160,770031616,9.618,2.036,87.249,1.096,0,1502050,202135903
32582582272,101431783424,49004544,770134016,8.145,1.942,89.192,0.721,0,1476966,202112818
32593743872,101420498944,49004544,770252800,9.653,1.999,88.035,0.312,0,1501950,202292157
32609579008,101404528640,49004544,770379776,7.946,2.104,89.667,0.283,0,1453030,201916433
32631353344,101382635520,49004544,770494464,9.722,2.219,87.809,0.250,0,1450370,202271814
32647462912,101366398976,49004544,770621440,9.445,2.369,87.905,0.281,0,1443830,202203846
32681082880,101332660224,49012736,770732032,10.836,2.067,86.032,1.065,0,1458544,202104932
32723566592,101290033152,49012736,770871296,13.094,2.518,84.073,0.315,0,1426456,202217803
32735764480,101277720576,49012736,770985984,9.576,1.978,88.163,0.283,0,1272264,201961710
32759681024,101253689344,49012736,771096576,9.071,2.040,88.606,0.282,0,1431956,202270148
32762855424,101250379776,49012736,771227648,9.031,1.906,88.594,0.469,0,1482806,202184241
32808419328,101204692992,49029120,771321856,10.762,1.945,85.472,1.820,0,1465262,202109924
32834531328,101178421248,49029120,771477504,10.434,2.062,87.223,0.281,0,1515708,202216701
32877862912,101134970880,49029120,771588096,9.537,1.731,88.480,0.252,0,1526866,202209410
32949350400,101063213056,49029120,771850240,10.151,1.697,87.838,0.314,0,1504618,202203633
32993042432,101019410432,49029120,771960832,10.863,1.884,86.970,0.283,0,1473014,202005834
33028509696,100983832576,49037312,772063232,9.062,1.756,87.488,1.693,0,1476500,201957204
33097744384,100914450432,49045504,772194304,11.153,2.156,86.379,0.312,0,1485304,201815745
33151963136,100860108800,49045504,772313088,10.459,2.029,87.262,0.250,0,1482750,202286423
33217748992,100794175488,49045504,772460544,11.931,2.305,85.483,0.280,0,1493416,202046477
33267023872,100744773632,49045504,772571136,10.500,1.688,87.562,0.250,0,1434142,202214586
33310867456,100700798976,49053696,772689920,10.432,2.608,85.843,1.118,0,1429882,201942463
33311838208,100699709440,49061888,772800512,4.444,1.639,93.445,0.473,0,1389922,202077742
33308504064,100702904320,49061888,772935680,5.169,1.598,92.920,0.313,0,1399658,201999384
33311440896,100699856896,49061888,773046272,5.807,1.780,92.164,0.250,0,1442734,202092832
33312231424,100698935296,49061888,773169152,5.945,2.085,91.659,0.311,0,1417930,202089295
33312858112,100698173440,49070080,773296128,5.599,2.165,90.813,1.423,0,1387152,201938733
33313517568,100697387008,49070080,773419008,4.476,1.815,93.459,0.250,0,1428150,202370695
33316147200,100694646784,49078272,773517312,4.786,1.845,92.931,0.438,0,1450948,202085645
33318088704,100692582400,49078272,773636096,5.215,1.697,92.837,0.251,0,1416186,202024255
33319600128,100690927616,49078272,773771264,5.807,1.842,92.132,0.219,0,1428618,201913966
33320722432,100689682432,49086464,773877760,4.545,1.881,91.944,1.630,0,1436728,202166213
33322414080,100687863808,49086464,774004736,4.232,1.630,93.918,0.219,0,1431262,202180341
33319886848,100690251776,49086464,774144000,4.584,2.027,92.984,0.405,0,1419808,202233755
33319776256,100690219008,49094656,774275072,4.845,1.957,92.795,0.404,0,1417346,202031492
33319485440,100690411520,49094656,774369280,4.216,1.982,93.549,0.252,0,1449172,201809106
33319694336,100690071552,49102848,774488064,4.554,2.059,92.608,0.780,0,1392894,202534071
33319936000,100689686528,49102848,774631424,4.262,1.692,93.137,0.909,0,1410992,201944492
33321947136,100687511552,49102848,774750208,4.989,1.964,92.735,0.312,0,1445626,201965861
33323118592,100686217216,49111040,774860800,4.349,1.752,93.461,0.438,0,1427110,202423952
33323499520,100685701120,49111040,774995968,4.190,1.751,93.809,0.250,0,1253684,201979010
33322545152,100686528512,49119232,775114752,4.045,1.725,93.854,0.376,0,1387926,202089457
33321758720,100687192064,49119232,775237632,4.881,2.128,91.771,1.220,0,1440318,202409029
33323065344,100685774848,49119232,775344128,4.981,1.806,92.684,0.529,0,1388624,202115680
33324019712,100684611584,49127424,775544832,5.104,2.303,92.250,0.342,0,1400272,202007109
33324253184,100684238848,49127424,775671808,4.753,1.563,93.277,0.407,0,1414264,201968707
33324486656,100683886592,49135616,775778304,4.208,1.933,93.454,0.405,0,1411098,202105315
33324118016,100684111872,49135616,775921664,4.778,2.138,91.795,1.289,0,1429908,202117442
33328951296,100679143424,49135616,776052736,4.555,1.872,93.198,0.374,0,1414446,202178896
33334026240,100673933312,49143808,776175616,4.611,1.380,93.570,0.439,0,1421306,202020806
33333235712,100674482176,49143808,776417280,4.382,1.815,93.521,0.282,0,1404538,202119357
33334173696,100673429504,49152000,776519680,4.597,1.970,92.683,0.750,0,1413502,202015064
33335328768,100672126976,49152000,776663040,4.501,1.688,93.342,0.469,0,1433502,202216224
33334448128,100672868352,49152000,776802304,4.682,1.748,93.258,0.312,0,1420994,201953659
33334804480,100672364544,49152000,776937472,4.765,1.900,92.837,0.498,0,1420520,202303419
33335160832,100671893504,49160192,777043968,5.008,1.878,92.739,0.376,0,1444784,202022131
33335926784,100670988288,49168384,777170944,4.240,1.508,93.687,0.565,0,1425362,202153080
33335767040,100671021056,49168384,777293824,4.318,1.783,93.023,0.876,0,1425438,201833554
33336684544,100669988864,49168384,777408512,5.338,2.283,91.114,1.265,0,1440682,202057664
33335480320,100671053824,49168384,777539584,4.444,1.847,93.114,0.595,0,1413126,202283664
33336442880,100669890560,49176576,777732096,4.412,1.940,93.179,0.469,0,1403020,202163906
33337749504,100668440576,49184768,777867264,4.618,2.122,92.356,0.905,0,1394032,202239010
33336844288,100669214720,49184768,777994240,4.216,1.353,94.053,0.378,0,1374758,201983086
33337769984,100668166144,49184768,778108928,4.610,1.662,92.631,1.098,0,1423496,201897698
33339760640,100666036224,49184768,778240000,5.288,1.877,92.584,0.250,0,1397016,202254828
33340112896,100665520128,49192960,778354688,4.889,1.713,93.086,0.311,0,1403298,202175541
33340399616,100664971264,49201152,778608640,4.403,1.843,93.067,0.687,0,1397272,201980466
33340485632,100664745984,49201152,778743808,4.139,1.725,93.885,0.251,0,1443272,202169642
33340940288,100664164352,49201152,778862592,4.854,1.660,92.421,1.065,0,1345294,201862155
33340297216,100664664064,49201152,778997760,4.348,1.720,93.650,0.282,0,1386530,202016156
33340649472,100664180736,49201152,779124736,4.531,2.017,93.141,0.310,0,1415772,202351463
33340981248,100663697408,49217536,779255808,4.658,1.969,92.873,0.500,0,1401722,202162747
33340870656,100663558144,49217536,779501568,3.969,1.669,94.047,0.315,0,1397268,201984534
33341517824,100662759424,49229824,779636736,4.262,1.630,92.291,1.818,0,1369520,202188334
33342795776,100661374976,49229824,779743232,4.190,1.720,93.809,0.281,0,1450460,202053237
33342472192,100661567488,49229824,779874304,4.889,1.931,92.744,0.436,0,1463762,201983357
33342562304,100661342208,49238016,779997184,4.281,1.719,93.281,0.719,0,1453524,202413874
33343057920,100660695040,49238016,780144640,4.921,1.869,92.899,0.311,0,1460748,201953657
33343107072,100660535296,49238016,780251136,4.374,1.718,93.596,0.312,0,1450778,202246300
33342947328,100660568064,49246208,780365824,4.567,1.783,91.992,1.658,0,1392484,201906865
33342001152,100661374976,49246208,780505088,4.161,1.752,93.836,0.250,0,1410190,202263301
33341980672,100661276672,49254400,780611584,3.528,1.669,94.457,0.346,0,1446094,202209077
33342341120,100660760576,49254400,780759040,4.473,1.564,93.619,0.344,0,1440104,202081591
33342955520,100660019200,49254400,780881920,4.842,2.031,92.690,0.437,0,1426428,202024931
33342963712,100659888128,49262592,780996608,4.147,1.809,93.389,0.655,0,1427660,202473744
33343770624,100658954240,49270784,781111296,4.554,1.996,93.138,0.312,0,1429338,202134854
33344032768,100658561024,49278976,781234176,4.206,1.569,93.691,0.534,0,1386438,201926438
33343909888,100658532352,49278976,781373440,4.216,2.329,93.046,0.409,0,1424604,202055632
33344069632,100658253824,49278976,781492224,3.875,2.062,93.719,0.344,0,1443820,202357638
33344368640,100657823744,49278976,781623296,4.720,1.751,92.341,1.188,0,1416210,201657790
33345298432,100656758784,49287168,781750272,4.399,1.778,93.417,0.406,0,1460734,202693780
33345241088,100656693248,49295360,781860864,4.254,1.939,93.338,0.469,0,1432000,201854685
33345835008,100655951872,49295360,782004224,4.336,1.871,93.481,0.312,0,1447332,202385509
33345490944,100656017408,49295360,782274560,4.405,1.749,93.440,0.406,0,1467142,201891234
33344946176,100656373760,49295360,782389248,4.319,1.565,93.803,0.313,0,1482600,202286258
33346793472,100654395392,49299456,782508032,4.880,1.927,91.980,1.212,0,1490438,202212436
33346764800,100654276608,49315840,782635008,4.658,2.063,92.591,0.688,0,1475722,201986127
33346056192,100654862336,49315840,782757888,4.227,1.691,93.801,0.282,0,1472260,201929419
33347084288,100653699072,49315840,782893056,4.842,1.718,93.065,0.375,0,1414920,202094024
33346846720,100653809664,49315840,783011840,4.496,1.686,93.537,0.281,0,1427578,202297784
33346375680,100654149632,49315840,783138816,4.283,1.813,93.529,0.375,0,1453966,202065889
33343868928,100656504832,49332224,783265792,4.245,1.810,93.227,0.718,0,1451430,201854901
33345490944,100654751744,49332224,783392768,4.428,1.933,93.296,0.343,0,1562856,202179346
33346842624,100653297664,49332224,783491072,4.378,1.876,93.371,0.375,0,1478516,201821984
33346490368,100653490176,49332224,783646720,4.670,2.117,92.902,0.311,0,1473558,202364307
33346691072,100653166592,49332224,783769600,3.918,1.630,93.699,0.752,0,1453334,202261050
33346293760,100653428736,49340416,783892480,4.526,1.717,93.352,0.406,0,1463598,202108329
33347321856,100652265472,49348608,784015360,3.977,1.816,93.893,0.313,0,1461568,202158838
33346654208,100652814336,49348608,784134144,4.446,1.628,93.644,0.282,0,1464912,202026763
33345384448,100653940736,49348608,784273408,4.069,1.878,93.803,0.250,0,1445218,202216208
33345597440,100653617152,49348608,784384000,4.277,1.780,92.288,1.655,0,1492758,202299847
33345626112,100653457408,49356800,784502784,4.077,1.568,93.917,0.439,0,1424920,202062849
33347039232,100651909120,49356800,784633856,4.280,1.781,93.627,0.312,0,1457052,202103189
33346981888,100651683840,49364992,784908288,4.060,1.905,93.754,0.281,0,1423176,202221850
33346637824,100651909120,49364992,785027072,4.814,2.081,92.826,0.280,0,1433836,202018837
33347153920,100651278336,49364992,785137664,4.220,1.719,93.811,0.250,0,1471594,201892054
33347555328,100650749952,49373184,785256448,4.075,1.693,92.476,1.755,0,1460342,202142465
33346744320,100651425792,49373184,785387520,4.091,1.811,93.691,0.406,0,1434756,202037735
33346338816,100651683840,49373184,785530880,4.517,1.869,93.053,0.561,0,1477060,202048623
33346478080,100651425792,49381376,785633280,4.126,1.751,93.717,0.406,0,1452540,202096564
33346371584,100651393024,49381376,785768448,4.077,1.631,94.073,0.220,0,1447574,201822719
33346756608,100650876928,49389568,785891328,3.874,1.906,92.784,1.437,0,1471670,202478850
33346592768,100650909696,49389568,786018304,4.368,1.872,93.510,0.250,0,1425400,202040234
33342951424,100654424064,49389568,786137088,4.019,1.664,94.097,0.220,0,1464686,202094642
33343823872,100653416448,49389568,786264064,4.220,1.719,93.842,0.219,0,1435634,202065415
33343418368,100653674496,49397760,786395136,4.089,1.841,93.758,0.312,0,1459502,202133833
33343016960,100653965312,49405952,786497536,3.949,1.724,93.074,1.254,0,1452884,202128162
33343311872,100653543424,49405952,786624512,4.689,2.050,92.919,0.342,0,1438144,202160802
33342836736,100653867008,49405952,786771968,4.626,2.049,93.077,0.248,0,1435536,202084497
33343700992,100652867584,49405952,786898944,4.551,2.026,93.049,0.374,0,1442216,202211665
33344446464,100651868160,49405952,787144704,4.402,1.686,93.506,0.406,0,1407572,202113647
33345597440,100650577920,49422336,787267584,4.338,1.841,92.228,1.592,0,1406958,202103900
33346576384,100649480192,49422336,787386368,4.133,1.597,93.957,0.313,0,1406212,202249621
33345798144,100650127360,49422336,787517440,4.115,1.964,93.641,0.281,0,1485284,201933938
33345224704,100650479616,49422336,787660800,4.633,1.648,93.408,0.311,0,1458956,202248464
33344073728,100651511808,49422336,787775488,3.883,1.723,94.143,0.251,0,1460947,202088950
33343553536,100651900928,49438720,787890176,4.577,1.775,93.120,0.529,0,1449290,202278525
33344831488,100650479616,49438720,788025344,4.561,1.687,93.471,0.281,0,1438946,202125584
33345482752,100649705472,49438720,788148224,3.644,1.885,94.188,0.283,0,1461242,202263136
33346637824,100648415232,49438720,788279296,4.449,1.960,93.342,0.249,0,1489560,201929942
33347260416,100647673856,49438720,788393984,3.879,1.877,93.963,0.282,0,1472164,202192662
33347158016,100647641088,49442816,788520960,4.337,1.997,91.482,2.184,0,1469610,202057155
33347883008,100646768640,49455104,788652032,4.551,1.746,92.830,0.873,0,1425686,202052839
33347772416,100646748160,49455104,788774912,4.406,1.656,93.719,0.219,0,1398844,201755534
33347276800,100647124992,49455104,788893696,4.353,1.866,93.532,0.249,0,1478620,202256882
33347215360,100647059456,49455104,789020672,3.708,1.571,94.406,0.314,0,1483162,202263187
33346220032,100647931904,49463296,789135360,3.589,1.700,94.238,0.472,0,1399846,202288067
33347174400,100646838272,49463296,789270528,4.344,1.656,92.688,1.312,0,1401200,201968706
33347264512,100646612992,49463296,789401600,4.496,2.140,93.085,0.279,0,1406306,202210766
33345810432,100647936000,49463296,789532672,4.741,1.560,93.419,0.281,0,1446258,202059433
33345581056,100648034304,49463296,789663744,4.480,2.054,93.093,0.373,0,1454994,202137323
33345916928,100647591936,49471488,789757952,4.628,1.751,93.089,0.532,0,1453024,201996157
33347633152,100645425152,49479680,790020096,4.129,1.783,92.962,1.126,0,1486041,202031278
33347104768,100645814272,49479680,790159360,3.888,1.662,94.199,0.251,0,1465346,202093301
33346224128,100646567936,49479680,790286336,3.976,1.816,93.926,0.282,0,1494962,202336858
33350660096,100642004992,49479680,790409216,4.528,1.874,93.192,0.406,0,1470626,201938799
33351364608,100641165312,49487872,790532096,4.131,1.659,93.365,0.845,0,1448570,202260460
29346729984,104645672960,49496064,790650880,3.863,2.025,85.639,8.474,0,1279582,179319427
26109300736,107884097536,49496064,789647360,4.055,1.622,94.074,0.250,0,1188404,165367752
22023106560,111971086336,49496064,788848640,3.626,1.375,94.811,0.188,0,1048794,144425877
18702467072,115292532736,49496064,788041728,3.224,1.189,95.368,0.219,0,932588,123105759
15519051776,118476754944,49508352,787218432,2.387,0.974,96.263,0.377,0,761408,101833374
12308828160,121688035328,49508352,786161664,2.096,1.032,96.309,0.563,0,590030,80267682
8985219072,125012480000,49516544,785309696,1.507,0.565,97.802,0.126,0,408900,58666231
5928431616,128070123520,49516544,784453632,1.097,0.501,98.245,0.157,0,238026,37875460
2646319104,131353112576,49516544,783577088,0.938,0.500,98.281,0.281,0,103504,18204072
1049927680,132950388736,49516544,782692352,0.188,0.125,99.624,0.063,0,11334,1937984
1032605696,132968140800,49528832,782249984,0.031,0.031,99.812,0.125,0,346,0
1032597504,132968148992,49528832,782249984,0,0.031,99.500,0.469,0,346,0
1032073216,132968673280,49528832,782249984,0,0,100,0,0,752,0
1032065024,132968673280,49537024,782249984,0,0,99.875,0.125,0,346,0
1031806976,132968931328,49537024,782249984,0,0,100,0,0,1280,0
1031536640,132969189376,49549312,782249984,0,0,99.906,0.094,0,346,148
1031536640,132969189376,49549312,782249984,0,0,100,0,0,346,1948
1031278592,132969447424,49549312,782249984,0,0,100,0,0,926,0
1031020544,132969705472,49549312,782249984,0,0,100,0,0,528,1508
1030762496,132969963520,49549312,782249984,0,0,100,0,0,8146,546
1030504448,132970221568,49549312,782249984,0,0,100,0,0,3014,546
1030238208,132970479616,49557504,782249984,0,0,99.875,0.125,0,412,0
1029722112,132970995712,49557504,782249984,0,0,100,0,0,512,0
1029464064,132971253760,49557504,782249984,0,0,100,0,0,460,0
1028947968,132971769856,49557504,782249984,0,0,100,0,0,588,0
1028947968,132971769856,49557504,782249984,0,0,100,0,0,466,0
1029033984,132969095168,49557504,782704640,1.375,0.688,97.937,0,0,404136,47148
1028784128,132969779200,49569792,782258176,0,0,99.875,0.125,0,528,0
