172.16.72.14 : 10.25 10.26 10.28 10.28 10.27 10.26 10.28 10.30 10.32 10.31
172.16.72.23 : 10.23 10.22 10.27 10.28 10.27 10.30 10.23 10.25 10.25 10.26
172.16.72.25 : 0.20 0.19 0.15 0.19 0.19 0.19 0.15 0.20 0.18 0.19
172.16.72.26 : 0.17 0.17 0.15 0.18 0.17 0.14 0.15 0.16 0.15 0.21
172.16.72.27 : 0.18 0.19 0.16 0.18 0.20 0.19 0.14 0.17 0.17 0.16
172.16.72.28 : 0.17 0.16 0.15 0.16 0.11 0.13 0.12 0.13 0.17 0.19
172.16.72.29 : 0.15 0.18 0.17 0.19 0.21 0.21 0.15 0.20 0.18 0.17
172.16.72.3  : 0.16 0.18 0.17 0.23 0.18 0.18 0.09 0.18 0.17 0.19
172.16.72.30 : 0.20 0.18 0.17 0.22 0.19 0.20 0.20 0.18 0.19 0.17
172.16.72.31 : 0.19 0.20 0.22 0.17 0.20 0.17 0.17 0.20 0.17 0.20
172.16.72.32 : 0.04 0.03 0.03 0.03 0.01 0.03 0.02 0.03 0.03 0.03
172.16.72.33 : 0.19 0.17 0.17 0.19 0.17 0.19 0.18 0.16 0.20 0.20
172.16.72.34 : 0.15 0.18 0.21 0.19 0.20 0.20 0.16 0.15 0.17 0.17
172.16.72.35 : 0.19 0.17 0.19 0.19 0.20 0.18 0.21 0.20 0.18 0.21
172.16.72.36 : 0.18 0.15 0.18 0.18 0.16 0.19 0.16 0.18 0.15 0.14
172.16.72.37 : 0.17 0.17 0.20 0.16 0.16 0.19 0.16 0.18 0.19 0.20
172.16.72.38 : 0.15 0.16 0.21 0.14 0.19 0.17 0.16 0.20 0.20 0.20
172.16.72.39 : 0.19 0.19 0.18 0.21 0.19 0.18 0.18 0.19 0.16 0.14
172.16.72.4  : 10.30 10.22 10.25 10.27 10.26 10.28 10.25 10.23 10.29 10.35
172.16.72.40 : 10.22 10.23 10.24 10.26 10.24 10.23 10.19 10.27 10.26 10.27
172.16.72.41 : 10.24 10.20 10.20 10.29 10.24 10.24 10.22 10.25 10.24 10.22
172.16.72.42 : - 10.25 10.25 10.24 10.20 - 10.22 10.25 10.23 10.24
172.16.72.43 : 10.19 10.29 10.23 10.23 10.25 10.23 10.31 10.27 10.30 10.25
172.16.72.44 : 10.17 10.26 10.22 10.23 10.25 10.24 10.24 10.28 10.25 10.25
172.16.72.46 : - 10.26 10.25 - 10.29 - 10.28 10.27 10.25 10.29
172.16.72.47 : 10.22 10.25 10.27 10.22 10.26 - 10.22 10.16 10.24 10.21
172.16.72.48 : 10.17 10.30 10.22 10.25 10.26 10.27 10.26 10.26 10.27 10.31
172.16.72.49 : 10.25 10.26 10.26 10.26 10.26 10.26 10.26 10.23 10.21 10.24
172.16.72.5  : 10.22 10.26 10.26 10.29 10.27 10.28 10.24 10.29 10.28 10.27
172.16.72.50 : 10.22 10.27 10.26 10.31 10.28 10.27 10.25 10.24 10.22 10.26
172.16.72.51 : 10.14 10.22 10.24 10.21 10.22 10.24 10.20 10.22 10.28 10.31
172.16.72.6  : 10.18 10.27 10.28 10.28 10.26 10.21 10.20 10.27 10.26 10.25
172.16.72.7  : 10.27 10.29 10.29 10.26 10.26 10.28 10.27 10.23 10.28 10.28
172.16.72.8  : 10.20 10.26 10.27 10.24 10.24 10.25 10.26 10.26 10.28 10.28
172.16.72.9  : 4.28 4.30 4.32 4.32 4.29 4.24 4.28 4.29 4.30 4.26

      35 targets
      35 alive
       0 unreachable
       0 unknown addresses

       3 timeouts (waiting for response)
     350 ICMP Echos sent
     344 ICMP Echo Replies received
       0 other ICMP received

 0.01 ms (min round trip time)
 5.38 ms (avg round trip time)
 10.3 ms (max round trip time)
       10.264 sec (elapsed real time)

