"Dstat 0.7.3 CSV output"
"Author:","Dag Wieers <dag@wieers.com>",,,,"URL:","http://dag.wieers.com/home-made/dstat/"
"Host:","grisou-26.nancy.grid5000.fr",,,,"User:","root"
"Cmdline:","dstat -m -c -n -o dstat.csv",,,,"Date:","27 May 2020 10:35:03 CEST"
"memory usage",,,,"total cpu usage",,,,,"net/total",
"used","free","buff","cach","usr","sys","idl","wai","stl","recv","send"
1200099328,132358127616,55357440,1194561536,0.944,0.084,98.912,0.059,0,0,0
1212502016,132345417728,55357440,1194901504,0.655,0.187,99.158,0,0,426232,14986
1210183680,132348182528,55357440,1194455040,0.781,0.531,98.688,0,0,398090,26392
1201979392,132356386816,55357440,1194455040,1.030,0.593,98.378,0,0,86656,16378
1201381376,132356972544,55369728,1194455040,0,0,99.687,0.313,0,25986,180
1200558080,132357779456,55382016,1194459136,0.876,0.689,96.557,1.878,0,439598,26538
1199865856,132358471680,55382016,1194459136,0,0.031,99.969,0,0,8166,1408
1199607808,132358729728,55382016,1194459136,0.062,0.031,99.906,0,0,34476,0
1199345664,132358991872,55382016,1194459136,0,0,100,0,0,18954,0
1199312896,132359024640,55382016,1194459136,0.031,0,99.969,0,0,56210,2380
1198956544,132359356416,55406592,1194459136,0,0.063,98.374,1.563,0,23458,304
1198698496,132359614464,55406592,1194459136,0,0.031,99.813,0.156,0,23096,0
1198612480,132359700480,55406592,1194459136,0.031,0,99.969,0,0,15042,0
1198612480,132359700480,55406592,1194459136,0,0,100,0,0,40308,0
1198444544,132359868416,55406592,1194459136,0,0.031,99.969,0,0,12634,696
1198444544,132359868416,55414784,1194450944,0,0,99.969,0.031,0,27192,0
1198436352,132359868416,55418880,1194455040,0,0,99.969,0.031,0,22618,0
1198170112,132360130560,55418880,1194459136,0,0,100,0,0,19584,0
1200058368,132358242304,55418880,1194459136,0.125,0.031,99.844,0,0,13262,6520
1200193536,132357959680,55418880,1194590208,1.000,0.687,98.313,0,0,388584,24070
1202991104,132355158016,55422976,1194590208,0.094,0.094,99.812,0,0,535170,8416
1202499584,132355608576,55435264,1194618880,0.281,0.281,99.375,0.063,0,225022,3652
1201098752,132356816896,55435264,1194807296,1.125,0.719,98.156,0,0,571000,30714
1199099904,132359004160,55435264,1194618880,0.063,0,99.937,0,0,138358,612
1203433472,132354342912,55447552,1194930176,1.126,0.625,98.186,0.063,0,452202,26042
1202163712,132355801088,55447552,1194741760,0.031,0.031,99.938,0,0,116018,0
1201971200,132355530752,55459840,1195188224,1.188,0.594,98.188,0.031,0,470716,26522
1200467968,132357345280,55459840,1194876928,0,0.031,99.969,0,0,165436,0
1199943680,132357869568,55459840,1194876928,0.031,0.031,99.938,0,0,100498,0
1200525312,132357275648,55472128,1194876928,1.906,0.219,97.813,0.062,0,364576,11136
1200312320,132357488640,55472128,1194876928,0.031,0.031,99.937,0,0,99808,2888
1199304704,132358496256,55484416,1194864640,0.031,0.062,99.875,0.031,0,65986,0
1198567424,132359221248,55484416,1194876928,0.031,0,99.969,0,0,90098,1428
1199349760,132358434816,55484416,1194876928,0.438,0.156,99.406,0,0,452274,13592
1203843072,132353740800,55496704,1195065344,0.250,0.094,99.625,0.031,0,269632,21504
1204092928,132353490944,55496704,1195065344,0.094,0.031,99.875,0,0,97164,13328
1203834880,132353748992,55500800,1195061248,0.031,0.031,99.188,0.750,0,45696,12936
1203470336,132354088960,55513088,1195073536,0,0,99.937,0.063,0,29764,13406
1203077120,132354482176,55513088,1195073536,0,0.031,99.969,0,0,30742,13620
1202790400,132354760704,55521280,1195073536,0,0.031,99.937,0.031,0,87276,19916
1202532352,132355018752,55521280,1195073536,0.031,0,99.969,0,0,49742,13756
1202532352,132355018752,55521280,1195073536,0,0.062,99.938,0,0,161206,13600
1202421760,132355129344,55521280,1195073536,0,0,99.875,0.125,0,99120,13796
1202413568,132355129344,55529472,1195073536,0,0.031,99.906,0.063,0,119290,14116
1194954752,132362776576,55529472,1194885120,0.031,0.031,99.937,0,0,76276,3366
1194704896,132363022336,55529472,1194889216,0.250,0.094,99.656,0,0,348886,14744
1194143744,132363583488,55529472,1194889216,0,0.031,99.969,0,0,90244,936
1194143744,132363583488,55549952,1194868736,0,0,99.531,0.469,0,152512,0
1194123264,132363583488,55549952,1194889216,0,0.031,99.875,0.094,0,101602,0
1194119168,132363583488,55562240,1194881024,0,0,100,0,0,199476,1948
1194106880,132363583488,55562240,1194893312,0,0,99.969,0.031,0,111352,0
1193709568,132363980800,55562240,1194893312,0.031,0.031,99.938,0,0,89022,2536
1195491328,132361936896,55570432,1195147264,1.125,0.656,98.156,0.062,0,472680,29780
1194553344,132363124736,55570432,1194897408,0,0.031,99.969,0,0,119294,546
1194553344,132363124736,55570432,1194897408,0,0,99.687,0.313,0,89612,156
1254248448,132303282176,55570432,1195044864,2.466,0.343,97.190,0,0,424918,17814
1348063232,132209471488,55570432,1195073536,0.967,0.156,98.877,0,0,144132,852
1347776512,132209733632,55595008,1195073536,0.031,0,99.844,0.125,0,129714,396
1346994176,132210515968,55595008,1195073536,0,0,100,0,0,158196,1276
1346981888,132210528256,55595008,1195073536,0,0.031,99.969,0,0,115056,0
1346711552,132210786304,55599104,1195081728,0,0.031,99.718,0.250,0,177286,504
1346174976,132211322880,55599104,1195081728,2.904,0.031,97.064,0,0,119492,1260
1346174976,132211322880,55599104,1195081728,3.156,0,96.844,0,0,206674,2034
1345724416,132211761152,55607296,1195085824,3.155,0.031,96.782,0.031,0,75222,1756
1345552384,132211933184,55607296,1195085824,3.127,0,96.873,0,0,158134,2100
1347682304,132209803264,55615488,1195077632,3.344,0.031,96.438,0.188,0,539944,7518
1386725376,132170616832,55615488,1195094016,5.748,0.312,93.939,0,0,7251512,121802
1473327104,132083933184,55615488,1195094016,10.765,0.498,88.737,0,0,20987816,534316
1570553856,131986698240,55623680,1195094016,6.404,0.344,93.190,0.062,0,29145370,684328
1662275584,131894972416,55623680,1195098112,3.816,0.313,95.871,0,0,41583784,960058
1681952768,131875160064,55631872,1195102208,3.442,0.407,96.026,0.125,0,54484132,1270268
1714737152,131842375680,55631872,1195102208,3.565,0.375,96.060,0,0,64038804,1479348
1758396416,131798716416,55631872,1195102208,3.781,0.406,95.812,0,0,76435154,1755008
1809735680,131747377152,55640064,1195094016,3.988,0.623,95.265,0.125,0,88970622,1983944
1863311360,131693793280,55640064,1195102208,4.299,0.530,95.171,0,0,100998236,2275030
1925529600,131631566848,55648256,1195102208,4.300,0.717,94.671,0.312,0,114590114,2482724
1988603904,131568492544,55648256,1195102208,4.306,0.562,95.133,0,0,116022320,2506070
2051817472,131505278976,55648256,1195102208,4.364,0.561,95.075,0,0,109845676,2452708
2110988288,131446099968,55656448,1195102208,4.146,0.717,95.075,0.062,0,107827048,2410310
2171473920,131385614336,55656448,1195102208,4.124,0.562,95.314,0,0,110509706,2406260
2231554048,131325521920,55664640,1195106304,4.356,0.716,94.400,0.529,0,110904574,2449784
2300112896,131256963072,55664640,1195106304,4.087,0.811,95.101,0,0,119578278,2506308
2367705088,131189370880,55664640,1195106304,4.004,0.626,95.371,0,0,121434322,2583824
2429472768,131127595008,55672832,1195106304,3.817,0.751,95.369,0.063,0,115792450,2495504
2490900480,131066167296,55672832,1195106304,3.974,0.563,95.463,0,0,112326216,2489336
2559684608,130997374976,55681024,1195106304,3.876,0.813,94.717,0.594,0,123657484,2679026
2622062592,130934996992,55681024,1195106304,3.915,0.689,95.396,0,0,121004776,2527850
2687684608,130869374976,55681024,1195106304,4.001,0.625,95.374,0,0,121547444,2590704
2753966080,130803093504,55689216,1195098112,4,0.688,95.250,0.062,0,119794268,2630600
2817953792,130739097600,55689216,1195106304,3.879,0.719,95.402,0,0,119548654,2534788
2879225856,130677817344,55697408,1195106304,3.795,0.565,95.420,0.220,0,113486024,2441548
2940211200,130616832000,55697408,1195106304,3.754,0.782,95.402,0.063,0,113544842,2419456
3001335808,130555707392,55697408,1195106304,3.968,0.625,95.408,0,0,112559712,2413362
3062185984,130494849024,55705600,1195106304,3.880,0.594,95.432,0.094,0,111689480,2420016
3121491968,130435543040,55705600,1195106304,3.756,0.657,95.587,0,0,109008700,2378570
3181088768,130375946240,55705600,1195106304,3.944,0.501,95.556,0,0,112869272,2367238
3252363264,130304671744,55713792,1195098112,3.944,0.595,95.117,0.344,0,113904862,2335250
3467931648,130089095168,55713792,1195106304,4.853,0.908,94.239,0,0,111683988,2270900
3648000000,129909014528,55721984,1195110400,5.372,1.280,93.254,0.094,0,115922882,2476682
3705733120,129851273216,55721984,1195118592,4.977,0.595,94.429,0,0,117807364,2447156
3769925632,129787080704,55721984,1195118592,3.851,0.689,95.460,0,0,118744476,2539016
3832324096,129724674048,55730176,1195118592,3.979,0.627,95.050,0.345,0,114927168,2551238
3892785152,129664212992,55730176,1195118592,3.853,0.407,95.739,0,0,111477636,2361792
3953823744,129603166208,55738368,1195118592,3.912,0.689,95.336,0.063,0,114718888,2579724
4020203520,129536786432,55738368,1195118592,3.939,0.719,95.342,0,0,122855740,2633752
4085452800,129471537152,55738368,1195118592,3.912,0.595,95.493,0,0,119151858,2514906
4146868224,129410113536,55746560,1195118592,3.820,0.626,95.366,0.188,0,114270804,2457404
4209733632,129347248128,55746560,1195118592,3.816,0.688,95.496,0,0,113925874,2490464
4271407104,129285566464,55754752,1195118592,3.968,0.656,95.314,0.062,0,113354252,2416814
4332113920,129224859648,55754752,1195118592,3.910,0.563,95.527,0,0,111830186,2391358
4392902656,129164066816,55754752,1195122688,3.758,0.689,95.553,0,0,113388926,2482760
4450000896,129106960384,55762944,1195122688,3.852,0.626,95.208,0.313,0,110877806,2431084
4513349632,129043611648,55762944,1195122688,3.915,0.658,95.427,0,0,115584388,2522600
4575109120,128981843968,55771136,1195122688,3.974,0.532,95.432,0.063,0,113875880,2535748
4643061760,128914022400,55771136,1195114496,3.788,0.814,95.398,0,0,118509186,2622596
4704239616,128852844544,55771136,1195114496,3.942,0.563,95.494,0,0,114779540,2537260
4772941824,128784134144,55779328,1195114496,4.160,0.563,94.901,0.375,0,127193412,2779384
4835278848,128721797120,55779328,1195114496,3.757,0.689,95.554,0,0,115146170,2497718
4897714176,128659353600,55787520,1195114496,3.879,0.594,95.433,0.094,0,116667140,2362236
4957667328,128599400448,55787520,1195114496,3.696,0.689,95.615,0,0,111070056,2369444
5023805440,128533262336,55787520,1195114496,4,0.688,95.312,0,0,122925128,2605756
5087752192,128469307392,55795712,1195114496,3.791,0.721,95.175,0.313,0,115855738,2482532
5147328512,128409731072,55795712,1195114496,3.791,0.501,95.708,0,0,109675726,2406854
5212008448,128345042944,55803904,1195114496,3.820,0.720,95.366,0.094,0,116633810,2565908
5273374720,128283676672,55803904,1195114496,3.820,0.657,95.523,0,0,112756738,2467022
5332627456,128224423936,55803904,1195114496,3.816,0.626,95.558,0,0,110129950,2426662
5395927040,128161116160,55812096,1195114496,3.822,0.627,94.925,0.627,0,118731544,2544268
5457633280,128099409920,55812096,1195114496,3.694,0.720,95.585,0,0,112750046,2426856
5508530176,128048500736,55820288,1195118592,6.186,0.968,92.784,0.062,0,119207392,2543748
5559402496,127997624320,55820288,1195122688,4.536,0.688,94.776,0,0,115426424,2478336
5619523584,127937503232,55820288,1195122688,3.663,0.657,95.679,0,0,110329292,2304352
5681860608,127875158016,55828480,1195122688,3.876,0.688,95.030,0.406,0,115271962,2458502
5740507136,127816511488,55828480,1195122688,3.910,0.594,95.496,0,0,108914562,2411576
5801943040,127755067392,55836672,1195122688,3.846,0.750,95.372,0.031,0,111391824,2485214
5864583168,127692427264,55836672,1195122688,3.876,0.750,95.374,0,0,114621724,2589416
5928251392,127628759040,55836672,1195122688,3.852,0.658,95.490,0,0,119188780,2692426
5989421056,127567589376,55836672,1195122688,3.850,0.626,95.524,0,0,113627640,2555880
6048731136,127508271104,55844864,1195122688,4.066,0.532,94.964,0.438,0,109430044,2482486
6109814784,127447179264,55853056,1195122688,3.911,0.532,95.494,0.063,0,111867222,2508122
6171131904,127385862144,55853056,1195122688,3.940,0.594,95.466,0,0,112990720,2480954
6235566080,127321362432,55853056,1195188224,4.070,0.564,95.366,0,0,118151704,2591908
6297055232,127259873280,55853056,1195188224,3.877,0.750,95.372,0,0,113536908,2467684
6360186880,127196733440,55861248,1195188224,3.820,0.626,95.366,0.188,0,116593488,2379414
6426525696,127130382336,55869440,1195188224,3.845,0.719,95.374,0.063,0,120890082,2498332
6489333760,127067574272,55869440,1195188224,3.909,0.657,95.435,0,0,114605894,2420396
6552829952,127004078080,55869440,1195188224,3.911,0.626,95.463,0,0,118398166,2515366
6618669056,126938234880,55869440,1195192320,3.907,0.750,95.342,0,0,121267972,2609074
6682112000,126874783744,55877632,1195192320,3.939,0.688,95.155,0.219,0,116806974,2525980
6743941120,126812946432,55885824,1195192320,3.723,0.782,95.432,0.063,0,113034880,2479930
6805291008,126751596544,55885824,1195192320,3.910,0.594,95.496,0,0,112880178,2488902
6867189760,126689697792,55885824,1195192320,3.784,0.688,95.528,0,0,113237966,2398442
6929203200,126627684352,55885824,1195192320,3.693,0.751,95.556,0,0,112573144,2455284
6990487552,126566391808,55894016,1195192320,3.816,0.657,95.308,0.219,0,112931626,2382730
7054700544,126502170624,55902208,1195192320,3.818,0.689,95.430,0.063,0,116730486,2516646
7115526144,126441345024,55902208,1195192320,3.940,0.594,95.466,0,0,111977162,2443562
7180828672,126376042496,55902208,1195192320,3.941,0.626,95.433,0,0,118908120,2596744
7241703424,126315167744,55902208,1195192320,3.877,0.688,95.435,0,0,111981800,2456392
7303778304,126253084672,55910400,1195192320,3.968,0.687,95.064,0.281,0,113803472,2452624
7383994368,126172860416,55918592,1195192320,4.973,0.813,94.151,0.063,0,114478718,2449570
7496966144,126059880448,55918592,1195200512,6.531,1.250,92.219,0,0,115051630,2488760
7570849792,125985996800,55918592,1195200512,5.009,0.626,94.364,0,0,115259058,2512286
7620988928,125935857664,55918592,1195200512,3.885,0.564,95.551,0,0,112567460,2447728
7683428352,125873410048,55926784,1195200512,3.974,0.501,95.369,0.156,0,114636286,2395462
7746052096,125810778112,55934976,1195200512,3.852,0.564,95.521,0.063,0,115851830,2552922
7805362176,125751468032,55934976,1195200512,3.880,0.594,95.526,0,0,109193408,2454922
7869317120,125687513088,55934976,1195200512,4.186,0.594,95.220,0,0,114497080,2543010
7931846656,125624983552,55934976,1195200512,3.788,0.657,95.554,0,0,114068124,2555362
7994994688,125561835520,55943168,1195192320,3.942,0.594,95.275,0.188,0,116186512,2551952
8060084224,125496737792,55951360,1195192320,3.938,0.719,95.250,0.094,0,119940382,2585870
8123748352,125433065472,55951360,1195200512,3.907,0.719,95.374,0,0,118641188,2533312
8186503168,125370310656,55951360,1195200512,3.788,0.720,95.492,0,0,116630416,2467172
8251408384,125305405440,55951360,1195200512,3.700,0.690,95.610,0,0,120570544,2607752
8313548800,125243256832,55959552,1195200512,3.975,0.563,94.961,0.501,0,116826558,2591784
8378011648,125178785792,55967744,1195200512,3.977,0.595,95.365,0.063,0,120473826,2596360
8440176640,125116620800,55967744,1195200512,3.694,0.783,95.523,0,0,115777954,2506184
8504569856,125052227584,55967744,1195200512,3.844,0.812,95.344,0,0,118721438,2569074
8568532992,124988264448,55967744,1195200512,3.998,0.718,95.284,0,0,117742896,2545058
8632561664,124924235776,55975936,1195192320,3.969,0.688,95.312,0.031,0,117372922,2565798
8693612544,124863176704,55984128,1195192320,3.814,0.656,95.186,0.344,0,112168806,2314828
8753405952,124803375104,55984128,1195200512,3.784,0.657,95.560,0,0,110484052,2292490
8817336320,124739444736,55984128,1195200512,4.095,0.563,95.342,0,0,119440156,2586666
8883306496,124673474560,55984128,1195200512,3.942,0.657,95.401,0,0,120348756,2616012
8943964160,124612816896,55984128,1195200512,3.910,0.594,95.496,0,0,111861658,2447050
9006186496,124550578176,56000512,1195200512,3.882,0.626,95.085,0.407,0,114745244,2494236
9069957120,124486807552,56000512,1195200512,3.881,0.563,95.556,0,0,116326434,2497230
9130614784,124426149888,56000512,1195200512,3.940,0.625,95.435,0,0,114115796,2428152
9195159552,124361605120,56000512,1195200512,3.849,0.626,95.526,0,0,118767368,2438098
9254211584,124302553088,56000512,1195200512,3.966,0.593,95.440,0,0,108363180,2262854
9306882048,124249866240,56016896,1195200512,4.909,0.625,94.028,0.438,0,112791812,2382530
9369391104,124187348992,56016896,1195208704,10.454,0.782,88.764,0,0,116778002,2543834
9431453696,124125286400,56016896,1195208704,4.062,0.656,95.281,0,0,115261014,2470264
9496625152,124060114944,56016896,1195208704,3.974,0.657,95.369,0,0,119520884,2590068
9555738624,124001001472,56016896,1195208704,3.846,0.625,95.528,0,0,107760144,2346256
9620742144,123935969280,56037376,1195212800,3.820,0.751,94.865,0.564,0,120232538,2543142
9684783104,123871928320,56037376,1195212800,4.036,0.594,95.369,0,0,117557320,2530360
9747353600,123809357824,56037376,1195212800,4.004,0.532,95.464,0,0,115175862,2455020
9808760832,123747950592,56037376,1195212800,3.849,0.594,95.557,0,0,112764018,2465088
9873694720,123683016704,56037376,1195212800,4.033,0.594,95.374,0,0,118596294,2543342
9939456000,123617255424,56053760,1195196416,3.879,0.751,95.277,0.094,0,121933090,2617976
10001477632,123555217408,56053760,1195212800,3.875,0.688,95.438,0,0,114208462,2433272
10065756160,123490938880,56053760,1195212800,3.975,0.563,95.462,0,0,117862062,2491600
10129154048,123427540992,56053760,1195212800,3.945,0.470,95.585,0,0,115326214,2469524
10188697600,123367997440,56053760,1195212800,3.876,0.656,95.467,0,0,110505652,2415930
10252115968,123304570880,56061952,1195212800,3.906,0.625,95.375,0.094,0,115284940,2343906
10316070912,123240615936,56061952,1195212800,3.940,0.657,95.403,0,0,117096298,2546384
10379653120,123177033728,56061952,1195212800,3.879,0.719,95.402,0,0,116713476,2481672
10442907648,123113779200,56061952,1195212800,4.057,0.687,95.256,0,0,117758434,2480106
10505306112,123051380736,56061952,1195212800,4.030,0.625,95.345,0,0,114996686,2456438
10569822208,122986856448,56070144,1195212800,4,0.656,95.312,0.031,0,117333806,2526176
10627158016,122929520640,56070144,1195212800,3.785,0.688,95.527,0,0,107346518,2268524
10690379776,122866298880,56070144,1195212800,3.764,0.565,95.671,0,0,116708620,2505220
10752430080,122804248576,56070144,1195212800,3.944,0.595,95.462,0,0,114792850,2474102
10814885888,122741792768,56070144,1195212800,3.938,0.688,95.375,0,0,114826118,2463832
10877968384,122678702080,56078336,1195212800,4.001,0.625,95.342,0.031,0,114902202,2470958
10941034496,122615635968,56078336,1195212800,3.755,0.720,95.526,0,0,114477112,2498462
11003674624,122552995840,56078336,1195212800,3.910,0.626,95.464,0,0,115742470,2403224
11067920384,122488750080,56078336,1195212800,3.910,0.657,95.433,0,0,117707098,2572458
11129634816,122427035648,56078336,1195212800,3.879,0.688,95.433,0,0,112750364,2465560
11199254528,122357407744,56086528,1195212800,4.520,0.655,94.763,0.062,0,116390490,2531818
11267555328,122289098752,56086528,1195220992,14.963,0.966,84.071,0,0,97567696,2178806
11330551808,122226102272,56086528,1195220992,4.184,0.624,95.192,0,0,117469768,2462630
11381878784,122174775296,56086528,1195220992,4.182,0.562,95.256,0,0,113943668,2417648
11447934976,122108719104,56086528,1195220992,4.401,0.531,95.069,0,0,122324488,2585902
11511140352,122045505536,56094720,1195220992,4.121,0.656,95.161,0.062,0,115016306,2495040
11573653504,121982992384,56094720,1195220992,4.034,0.688,95.278,0,0,117272384,2593118
11637071872,121919574016,56094720,1195220992,4.122,0.593,95.284,0,0,115578252,2514608
11700711424,121855934464,56094720,1195220992,4.120,0.687,95.194,0,0,116400102,2591926
11766464512,121790181376,56094720,1195220992,4.234,0.841,94.925,0,0,120318070,2523398
11830624256,121726013440,56102912,1195220992,3.975,0.720,95.274,0.031,0,118888832,2513862
11896008704,121660620800,56111104,1195220992,4.156,0.594,95.062,0.188,0,120506574,2600094
11957293056,121599336448,56111104,1195220992,3.910,0.688,95.402,0,0,114116678,2470474
12018798592,121537826816,56111104,1195220992,4.010,0.752,95.238,0,0,113578052,2393280
12079144960,121477476352,56111104,1195225088,3.905,0.719,95.376,0,0,112333104,2334214
12142682112,121413931008,56119296,1195225088,4.304,0.593,95.041,0.062,0,116084188,2407978
12206886912,121349726208,56119296,1195225088,3.998,0.781,95.097,0.125,0,117219078,2496124
12274200576,121282412544,56119296,1195225088,4,0.750,95.250,0,0,124235972,2630458
12338356224,121218256896,56119296,1195225088,4.057,0.780,95.162,0,0,117391960,2517944
12404318208,121152294912,56119296,1195225088,4.304,0.593,95.103,0,0,120980404,2581472
12471300096,121085313024,56127488,1195216896,4.030,0.843,95.064,0.062,0,123636417,2508110
12533665792,121022939136,56135680,1195216896,3.940,0.625,94.934,0.500,0,114634660,2483722
12598792192,120957804544,56135680,1195225088,3.944,0.626,95.430,0,0,119112718,2569622
12665569280,120891023360,56135680,1195229184,3.911,0.782,95.307,0,0,122989424,2654094
12731064320,120825528320,56135680,1195229184,3.998,0.718,95.284,0,0,121235152,2606322
12792827904,120763756544,56143872,1195229184,3.755,0.688,95.494,0.063,0,112285084,2369378
12853309440,120703266816,56152064,1195229184,3.818,0.595,95.055,0.532,0,110634506,2363684
12915888128,120640688128,56152064,1195229184,3.757,0.720,95.523,0,0,115388666,2476070
12982906880,120573669376,56152064,1195229184,3.945,0.595,95.460,0,0,123625862,2699938
13046120448,120510455808,56152064,1195229184,3.911,0.594,95.494,0,0,115261994,2583888
13110546432,120446021632,56160256,1195229184,3.787,0.751,95.399,0.063,0,117968032,2550224
13152030720,120404529152,56168448,1195229184,5.453,0.533,93.983,0.031,0,116862172,2473366
13203427328,120353124352,56168448,1195237376,4.624,0.625,94.752,0,0,113961802,2520660
13264232448,120292319232,56168448,1195237376,3.790,0.595,95.615,0,0,113368316,2462004
13325074432,120231477248,56168448,1195237376,3.729,0.564,95.707,0,0,110098598,2379374
13388996608,120167546880,56176640,1195237376,3.817,0.688,95.432,0.063,0,119072966,2498284
13455695872,120100847616,56176640,1195237376,3.727,0.814,95.459,0,0,121975638,2632084
13527785472,120028504064,56197120,1195216896,4.158,0.719,95.092,0.031,0,119052532,2592024
13590601728,119965503488,56197120,1195245568,3.790,0.595,95.615,0,0,116325732,2549300
13652946944,119903158272,56197120,1195245568,3.911,0.563,95.526,0,0,112372614,2421238
13717606400,119838486528,56209408,1195245568,3.907,0.688,95.342,0.063,0,119594644,2465606
13778456576,119777636352,56209408,1195245568,4.003,0.594,95.216,0.188,0,114065334,2478988
13842030592,119714062336,56221696,1195233280,3.939,0.656,95.342,0.063,0,117516784,2561112
13907591168,119648485376,56221696,1195249664,4.155,0.687,95.158,0,0,120481836,2636406
13970198528,119585878016,56221696,1195249664,3.966,0.687,95.347,0,0,115387068,2570110
14030442496,119525625856,56229888,1195249664,3.946,0.376,95.615,0.063,0,112072286,2442362
14092607488,119463460864,56229888,1195249664,3.914,0.532,95.554,0,0,113224948,2501306
14158069760,119397998592,56229888,1195249664,3.697,0.752,95.551,0,0,120926594,2664288
14222872576,119333195776,56238080,1195241472,3.821,0.626,95.490,0.063,0,118973972,2632398
14285185024,119270875136,56238080,1195249664,3.907,0.688,95.405,0,0,116319672,2500514
14348759040,119207301120,56246272,1195241472,3.906,0.719,95.312,0.062,0,117531806,2529996
14412488704,119143563264,56246272,1195249664,3.786,0.720,95.494,0,0,117015080,2562880
14476410880,119079641088,56246272,1195249664,4.027,0.687,95.286,0,0,116207086,2575592
14535356416,119020695552,56246272,1195249664,3.904,0.718,95.378,0,0,109571214,2458582
14597980160,118958071808,56246272,1195249664,3.910,0.626,95.464,0,0,115921558,2448864
14660853760,118895190016,56254464,1195249664,3.941,0.626,95.402,0.031,0,114898358,2463044
14723506176,118832537600,56254464,1195249664,4.005,0.532,95.463,0,0,118011256,2525632
14783807488,118772236288,56254464,1195249664,3.851,0.595,95.554,0,0,111142632,2428038
14842769408,118713274368,56254464,1195249664,3.788,0.626,95.585,0,0,110085468,2425416
14904451072,118651592704,56254464,1195249664,4.003,0.563,95.435,0,0,111640330,2446166
14968852480,118587183104,56262656,1195249664,3.938,0.688,95.281,0.094,0,118741528,2616414
15021805568,118534230016,56262656,1195249664,4.631,0.594,94.775,0,0,111281420,2490020
15059615744,118496419840,56262656,1195249664,4.975,0.751,94.274,0,0,111996576,2379738
15122554880,118433472512,56262656,1195257856,3.816,0.719,95.464,0,0,114906268,2524118
15184474112,118371553280,56262656,1195257856,3.692,0.845,95.463,0,0,115942366,2502566
15244021760,118311997440,56270848,1195257856,3.911,0.626,95.432,0.031,0,110365052,2437910
15305613312,118250405888,56270848,1195257856,3.912,0.532,95.556,0,0,112954542,2483700
15367905280,118188113920,56270848,1195257856,4.030,0.656,95.314,0,0,114424208,2453338
15422062592,118133956608,56270848,1195257856,3.787,0.469,95.743,0,0,100991536,2160584
15469092864,118086926336,56270848,1195257856,3.812,0.438,95.750,0,0,83936840,1864858
15510589440,118045413376,56279040,1195261952,3.750,0.406,95.750,0.094,0,75282790,1724152
15544328192,118011674624,56279040,1195261952,3.598,0.282,96.120,0,0,63070044,1437384
15570804736,117985198080,56287232,1195253760,3.441,0.313,96.246,0,0,47981432,1002908
15591469056,117964521472,56287232,1195266048,3.406,0.250,96.344,0,0,37525868,754072
15608242176,117947748352,56287232,1195266048,3.316,0.188,96.497,0,0,29735698,589206
15616876544,117939105792,56295424,1195266048,3.283,0.094,96.560,0.063,0,16369104,339842
15620165632,117935816704,56295424,1195266048,3.188,0.063,96.749,0,0,5361794,162968
15620100096,117935882240,56295424,1195266048,3.126,0,96.686,0.188,0,10844,141260
15619768320,117936205824,56303616,1195266048,3.154,0.031,96.752,0.062,0,34960,159296
15619379200,117936594944,56303616,1195266048,3.156,0.031,96.812,0,0,47054,150212
15619047424,117936918528,56311808,1195266048,3.187,0,96.751,0.062,0,32124,98932
15618756608,117937209344,56311808,1195266048,3.187,0,96.813,0,0,33936,55886
15618433024,117937532928,56311808,1195266048,3.155,0.031,96.689,0.125,0,18518,33440
15621689344,117934276608,56311808,1195266048,3.126,0,96.874,0,0,11514,45420
15621509120,117934456832,56311808,1195266048,3.125,0.031,96.844,0,0,17260,70498
15621226496,117934731264,56320000,1195266048,3.126,0,96.812,0.063,0,13144,99264
15621419008,117934538752,56320000,1195266048,3.187,0.031,96.782,0,0,23508,110980
15621476352,117934346240,56324096,1195397120,3.125,0,96.812,0.062,0,10820,90180
15621287936,117934530560,56328192,1195397120,3.155,0.031,96.282,0.531,0,19952,117366
15621287936,117934530560,56328192,1195397120,3.156,0.031,96.812,0,0,4190,94656
15620947968,117934862336,56336384,1195397120,3.156,0,96.750,0.094,0,5010,130398
15620915200,117934895104,56336384,1195397120,3.156,0,96.844,0,0,4302,130596
15602659328,117953142784,56336384,1195405312,4.784,0.156,95.059,0,0,4086,99264
15602307072,117953486848,56344576,1195405312,3.188,0.031,96.374,0.406,0,4018,104062
15602241536,117953552384,56344576,1195405312,3.125,0,96.875,0,0,3204,124540
15602200576,117953585152,56352768,1195405312,3.155,0.031,96.782,0.031,0,2714,52792
15602135040,117953650688,56352768,1195405312,3.156,0,96.844,0,0,3214,73394
15602003968,117953781760,56352768,1195405312,3.186,0.031,96.783,0,0,3914,88468
15601831936,117953945600,56360960,1195405312,3.125,0,96.531,0.344,0,3360,112362
15601864704,117953912832,56360960,1195405312,3.155,0.031,96.813,0,0,4022,121512
15601627136,117954142208,56369152,1195405312,3.157,0,96.780,0.063,0,20334,61810
15601401856,117954367488,56369152,1195405312,3.155,0,96.845,0,0,14884,78134
14399483904,119156285440,56369152,1195405312,3.182,0.187,96.631,0,0,8866,43774
9475960832,124079800320,56377344,1195405312,0.531,0.594,98.406,0.469,0,10116,22056
9475321856,124080660480,56377344,1195184128,0,0,100,0,0,24010,15356
9475321856,124080660480,56377344,1195184128,0,0.031,99.969,0,0,12410,0
9475301376,124080668672,56389632,1195184128,0,0.031,99.906,0.062,0,4410,0
9475293184,124080676864,56389632,1195184128,0,0,100,0,0,8880,0
9475293184,124080676864,56389632,1195184128,0,0,99.875,0.125,0,1492,168
9475293184,124080676864,56389632,1195184128,0,0.031,99.969,0,0,1098,0
9479262208,124076707840,56389632,1195184128,0,0.031,99.969,0,0,2076,1108
9479262208,124076707840,56389632,1195184128,0,0,100,0,0,1564,2380
9479254016,124076707840,56397824,1195184128,0.125,0,99.844,0.031,0,13700,0
9478893568,124077068288,56397824,1195184128,0,0.031,99.969,0,0,5024,1508
9478893568,124077068288,56397824,1195184128,0.031,0.031,99.938,0,0,3148,0
9478893568,124077068288,56397824,1195184128,0,0,100,0,0,2728,0
9478635520,124077326336,56397824,1195184128,0,0.031,99.969,0,0,8990,0
9478635520,124077326336,56397824,1195184128,0,0.031,99.969,0,0,2342,0
9478627328,124077326336,56406016,1195184128,0,0,99.938,0.062,0,840,180
9478627328,124077326336,56406016,1195184128,0,0,100,0,0,1816,0
9482498048,124073455616,56406016,1195184128,0.031,0,99.969,0,0,1464,0
9501257728,124053606400,56406016,1195638784,0.688,0.250,99.062,0,0,415856,22026
9507684352,124046962688,56406016,1195192320,0.562,0.750,98.688,0,0,179116,36822
