172.16.192.20 : 39.93 4.39 4.25 4.30 4.24 4.24 4.35 4.28 4.32 4.30
172.16.192.3  : 70.72 4.37 4.30 4.35 4.33 4.32 4.41 4.32 4.34 4.35
172.16.192.4  : 200.35 200.32 200.36 200.36 200.37 200.40 200.39 200.38 200.39 200.37
172.16.192.5  : 0.03 0.03 0.03 0.03 0.03 0.03 0.03 0.03 0.03 0.03
172.16.192.9  : 4.36 4.32 4.28 4.35 4.30 4.35 4.38 4.34 4.30 4.25

       5 targets
       5 alive
       0 unreachable
       0 unknown addresses

       0 timeouts (waiting for response)
      50 ICMP Echos sent
      50 ICMP Echo Replies received
       0 other ICMP received

 0.03 ms (min round trip time)
 44.7 ms (avg round trip time)
 200 ms (max round trip time)
        9.241 sec (elapsed real time)

