172.16.72.14 : 0.19 0.15 0.14 0.18 0.14 0.17 0.14 0.12 0.15 0.19
172.16.72.23 : 0.02 0.03 0.03 0.03 0.03 0.01 0.03 0.03 0.01 0.03
172.16.72.25 : 10.36 10.27 10.28 10.28 10.30 10.25 10.18 10.24 10.17 10.22
172.16.72.26 : 10.23 10.24 10.26 10.27 10.27 10.27 10.28 10.24 10.30 10.31
172.16.72.27 : 10.35 10.32 10.29 10.27 10.29 10.24 - 10.28 10.29 10.29
172.16.72.28 : 10.20 10.19 10.19 10.19 10.21 10.27 10.22 10.23 10.19 -
172.16.72.29 : 10.29 10.31 10.31 10.30 10.25 10.24 10.24 10.29 10.30 10.30
172.16.72.3  : 10.22 10.31 10.32 10.24 10.28 10.24 10.27 10.23 10.30 10.28
172.16.72.30 : 10.24 10.31 10.31 10.22 10.25 10.27 10.28 - 10.27 10.28
172.16.72.31 : 10.29 10.30 10.26 10.28 10.29 10.28 10.30 10.29 10.30 10.28
172.16.72.32 : 10.26 10.24 - 10.22 10.24 10.22 10.19 10.20 10.24 10.24
172.16.72.33 : 10.24 10.26 10.28 10.24 10.28 10.24 10.28 10.28 10.21 10.28
172.16.72.34 : 10.34 10.27 10.24 10.28 10.24 10.29 10.28 10.29 10.28 10.27
172.16.72.35 : 10.29 - - 10.26 10.23 10.32 10.32 10.27 10.30 10.20
172.16.72.36 : 10.25 10.28 10.28 10.28 10.32 10.24 10.30 10.30 10.31 10.31
172.16.72.37 : - 10.28 10.30 10.26 10.32 10.29 10.29 10.32 10.32 10.28
172.16.72.38 : 10.29 10.29 10.30 10.31 10.26 10.28 10.29 10.28 10.30 10.27
172.16.72.39 : 10.18 10.30 10.29 10.27 10.29 10.30 10.30 10.29 10.30 10.24
172.16.72.4  : 4.33 4.28 4.29 4.26 4.30 4.29 4.31 4.32 4.29 4.31
172.16.72.40 : 4.27 4.28 4.33 4.28 4.30 4.32 4.30 4.31 4.30 4.30
172.16.72.41 : 4.26 4.31 4.28 4.28 4.31 4.29 4.30 4.32 4.32 4.29
172.16.72.42 : 4.29 4.25 4.29 4.31 4.28 4.26 4.29 4.26 4.25 4.25
172.16.72.43 : 4.37 4.30 4.30 4.25 4.29 4.31 4.31 4.31 4.33 4.28
172.16.72.44 : 4.23 4.29 4.30 4.26 4.25 4.28 4.31 4.32 4.25 4.30
172.16.72.46 : 4.28 4.28 4.28 4.26 4.29 4.23 4.30 4.30 4.32 4.31
172.16.72.47 : 4.25 4.30 4.31 4.28 4.31 4.28 4.32 4.30 4.28 4.31
172.16.72.48 : 4.30 4.31 4.32 4.30 4.30 4.29 4.27 4.29 4.29 4.25
172.16.72.49 : 4.28 4.34 4.27 4.27 4.31 4.28 4.30 4.30 4.31 4.30
172.16.72.5  : 4.26 4.32 4.32 4.27 4.30 4.30 4.29 4.30 4.30 4.32
172.16.72.50 : 4.24 4.32 4.30 4.29 4.30 4.27 4.27 4.28 4.29 4.28
172.16.72.51 : 4.37 4.31 4.31 4.29 4.32 4.31 4.28 4.27 4.27 4.30
172.16.72.6  : 4.34 4.30 4.31 4.29 4.28 4.24 4.28 4.32 4.27 4.31
172.16.72.7  : 4.24 4.32 4.32 4.32 4.30 4.25 4.33 4.28 4.26 4.26
172.16.72.8  : 4.25 4.29 4.28 4.28 4.27 4.27 4.33 4.29 4.33 4.32
172.16.72.9  : 4.35 4.30 4.29 4.25 4.22 4.22 4.26 4.25 4.33 4.30

      35 targets
      35 alive
       0 unreachable
       0 unknown addresses

       6 timeouts (waiting for response)
     350 ICMP Echos sent
     343 ICMP Echo Replies received
       0 other ICMP received

 0.01 ms (min round trip time)
 6.71 ms (avg round trip time)
 10.3 ms (max round trip time)
       10.163 sec (elapsed real time)

