"Dstat 0.7.3 CSV output"
"Author:","Dag Wieers <dag@wieers.com>",,,,"URL:","http://dag.wieers.com/home-made/dstat/"
"Host:","grisou-41.nancy.grid5000.fr",,,,"User:","root"
"Cmdline:","dstat -m -c -n -o dstat.csv",,,,"Date:","27 May 2020 10:04:35 CEST"
"memory usage",,,,"total cpu usage",,,,,"net/total",
"used","free","buff","cach","usr","sys","idl","wai","stl","recv","send"
1008025600,133066489856,50647040,706240512,0.631,0.143,99.140,0.086,0,0,0
1021153280,133052956672,50647040,706580480,0.531,0.219,99.250,0,0,391376,15382
1007112192,133067444224,50647040,706134016,0.406,0.531,99.062,0,0,384980,25602
1003806720,133070741504,50647040,706134016,0.999,0.624,98.377,0,0,6534,15702
1003245568,133071290368,50659328,706134016,0.031,0,99.937,0.031,0,8688,0
1006002176,133068500992,50675712,706142208,1.124,0.655,96.754,1.467,0,392108,26286
1005121536,133069381632,50675712,706142208,0,0,100,0,0,6632,1092
1004728320,133069774848,50675712,706142208,0.031,0,99.969,0,0,14278,0
1004204032,133070299136,50675712,706142208,0.031,0,99.969,0,0,14806,0
1003945984,133070557184,50675712,706142208,0,0.031,99.969,0,0,4372,0
1003405312,133071073280,50700288,706142208,0.031,0,99.719,0.250,0,4128,0
1002889216,133071589376,50700288,706142208,0,0.031,99.969,0,0,3854,662
1002889216,133071589376,50700288,706142208,0,0,100,0,0,2130,0
1002889216,133071589376,50700288,706142208,0.031,0,99.969,0,0,1066,0
1002631168,133071847424,50700288,706142208,0,0,100,0,0,466,0
1002446848,133072031744,50700288,706142208,0.031,0,99.969,0,0,1458,0
1002180608,133072289792,50708480,706142208,0,0.031,99.938,0.031,0,1338,220
1002180608,133072289792,50708480,706142208,0.031,0,99.969,0,0,3832,0
1016696832,133057298432,50708480,706588672,0.968,0.656,98.376,0,0,392810,18090
1002201088,133072240640,50708480,706142208,0.156,0.125,99.719,0,0,7612,13228
1005785088,133068607488,50708480,706170880,0.406,0.219,99.375,0,0,189254,11988
1018556416,133055549440,50708480,706428928,0.687,0.062,98.657,0.593,0,410290,14384
1008697344,133065654272,50720768,706170880,0.687,0.469,98.813,0.031,0,24168,16106
1017950208,133055942656,50720768,706621440,0.562,0.250,99.188,0,0,402276,11142
1006092288,133067976704,50733056,706433024,0.406,0.531,99.000,0.063,0,25544,15012
1018961920,133054910464,50733056,706621440,0.844,0.406,98.750,0,0,389330,13290
1007202304,133067116544,50733056,706174976,0.156,0.188,99.531,0.125,0,35970,13244
1007173632,133067132928,50745344,706174976,0,0,99.969,0.031,0,27696,0
1009971200,133064040448,50745344,706424832,1.657,0.219,98.124,0,0,224086,10988
1008234496,133065994240,50745344,706174976,0.062,0,99.938,0,0,4080,2800
1007648768,133066567680,50757632,706174976,0,0,99.906,0.094,0,812,0
1007390720,133066825728,50757632,706174976,0.031,0,99.593,0.375,0,812,0
1005690880,133068472320,50757632,706179072,0.500,0.125,99.376,0,0,342670,15004
1012776960,133061185536,50769920,706367488,0.219,0.094,99.625,0.062,0,179486,21308
1012502528,133061459968,50769920,706367488,0,0.031,99.969,0,0,12538,13132
1012428800,133061533696,50769920,706367488,0.031,0,99.969,0,0,12824,12936
1012428800,133061533696,50769920,706367488,0.031,0,99.969,0,0,13232,13230
1012158464,133061791744,50782208,706367488,0,0.062,99.594,0.344,0,12114,15512
1011118080,133062823936,50790400,706367488,0.031,0,99.906,0.062,0,19384,18966
1011118080,133062823936,50790400,706367488,0,0,100,0,0,12884,13132
1011118080,133062823936,50790400,706367488,0.031,0.031,99.938,0,0,12564,12838
1011109888,133062832128,50790400,706367488,0.031,0,99.969,0,0,12600,12936
1010581504,133063348224,50794496,706375680,0,0,99.937,0.063,0,12660,13132
1002766336,133071347712,50794496,706191360,0.031,0.031,99.938,0,0,1772,2236
1000480768,133073620992,50806784,706191360,0.312,0.187,99.469,0.031,0,173642,14300
999694336,133074403328,50806784,706195456,0.031,0,99.969,0,0,67102,1008
999178240,133074919424,50806784,706195456,0.031,0,99.969,0,0,5674,1008
998391808,133075693568,50819072,706195456,0,0.031,99.531,0.437,0,782,432
998133760,133075951616,50819072,706195456,0,0,100,0,0,528,0
998121472,133075951616,50831360,706195456,0,0.031,99.906,0.062,0,692,0
997863424,133076209664,50831360,706195456,0,0,100,0,0,646,0
997859328,133076209664,50831360,706199552,0,0,100,0,0,346,0
997859328,133076209664,50831360,706199552,0,0,100,0,0,918,84
997343232,133076725760,50831360,706199552,0.031,0,99.969,0,0,1038,0
997343232,133076725760,50831360,706199552,0,0,100,0,0,1192,662
996810752,133077250048,50839552,706199552,0,0.031,99.906,0.062,0,692,0
996810752,133077250048,50839552,706199552,0.031,0,99.969,0,0,346,0
1017319424,133056290816,50839552,706646016,1.154,0.499,98.129,0.218,0,390924,16522
1004748800,133069307904,50839552,706199552,0.125,0.125,99.625,0.125,0,4222,15344
1004732416,133069324288,50839552,706199552,0,0,100,0,0,2516,168
1018949632,133055070208,50839552,706236416,0.344,0.094,99.562,0,0,332022,13156
3321200640,130752196608,50851840,706805760,19.881,8.735,71.321,0.063,0,1651730,63530
6367350784,127704391680,50864128,708296704,33.146,12.648,54.174,0.031,0,1325732,55443
9410916352,124659281920,50917376,709718016,36.503,12.918,49.828,0.751,0,1488678,62284
12455313408,121613287424,50917376,711151616,34.402,13.014,52.428,0.156,0,1487526,61606
15627096064,118440034304,50917376,712581120,36.210,13.994,49.733,0.063,0,1324000,54236
18785652736,115279921152,50933760,714072064,36.275,13.897,49.671,0.156,0,1325872,87796
21712162816,112351817728,50950144,715538432,37.696,13.557,48.528,0.219,0,1337244,541535
24739954688,109322616832,50954240,716873728,41.698,14.576,43.571,0.156,0,1359488,1979047
27770449920,106290409472,50958336,718479360,42.158,13.300,44.385,0.157,0,1554256,2965627
30557483008,103502856192,50962432,718942208,35.768,11.755,52.163,0.313,0,251448,3670505
30742495232,103317786624,50970624,718991360,14.237,1.359,84.033,0.371,0,102420,4694113
30923005952,103137214464,50970624,719052800,13.182,1.465,84.762,0.592,0,123624,5534614
31073542144,102986584064,50982912,719122432,16.113,1.118,78.920,3.850,0,120932,5213644
31217786880,102842265600,50982912,719196160,17.847,1.392,80.359,0.402,0,127416,5232178
31385731072,102674227200,50982912,719282176,17.714,1.889,80.025,0.372,0,139050,5432936
31518146560,102541713408,50991104,719372288,18.750,2.290,78.187,0.774,0,246790,5662286
31625834496,102433951744,50991104,719446016,17.242,2.128,80.105,0.524,0,142340,5340128
31749210112,102310330368,50991104,719687680,17.132,2.142,79.733,0.993,0,229252,4561110
31832088576,102226993152,51113984,720019456,17.737,2.275,65.386,14.602,0,110994,4274534
31920820224,102138138624,51113984,720142336,17.148,1.875,77.843,3.135,0,227796,4199410
31895474176,102163382272,51122176,720228352,9.957,1.572,87.793,0.678,0,118588,4130842
31849848832,102208897024,51122176,720334848,8.636,1.678,89.034,0.652,0,329096,3750078
31819046912,102239600640,51122176,720433152,7.852,1.490,90.130,0.528,0,217942,3575738
31778496512,102280069120,51130368,720506880,8.116,1.368,89.801,0.715,0,123480,3560148
31759446016,102299000832,51130368,720625664,8.096,1.489,89.981,0.434,0,81880,3521422
31765196800,102293151744,51138560,720711680,5.915,1.002,92.582,0.501,0,114072,3524714
31765561344,102292680704,51138560,720814080,6.780,0.942,91.777,0.502,0,91192,3714798
31770312704,102287814656,51138560,720920576,8.162,1.059,90.374,0.405,0,115166,3570278
31771770880,102286266368,51138560,721006592,6.865,0.901,91.892,0.342,0,90642,3670722
31768023040,102289915904,51138560,721104896,5.860,1.372,91.615,1.153,0,120588,3652922
31776276480,102281576448,51146752,721178624,6.692,1.089,91.472,0.747,0,91962,3944072
31781961728,102275764224,51146752,721297408,6.627,1.151,91.786,0.436,0,91552,3794000
31787720704,102269886464,51146752,721412096,7.726,0.807,91.064,0.403,0,83814,3582052
31790469120,102267052032,51146752,721498112,5.531,0.723,93.432,0.314,0,87756,3600906
31793524736,102263885824,51146752,721604608,7.118,0.999,87.605,4.277,0,91752,3689356
31796617216,102260699136,51154944,721686528,4.517,0.941,93.726,0.816,0,93990,3840680
31797981184,102259232768,51154944,721788928,4.865,1.130,93.628,0.377,0,119522,3880304
31798673408,102258446336,51154944,721879040,8.323,1.176,90.192,0.309,0,91324,3810094
31802781696,102254088192,51154944,722124800,5.676,1.317,92.756,0.251,0,117330,3771328
31801081856,102255697920,51154944,722214912,6.293,1.246,92.181,0.280,0,89346,3513910
31805038592,102251622400,51171328,722313216,5.925,0.940,92.320,0.815,0,115014,3524166
31806337024,102250209280,51171328,722419712,4.931,0.974,93.844,0.251,0,92118,3764042
31807848448,102248620032,51171328,722497536,6.207,0.936,92.545,0.312,0,116864,3817610
31808753664,102247616512,51171328,722591744,6.467,0.781,92.502,0.250,0,91100,3878470
31813455872,102242795520,51171328,722710528,4.446,1.002,94.302,0.250,0,92352,3948396
31815737344,102240411648,51179520,722800640,5.535,0.938,90.463,3.064,0,89210,3700892
31816232960,102239797248,51179520,722915328,5.441,0.719,93.621,0.219,0,124170,3352564
31818158080,102237794304,51179520,722989056,5.185,0.900,93.636,0.279,0,89000,3662106
31826567168,102229278720,51179520,723095552,6.562,1.062,91.969,0.406,0,86528,3566128
31832588288,102223179776,51179520,723169280,4.676,0.998,93.984,0.343,0,84854,3548648
31833001984,102222622720,51187712,723296256,4.772,1.005,92.433,1.790,0,112208,3334816
31833669632,102221860864,51187712,723390464,5.543,0.965,93.211,0.280,0,83138,3338422
31834292224,102221139968,51187712,723484672,6.328,1.309,92.082,0.281,0,110456,3195552
31835766784,102219567104,51187712,723578880,5.600,0.990,93.100,0.309,0,82986,3144848
31836774400,102218469376,51187712,723668992,4.998,1.000,93.721,0.281,0,110246,3377534
31838351360,102216757248,51204096,723779584,6.654,0.968,90.753,1.624,0,87376,3683776
31839838208,102215176192,51204096,723873792,5.453,1.091,93.207,0.249,0,91558,3955086
31843639296,102211280896,51204096,723963904,6.303,1.654,91.763,0.281,0,93760,4012422
31847886848,102206840832,51204096,724086784,5.761,1.090,92.806,0.343,0,99950,4037018
31847481344,102207037440,51204096,724295680,7.389,1.428,90.872,0.310,0,103738,3954774
31849152512,102205251584,51212288,724402176,6.126,0.902,92.133,0.840,0,394038,4054122
31856078848,102198300672,51212288,724480000,8.893,1.430,87.904,1.772,0,100884,4242952
31859036160,102195204096,51212288,724611072,8.766,1.741,89.089,0.404,0,99472,4142156
31860793344,102193364992,51212288,724692992,7.891,1.149,90.649,0.311,0,99998,4105640
31861673984,102192381952,51212288,724791296,8.613,1.928,89.117,0.342,0,96482,3849060
31865536512,102188396544,51220480,724901888,6.744,1.066,91.750,0.439,0,104306,3638358
31865831424,102188011520,51228672,724979712,7.361,0.717,90.237,1.684,0,108432,3620882
31866728448,102187003904,51228672,725086208,6.912,1.090,91.719,0.280,0,108464,3664128
31867543552,102186070016,51228672,725200896,8.128,0.907,90.560,0.406,0,104508,3531044
31872188416,102181335040,51228672,725282816,6.516,1.190,91.980,0.313,0,87704,3397170
31894011904,102159400960,51236864,725385216,6.240,1.009,92.342,0.410,0,101654,3568620
31949545472,102103789568,51236864,725458944,10.282,1.270,87.922,0.526,0,100488,3631698
31992270848,102060929024,51236864,725590016,8,1.281,89.656,1.062,0,132550,3583740
32022753280,102030372864,51236864,725663744,9.099,0.994,89.627,0.280,0,96824,3636756
32058306560,101994696704,51236864,725786624,6.897,0.909,91.787,0.408,0,131250,3707698
32099356672,101953544192,51245056,725872640,9.043,1.119,89.372,0.466,0,140476,3709604
32128385024,101924421632,51245056,725966848,9.988,0.840,88.861,0.311,0,143442,3709452
32156704768,101895987200,51253248,726069248,6.950,0.629,90.629,1.792,0,97706,3654460
32207519744,101845094400,51253248,726147072,9.598,0.810,89.280,0.312,0,126834,3461114
32250142720,101802221568,51253248,726396928,7.045,0.935,91.615,0.405,0,125874,3304860
32247091200,101805142016,51277824,726491136,6.985,0.967,85.906,6.143,0,93354,3254952
32243671040,101808467968,51277824,726585344,6.082,0.780,92.857,0.281,0,77816,3367548
32239747072,101812277248,51277824,726695936,4.951,0.627,88.969,5.453,0,77658,3355624
32236322816,101815631872,51277824,726765568,5.155,0.750,93.814,0.281,0,78978,3205488
32236589056,101815246848,51277824,726884352,5.961,0.900,92.766,0.373,0,78670,3151412
32237957120,101813788672,51286016,726962176,7.192,0.806,91.507,0.496,0,78654,3328124
32233299968,101818314752,51286016,727089152,4.716,0.812,94.160,0.312,0,82328,3409146
32233185280,101818339328,51286016,727179264,5.017,0.470,94.230,0.282,0,86976,3813286
32232890368,101818531840,51294208,727269376,4.969,0.656,93.906,0.469,0,92060,3845834
32224829440,101826494464,51294208,727367680,5.634,0.782,93.271,0.313,0,109150,4167310
32225550336,101825683456,51302400,727449600,5.599,0.845,93.181,0.375,0,99412,4098606
32226168832,101824946176,51302400,727564288,5.712,0.687,93.321,0.281,0,93560,3852756
32226492416,101824520192,51302400,727662592,5.311,0.656,93.721,0.312,0,86282,3538898
32228425728,101822492672,51302400,727756800,4.024,0.880,93.996,1.100,0,93850,3396914
32228691968,101822107648,51302400,727871488,6.151,0.746,92.824,0.280,0,81082,3451650
32229613568,101821104128,51310592,727945216,5.540,0.845,93.146,0.469,0,83632,3527482
32228392960,101822205952,51310592,728059904,5.069,0.945,93.703,0.283,0,90262,3602624
32227983360,101822529536,51310592,728145920,5.632,0.809,93.248,0.311,0,88672,3609286
32228962304,101821427712,51310592,728264704,4.859,0.564,92.978,1.599,0,84532,3432304
32229818368,101820489728,51310592,728346624,4.738,0.722,94.164,0.377,0,80996,3498180
32230940672,101819265024,51318784,728432640,6.390,0.810,92.207,0.592,0,83688,3322416
32232464384,101817622528,51318784,728539136,6.486,0.717,92.454,0.343,0,81074,3322768
32232607744,101817393152,51318784,728625152,4.851,0.563,94.241,0.344,0,80798,3142146
32232005632,101817880576,51318784,728735744,5.034,0.901,93.505,0.559,0,76908,3178860
32232890368,101816877056,51326976,728846336,6.912,0.809,90.816,1.463,0,82298,3508138
32234557440,101815103488,51335168,728944640,5.288,0.692,93.610,0.409,0,80094,3522100
32235626496,101813903360,51335168,729059328,6.885,0.717,92.056,0.343,0,89610,3762406
32236744704,101812719616,51335168,729124864,2.994,0.788,95.934,0.284,0,86756,3666334
32236904448,101812428800,51335168,729255936,5.020,1.178,93.337,0.465,0,115516,3550510
32237920256,101811265536,51335168,729403392,6.900,0.999,90.571,1.530,0,82648,3351886
32238317568,101810778112,51343360,729485312,7.143,0.686,91.734,0.437,0,107028,3164364
32238313472,101810655232,51343360,729612288,4.975,0.693,93.986,0.346,0,74866,3058522
32237641728,101811232768,51343360,729698304,3.955,0.810,94.861,0.374,0,108764,3143636
32237199360,101811556352,51343360,729812992,6.340,1.016,92.275,0.369,0,78358,3277334
32238243840,101810298880,51351552,730013696,5.493,0.910,91.682,1.915,0,114358,3514000
32239239168,101809168384,51359744,730140672,7.877,1.027,90.722,0.374,0,85416,3504752
32239800320,101808504832,51359744,730238976,4.571,0.971,94.208,0.250,0,81294,3472250
32240754688,101807460352,51359744,730324992,3.844,0.812,95,0.344,0,107402,3497956
32242126848,101805944832,51359744,730464256,6.464,0.870,92.356,0.311,0,90602,3564292
32242700288,101805297664,51359744,730533888,5.805,1.155,92.665,0.375,0,87038,3773608
32244391936,101803360256,51367936,730771456,6.184,0.812,88.819,4.185,0,93042,3781654
32244760576,101802881024,51367936,730873856,5.073,0.809,93.806,0.311,0,86844,3591088
32245587968,101801955328,51367936,730972160,4.506,1.189,93.992,0.313,0,91902,3690240
32246702080,101800730624,51367936,731078656,5.805,0.843,93.040,0.312,0,104298,4010342
32246484992,101800849408,51367936,731172864,5.684,1.187,92.755,0.375,0,95214,3883756
32248025088,101799170048,51384320,731283456,5.829,0.810,91.926,1.434,0,107668,3975884
32248832000,101798264832,51384320,731381760,4.124,0.719,94.814,0.344,0,104532,3786962
32248442880,101798559744,51384320,731475968,5.860,1.216,92.581,0.343,0,91078,3856368
32249511936,101797367808,51384320,731594752,4.820,0.626,94.178,0.376,0,93826,4003184
32249937920,101796847616,51384320,731688960,5.958,1.185,92.452,0.405,0,91742,3943110
32250417152,101796265984,51392512,731779072,3.986,0.847,93.220,1.946,0,93288,3915060
32250761216,101795815424,51392512,731885568,5.152,0.785,93.622,0.440,0,91376,3880652
32252891136,101793579008,51392512,731987968,6.866,0.999,91.885,0.250,0,149326,3691424
32253394944,101792968704,51392512,732090368,4.980,0.778,93.869,0.373,0,84262,3506892
32254038016,101792219136,51392512,732196864,5.439,0.719,93.498,0.344,0,143990,3503422
32255881216,101790281728,51400704,732282880,4.229,0.940,94.173,0.658,0,84982,3467912
32258523136,101787512832,51408896,732397568,4.953,0.878,93.793,0.376,0,151528,3615368
32257470464,101788479488,51408896,732483584,6.022,0.718,92.917,0.343,0,93172,3583356
32258383872,101787443200,51408896,732606464,4.689,0.750,94.186,0.375,0,147024,3636078
32258048000,101787652096,51408896,732725248,5.557,0.838,93.263,0.342,0,90186,3638852
32259485696,101786124288,51417088,732807168,6.093,1.088,92.415,0.404,0,82104,3425338
32260485120,101785022464,51417088,732905472,6.027,1.031,91.224,1.718,0,76760,3187854
32262803456,101782478848,51417088,733130752,4.271,0.879,94.504,0.345,0,78758,3241084
32263200768,101781962752,51417088,733249536,3.921,0.753,94.981,0.345,0,92634,3423478
32262811648,101782253568,51417088,733343744,5.096,0.692,93.960,0.252,0,111994,3525964
32270499840,101774442496,51425280,733450240,6.088,1.374,92.164,0.375,0,96068,3730680
32271523840,101773312000,51429376,733552640,6.275,1.180,85.461,7.083,0,187982,3827336
32273760256,101770989568,51429376,733638656,4.554,0.873,94.292,0.281,0,376586,3537072
32273608704,101771026432,51429376,733749248,4.538,1.002,94.147,0.313,0,349606,3453366
32275021824,101769506816,51429376,733855744,4.465,0.881,94.340,0.314,0,139996,3541894
32274739200,101769699328,51437568,733933568,6.569,1.001,92.086,0.344,0,111062,3340926
32275423232,101768892416,51437568,734052352,4.890,0.627,93.166,1.317,0,80586,3218572
32275554304,101768638464,51449856,734162944,4.125,0.906,94.594,0.375,0,85278,3130698
32277876736,101766213632,51449856,734265344,4.206,0.722,94.821,0.251,0,81116,3441188
32278134784,101765832704,51449856,734380032,6.012,1.121,92.555,0.312,0,82370,3454178
32278851584,101765033984,51458048,734453760,5.045,0.689,93.795,0.470,0,93268,3777676
32280977408,101762797568,51458048,734564352,5.849,1.069,92.799,0.283,0,91560,3638810
32280735744,101762928640,51458048,734674944,3.863,0.872,94.268,0.997,0,90800,3492042
32282062848,101761507328,51458048,734769152,6.168,0.717,92.773,0.343,0,92634,3573006
32282144768,101761323008,51458048,734871552,5.378,0.777,93.503,0.342,0,161686,3628370
32283275264,101760090112,51466240,734965760,4.647,0.754,94.097,0.502,0,307940,3535254
32284459008,101758795776,51466240,735072256,5.651,0.781,93.256,0.312,0,487208,3488612
32288968704,101754159104,51474432,735178752,6.412,0.907,91.054,1.627,0,495576,3800218
32289718272,101753311232,51474432,735277056,4.111,0.872,94.830,0.187,0,424774,3749796
32289193984,101753729024,51474432,735375360,5.476,0.622,93.653,0.249,0,255926,3452604
32289759232,101752926208,51482624,735596544,4.678,0.879,93.909,0.534,0,177898,3332804
32290181120,101752377344,51482624,735723520,4.780,0.750,94.127,0.344,0,168544,3362786
32291737600,101750730752,51482624,735813632,6.562,1.099,85.181,7.159,0,111688,3664984
32292380672,101749993472,51482624,735899648,6.021,0.962,92.675,0.341,0,112590,3752740
32292048896,101750210560,51482624,736010240,6.590,1.083,91.894,0.433,0,124100,3832564
32292196352,101749989376,51490816,736075776,4.608,0.778,94.022,0.592,0,91662,3552198
32293744640,101748281344,51490816,736227328,5.642,0.966,93.080,0.312,0,129412,3647242
32295387136,101746536448,51490816,736329728,5.773,0.726,93.186,0.315,0,152326,3597126
32295591936,101746233344,51499008,736419840,4.451,0.784,94.326,0.439,0,233842,3488906
32295542784,101746171904,51499008,736522240,6.399,0.878,92.440,0.282,0,201250,3594550
32294748160,101746876416,51507200,736604160,3.416,0.721,95.456,0.407,0,279656,3570450
32295653376,101745844224,51507200,736727040,5.915,0.939,92.833,0.313,0,184660,3845358
32296431616,101744971776,51507200,736817152,4.854,0.814,93.987,0.345,0,141976,3979716
32296648704,101744656384,51507200,736911360,5.461,0.816,92.090,1.632,0,125574,4061878
32297742336,101743427584,51507200,737042432,5.724,0.751,93.244,0.282,0,125054,3970014
32298491904,101742587904,51515392,737124352,5.403,0.812,93.379,0.406,0,97138,3760562
32298967040,101742006272,51515392,737226752,4.853,0.845,94.020,0.282,0,86174,3546156
32299147264,101741715456,51515392,737333248,4.194,0.782,94.742,0.282,0,90104,3653614
32300953600,101739683840,51515392,737554432,6.727,1.054,91.104,1.116,0,87554,3483550
32302927872,101737590784,51515392,737669120,5.985,0.935,92.706,0.374,0,86286,3584162
32303792128,101736599552,51523584,737787904,4.806,0.992,93.767,0.434,0,90994,3646916
32306286592,101734010880,51523584,737878016,6.598,0.848,92.240,0.314,0,91670,3556682
32306016256,101734170624,51523584,737984512,3.276,0.718,95.757,0.250,0,97326,3617058
32303702016,101736394752,51523584,738066432,5.316,1.126,93.027,0.532,0,87084,3447652
32304295936,101735682048,51531776,738177024,4.482,0.663,93.403,1.452,0,81128,3462794
32306454528,101733425152,51539968,738267136,4.623,0.755,94.245,0.377,0,85628,3522350
32306192384,101733588992,51539968,738365440,5.312,0.969,93.469,0.250,0,87784,3716760
32305057792,101734588416,51539968,738500608,3.139,0.753,95.825,0.282,0,84722,3384068
32305582080,101733974016,51539968,738582528,5.523,0.811,93.417,0.250,0,80244,3310070
32306753536,101732683776,51539968,738701312,5.816,1.001,91.620,1.563,0,81936,3317684
32307826688,101731524608,51548160,738779136,5.512,0.747,93.273,0.467,0,84126,3492924
32311136256,101728108544,51548160,738877440,5.105,0.752,93.893,0.251,0,88606,3711328
32315277312,101723856896,51548160,738988032,6.043,1.315,92.298,0.344,0,90730,3785130
32314699776,101724336128,51548160,739078144,6.330,1.029,92.329,0.312,0,96534,4149920
32318504960,101720395776,51548160,739205120,6.082,0.749,91.454,1.716,0,93990,4001144
32318578688,101720072192,51564544,739434496,4.692,0.688,93.994,0.626,0,94976,3822552
32318726144,101719846912,51564544,739512320,4.222,0.788,94.612,0.378,0,95450,3885188
32318992384,101719457792,51564544,739635200,5.646,0.690,93.287,0.376,0,94562,3855916
32319242240,101719134208,51564544,739708928,6.750,0.875,92.125,0.250,0,100614,3796148
32318914560,101719330816,51564544,739827712,3.918,0.752,95.016,0.313,0,87632,3568522
32322666496,101715419136,51572736,739934208,5.041,0.689,89.136,5.135,0,142998,3752784
32323837952,101714018304,51572736,740016128,5.207,0.878,93.601,0.314,0,105808,3589702
32323649536,101714079744,51572736,740143104,4.951,0.658,94.171,0.219,0,119706,3822488
32325246976,101712388096,51572736,740229120,7.158,1.271,91.354,0.217,0,94332,4080942
32325750784,101711773696,51572736,740335616,4.239,0.816,94.725,0.220,0,127438,4092176
32325914624,101711482880,51589120,740438016,4.561,0.692,91.633,3.114,0,104440,3933244
32325836800,101711470592,51589120,740528128,4.844,0.938,93.906,0.312,0,120622,3801502
32327405568,101709774848,51589120,740651008,5.686,0.937,93.127,0.250,0,97732,3567734
32328204288,101708873728,51589120,740753408,6.363,1.241,92.117,0.279,0,92870,3491480
32328835072,101708156928,51589120,740839424,4.808,0.968,93.943,0.281,0,83642,3601734
32327262208,101709615104,51597312,740941824,5.033,0.781,91.810,2.376,0,88664,3562892
32328585216,101708197888,51597312,741036032,5.834,1.066,92.785,0.314,0,82756,3475590
32329601024,101707071488,51597312,741146624,4.732,1.090,93.898,0.280,0,89946,3778700
32333520896,101702504448,51597312,741244928,3.982,0.878,94.826,0.314,0,90146,3878892
32337252352,101698662400,51597312,741351424,5.817,0.866,93.038,0.278,0,92126,3809480
32336171008,101699629056,51609600,741453824,5.884,1.095,92.582,0.438,0,83472,3369072
32336408576,101699170304,51621888,741662720,4.677,0.816,93.189,1.318,0,81074,3315890
32343887872,101691568128,51621888,741785600,4.994,1.124,93.571,0.312,0,88462,3531116
32344829952,101690531840,51621888,741875712,4.732,0.783,94.108,0.376,0,83240,3337978
32345174016,101690081280,51621888,741974016,2.917,0.721,96.048,0.314,0,80538,3389038
28461486080,105573646336,51630080,742088704,6.260,0.881,92.419,0.440,0,79530,3381728
25326907392,108708814848,51630080,741498880,5.093,0.714,88.323,5.870,0,79768,3188770
22103543808,111933464576,51630080,740261888,4.599,0.870,94.313,0.218,0,68780,2753030
18991087616,115046768640,51630080,739446784,2.700,0.628,96.546,0.126,0,68688,2367558
15162314752,118876200960,51630080,738836480,2.038,0.533,97.272,0.157,0,56468,1991156
12036567040,122003038208,51642368,737775616,2.573,0.753,96.297,0.377,0,64506,1722670
8920866816,125119401984,51642368,737153024,2.662,0.282,96.712,0.345,0,34740,1168012
5762785280,128278822912,51650560,735846400,0.908,0.407,98.498,0.188,0,23042,769230
2623721472,131418791936,51650560,734982144,0.532,0.219,99.030,0.219,0,22488,437440
1052925952,132990517248,51650560,734101504,0.125,0.094,99.687,0.094,0,18370,134974
1034862592,133009031168,51650560,733659136,0.062,0.062,99.875,0,0,4280,3136
1034850304,133009031168,51662848,733659136,0,0,99.844,0.156,0,5860,0
1034559488,133009321984,51662848,733659136,0.031,0.031,99.188,0.750,0,28600,1508
1034301440,133009580032,51662848,733659136,0,0,100,0,0,812,0
1034301440,133009580032,51662848,733659136,0.031,0,99.969,0,0,2698,0
1034035200,133009846272,51662848,733659136,0,0,100,0,0,2766,0
1034035200,133009846272,51662848,733659136,0,0.031,99.969,0,0,32950,264
1032728576,133011144704,51671040,733659136,0,0,99.531,0.469,0,3316,0
1032470528,133011402752,51671040,733659136,0.031,0,99.969,0,0,31988,0
1032470528,133011402752,51671040,733659136,0,0.031,99.969,0,0,4008,0
1032470528,133011402752,51671040,733659136,0,0,100,0,0,12662,0
1032212480,133011660800,51671040,733659136,0,0.031,99.969,0,0,18674,1308
1031421952,133012434944,51683328,733663232,0,0,99.937,0.063,0,34702,1008
1031421952,133012434944,51683328,733663232,0,0,100,0,0,4386,0
1031163904,133012692992,51683328,733663232,0,0,100,0,0,2094,0
1031163904,133012692992,51683328,733663232,0.031,0,99.969,0,0,858,0
1030905856,133012951040,51683328,733663232,0,0,100,0,0,4114,168
1030647808,133013209088,51683328,733663232,0.031,0,99.969,0,0,25154,0
1030639616,133013209088,51691520,733663232,0,0,99.937,0.063,0,53868,1008
1030123520,133013725184,51691520,733663232,0.031,0.063,99.906,0,0,127574,2016
1028833280,133015015424,51691520,733663232,0.062,0.062,99.875,0,0,126706,1684
1028833280,133015015424,51691520,733663232,0.062,0.062,99.875,0,0,111556,4396
1028317184,133015531520,51691520,733663232,0.031,0,99.969,0,0,102542,3524
1028055040,133015789568,51691520,733667328,0.031,0,99.969,0,0,13492,1008
1027530752,133016305664,51699712,733667328,0,0,99.937,0.063,0,33058,1008
1027530752,133016305664,51699712,733667328,0,0,100,0,0,3924,0
1027162112,133016674304,51699712,733667328,0.031,0,99.969,0,0,3254,84
1026879488,133016956928,51699712,733667328,0,0,100,0,0,12018,0
1026879488,133016956928,51699712,733667328,0,0,100,0,0,2518,0
1026871296,133016956928,51707904,733667328,0.031,0,99.937,0.031,0,30738,0
1026871296,133016956928,51707904,733667328,0,0,100,0,0,3500,662
1026355200,133017473024,51707904,733667328,0,0,100,0,0,28972,180
1026355200,133017473024,51707904,733667328,0.031,0,99.969,0,0,3604,0
1026097152,133017731072,51707904,733667328,0,0,100,0,0,8614,0
1025581056,133018247168,51707904,733667328,0,0.031,99.969,0,0,3700,0
1025314816,133018505216,51716096,733667328,0.031,0,99.938,0.031,0,31944,0
1025314816,133018505216,51716096,733667328,0,0,100,0,0,4164,468
1025056768,133018763264,51716096,733667328,0,0,100,0,0,25048,312
1024561152,133019258880,51716096,733667328,0.031,0,99.969,0,0,4910,624
1024561152,133019258880,51716096,733667328,0,0,100,0,0,12260,390
1024561152,133019258880,51716096,733667328,0,0,100,0,0,39818,546
1024552960,133019258880,51724288,733667328,0.031,0,99.875,0.094,0,11946,984
1024294912,133019516928,51724288,733667328,0,0,100,0,0,68244,1188
1024036864,133019774976,51724288,733667328,0.031,0.031,99.656,0.281,0,11208,664
1039769600,133003055104,51724288,734121984,1.279,0.405,98.316,0,0,473493,19246
1032421376,133009702912,51724288,733675520,0.406,0.281,99.312,0,0,203757,40946
