172.16.97.1  : - 10.23 10.24 10.24 10.26 10.30 10.29 10.26 10.29 10.29
172.16.97.16 : 16.27 10.22 10.25 10.31 10.29 10.29 10.33 10.29 10.27 10.25
172.16.97.23 : 0.20 0.19 0.19 0.20 0.20 0.18 0.17 0.21 0.19 0.17
172.16.97.24 : 0.16 0.17 0.17 0.14 0.14 0.14 0.16 0.19 0.19 0.20
172.16.97.25 : 0.16 0.20 0.20 0.14 0.19 0.21 0.20 0.18 0.19 0.20
172.16.97.26 : 0.04 0.03 0.03 0.03 0.03 0.01 0.03 0.01 0.03 0.03
172.16.97.27 : 100.37 100.27 100.29 100.32 100.32 100.31 100.31 100.30 100.32 100.32
172.16.97.28 : 100.34 100.31 100.31 100.30 - 100.31 - 100.28 100.24 100.32
172.16.97.3  : 100.34 100.29 100.30 100.32 100.31 100.30 100.29 100.30 100.28 -
172.16.97.4  : 100.39 100.30 100.31 100.32 - 100.32 100.32 100.33 100.32 100.27
172.16.97.5  : 100.34 100.23 100.28 100.28 100.31 100.32 100.30 100.32 - 100.31
172.16.97.6  : 100.40 100.29 100.29 100.32 100.27 100.29 100.30 100.32 100.32 100.32
172.16.97.7  : 100.40 100.23 100.31 100.29 100.31 100.30 100.30 100.30 100.31 100.30
172.16.97.8  : 100.40 100.32 - 100.30 100.31 100.26 100.32 100.29 100.27 -
172.16.97.9  : 4.34 4.31 4.31 4.31 4.31 4.30 4.32 4.32 4.31 4.29

      15 targets
      15 alive
       0 unreachable
       0 unknown addresses

       6 timeouts (waiting for response)
     150 ICMP Echos sent
     142 ICMP Echo Replies received
       0 other ICMP received

 0.01 ms (min round trip time)
 53.3 ms (avg round trip time)
 100 ms (max round trip time)
       10.143 sec (elapsed real time)

