"Dstat 0.7.3 CSV output"
"Author:","Dag Wieers <dag@wieers.com>",,,,"URL:","http://dag.wieers.com/home-made/dstat/"
"Host:","grisou-26.nancy.grid5000.fr",,,,"User:","root"
"Cmdline:","dstat -m -c -n -o dstat.csv",,,,"Date:","27 May 2020 10:04:35 CEST"
"memory usage",,,,"total cpu usage",,,,,"net/total",
"used","free","buff","cach","usr","sys","idl","wai","stl","recv","send"
1165258752,132409921536,49876992,1192128512,0.532,0.038,99.368,0.061,0,0,0
1176121344,132398723072,49893376,1192476672,0.562,0.125,99.251,0.062,0,392866,14986
1172004864,132403286016,49893376,1192030208,0.625,0.625,98.750,0,0,389812,27068
1172992000,132402270208,49909760,1192038400,0.845,0.657,98.467,0.031,0,6384,16314
1172938752,132402298880,49934336,1192038400,0.031,0,99.437,0.532,0,7766,0
1173716992,132401520640,49934336,1192038400,0.938,0.688,98.373,0,0,392154,26538
1173352448,132401885184,49934336,1192038400,0,0,100,0,0,5850,180
1172971520,132402266112,49934336,1192038400,0,0,100,0,0,14200,84
1172176896,132403060736,49934336,1192038400,0,0.031,99.969,0,0,13468,84
1172176896,132403060736,49934336,1192038400,0,0,100,0,0,6938,0
1171898368,132403326976,49946624,1192038400,0,0,99.938,0.062,0,4594,0
1171611648,132403601408,49958912,1192038400,0,0.031,99.938,0.031,0,3770,1670
1171087360,132404125696,49958912,1192038400,0.031,0,99.969,0,0,2312,0
1171087360,132404125696,49958912,1192038400,0,0,100,0,0,1126,0
1170829312,132404383744,49958912,1192038400,0,0,100,0,0,586,0
1170829312,132404383744,49958912,1192038400,0,0,100,0,0,1158,0
1170563072,132404641792,49967104,1192038400,0,0,99.969,0.031,0,1098,84
1170124800,132405080064,49967104,1192038400,0,0,100,0,0,4822,264
1187901440,132386852864,49967104,1192488960,0.813,0.438,98.750,0,0,389472,17306
1170468864,132404727808,49967104,1192046592,0.344,0.250,99.406,0,0,7968,13644
1171505152,132403671040,49967104,1192067072,0.375,0.250,99.375,0,0,187626,11864
1176645632,132398530560,49983488,1192050688,0.156,0.125,99.688,0.031,0,406710,14384
1172402176,132402728960,49995776,1192075264,1.091,0.717,98.130,0.062,0,29378,16378
1175093248,132400001024,50008064,1192079360,1.124,0.656,98.189,0.031,0,405630,26670
1174982656,132400111616,50008064,1192079360,0,0,100,0,0,24136,0
1187962880,132386680832,50008064,1192525824,0.812,0.469,98.094,0.625,0,388970,12910
1182711808,132391931904,50008064,1192525824,0.250,0.062,99.688,0,0,14954,0
1172164608,132402814976,50020352,1192079360,0.188,0.219,99.531,0.062,0,49774,13680
1173606400,132401070080,50032640,1192316928,1.657,0.250,98.062,0.031,0,224738,11152
1173430272,132401483776,50032640,1192079360,0.031,0.031,99.938,0,0,3916,2800
1172606976,132402307072,50032640,1192079360,0.156,0,99.844,0,0,1098,0
1172606976,132402307072,50032640,1192079360,0,0,100,0,0,752,0
1172750336,132402147328,50044928,1192083456,0.468,0.187,99.282,0.062,0,342798,15036
1180184576,132394524672,50044928,1192271872,0.156,0.063,99.781,0,0,179598,20704
1179914240,132394782720,50057216,1192271872,0,0,99.969,0.031,0,12174,12740
1179914240,132394782720,50057216,1192271872,0,0.031,99.969,0,0,12460,12936
1179656192,132395040768,50057216,1192271872,0,0.031,99.969,0,0,13068,13034
1179648000,132395048960,50057216,1192271872,0,0,100,0,0,12582,14688
1179119616,132395565056,50069504,1192271872,0,0,99.937,0.063,0,19444,18868
1179119616,132395565056,50069504,1192271872,0,0,100,0,0,13188,12936
1178861568,132395823104,50069504,1192271872,0.031,0.031,99.938,0,0,12988,12838
1178861568,132395823104,50069504,1192271872,0,0,100,0,0,12418,13034
1178800128,132395884544,50069504,1192271872,0,0.031,99.969,0,0,12294,13598
1171140608,132403617792,50069504,1192198144,0,0.031,99.969,0,0,1892,2824
1171058688,132403773440,50098176,1192095744,0.375,0.031,99.531,0.062,0,173288,14284
1170784256,132404047872,50098176,1192095744,0,0,100,0,0,64412,1008
1170522112,132404305920,50098176,1192099840,0.031,0,99.969,0,0,8482,2016
1170264064,132404563968,50098176,1192099840,0,0,100,0,0,452,84
1170006016,132404822016,50098176,1192099840,0,0,100,0,0,346,0
1169969152,132404834304,50122752,1192099840,0,0.031,99.844,0.125,0,528,0
1169944576,132404858880,50122752,1192099840,0,0,100,0,0,992,0
1169940480,132404858880,50122752,1192103936,0,0,100,0,0,346,0
1169940480,132404858880,50122752,1192103936,0,0,100,0,0,812,0
1183768576,132390580224,50122752,1192550400,0.938,0.719,98.343,0,0,388332,16770
1170812928,132403982336,50122752,1192103936,0.031,0,99.969,0,0,3306,14320
1170800640,132403982336,50135040,1192103936,0,0,99.969,0.031,0,1038,0
1188577280,132386095104,50135040,1192214528,0.375,0.188,99.031,0.406,0,329856,13156
1321865216,132252618752,50135040,1192419328,3.176,0.311,96.513,0,0,3804,828
1322164224,132252422144,50171904,1192288256,0.031,0.031,99.469,0.469,0,2016,388
1321603072,132252983296,50171904,1192288256,0.031,0.031,99.937,0,0,2734,0
1321598976,132252987392,50171904,1192288256,0,0,100,0,0,3272,0
1321598976,132252987392,50180096,1192280064,0,0,99.594,0.406,0,3358,0
1321639936,132252938240,50180096,1192288256,1.876,0,98.124,0,0,4746,1334
1321123840,132253454336,50180096,1192288256,3.126,0,96.874,0,0,3514,1676
1321152512,132253421568,50180096,1192292352,3.126,0,96.874,0,0,3262,1968
1321152512,132253421568,50180096,1192292352,3.187,0,96.813,0,0,3852,1680
1321148416,132253421568,50180096,1192296448,3.124,0.031,96.845,0,0,3192,1692
1333846016,132240707584,50196480,1192296448,3.784,0.031,96.123,0.063,0,526428,367936
1344327680,132230217728,50196480,1192304640,3.840,0.062,96.097,0,0,1655654,1500318
1361473536,132213030912,50196480,1192304640,4.104,0.219,95.677,0,0,3135202,2753172
1385238528,132189265920,50196480,1192304640,5.102,0.094,94.804,0,0,4303892,3172654
1405276160,132169224192,50196480,1192308736,4.409,0.125,95.466,0,0,3842788,2806814
1400537088,132173914112,50204672,1192308736,3.882,0.063,96.024,0.031,0,4174092,3820536
1416237056,132158205952,50212864,1192308736,4.599,0.063,95.275,0.063,0,5187274,2076606
1438146560,132136296448,50212864,1192308736,4.541,0.125,95.334,0,0,5474082,2461436
1437839360,132136603648,50212864,1192308736,3.627,0.125,96.248,0,0,5498462,3309308
1447489536,132126953472,50212864,1192308736,3.536,0.063,96.402,0,0,5493366,3616498
1460854784,132113575936,50221056,1192312832,3.657,0.281,95.999,0.063,0,5531460,3050768
1460736000,132113694720,50221056,1192312832,3.470,0.125,96.405,0,0,4718920,3140764
1460158464,132114272256,50221056,1192312832,3.503,0.031,96.465,0,0,4470174,3301220
1465921536,132108509184,50221056,1192312832,3.411,0.156,96.433,0,0,4426194,3302584
1495511040,132078919680,50221056,1192312832,3.535,0.094,96.372,0,0,4394778,3301456
1520603136,132053819392,50229248,1192312832,3.472,0.094,96.309,0.125,0,3804130,3085678
1545469952,132028952576,50229248,1192312832,3.347,0.156,96.497,0,0,3800044,3557182
1568272384,132006146048,50229248,1192316928,3.537,0.094,96.369,0,0,3836382,2069118
1596153856,131978264576,50229248,1192316928,3.315,0.156,96.529,0,0,3835876,3038746
1622548480,131951869952,50229248,1192316928,3.472,0.063,96.465,0,0,3989042,2882542
1652637696,131921760256,50241536,1192325120,3.411,0.188,96.183,0.219,0,3946368,3586806
1676509184,131897888768,50241536,1192325120,3.408,0.094,96.498,0,0,4052304,3437050
1703747584,131870650368,50241536,1192325120,3.443,0.063,96.495,0,0,3667644,3280530
1726169088,131848228864,50241536,1192325120,3.688,0.062,96.250,0,0,3567182,3817242
1761927168,131812466688,50241536,1192329216,4.314,0.094,95.592,0,0,3665916,3026070
1785487360,131788890112,50257920,1192329216,3.504,0.063,96.245,0.188,0,3614562,2360280
1810624512,131763752960,50257920,1192329216,3.407,0.094,96.499,0,0,3672454,2663106
1835696128,131738681344,50257920,1192329216,3.316,0.094,96.591,0,0,3542006,2330664
1858863104,131715514368,50257920,1192329216,3.722,0.063,96.215,0,0,3527776,4413046
1879400448,131694977024,50257920,1192329216,3.564,0.063,96.374,0,0,3415548,3802356
1906270208,131668099072,50266112,1192329216,3.315,0.156,96.435,0.094,0,3624898,2584536
1931591680,131642777600,50266112,1192329216,3.226,0.063,96.712,0,0,3658204,3110432
1956818944,131617546240,50266112,1192333312,3.316,0.125,96.559,0,0,3422624,3530368
1980014592,131594350592,50266112,1192333312,3.467,0.125,96.408,0,0,3293808,3515276
2012618752,131561746432,50266112,1192333312,4.693,0.313,94.994,0,0,3584612,2435812
2035683328,131538669568,50274304,1192337408,8.482,0.094,91.330,0.094,0,3818160,2802060
2035240960,131539111936,50274304,1192337408,3.349,0.063,96.588,0,0,3913906,2178520
2035118080,131539234816,50274304,1192337408,3.438,0.094,96.469,0,0,4064636,2557796
2034675712,131539677184,50274304,1192337408,3.379,0.094,96.527,0,0,4091794,3451724
2034900992,131539447808,50274304,1192341504,3.320,0.063,96.618,0,0,3904316,3416992
2024022016,131550318592,50282496,1192341504,5.033,0.125,94.811,0.031,0,3749800,2744850
2028957696,131545382912,50282496,1192341504,4.159,0.063,95.779,0,0,3632722,3677204
2028748800,131545591808,50282496,1192341504,3.436,0.125,96.439,0,0,3678634,2789308
2028457984,131545882624,50282496,1192341504,3.408,0.094,96.498,0,0,3531854,3802892
2028261376,131546079232,50282496,1192341504,3.348,0.031,96.621,0,0,3592110,2710704
2020057088,131554275328,50290688,1192341504,3.470,0.031,96.436,0.063,0,3321244,3001144
2020024320,131554308096,50290688,1192341504,3.346,0.094,96.560,0,0,3318534,2509138
2019762176,131554566144,50290688,1192345600,3.535,0.031,96.434,0,0,3615402,2638892
2019991552,131554336768,50290688,1192345600,3.624,0.031,96.345,0,0,3989078,2251968
2019704832,131554623488,50290688,1192345600,3.500,0.094,96.406,0,0,3973036,4271092
2019479552,131554799616,50298880,1192345600,3.287,0.094,96.556,0.063,0,3770076,2399906
2019479552,131554799616,50298880,1192345600,3.315,0.094,96.592,0,0,3489632,3357480
2019491840,131554754560,50298880,1192345600,3.321,0.094,96.585,0,0,3510558,2834952
2019127296,131555119104,50298880,1192345600,3.376,0.094,96.530,0,0,3411378,2967666
2018861056,131555381248,50298880,1192349696,3.413,0.063,96.525,0,0,3537094,2639702
2018205696,131556024320,50307072,1192353792,3.376,0.094,96.436,0.094,0,3831842,2302416
2018189312,131556032512,50315264,1192353792,3.472,0.094,96.246,0.188,0,4062372,3374322
2018660352,131555696640,50315264,1192345600,3.660,0.125,96.215,0,0,3757654,3339468
2029170688,131545186304,50315264,1192345600,3.812,0.375,95.812,0,0,3670336,2689268
2028314624,131546042368,50315264,1192345600,3.257,0.063,96.680,0,0,3808014,2658740
2027917312,131546431488,50323456,1192345600,3.318,0.063,96.526,0.094,0,3835804,2340126
2027692032,131546652672,50323456,1192349696,3.316,0.094,96.591,0,0,3808766,2179404
2027474944,131546869760,50323456,1192349696,3.722,0.094,96.184,0,0,3786552,3278680
2027261952,131546959872,50323456,1192349696,3.287,0.031,96.681,0,0,3465170,3520604
2027229184,131546992640,50323456,1192349696,3.315,0.094,96.592,0,0,3436400,2747870
2026311680,131547901952,50331648,1192349696,3.287,0.063,96.556,0.094,0,3450786,3070680
2026205184,131548008448,50331648,1192349696,3.287,0.031,96.681,0,0,3453806,2272956
2026205184,131548008448,50331648,1192349696,3.347,0.063,96.591,0,0,3441604,2847474
2026045440,131548168192,50331648,1192349696,3.496,0.094,96.411,0,0,3393378,2666450
2026074112,131548135424,50331648,1192353792,3.286,0.094,96.620,0,0,3102058,2166658
2026307584,131547893760,50339840,1192353792,3.407,0.063,96.468,0.063,0,3338852,3162180
2025484288,131548717056,50339840,1192353792,3.348,0.031,96.621,0,0,3102348,2865636
2025226240,131548975104,50339840,1192353792,3.345,0.094,96.561,0,0,3203616,4279522
2025451520,131548749824,50339840,1192353792,3.379,0.063,96.558,0,0,3002242,3778852
2025451520,131548749824,50339840,1192353792,3.286,0.063,96.651,0,0,3200084,2835952
2025467904,131548725248,50348032,1192353792,3.596,0.063,96.279,0.063,0,3331218,2900380
2025750528,131548442624,50348032,1192353792,3.468,0.062,96.470,0,0,3158050,3209632
2025783296,131548409856,50348032,1192353792,4.158,0.063,95.780,0,0,3199536,3896038
2025811968,131548377088,50348032,1192357888,3.286,0.094,96.620,0,0,3461944,4037600
2025971712,131548217344,50348032,1192357888,3.411,0.094,96.496,0,0,3565314,3444414
2025996288,131548184576,50356224,1192357888,3.378,0.031,96.528,0.063,0,3733026,1768270
2026450944,131547729920,50356224,1192357888,3.349,0,96.651,0,0,3550160,2901792
2026577920,131547602944,50356224,1192357888,3.254,0.094,96.652,0,0,3722112,3312392
2032566272,131541614592,50356224,1192357888,3.875,0.312,95.812,0,0,3667330,1876614
2032947200,131541229568,50356224,1192361984,3.320,0.031,96.649,0,0,3713282,2573130
2032439296,131541729280,50364416,1192361984,3.288,0.031,96.618,0.063,0,3555238,3187316
2033377280,131540787200,50364416,1192366080,3.408,0.063,96.529,0,0,3487272,2898632
2032828416,131541327872,50372608,1192366080,3.344,0.094,96.500,0.062,0,3354576,4351054
2032799744,131541356544,50372608,1192366080,3.317,0.031,96.652,0,0,3301868,3629020
2032730112,131541426176,50372608,1192366080,3.435,0.125,96.440,0,0,3401112,2673354
2033180672,131540967424,50380800,1192366080,4.092,0.062,95.783,0.062,0,3693984,2565880
2032627712,131541520384,50380800,1192366080,3.346,0.063,96.592,0,0,3572198,2832692
2033250304,131540897792,50380800,1192366080,3.438,0.062,96.312,0.188,0,3633074,2623804
2034151424,131539996672,50380800,1192366080,3.845,0.094,96.061,0,0,3559856,2890488
2034057216,131540090880,50380800,1192366080,3.531,0.062,96.406,0,0,3744164,2910154
2034249728,131539881984,50388992,1192370176,4.160,0,95.777,0.063,0,3848322,2669492
2034978816,131539152896,50388992,1192370176,3.503,0.063,96.434,0,0,3764718,2874778
2035105792,131539025920,50388992,1192370176,3.379,0.031,96.589,0,0,3801136,2247162
2036105216,131538026496,50388992,1192370176,3.343,0.094,96.564,0,0,3833898,1980194
2036891648,131537240064,50388992,1192370176,3.377,0.063,96.560,0,0,3479737,2599130
2037047296,131537076224,50397184,1192370176,3.439,0.031,96.468,0.063,0,3550688,3208712
2037800960,131536322560,50397184,1192370176,3.284,0.063,96.653,0,0,3445366,2361620
2037686272,131536437248,50397184,1192370176,3.285,0.063,96.652,0,0,3473854,2863904
2037981184,131536142336,50397184,1192370176,3.255,0.063,96.682,0,0,3214990,3118280
2038210560,131535912960,50397184,1192370176,3.225,0.063,96.713,0,0,3295992,3205470
2038013952,131536097280,50405376,1192374272,3.312,0.188,96.406,0.094,0,3519356,3990882
2037805056,131536306176,50405376,1192374272,3.409,0.063,96.528,0,0,3530934,4054092
2037956608,131536154624,50405376,1192374272,3.315,0.094,96.592,0,0,3535256,2715976
2038415360,131535695872,50405376,1192374272,3.193,0.063,96.744,0,0,3509594,2603386
2039463936,131534647296,50405376,1192374272,3.348,0.031,96.621,0,0,3565708,1959784
2039336960,131534766080,50413568,1192374272,3.225,0.031,96.681,0.063,0,3421456,2507674
2039578624,131534524416,50413568,1192374272,3.345,0.063,96.593,0,0,3460512,2612808
2039902208,131534200832,50413568,1192374272,3.377,0.094,96.529,0,0,3264752,3043570
2041901056,131532201984,50413568,1192374272,3.721,0.094,96.185,0,0,3316412,2863392
2058928128,131515170816,50413568,1192378368,6.494,0.094,93.412,0,0,3304120,2344702
2059128832,131514830848,50421760,1192509440,4.122,0.062,95.721,0.094,0,3419808,2440444
2059681792,131514277888,50421760,1192509440,3.692,0.031,96.277,0,0,3441880,2964730
2059300864,131514658816,50421760,1192509440,3.378,0.063,96.559,0,0,3417890,3610696
2059714560,131514236928,50429952,1192509440,3.224,0.094,96.620,0.063,0,3530696,2345976
2060521472,131513430016,50429952,1192509440,3.538,0.063,96.399,0,0,3796586,2253294
2061152256,131512791040,50438144,1192509440,3.407,0.063,96.468,0.063,0,3624662,2936950
2061873152,131512070144,50438144,1192509440,3.314,0.125,96.561,0,0,3642620,2582548
2062069760,131511873536,50438144,1192509440,3.345,0.063,96.593,0,0,3614270,2490242
2062741504,131511197696,50438144,1192513536,3.255,0.063,96.682,0,0,3412892,2512250
2063433728,131510505472,50438144,1192513536,3.346,0.031,96.623,0,0,3316400,2075656
2064068608,131509862400,50446336,1192513536,3.226,0.031,96.680,0.063,0,3621764,2403118
2065248256,131508682752,50446336,1192513536,3.253,0.094,96.653,0,0,3542428,1391728
2065555456,131508375552,50446336,1192513536,3.254,0.063,96.527,0.156,0,3421476,2580142
2065666048,131508264960,50446336,1192513536,3.285,0.063,96.652,0,0,2836318,3484966
2065633280,131508297728,50446336,1192513536,3.434,0.062,96.503,0,0,2963056,2629148
2067091456,131506831360,50454528,1192513536,3.539,0.031,96.367,0.063,0,3088246,2624052
2067513344,131506335744,50454528,1192513536,3.347,0.031,96.622,0,0,3253184,2632550
2067558400,131506290688,50454528,1192513536,3.317,0.063,96.621,0,0,3280790,2946144
2067795968,131506044928,50454528,1192521728,3.317,0.063,96.621,0,0,3453092,3362958
2067390464,131506450432,50454528,1192521728,3.498,0.031,96.471,0,0,3725584,3142920
2068938752,131504893952,50462720,1192521728,3.283,0.125,96.498,0.094,0,3692160,2658072
2068393984,131505438720,50462720,1192521728,3.439,0.094,96.468,0,0,3613750,5112692
2068738048,131505094656,50462720,1192521728,3.377,0.063,96.560,0,0,3661048,3222050
2068426752,131505405952,50462720,1192521728,3.317,0.031,96.652,0,0,3442530,3037526
2068447232,131505385472,50462720,1192521728,3.285,0.094,96.621,0,0,3582964,3994706
2068877312,131504943104,50470912,1192525824,3.345,0.125,96.436,0.094,0,3762100,2511972
2068533248,131505287168,50470912,1192525824,3.441,0.031,96.528,0,0,3838228,3911270
2070937600,131502882816,50470912,1192525824,3.473,0.063,96.464,0,0,3733958,2639394
2070908928,131502911488,50470912,1192525824,3.377,0.094,96.529,0,0,3380984,3692220
2070433792,131503386624,50470912,1192525824,3.254,0.063,96.683,0,0,3264852,2349622
2071408640,131502403584,50479104,1192525824,3.344,0.062,96.531,0.062,0,3358096,2214526
2072498176,131501314048,50479104,1192525824,3.316,0.063,96.622,0,0,3487824,2362392
2073321472,131500490752,50479104,1192525824,3.254,0.031,96.715,0,0,3610410,2582382
2072866816,131500937216,50487296,1192525824,3.284,0.094,96.559,0.063,0,3667642,3285466
2072862720,131500937216,50487296,1192529920,3.316,0.031,96.653,0,0,3434696,3381326
2073124864,131500666880,50495488,1192529920,3.254,0.063,96.652,0.031,0,3362724,3004986
2073468928,131500322816,50495488,1192529920,3.254,0.063,96.683,0,0,3188354,3076350
2073968640,131499823104,50495488,1192529920,3.315,0.031,96.654,0,0,3086158,2114944
2074599424,131499192320,50495488,1192529920,3.192,0.063,96.745,0,0,3206038,2353864
2075279360,131498512384,50495488,1192529920,3.226,0.031,96.743,0,0,3325816,2375074
2075267072,131498516480,50503680,1192529920,3.350,0.063,96.462,0.125,0,3573772,3856580
2075414528,131498369024,50503680,1192529920,3.443,0.063,96.495,0,0,3635518,3739622
2075582464,131498201088,50503680,1192529920,3.409,0.094,96.497,0,0,3828660,2635838
2075185152,131498594304,50503680,1192534016,3.346,0.156,96.498,0,0,3821090,3091380
2075897856,131497881600,50503680,1192534016,3.470,0.094,96.436,0,0,3814878,3223206
2076033024,131497738240,50511872,1192534016,3.377,0.063,96.467,0.094,0,3659716,2464638
2076913664,131496857600,50511872,1192534016,3.373,0.125,96.502,0,0,3466646,1869556
2077016064,131496755200,50511872,1192534016,3.375,0.094,96.531,0,0,3506942,2983244
2077433856,131496337408,50511872,1192534016,3.225,0.063,96.556,0.157,0,3368756,3412582
2077655040,131496116224,50511872,1192534016,3.439,0.094,96.468,0,0,3566044,4424242
2077900800,131495862272,50520064,1192534016,3.285,0.094,96.527,0.094,0,3614134,2540738
2077564928,131496194048,50520064,1192538112,3.319,0.031,96.650,0,0,3588538,3338924
2078183424,131495575552,50520064,1192538112,3.286,0.031,96.682,0,0,3473812,1952532
2078240768,131495518208,50520064,1192538112,3.377,0.156,96.467,0,0,3776536,2862720
2079498240,131494252544,50528256,1192538112,3.319,0.063,96.556,0.063,0,3614194,2955252
2079068160,131494674432,50536448,1192538112,3.470,0.094,96.405,0.031,0,3830274,2881790
2080411648,131493330944,50536448,1192538112,3.288,0.157,96.555,0,0,4100558,2541700
2080632832,131493109760,50536448,1192538112,3.350,0.063,96.587,0,0,3874900,2977858
2081488896,131492253696,50536448,1192538112,3.318,0.031,96.651,0,0,3778294,3309776
2081341440,131492401152,50536448,1192538112,3.317,0.063,96.621,0,0,3709350,2907306
2081849344,131491880960,50544640,1192542208,3.316,0.125,96.465,0.094,0,3825636,3757182
2081210368,131492519936,50544640,1192542208,3.256,0.063,96.681,0,0,3710493,2660578
2081869824,131491860480,50544640,1192542208,3.225,0.031,96.744,0,0,3618608,2551824
2083151872,131490578432,50544640,1192542208,3.223,0.094,96.683,0,0,3489158,2046850
2083598336,131490131968,50552832,1192534016,3.318,0.031,96.588,0.063,0,3723928,2693090
2084245504,131489468416,50561024,1192542208,3.287,0.031,96.650,0.031,0,3704826,3424046
2084110336,131489599488,50561024,1192546304,3.407,0.063,96.530,0,0,3457802,3326164
2084368384,131489341440,50561024,1192546304,3.378,0.063,96.559,0,0,3346280,2913566
2084966400,131488743424,50561024,1192546304,3.254,0.063,96.683,0,0,3475900,2674262
2084814848,131488890880,50561024,1192550400,3.464,0.156,96.380,0,0,3359728,3884038
2084999168,131488698368,50569216,1192550400,3.346,0.094,96.467,0.094,0,3763586,3584284
2085695488,131488002048,50569216,1192550400,3.377,0.063,96.560,0,0,3714064,3720992
2085023744,131488673792,50569216,1192550400,3.316,0.063,96.622,0,0,3792066,2584560
2087010304,131486687232,50569216,1192550400,3.254,0.063,96.683,0,0,3752814,1803826
2087182336,131486515200,50569216,1192550400,3.256,0.031,96.713,0,0,3671666,2892472
2087972864,131485716480,50577408,1192550400,3.595,0.031,96.311,0.063,0,3564452,4193774
2087428096,131486257152,50577408,1192554496,3.317,0.063,96.621,0,0,3446156,3577240
2087739392,131485945856,50577408,1192554496,3.348,0.031,96.621,0,0,3451652,3926684
2087870464,131485814784,50577408,1192554496,3.405,0.094,96.501,0,0,3466994,3031950
2088214528,131485470720,50577408,1192554496,3.312,0.125,96.562,0,0,3324950,2603522
2087796736,131485880320,50585600,1192554496,3.285,0.063,96.589,0.063,0,3168790,2781648
2088071168,131485605888,50585600,1192554496,3.227,0,96.773,0,0,3540844,3522060
2089017344,131484659712,50585600,1192554496,3.408,0.031,96.560,0,0,3501836,2692162
2088411136,131485265920,50585600,1192554496,3.560,0.156,96.284,0,0,3610938,3929346
2088476672,131485196288,50585600,1192558592,3.316,0.063,96.497,0.125,0,3684056,3098814
2090434560,131483058176,50593792,1192558592,3.434,0.156,96.347,0.062,0,3848944,2480116
2090262528,131483230208,50593792,1192558592,3.284,0.125,96.591,0,0,3620328,4117688
2090590208,131482902528,50593792,1192558592,3.408,0.094,96.498,0,0,3395968,4023456
2090639360,131482853376,50593792,1192558592,3.226,0.031,96.743,0,0,3605466,2240298
2091245568,131482247168,50593792,1192558592,3.253,0.094,96.653,0,0,3558720,2288588
2091880448,131481595904,50610176,1192558592,3.347,0.063,96.528,0.063,0,3726606,3213042
2091769856,131481706496,50610176,1192558592,3.351,0.031,96.618,0,0,3783112,3719964
2092187648,131481284608,50610176,1192562688,3.286,0.063,96.651,0,0,3615916,3960290
2091679744,131481792512,50610176,1192562688,3.408,0.031,96.560,0,0,3683480,3280036
2092384256,131481088000,50610176,1192562688,3.406,0.062,96.531,0,0,3800056,3054906
2091954176,131481509888,50618368,1192562688,3.225,0.063,96.650,0.063,0,3501688,2740300
2092515328,131480948736,50618368,1192562688,3.285,0.094,96.621,0,0,3167922,4173068
2092523520,131480932352,50626560,1192562688,3.383,0.031,96.523,0.063,0,3078988,3624954
2092265472,131481190400,50626560,1192562688,3.224,0.063,96.714,0,0,3502254,2635158
2092609536,131480846336,50626560,1192562688,3.285,0.031,96.683,0,0,3471030,3144260
2092482560,131480961024,50634752,1192566784,3.314,0.094,96.561,0.031,0,3477652,2346562
2093273088,131480170496,50634752,1192566784,3.315,0.063,96.623,0,0,3591432,3033230
2093867008,131479576576,50634752,1192566784,3.315,0.063,96.623,0,0,3352160,2887236
2093748224,131479695360,50634752,1192566784,3.285,0.063,96.652,0,0,3520268,2838828
2094215168,131479228416,50634752,1192566784,3.344,0.062,96.594,0,0,3558416,2497756
2094886912,131478544384,50642944,1192570880,3.316,0.031,96.591,0.063,0,2991602,2614628
2097442816,131475730432,50663424,1192583168,3.560,0.125,96.284,0.031,0,2525448,2966706
2097598464,131475574784,50663424,1192583168,3.315,0,96.685,0,0,2128030,2797420
2097045504,131476123648,50663424,1192587264,3.312,0.062,96.625,0,0,2005786,2260118
2097463296,131475705856,50663424,1192587264,3.283,0,96.717,0,0,1779916,2028992
2097467392,131475673088,50688000,1192587264,3.161,0,96.745,0.094,0,1338132,2239630
2097389568,131475746816,50688000,1192591360,3.588,0.094,96.318,0,0,995594,2744840
2097405952,131475730432,50688000,1192591360,3.251,0.031,96.718,0,0,558902,2829708
2097364992,131475771392,50688000,1192591360,3.343,0,96.657,0,0,324936,3436338
2097287168,131475849216,50688000,1192591360,3.191,0,96.809,0,0,76328,3241794
2096689152,131476439040,50696192,1192591360,3.221,0.031,96.498,0.250,0,62010,3350148
2097537024,131475578880,50704384,1192595456,3.160,0,96.777,0.063,0,83492,3108894
2095960064,131477151744,50704384,1192599552,3.309,0.031,96.659,0,0,40944,2223940
2096271360,131476840448,50704384,1192599552,3.251,0.031,96.718,0,0,58422,3216758
2097176576,131475935232,50704384,1192599552,3.188,0.031,96.780,0,0,41372,2238226
2096209920,131476893696,50712576,1192599552,3.250,0.031,96.656,0.062,0,76134,2621340
2095583232,131477520384,50712576,1192599552,3.312,0,96.688,0,0,57002,3094646
2094985216,131478118400,50712576,1192599552,3.250,0.031,96.719,0,0,85738,3192036
2094829568,131478274048,50712576,1192599552,3.281,0,96.719,0,0,48594,2640806
2093907968,131479195648,50712576,1192599552,3.158,0.031,96.811,0,0,38110,1953488
2094419968,131478667264,50728960,1192599552,3.314,0,96.561,0.125,0,87672,4223870
2093305856,131479777280,50728960,1192603648,3.312,0,96.688,0,0,87738,2825256
2093043712,131480039424,50728960,1192603648,3.251,0,96.749,0,0,56554,2985132
2088415232,131484667904,50728960,1192603648,3.189,0.031,96.779,0,0,46206,2588596
2082123776,131490959360,50728960,1192603648,3.343,0,96.657,0,0,66836,3761724
2079612928,131493462016,50737152,1192603648,3.190,0,96.747,0.063,0,42126,2155352
2078167040,131494907904,50737152,1192603648,3.221,0,96.779,0,0,69292,2961542
2076790784,131496284160,50737152,1192603648,3.282,0,96.718,0,0,74796,3403650
2075054080,131498020864,50737152,1192603648,3.284,0,96.716,0,0,171156,3691774
2073604096,131499466752,50737152,1192607744,3.315,0.031,96.654,0,0,181274,2846334
2072219648,131500843008,50745344,1192607744,3.402,0.062,96.380,0.156,0,180994,3109720
2070724608,131502338048,50745344,1192607744,3.221,0.031,96.748,0,0,149196,2465410
2069274624,131503788032,50745344,1192607744,3.688,0.031,96.281,0,0,106664,3542630
2067341312,131505721344,50745344,1192607744,3.252,0,96.748,0,0,76312,3815636
2066796544,131506266112,50745344,1192607744,3.247,0.062,96.691,0,0,86168,2900876
1171951616,132401102848,50753536,1192607744,0.688,0.062,99.219,0.031,0,15220,458994
1164132352,132409143296,50761728,1192378368,0.031,0,99.937,0.031,0,12826,180
1164124160,132409143296,50761728,1192386560,0,0,100,0,0,1178,0
1164124160,132409143296,50761728,1192386560,0.031,0,99.969,0,0,2636,0
1164124160,132409143296,50761728,1192386560,0,0,100,0,0,30014,0
1164357632,132408893440,50774016,1192386560,0,0,99.938,0.062,0,3482,662
1164357632,132408893440,50774016,1192386560,0,0,99.906,0.094,0,28444,0
1164357632,132408893440,50774016,1192386560,0,0,100,0,0,7542,0
1164357632,132408893440,50774016,1192386560,0,0,100,0,0,4648,0
1164357632,132408893440,50774016,1192386560,0,0,100,0,0,3974,0
1164357632,132408893440,50774016,1192386560,0,0,100,0,0,31414,390
1164349440,132408893440,50782208,1192386560,0,0,99.938,0.062,0,3748,390
1164349440,132408893440,50782208,1192386560,0,0,100,0,0,27502,546
1164349440,132408893440,50782208,1192386560,0,0.031,99.969,0,0,8840,546
1164349440,132408893440,50782208,1192386560,0,0,100,0,0,41058,468
1164349440,132408893440,50782208,1192386560,0,0,100,0,0,9906,976
1164349440,132408893440,50786304,1192382464,0,0,99.844,0.156,0,38214,1054
1164337152,132408893440,50794496,1192386560,0,0,99.969,0.031,0,41442,1992
1182212096,132390678528,50794496,1192398848,0.656,0.281,99.062,0,0,448912,22670
1182949376,132388532224,50794496,1192398848,1.030,0.500,98.470,0,0,227750,37796
