"Dstat 0.7.3 CSV output"
"Author:","Dag Wieers <dag@wieers.com>",,,,"URL:","http://dag.wieers.com/home-made/dstat/"
"Host:","gros-70.nancy.grid5000.fr",,,,"User:","root"
"Cmdline:","dstat -m -c -n -o dstat.csv",,,,"Date:","23 May 2020 23:34:41 CEST"
"memory usage",,,,"total cpu usage",,,,,"net/total",
"used","free","buff","cach","usr","sys","idl","wai","stl","recv","send"
1266675712,97593503744,46292992,694620160,0.611,0.167,99.178,0.044,0,0,0
1261268992,97598558208,46292992,694964224,0.914,0.305,98.782,0,0,400816,29152
1260822528,97599451136,46292992,694517760,0,0,100,0,0,9172,204
1258737664,97601519616,46305280,694517760,0.639,0.361,99,0,0,387432,17394
1270177792,97590079488,46305280,694517760,0.250,0.056,99.694,0,0,385471,11704
1257558016,97602682880,46317568,694517760,0.499,0.361,99.113,0.028,0,14760,10238
1257549824,97602691072,46317568,694517760,0,0.028,99.972,0,0,7678,102
1257549824,97602691072,46317568,694517760,0.028,0,99.972,0,0,9148,0
1257541632,97602699264,46329856,694505472,0,0,100,0,0,9886,0
1257521152,97602707456,46329856,694517760,0,0,100,0,0,2894,0
1257508864,97602707456,46342144,694517760,0,0.028,99.972,0,0,1804,0
1269641216,97590312960,46342144,694775808,0.389,0.139,99.472,0,0,387884,15662
1260265472,97599737856,46342144,694726656,0.445,0.584,98.971,0,0,173434,16976
1267421184,97592090624,46346240,695193600,0.639,0.417,98.777,0.167,0,390800,27818
1259175936,97600184320,46358528,695328768,0.694,0.333,98.973,0,0,391640,18542
1258692608,97601114112,46358528,694882304,0,0,100,0,0,7983,0
1257652224,97602146304,46358528,694886400,0.749,0.361,98.890,0,0,395202,17738
1287794688,97571848192,46370816,695029760,0.445,0.083,99.472,0,0,229346,9864
1257689088,97602064384,46370816,694886400,0.694,0.111,99.195,0,0,14226,5448
1258618880,97601122304,46383104,694886400,0.194,0.056,99.750,0,0,352716,14060
1265065984,97594482688,46383104,695078912,0.278,0.223,99.499,0,0,192632,22360
1265373184,97594175488,46383104,695078912,0,0.083,99.917,0,0,38578,10196
1265373184,97594175488,46383104,695078912,0,0.028,99.972,0,0,12684,10094
1265364992,97594183680,46395392,695066624,0,0,100,0,0,12650,10094
1265352704,97594183680,46407680,695066624,0,0.028,99.972,0,0,12146,9898
1265340416,97594183680,46407680,695078912,0,0.028,99.972,0,0,15552,14860
1265340416,97594183680,46407680,695078912,0.028,0,99.972,0,0,13074,10812
1265340416,97594183680,46407680,695078912,0,0,100,0,0,12372,9898
1265340416,97594183680,46407680,695078912,0,0.028,99.972,0,0,12320,10094
1265340416,97594183680,46407680,695078912,0.028,0.028,99.944,0,0,11350,9996
1257119744,97602396160,46415872,695078912,0.028,0,99.972,0,0,2402,2628
1257349120,97602351104,46415872,694894592,0.195,0.083,99.722,0,0,172870,14272
1257349120,97602351104,46415872,694894592,0.028,0,99.972,0,0,2156,0
1257349120,97602351104,46415872,694894592,0.028,0,99.972,0,0,924,0
1257340928,97602359296,46415872,694894592,0,0,100,0,0,2191,0
1257340928,97602359296,46415872,694894592,0,0,100,0,0,1730,0
1257316352,97602359296,46440448,694894592,0,0,100,0,0,2082,0
1257316352,97602359296,46440448,694894592,0,0,100,0,0,966,0
1255714816,97603506176,46440448,695345152,0.556,0.361,99.083,0,0,392500,30530
1256660992,97603006464,46440448,694898688,0,0,100,0,0,2908,1108
2077462528,96781787136,46440448,695246848,4.307,2.084,93.609,0,0,1183584,51016
5769523200,93087522816,46440448,697065472,26.596,9.689,63.715,0,0,1835394,77292
9445462016,89409581056,46456832,698744832,27.583,9.458,62.931,0.028,0,1660342,74584
13243330560,85609816064,46473216,700407808,30.737,8.626,60.637,0,0,1658404,76454
15818362880,83033817088,46477312,701231104,19.029,6.879,74.092,0,0,335800,19442
15864451072,82987487232,46555136,701386752,0.500,0.139,99.333,0.028,0,3114,4708
15867289600,82984574976,46563328,701390848,1.253,0.139,98.608,0,0,100088,8574832
15921205248,82930618368,46563328,701423616,2.648,0.251,97.101,0,0,328302,23517530
16027385856,82824392704,46575616,701456384,3.984,0.585,95.430,0,0,609132,42549380
16148344832,82703380480,46575616,701501440,5.545,0.502,93.954,0,0,911030,59161715
16252542976,82599129088,46575616,701554688,5.545,0.390,94.065,0,0,975166,58142421
16438894592,82412724224,46583808,701599744,9.615,0.780,89.604,0,0,960220,55673986
16564994048,82286563328,46583808,701661184,10.357,0.670,88.973,0,0,1032580,60997676
16673742848,82177748992,46583808,701718528,9.501,0.776,89.723,0,0,999462,59259430
16745398272,82106019840,46592000,701775872,7.059,0.446,92.467,0.028,0,965260,57482502
16724672512,82126696448,46592000,701820928,2.757,0.446,96.798,0,0,965986,57413474
16678088704,82173202432,46600192,701890560,3.310,0.306,96.384,0,0,958030,55455334
16663404544,82187784192,46600192,701992960,3.092,0.418,96.490,0,0,941320,55419488
16638128128,82212999168,46600192,702054400,2.925,0.501,96.574,0,0,931136,55312836
16659230720,82191831040,46600192,702119936,3.672,0.473,95.855,0,0,937246,58044716
16662126592,82188890112,46600192,702164992,3.472,0.500,96.028,0,0,1018894,60419510
16651743232,82199220224,46608384,702210048,3.396,0.362,96.242,0,0,1052806,62243008
16612900864,82237984768,46608384,702287872,3.315,0.279,96.407,0,0,938000,55189258
16588054528,82262781952,46608384,702337024,3.612,0.389,95.999,0,0,1137382,66021682
16580939776,82269843456,46608384,702386176,3.036,0.334,96.630,0,0,1016525,61395998
16582447104,82268274688,46608384,702447616,2.535,0.474,96.992,0,0,989358,59811538
16583544832,82267131904,46616576,702484480,2.035,0.362,97.602,0,0,1030438,60550252
16583405568,82267070464,46616576,702685184,2.719,0.305,96.976,0,0,1066110,60654972
16583737344,82266673152,46616576,702742528,1.750,0.445,97.805,0,0,983224,57122372
16582901760,82267463680,46616576,702787584,2.725,0.362,96.913,0,0,1046988,63067662
16585232384,82265071616,46616576,702849024,2.893,0.362,96.745,0,0,990568,59053620
16584818688,82265403392,46632960,702914560,2.676,0.446,96.878,0,0,998070,60487576
16588259328,82261708800,46632960,703168512,1.703,0.391,97.906,0,0,1107116,66444134
16589844480,82260074496,46632960,703217664,2.444,0.500,97.056,0,0,1031906,60679086
16590946304,82258907136,46632960,703279104,1.480,0.335,98.185,0,0,965292,58345288
16593678336,82256130048,46632960,703324160,2.834,0.361,96.805,0,0,995228,62022302
16593342464,82256396288,46641152,703381504,1.943,0.444,97.613,0,0,945416,60156134
16593649664,82256035840,46641152,703434752,1.649,0.280,98.071,0,0,993036,60127908
16594608128,82255024128,46641152,703488000,2.013,0.280,97.708,0,0,958618,56445858
16594317312,82255257600,46641152,703545344,1.953,0.167,97.880,0,0,990356,58887462
16594735104,82254704640,46641152,703606784,2.263,0.335,97.402,0,0,995804,57933266
16598224896,82251165696,46649344,703647744,1.760,0.279,97.960,0,0,951254,55217486
16611475456,82237698048,46649344,703840256,2.289,0.447,97.264,0,0,1021624,58805850
16618778624,82230329344,46649344,703905792,2.169,0.445,97.386,0,0,951902,57616252
16621457408,82227605504,46649344,703950848,1.672,0.390,97.938,0,0,966910,59526856
16628727808,82220269568,46649344,704016384,1.808,0.556,97.636,0,0,957030,54865382
16645054464,82203873280,46657536,704073728,1.564,0.363,98.073,0,0,1035870,62997080
16644583424,82204295168,46657536,704122880,1.478,0.390,98.132,0,0,960714,58718086
16646000640,82202828800,46657536,704172032,1.145,0.223,98.632,0,0,942860,54414264
16650817536,82197950464,46657536,704233472,2.118,0.362,97.520,0,0,1039618,61570366
16651378688,82197327872,46657536,704294912,2.275,0.361,97.365,0,0,968568,57743554
16652075008,82196578304,46665728,704339968,1.426,0.308,98.238,0.028,0,1025154,63204326
16651587584,82197008384,46665728,704397312,2.248,0.389,97.363,0,0,984786,58069712
16654131200,82194395136,46665728,704458752,2.005,0.278,97.717,0,0,1043074,62877728
16653451264,82195017728,46665728,704516096,2.176,0.363,97.461,0,0,1034057,62163718
16654114816,82194300928,46665728,704569344,1.919,0.417,97.663,0,0,971406,57337298
16655396864,82192961536,46682112,704610304,2.285,0.334,97.380,0,0,974424,59272344
16654311424,82193977344,46682112,704679936,1.450,0.251,98.299,0,0,990144,61066850
16665227264,82183004160,46682112,704737280,2.197,0.501,97.302,0,0,1016706,61531374
16675721216,82172452864,46682112,704794624,1.868,0.558,97.575,0,0,1060386,62896902
16676790272,82171199488,46682112,704847872,3.341,0.390,96.269,0,0,1014080,57970638
16684298240,82163630080,46690304,704901120,3.614,0.306,96.080,0,0,922066,54552092
16701956096,82145910784,46690304,704962560,4.012,0.223,95.765,0,0,939192,55115376
16704761856,82143055872,46690304,705011712,3.601,0.335,96.064,0,0,999026,61225120
16720154624,82127597568,46690304,705073152,2.734,0.335,96.931,0,0,1050126,61282752
16725827584,82121879552,46690304,705118208,1.730,0.279,97.991,0,0,997584,59494436
16722485248,82125152256,46698496,705179648,1.696,0.445,97.859,0,0,1060678,61416060
16722116608,82125451264,46698496,705245184,1.867,0.362,97.770,0,0,1023108,57213258
16723329024,82124181504,46698496,705294336,1.890,0.334,97.776,0,0,975600,57426704
16722948096,82124505088,46698496,705351680,1.646,0.279,98.075,0,0,913240,55317370
16739799040,82107613184,46698496,705392640,2.868,0.334,96.798,0,0,931186,56306622
16828039168,82019303424,46706688,705454080,6.201,0.584,93.215,0,0,1008346,63206326
16898625536,81948516352,46706688,705650688,6.023,0.558,93.419,0,0,1024426,59995504
17003589632,81843597312,46706688,705695744,7.129,0.668,92.203,0,0,1008308,59223006
17036390400,81810755584,46706688,705732608,3.041,0.474,96.484,0,0,939970,55421016
17037611008,81809457152,46706688,705810432,2.057,0.389,97.554,0,0,963412,57476996
17020411904,81826603008,46714880,705855488,1.916,0.416,97.640,0.028,0,947978,58339436
17002086400,81844871168,46714880,705912832,1.923,0.167,97.910,0,0,928644,57006840
16964591616,81882300416,46714880,705974272,1.337,0.362,98.300,0,0,948416,57176536
16958156800,81888694272,46714880,706015232,2.003,0.389,97.608,0,0,910536,55597300
16959889408,81886781440,46714880,706080768,1.200,0.307,98.493,0,0,1012472,60571994
16960253952,81886363648,46731264,706117632,2.284,0.418,97.298,0,0,1160354,68715140
16961232896,81885179904,46731264,706322432,2.230,0.502,97.268,0,0,1013366,62089208
16961257472,81885102080,46731264,706375680,2.123,0.307,97.569,0,0,954510,58216564
16961810432,81884483584,46731264,706437120,1.918,0.389,97.693,0,0,957213,58075334
16966021120,81880223744,46731264,706486272,2.162,0.416,97.422,0,0,943092,56097300
16961683456,81884483584,46739456,706551808,1.171,0.362,98.467,0,0,1044622,61357556
16955965440,81890148352,46739456,706605056,1.835,0.334,97.832,0,0,995951,59796192
16954564608,81891491840,46739456,706662400,1.697,0.334,97.969,0,0,1089810,62906002
16944361472,81901641728,46739456,706711552,1.946,0.361,97.693,0,0,973572,58900150
16944009216,81901936640,46739456,706768896,1.589,0.167,98.244,0,0,944202,56484290
16944926720,81900957696,46747648,706822144,1.451,0.307,98.242,0,0,953663,57391434
16944619520,81901219840,46747648,706867200,1.226,0.418,98.357,0,0,1019750,61771166
16945618944,81900146688,46747648,706932736,1.844,0.335,97.821,0,0,1014456,59239062
16945274880,81900425216,46747648,706990080,1.869,0.335,97.796,0,0,996604,59862390
16946335744,81899311104,46747648,707043328,1.724,0.361,97.915,0,0,926461,56682090
16945393664,81900195840,46755840,707092480,1.446,0.334,98.221,0,0,966374,57345978
16943718400,81901805568,46755840,707158016,1.893,0.250,97.857,0,0,961870,58211064
16938782720,81906667520,46755840,707219456,2.501,0.417,97.082,0,0,963168,58032364
16940056576,81905352704,46755840,707260416,1.702,0.279,98.020,0,0,987823,58692266
16939032576,81906307072,46755840,707325952,2.091,0.279,97.630,0,0,1067132,61135418
16940056576,81905229824,46764032,707371008,2.064,0.279,97.657,0,0,1044146,59555592
16939700224,81905528832,46764032,707428352,2.924,0.251,96.798,0.028,0,962466,58095196
16938557440,81906610176,46764032,707489792,2.944,0.389,96.667,0,0,953404,56407302
16939548672,81905565696,46764032,707543040,1.510,0.252,98.239,0,0,1087360,63060230
16940134400,81904918528,46764032,707600384,1.510,0.280,98.210,0,0,988904,60242510
16940601344,81904386048,46772224,707653632,1.948,0.362,97.691,0,0,957826,58732936
16940814336,81904107520,46772224,707706880,2.006,0.306,97.687,0,0,965752,60784824
16942542848,81902313472,46780416,707764224,1.941,0.333,97.727,0,0,1025060,60180458
16942227456,81902575616,46780416,707817472,1.368,0.279,98.352,0,0,981448,58981938
16942731264,81901993984,46780416,707891200,1.501,0.334,98.165,0,0,956478,56446896
16943165440,81901514752,46788608,707928064,1.803,0.388,97.809,0,0,916188,54450634
16943185920,81901416448,46788608,708005888,1.198,0.390,98.412,0,0,983778,58262110
16942936064,81901613056,46788608,708059136,1.285,0.447,98.268,0,0,1006738,60239018
16942985216,81901518848,46788608,708104192,2.178,0.335,97.487,0,0,1059687,61152588
16944156672,81900281856,46788608,708169728,2.940,0.388,96.672,0,0,1015766,60010046
16945762304,81898618880,46796800,708218880,2.205,0.279,97.516,0,0,1016018,60975564
16947335168,81896972288,46796800,708284416,2.932,0.223,96.817,0.028,0,975789,57872266
16950829056,81893433344,46796800,708329472,2.563,0.334,97.103,0,0,956056,57592366
16952045568,81892134912,46796800,708407296,3.041,0.251,96.708,0,0,1020990,60613376
16954454016,81889681408,46796800,708452352,4.004,0.362,95.634,0,0,1047912,60502048
16954486784,81889591296,46804992,708501504,3.071,0.335,96.594,0,0,993821,59264776
16952311808,81891659776,46804992,708575232,1.363,0.473,98.164,0,0,981768,59174340
16951717888,81892188160,46813184,708632576,2.337,0.362,97.302,0,0,1002988,57429922
16952291328,81891549184,46813184,708685824,1.475,0.584,97.940,0,0,1048560,59262296
16952709120,81890934784,46813184,708882432,2.006,0.306,97.688,0,0,1034406,59793296
16954064896,81889525760,46821376,708927488,1.199,0.251,98.550,0,0,913316,54752430
16952860672,81890672640,46821376,708984832,1.170,0.418,98.412,0,0,918988,54990872
16953704448,81889763328,46821376,709050368,1.722,0.472,97.806,0,0,1011892,58117606
16954556416,81888858112,46821376,709103616,2.032,0.473,97.495,0,0,983486,58179958
16954105856,81889255424,46821376,709156864,1.535,0.279,98.185,0,0,1002384,59194544
16954855424,81888440320,46829568,709214208,1.257,0.224,98.519,0,0,1062892,60086922
16955420672,81887817728,46829568,709271552,1.506,0.279,98.215,0,0,1031206,58037214
16954630144,81888542720,46829568,709332992,1.198,0.390,98.412,0,0,1020044,59172768
16954634240,81888477184,46829568,709394432,1.559,0.334,98.107,0,0,1027954,60499210
16955215872,81887830016,46829568,709459968,1.447,0.445,98.108,0,0,975586,58430200
16957235200,81885769728,46837760,709492736,1.755,0.306,97.938,0,0,976112,55769656
16958390272,81884540928,46837760,709562368,1.474,0.389,98.136,0,0,860216,51956804
16958582784,81884286976,46837760,709623808,1.394,0.251,98.327,0.028,0,923396,56528284
16959598592,81883213824,46837760,709681152,1.426,0.363,98.211,0,0,1021974,60521296
16959287296,81883475968,46837760,709730304,1.784,0.307,97.910,0,0,975144,57190134
16960368640,81882329088,46845952,709787648,1.226,0.251,98.523,0,0,978734,59230654
16958590976,81884033024,46845952,709861376,1.698,0.334,97.968,0,0,1011782,62232336
16959262720,81883312128,46854144,709902336,1.421,0.362,98.217,0,0,1013592,60871306
16958738432,81883770880,46854144,709963776,1.725,0.250,98.024,0,0,938859,54891468
16959688704,81882759168,46854144,710021120,1.088,0.223,98.688,0,0,1031512,61201158
16960069632,81882312704,46862336,710074368,1.394,0.585,98.021,0,0,1058020,61720974
16960393216,81881923584,46862336,710135808,1.394,0.335,98.271,0,0,1076158,65109762
16960221184,81882025984,46862336,710197248,1.726,0.334,97.940,0,0,958136,62111634
16960872448,81881305088,46870528,710258688,1.005,0.307,98.688,0,0,1017056,63075614
16960651264,81881473024,46870528,710311936,1.611,0.361,98.028,0,0,982354,58532424
16961490944,81880567808,46878720,710369280,1.311,0.307,98.382,0,0,1025274,61160848
16962805760,81879199744,46878720,710422528,1.060,0.363,98.577,0,0,982853,59097864
16961818624,81880121344,46878720,710483968,1.058,0.473,98.469,0,0,1009268,59563932
16961888256,81879990272,46878720,710545408,1.311,0.363,98.327,0,0,968652,57854722
16962318336,81879498752,46878720,710606848,1.280,0.362,98.358,0,0,930056,57586522
16962301952,81879470080,46886912,710639616,1.893,0.362,97.745,0,0,947323,56160344
16961802240,81879900160,46886912,710709248,1.368,0.391,98.241,0,0,970296,56456280
16962846720,81878790144,46886912,710774784,1.422,0.362,98.216,0,0,1000084,58350314
16963543040,81878048768,46886912,710819840,1.427,0.224,98.349,0,0,898884,54489296
16964018176,81877442560,46886912,710877184,1.058,0.418,98.524,0,0,1058088,59537942
16963125248,81878265856,46895104,710938624,1.586,0.334,98.080,0,0,1028222,59675706
16963342336,81877975040,46895104,711008256,1.114,0.418,98.469,0,0,1004530,58832800
16963768320,81877483520,46899200,711065600,1.251,0.389,98.332,0.028,0,1000718,58330420
16964300800,81876901888,46899200,711114752,1.729,0.307,97.964,0,0,1026738,59533264
16965083136,81876054016,46899200,711180288,1.504,0.306,98.189,0,0,997820,60686236
16964878336,81876197376,46907392,711229440,1.421,0.362,98.217,0,0,1012206,60119450
16964517888,81876492288,46907392,711290880,1.253,0.334,98.413,0,0,939594,57939306
16965062656,81875750912,46907392,711487488,1.754,0.529,97.717,0,0,1046114,59922144
16964886528,81875881984,46915584,711524352,0.977,0.363,98.660,0,0,963834,59025866
16964325376,81876373504,46915584,711593984,1.257,0.363,98.380,0,0,931330,56786410
16963969024,81876668416,46923776,711647232,1.280,0.362,98.358,0,0,1005924,59604168
16964599808,81875980288,46923776,711704576,1.335,0.334,98.331,0,0,1015372,60971024
16965177344,81875341312,46923776,711766016,1.365,0.306,98.329,0,0,946454,58194252
16965218304,81875243008,46923776,711823360,1.313,0.251,98.436,0,0,957417,58448600
16964141056,81876258816,46931968,711876608,1.612,0.278,98.110,0,0,1097652,62536182
16966053888,81874284544,46940160,711929856,1.313,0.279,98.408,0,0,1001892,59253350
16965472256,81874808832,46940160,711983104,1.500,0.472,98.028,0,0,956860,57858222
16965267456,81874939904,46940160,712056832,1.587,0.334,98.079,0,0,1008800,58338170
16966086656,81874059264,46940160,712110080,2.052,0.333,97.616,0,0,1030600,59860896
16965943296,81874137088,46940160,712175616,1.615,0.418,97.967,0,0,946894,56547456
16965976064,81874038784,46948352,712228864,1.114,0.334,98.552,0,0,953810,57675494
16966381568,81873584128,46948352,712278016,1.173,0.195,98.632,0,0,927266,56784220
16966942720,81872965632,46948352,712335360,1.061,0.279,98.660,0,0,895334,55874212
16966672384,81873166336,46952448,712396800,1.034,0.335,98.631,0,0,1017100,62043260
16966737920,81873039360,46952448,712458240,1.504,0.362,98.134,0,0,1098496,65002250
16966995968,81872719872,46960640,712507392,1.200,0.335,98.438,0.028,0,1004060,60680546
16968163328,81871486976,46960640,712572928,1.533,0.390,98.076,0,0,998918,60005048
16968040448,81871552512,46960640,712630272,0.948,0.335,98.718,0,0,847470,51872368
16968372224,81871142912,46968832,712691712,1.449,0.418,98.133,0,0,1009522,60187872
16968015872,81871437824,46968832,712753152,1.202,0.196,98.602,0,0,1043042,60825166
16968314880,81871081472,46977024,712802304,1.640,0.306,98.054,0,0,994790,58809964
16968716288,81870622720,46977024,712855552,1.835,0.306,97.859,0,0,1030778,61796478
16968499200,81870786560,46977024,712908800,1.586,0.390,98.024,0,0,1028292,61755668
16967741440,81871474688,46985216,712966144,1.364,0.390,98.247,0,0,933784,56266438
16968167424,81870987264,46985216,713023488,1.363,0.417,98.220,0,0,1030570,61468530
16968617984,81870467072,46993408,713080832,1.333,0.417,98.250,0,0,988134,58629730
16967380992,81871650816,46993408,713134080,1.645,0.362,97.993,0,0,957372,58200506
16968355840,81870606336,46993408,713199616,1.032,0.307,98.661,0,0,985924,59237474
16969998336,81868910592,46993408,713252864,1.143,0.446,98.411,0,0,921694,54531374
16970129408,81868718080,46993408,713314304,1.505,0.279,98.216,0,0,937378,56201390
16969768960,81869012992,47001600,713363456,1.308,0.445,98.246,0,0,1008536,59640362
16968916992,81869799424,47001600,713428992,1.171,0.307,98.522,0,0,999626,58189764
16969654272,81868865536,47001600,713625600,1.368,0.251,98.381,0,0,902830,54500430
16969691136,81868771328,47001600,713682944,1.314,0.363,98.323,0,0,1008195,59487174
16970690560,81867726848,47001600,713728000,1.113,0.362,98.525,0,0,1024206,59547566
16970682368,81867661312,47009792,713793536,1.336,0.445,98.219,0,0,1026792,60474844
16970186752,81868087296,47009792,713863168,1.032,0.419,98.549,0,0,1017730,59094482
16971063296,81867169792,47009792,713900032,1.115,0.418,98.466,0,0,974468,57141852
16970727424,81867440128,47009792,713961472,1.419,0.278,98.303,0,0,1020298,60291736
16970493952,81867603968,47009792,714031104,1.611,0.306,98.083,0,0,1001860,59553870
16971055104,81866989568,47017984,714076160,1.978,0.195,97.827,0,0,935118,57331638
16972034048,81865949184,47017984,714137600,1.368,0.223,98.409,0,0,1009542,58496114
16971870208,81866047488,47017984,714199040,1.282,0.362,98.356,0,0,935602,56020898
16972271616,81865592832,47017984,714252288,1.003,0.307,98.690,0,0,1042004,62634692
16971292672,81866514432,47017984,714309632,2.142,0.445,97.412,0,0,1017348,61465632
16973283328,81864454144,47026176,714362880,1.311,0.446,98.243,0,0,991008,58912036
16972947456,81864716288,47026176,714432512,1.060,0.251,98.689,0,0,976100,57924452
16973090816,81864519680,47026176,714481664,1.117,0.335,98.548,0,0,1013582,59752576
16973287424,81864257536,47026176,714547200,1.140,0.473,98.387,0,0,986864,59040858
16972922880,81864556544,47034368,714604544,1.307,0.501,98.192,0,0,1019668,60995376
16973864960,81863376896,47042560,714653696,1.364,0.306,98.302,0.028,0,1048131,59097300
16973082624,81864097792,47042560,714715136,1.422,0.307,98.272,0,0,998478,59683484
16972783616,81864327168,47042560,714776576,1.253,0.390,98.357,0,0,1032840,62359756
16973389824,81863671808,47042560,714825728,1.641,0.334,98.026,0,0,992300,57798654
15403384832,83433050112,47050752,714887168,1.982,0.502,97.516,0,0,1002944,59162114
11467960320,87368818688,47063040,714711040,1.669,0.334,97.997,0,0,706200,42724942
7577661440,91260416000,47063040,713416704,0.780,0.334,98.886,0,0,487068,32366676
3621392384,95217819648,47063040,712323072,0.446,0.111,99.443,0,0,234044,16279400
1310978048,97529352192,47083520,711225344,0.167,0.083,99.750,0,0,23706,1818428
1285222400,97555812352,47083520,710561792,0.028,0.028,99.944,0,0,552,0
1285210112,97555812352,47095808,710561792,0,0,100,0,0,1510,0
1285201920,97555820544,47095808,710561792,0,0,100,0,0,2116,0
1285201920,97555820544,47095808,710561792,0,0,100,0,0,1840,0
1285292032,97555730432,47095808,710561792,0.056,0.028,99.917,0,0,279645,16950
1285271552,97555738624,47108096,710561792,0,0,100,0,0,2012,0
1285271552,97555738624,47108096,710561792,0,0.028,99.972,0,0,4708,0
1285271552,97555738624,47108096,710561792,0,0,100,0,0,1944,0
1285271552,97555738624,47108096,710561792,0,0,100,0,0,840,0
1285271552,97555738624,47108096,710561792,0,0,100,0,0,1958,0
1285271552,97555738624,47108096,710561792,0.028,0,99.972,0,0,14392,1948
1285263360,97555738624,47116288,710561792,0,0,100,0,0,9626,220
1285263360,97555738624,47116288,710561792,0,0,100,0,0,3494,0
1285263360,97555738624,47116288,710561792,0,0,100,0,0,1852,180
1285263360,97555738624,47116288,710561792,0,0,100,0,0,3866,0
1285263360,97555738624,47116288,710561792,0,0.028,99.972,0,0,1362,0
1285296128,97555705856,47116288,710561792,0.028,0,99.972,0,0,6222,0
1285287936,97555705856,47124480,710561792,0,0.028,99.972,0,0,6030,0
1285287936,97555705856,47124480,710561792,0,0,100,0,0,8066,102
1285287936,97555705856,47124480,710561792,0,0.028,99.972,0,0,4296,0
1285287936,97555705856,47124480,710561792,0,0,99.972,0.028,0,2292,0
1285283840,97555705856,47128576,710561792,0,0,100,0,0,552,0
1285283840,97555705856,47128576,710561792,0,0,100,0,0,1248,0
1288892416,97550413824,47136768,710569984,0.862,0.417,98.722,0,0,403678,46462
1288892416,97550413824,47136768,710569984,0,0,100,0,0,1622,0
