"Dstat 0.7.3 CSV output"
"Author:","Dag Wieers <dag@wieers.com>",,,,"URL:","http://dag.wieers.com/home-made/dstat/"
"Host:","grisou-39.nancy.grid5000.fr",,,,"User:","root"
"Cmdline:","dstat -m -c -n -o dstat.csv",,,,"Date:","24 May 2020 18:19:52 CEST"
"memory usage",,,,"total cpu usage",,,,,"net/total",
"used","free","buff","cach","usr","sys","idl","wai","stl","recv","send"
992645120,133061627904,47886336,735846400,0.752,0.219,98.889,0.140,0,0,0
1003511808,133050413056,47886336,736186368,0.655,0.250,99.095,0,0,388144,15536
999362560,133055008768,47886336,735739904,0.781,0.437,98.782,0,0,387690,26584
987201536,133067149312,47890432,735752192,0.842,0.624,97.785,0.749,0,5276,15398
987168768,133067182080,47890432,735752192,0,0.031,99.781,0.188,0,1176,662
988463104,133065809920,47915008,735760384,1.031,0.656,98.220,0.094,0,386728,26286
988499968,133065773056,47915008,735760384,0,0,100,0,0,2030,0
988475392,133065797632,47915008,735760384,0,0,100,0,0,1310,0
988475392,133065797632,47915008,735760384,0,0,100,0,0,1566,0
987959296,133066313728,47915008,735760384,0,0,100,0,0,1260,0
987947008,133066313728,47939584,735748096,0,0,99.812,0.188,0,1204,0
987934720,133066313728,47939584,735760384,0,0,100,0,0,4650,0
987934720,133066313728,47939584,735760384,0,0,100,0,0,3468,0
987934720,133066313728,47939584,735760384,0,0,100,0,0,1702,476
987668480,133066579968,47939584,735760384,0,0,100,0,0,858,148
987402240,133066846208,47939584,735760384,0,0,100,0,0,3958,1948
987394048,133066846208,47947776,735760384,0,0.062,99.906,0.031,0,1204,368
987394048,133066846208,47947776,735760384,0,0,100,0,0,1404,0
987652096,133066588160,47947776,735760384,0,0,100,0,0,1654,0
989761536,133064212480,47947776,736018432,1.062,0.687,98.252,0,0,391438,30206
988770304,133065461760,47947776,735760384,0,0,100,0,0,1390,698
991825920,133062365184,47947776,735780864,0.344,0.250,99.407,0,0,170594,11956
999247872,133054480384,47960064,736227328,0.968,0.499,98.471,0.062,0,389002,17486
989601792,133064572928,47960064,735780864,0.250,0.125,99.625,0,0,3862,13772
1001181184,133052530688,47972352,736227328,0.624,0.187,99.126,0.062,0,383810,11274
985202688,133068955648,47972352,735780864,0.561,0.499,98.939,0,0,11188,14996
997019648,133056688128,47972352,736227328,0.562,0.219,99.219,0,0,383672,11926
982052864,133072097280,47972352,735784960,0.500,0.406,99.094,0,0,4584,15260
982007808,133072130048,47984640,735784960,0.031,0,99.906,0.063,0,7226,148
981970944,133072166912,47984640,735784960,0,0,99.344,0.656,0,8382,832
982360064,133071724544,47996928,735784960,1.780,0.187,97.971,0.062,0,222950,10132
982380544,133071704064,47996928,735784960,0.062,0,99.938,0,0,2976,2668
982896640,133071187968,47996928,735784960,0,0,100,0,0,7166,84
982896640,133071187968,47996928,735784960,0,0,100,0,0,904,0
985411584,133068656640,48009216,735789056,0.624,0.156,99.095,0.125,0,367950,20174
991830016,133062049792,48009216,735977472,0.250,0.031,99.406,0.313,0,310674,20768
991293440,133062574080,48021504,735977472,0,0.062,99.875,0.062,0,12384,13548
991285248,133062582272,48021504,735977472,0,0.031,99.969,0,0,12622,13230
991285248,133062582272,48021504,735977472,0.031,0.031,99.938,0,0,12640,13230
991014912,133062840320,48033792,735977472,0,0,99.937,0.063,0,12746,13398
990892032,133062963200,48033792,735977472,0.031,0.031,99.938,0,0,16552,16016
990892032,133062963200,48033792,735977472,0,0.062,99.938,0,0,13634,13328
990887936,133062967296,48033792,735977472,0.031,0,99.969,0,0,13664,13328
990887936,133062967296,48033792,735977472,0,0.031,99.969,0,0,13482,13328
982704128,133071224832,48033792,735903744,0.031,0.031,99.937,0,0,13944,14584
982327296,133071699968,48046080,735793152,0,0,99.938,0.062,0,2374,1344
982261760,133071765504,48046080,735793152,0.250,0.125,99.625,0,0,174150,15616
982261760,133071765504,48046080,735793152,0,0,100,0,0,1370,0
982261760,133071765504,48046080,735793152,0,0,100,0,0,1160,0
982261760,133071765504,48046080,735793152,0,0,100,0,0,1098,0
982241280,133071773696,48058368,735793152,0,0,99.938,0.062,0,6734,0
981962752,133072039936,48070656,735793152,0,0,99.969,0.031,0,1552,0
981962752,133072039936,48070656,735793152,0,0,100,0,0,686,0
981958656,133072039936,48070656,735797248,0,0,100,0,0,1370,0
981958656,133072039936,48070656,735797248,0,0,100,0,0,1296,662
981700608,133072297984,48070656,735797248,0,0,100,0,0,1144,2380
994422784,133059309568,48070656,736059392,0.718,0.219,99.063,0,0,396866,16394
980807680,133073174528,48078848,735801344,0.406,0.469,99.062,0.062,0,10056,15572
980807680,133073174528,48078848,735801344,0,0,100,0,0,3634,0
980549632,133073432576,48078848,735801344,0,0,100,0,0,1868,84
980807680,133073174528,48078848,735801344,0,0,99.500,0.500,0,4054,0
2354774016,131697807360,48091136,736067584,13.553,6.155,80.230,0.062,0,1653736,63624
5517131776,128533237760,48103424,737546240,34.581,12.254,52.947,0.218,0,1325988,55004
8397713408,125651165184,48103424,738795520,34.630,11.637,53.703,0.031,0,1323988,55540
11686887424,122360205312,48103424,740409344,36.665,14.741,48.532,0.062,0,1326568,59148
14790414336,119255113728,48103424,741842944,34.033,12.523,53.350,0.094,0,1325440,57532
17661456384,116382633984,48115712,743141376,30.519,13.061,54.111,2.309,0,1648696,62204
20762042368,113280409600,48128000,744611840,40.885,13.806,45.152,0.157,0,1401914,9786411
23753801728,110287364096,48136192,745857024,40.683,13.667,45.460,0.190,0,1575906,30593197
26922209280,107117236224,48140288,747388928,43.354,14.671,41.755,0.219,0,1772714,49924626
29744181248,104294273024,48156672,748314624,43.485,14.121,42.269,0.125,0,1310778,72433457
30654349312,103383744512,48218112,748601344,21.513,4.483,72.291,1.712,0,792600,93914832
30828318720,103209422848,48267264,748879872,17.068,1.813,78.024,3.095,0,915980,113810294
31017283584,103020363776,48267264,748969984,17.043,1.974,80.639,0.345,0,1074498,134319019
31247552512,102789857280,48267264,749166592,22.425,2.356,74.843,0.377,0,1265994,154983828
31441833984,102595465216,48267264,749273088,25.260,2.579,71.721,0.440,0,1414274,175381703
31559004160,102478163968,48267264,749404160,24.500,3.031,72.062,0.406,0,1585774,196438733
31709732864,102327316480,48283648,749506560,24.820,3.291,70.605,1.285,0,1574628,202181672
31812984832,102223958016,48283648,749613056,23.132,2.637,73.603,0.628,0,1587022,202083550
31935848448,102100971520,48283648,749735936,22.302,3.253,73.882,0.563,0,1594266,202179912
32048599040,101988073472,48283648,749879296,22.882,4.251,71.554,1.313,0,1521274,202195444
32072331264,101964238848,48283648,749973504,16.827,2.675,80.031,0.467,0,1288830,201808799
32045694976,101990735872,48291840,750096384,13.133,2.763,79.354,4.750,0,1344236,202238428
32017686528,102018605056,48291840,750231552,10.717,2.274,86.604,0.405,0,1542028,202155319
32040386560,101995798528,48291840,750338048,10.759,2.070,86.731,0.439,0,1525900,202242818
32056012800,101980033024,48291840,750469120,11.139,2.753,85.513,0.594,0,1538874,201985530
32100114432,101935816704,48291840,750579712,8.472,2.866,87.969,0.693,0,1541170,202066235
32126824448,101908971520,48300032,750706688,7.719,1.645,89.845,0.791,0,1492482,202201276
32129814528,101905645568,48373760,750968832,7.805,1.959,77.674,12.562,0,1481374,202187431
32106127360,101929213952,48373760,751087616,7.600,1.734,90.161,0.505,0,1394604,201833434
32120107008,101915107328,48373760,751210496,7.894,1.872,89.735,0.499,0,1491178,202494985
32141799424,101893287936,48373760,751337472,7.015,1.754,90.855,0.376,0,1489332,202057175
32155308032,101879631872,48381952,751472640,7.577,2.027,89.866,0.530,0,1499028,202136181
32183926784,101850873856,48390144,751579136,7.147,1.975,90.282,0.596,0,1482444,202106585
32214859776,101819801600,48390144,751714304,7.348,2.001,90.213,0.438,0,1519956,202049240
32242696192,101791842304,48390144,751828992,6.958,1.858,90.743,0.441,0,1527240,202176957
32273293312,101761003520,48390144,752066560,7.712,2.257,89.624,0.408,0,1482946,201883757
32284356608,101749792768,48398336,752201728,7.244,2.477,89.777,0.502,0,1500092,202432993
32287506432,101746520064,48398336,752316416,6.440,2.032,90.997,0.531,0,1515160,201949456
32299765760,101734096896,48398336,752467968,7.120,1.819,88.802,2.258,0,1476902,202277126
32317657088,101716123648,48398336,752549888,7.865,2.247,89.544,0.343,0,1493790,201865076
32343703552,101689925632,48398336,752697344,7.062,1.955,90.637,0.347,0,1458488,201991776
32369721344,101663764480,48406528,752820224,7.507,2.344,89.452,0.697,0,1475694,202259543
32398520320,101634863104,48406528,752922624,7.642,2.756,89.195,0.407,0,1463702,202004101
32401125376,101632118784,48406528,753057792,6.461,1.796,88.024,3.719,0,1472444,202281500
32430325760,101602807808,48406528,753168384,6.908,2.157,90.591,0.344,0,1503522,202252225
32446672896,101586337792,48406528,753291264,6.228,1.762,91.664,0.346,0,1485768,202060391
32470192128,101562671104,48414720,753422336,6.446,2.472,90.238,0.845,0,1495074,201994152
32490569728,101542182912,48414720,753532928,6.727,2.284,90.582,0.407,0,1507956,202087262
32511062016,101521567744,48414720,753651712,6.936,2.208,90.544,0.311,0,1452968,202118856
32523419648,101509083136,48422912,753770496,4.775,1.885,92.868,0.471,0,1485854,201876689
32523243520,101509128192,48422912,753901568,6.032,2.325,91.172,0.471,0,1498034,202240382
32524107776,101508149248,48431104,754003968,4.745,2.011,92.175,1.069,0,1501604,202131089
32527069184,101505052672,48431104,754135040,5.054,1.927,92.546,0.474,0,1471362,202036093
32527958016,101504045056,48431104,754253824,6.270,2.268,89.887,1.575,0,1496606,202237181
32540241920,101491634176,48431104,754376704,5.350,1.940,91.270,1.439,0,1499846,201998626
32552333312,101479284736,48431104,754634752,7.121,1.968,90.568,0.344,0,1471434,202101911
32557641728,101473853440,48447488,754741248,4.675,1.820,91.967,1.537,0,1481970,202151343
32563539968,101467820032,48447488,754876416,5.745,2.154,91.758,0.343,0,1472644,202182437
32565190656,101466058752,48447488,754987008,4.857,1.671,93.188,0.284,0,1475306,202103840
32565338112,101465788416,48447488,755105792,5.696,1.941,91.236,1.127,0,1453886,202181099
32565710848,101465288704,48447488,755232768,7.975,2.212,89.408,0.405,0,1498086,202039841
32574783488,101456093184,48455680,755339264,7.875,2.125,89.312,0.688,0,1501882,202198993
32581320704,101449404416,48455680,755490816,9.237,2.325,88.062,0.377,0,1460884,202204010
32592257024,101438369792,48455680,755585024,8.579,2.004,89.073,0.344,0,1461490,201904557
32600375296,101430042624,48455680,755728384,8.664,2.221,88.802,0.313,0,1456820,202283973
32609386496,101421006848,48463872,755830784,9.472,2.313,87.777,0.438,0,1491952,202144078
32619843584,101410340864,48472064,755957760,8.433,1.699,89.490,0.378,0,1518264,202147509
32633274368,101396795392,48472064,756060160,8.926,1.848,88.913,0.313,0,1515022,202079026
32646500352,101383430144,48472064,756195328,8.900,1.849,88.906,0.345,0,1497902,202127047
32653623296,101376180224,48472064,756314112,9.678,2.685,85.201,2.435,0,1485340,202225947
32667258880,101362368512,48472064,756445184,9.466,2.204,87.989,0.341,0,1491358,202170236
32700841984,101328666624,48480256,756547584,9.478,2.020,88.098,0.404,0,1489402,202067496
32726818816,101302558720,48480256,756670464,10.094,2.013,87.579,0.314,0,1456730,202182820
32748531712,101280571392,48480256,756932608,9.170,1.965,88.615,0.250,0,1456104,202115853
32755298304,101273665536,48480256,757022720,8.286,1.939,88.493,1.282,0,1464189,202044855
32771260416,101257555968,48480256,757166080,9.465,1.868,88.356,0.311,0,1428926,202099863
32785481728,101243199488,48488448,757293056,10.516,1.847,87.074,0.563,0,1471832,202146704
32797114368,101231448064,48488448,757399552,7.843,1.921,89.921,0.315,0,1512762,202158950
32811614208,101216817152,48488448,757530624,9.458,1.797,88.462,0.284,0,1478092,201888499
32813834240,101214461952,48488448,757665792,10.187,2.150,86.947,0.717,0,1452864,202177574
32818446336,101209735168,48496640,757772288,7.501,2.023,88.422,2.054,0,1450992,202402087
32887533568,101140525056,48504832,757882880,12.014,1.757,85.790,0.439,0,1472946,201703239
32931799040,101096128512,48504832,758009856,10.395,2.179,87.115,0.311,0,1439334,202530241
33039044608,100988755968,48504832,758136832,15.057,2.453,82.148,0.342,0,1504678,202010087
33116254208,100911403008,48504832,758280192,12.156,2.281,85.219,0.344,0,1505622,202093534
33174089728,100853456896,48504832,758390784,10.571,2.370,85.563,1.497,0,1470106,202154967
33221468160,100805943296,48521216,758501376,11.242,2.354,85.785,0.619,0,1460014,202176336
33288851456,100738428928,48521216,758620160,11.014,1.810,86.833,0.343,0,1465728,202129343
33340669952,100686479360,48521216,758747136,11.732,1.778,86.178,0.312,0,1404940,201993427
33411829760,100615184384,48521216,758874112,10.022,2.061,87.543,0.375,0,1427384,201934645
33446715392,100580179968,48521216,758988800,7.789,1.884,88.474,1.853,0,1420240,202065984
33438814208,100587937792,48537600,759115776,6.029,2.300,90.802,0.870,0,1467892,202276407
33436028928,100590604288,48537600,759234560,4.103,1.816,93.642,0.438,0,1443394,201735815
33434984448,100591542272,48537600,759336960,5.354,1.785,92.580,0.282,0,1456554,202337716
33431408640,100594999296,48537600,759455744,5.613,2.183,91.830,0.374,0,1460584,202212852
33434525696,100591742976,48537600,759590912,5.857,1.785,91.982,0.376,0,1436032,201907552
33435709440,100590292992,48553984,759836672,5.050,1.223,91.248,2.478,0,1455084,201947461
33436819456,100589064192,48553984,759955456,5.660,1.876,92.089,0.375,0,1446188,202188547
33438621696,100587110400,48553984,760102912,5.336,1.632,92.624,0.408,0,1471632,202223969
33439617024,100586000384,48553984,760209408,4.337,1.425,93.890,0.348,0,1469538,202091982
33440165888,100585324544,48553984,760336384,5.175,1.870,92.581,0.374,0,1474442,202156787
33440710656,100584673280,48566272,760426496,4.554,1.591,90.268,3.587,0,1436322,202247766
33439744000,100585484288,48570368,760578048,3.921,1.662,93.977,0.439,0,1480640,202006244
33439539200,100585451520,48570368,760815616,4.671,2.118,92.806,0.405,0,1445268,202135395
33442807808,100582064128,48570368,760934400,4.816,1.939,92.871,0.375,0,1443386,202059023
33441869824,100582871040,48570368,761065472,4.521,1.933,93.202,0.343,0,1309060,202198159
33443549184,100581044224,48578560,761196544,4.796,1.755,92.038,1.411,0,1411346,201911075
33442689024,100581773312,48586752,761311232,4.264,2.179,93.122,0.436,0,1476042,202323515
33442160640,100582195200,48586752,761417728,4.137,1.818,93.732,0.313,0,1470220,201992293
33443729408,100580495360,48586752,761532416,4.203,1.631,93.821,0.345,0,1491066,202152803
33443803136,100580270080,48586752,761679872,4.866,1.871,92.951,0.312,0,1475000,202095241
33445052416,100578869248,48594944,761819136,4.296,1.725,93.509,0.470,0,1445138,202192832
33444241408,100579565568,48603136,761913344,5.089,2.092,92.382,0.437,0,1473862,202166034
33445117952,100578533376,48603136,762060800,3.778,1.480,94.332,0.409,0,1458408,202060785
33445408768,100578144256,48603136,762159104,4.944,2.270,92.475,0.311,0,1484320,202065026
33444864000,100578562048,48603136,762286080,4.765,1.993,92.868,0.374,0,1509004,202159375
33444511744,100578758656,48611328,762429440,5.230,2.179,91.905,0.685,0,1494890,202063670
33445105664,100577902592,48611328,762671104,3.756,1.484,91.540,3.220,0,1482614,202194890
33445498880,100577361920,48611328,762806272,4.281,2.281,93.031,0.406,0,1469946,202137919
33445687296,100577046528,48611328,762929152,4.458,2.151,93.049,0.343,0,1438352,202124900
33446088704,100576514048,48611328,763060224,4.425,1.932,93.207,0.436,0,1479274,202063595
33446375424,100576096256,48619520,763179008,4.194,1.545,93.724,0.536,0,1468548,202130489
33446453248,100575899648,48619520,763297792,4.548,1.631,92.503,1.317,0,1430360,202242814
33447538688,100574674944,48627712,763428864,4.307,1.904,93.321,0.468,0,1454876,201751888
33448296448,100573769728,48627712,763568128,5.178,2.233,92.155,0.434,0,1476616,202094209
33446899712,100575059968,48627712,763674624,4.336,1.716,93.668,0.281,0,1427522,202198403
33446641664,100575170560,48635904,763809792,4.734,1.806,92.962,0.498,0,1449682,202023232
33447837696,100573868032,48635904,763916288,4.506,1.815,91.990,1.690,0,1442912,202168682
33448452096,100573126656,48644096,764035072,4.731,1.848,93.014,0.407,0,1485670,202243419
33448681472,100572741632,48644096,764182528,4.814,1.876,93.092,0.219,0,1443054,202112495
33450565632,100570726400,48644096,764313600,4.986,2.057,92.677,0.280,0,1440970,202128281
33450147840,100570873856,48668672,764559360,4.739,1.789,89.674,3.798,0,1479178,202300982
33450479616,100570419200,48668672,764682240,4.679,1.840,92.639,0.842,0,1436274,202108388
33451331584,100569432064,48680960,764801024,4.152,1.887,92.891,1.070,0,1437560,201973866
33452077056,100568551424,48680960,764932096,4.460,1.934,93.200,0.405,0,1392720,202092988
33452052480,100568465408,48680960,765042688,4.558,1.998,93.100,0.343,0,1431076,202273686
33453146112,100567179264,48689152,765181952,4.851,1.471,93.239,0.438,0,1457116,202267977
33453330432,100566855680,48689152,765317120,4.501,1.844,93.373,0.281,0,1446108,202001596
33453600768,100566470656,48689152,765431808,4.638,2.131,90.912,2.319,0,1435532,202409491
33453338624,100566601728,48697344,765550592,4.480,1.880,93.108,0.533,0,1455480,201951668
33452875776,100566921216,48697344,765689856,3.921,1.945,93.789,0.345,0,1433616,201842554
33453744128,100565954560,48705536,765779968,5.016,1.931,92.555,0.498,0,1434454,202465683
33453203456,100566339584,48705536,765935616,3.984,1.600,94.103,0.314,0,1376550,202171690
33454182400,100565209088,48721920,766070784,4.114,1.570,92.525,1.790,0,1455206,202066674
33454358528,100564922368,48721920,766181376,4.124,1.749,93.814,0.312,0,1473044,202041160
33457545216,100561600512,48721920,766316544,3.505,1.389,94.790,0.316,0,1413508,202014464
33454841856,100564160512,48730112,766435328,4.211,2.011,93.306,0.471,0,1462018,202189926
33455980544,100562886656,48730112,766558208,4.550,2.275,92.864,0.312,0,1437720,202198874
33456476160,100562243584,48738304,766685184,3.809,1.763,93.988,0.441,0,1428034,202114035
33456877568,100561694720,48742400,766812160,4.253,1.689,92.214,1.845,0,1410998,202166464
33457135616,100561309696,48742400,766939136,4.555,2.371,92.730,0.343,0,1449664,201354360
33457369088,100560920576,48750592,767082496,4.531,1.625,93.406,0.438,0,1433342,202854468
33457848320,100560322560,48750592,767197184,3.867,1.729,94.121,0.283,0,1437318,202289560
33458233344,100559679488,48750592,767451136,4.040,1.723,93.956,0.282,0,1452236,202061415
33458286592,100559486976,48771072,767565824,3.820,1.941,93.049,1.190,0,1464542,202167538
33458454528,100559175680,48771072,767709184,4.036,1.940,93.711,0.313,0,1428438,201946190
33459462144,100558032896,48779264,767832064,3.652,1.543,94.081,0.724,0,1324394,202364884
33459511296,100557877248,48779264,767938560,4.476,1.659,93.521,0.344,0,1403020,202094815
33458458624,100558811136,48779264,768053248,4.521,2.058,93.078,0.343,0,1456874,201876644
33458282496,100558835712,48787456,768188416,4.674,1.932,92.957,0.436,0,1441248,202424282
33458651136,100558323712,48787456,768331776,3.690,1.482,94.513,0.315,0,1449356,202145853
33459707904,100557164544,48795648,768425984,4.674,1.901,92.833,0.592,0,1463156,202142226
33459748864,100557012992,48795648,768532480,4.123,1.479,94.114,0.283,0,1460768,202147261
33459789824,100556808192,48795648,768692224,3.655,1.638,94.329,0.378,0,1433082,202058430
33459388416,100557066240,48795648,768827392,4.855,1.992,92.375,0.778,0,1413902,202040630
33459437568,100556906496,48803840,768929792,4.312,1.844,91,2.844,0,1464658,201945744
33460482048,100555710464,48812032,769073152,4.003,1.939,93.433,0.625,0,1440302,202270127
33461030912,100555034624,48812032,769196032,4.622,1.718,93.379,0.281,0,1434040,202045451
33460817920,100555132928,48812032,769310720,4.271,1.870,93.485,0.374,0,1464836,202218635
33460744192,100555067392,48812032,769449984,4.071,1.723,93.924,0.282,0,1429246,202179568
33459351552,100556324864,48820224,769576960,4.238,1.901,87.660,6.201,0,1414084,197448864
33460600832,100554936320,48828416,769708032,4.250,1.750,93.594,0.406,0,1435472,201974921
33460195328,100555227136,48828416,769814528,4.353,2.083,93.252,0.311,0,1457356,202024144
33459474432,100555841536,48828416,769921024,4.122,2.061,93.473,0.344,0,1458768,202176634
33459994624,100555194368,48828416,770048000,4.671,1.993,92.931,0.405,0,1452976,202164179
33460162560,100554756096,48836608,770310144,4.625,1.688,91.469,2.219,0,1441386,201686196
33461026816,100553744384,48844800,770445312,3.947,1.880,93.766,0.407,0,1466096,202113410
33461243904,100553388032,48844800,770580480,4.016,1.663,94.007,0.314,0,1452162,202169835
33460850688,100553650176,48844800,770707456,4.273,1.778,93.668,0.281,0,1437204,202048185
33461137408,100553228288,48844800,770842624,4.009,1.816,93.642,0.532,0,1437622,202010332
33513238528,100500987904,48852992,770961408,7.704,1.996,89.488,0.811,0,1472110,202147772
33499500544,100514598912,48861184,771067904,4.131,1.659,93.803,0.407,0,1452494,202078759
33500037120,100513923072,48861184,771203072,4.613,1.808,93.298,0.281,0,1451942,202332348
33499353088,100514471936,48861184,771338240,4.527,2.171,93.054,0.248,0,1428784,201968854
33480187904,100533522432,48861184,771452928,3.870,1.573,94.336,0.220,0,1433838,202303193
33480077312,100533518336,48861184,771563520,4.365,1.809,93.109,0.717,0,1465844,201965039
33480708096,100532744192,48877568,771682304,4.074,1.692,92.510,1.724,0,1449386,201965823
33480454144,100532842496,48877568,771833856,4.217,1.781,93.721,0.281,0,1454654,202331802
33480052736,100533133312,48877568,771936256,4.203,2.086,93.462,0.249,0,1419228,201704700
33480003584,100532948992,48877568,772083712,4.052,1.508,94.158,0.283,0,1629528,202111597
33479958528,100532883456,48877568,772186112,3.701,1.882,94.197,0.220,0,1505064,202260897
33480331264,100532367360,48893952,772308992,4.455,1.994,91.838,1.713,0,1489882,202305582
33480278016,100532142080,48893952,772587520,4.048,1.663,93.976,0.314,0,1503088,201938642
33480155136,100532146176,48893952,772702208,4.337,1.934,93.479,0.250,0,1407748,202019895
33480687616,100531412992,48893952,772829184,4.247,1.718,93.754,0.281,0,1492822,202165242
33481179136,100530798592,48893952,772952064,3.977,1.754,93.830,0.438,0,1482130,202188255
33480593408,100531220480,48902144,773099520,3.721,2.158,92.245,1.876,0,1473658,202313763
33481920512,100529717248,48910336,773222400,4.035,2.002,93.588,0.375,0,1488898,201993557
33481220096,100530274304,48910336,773328896,4,2,93.719,0.281,0,1488734,202089127
33480138752,100531208192,48910336,773476352,4.075,1.850,93.856,0.219,0,1437306,202164263
33481056256,100530176000,48910336,773591040,4.180,1.414,94.092,0.314,0,1476948,202243685
33471205376,100539916288,48918528,773693440,4.517,2.274,92.492,0.717,0,1471140,202149191
33470529536,100540465152,48926720,773812224,4.322,1.629,92.953,1.096,0,1446422,202043372
33469575168,100541272064,48926720,773959680,4.058,1.384,94.243,0.315,0,1434286,202074889
33468997632,100541730816,48926720,774070272,4.346,1.595,93.746,0.313,0,1448508,202170846
33469403136,100541181952,48926720,774205440,4.312,1.719,93.562,0.406,0,1444752,202156216
33469427712,100541022208,48934912,774332416,4.409,1.689,93.465,0.438,0,1415204,202003086
33469579264,100540731392,48934912,774463488,4.041,1.629,92.074,2.256,0,1456676,202226605
33469206528,100540989440,48943104,774569984,4.107,1.567,93.950,0.376,0,1352026,202174043
33468862464,100541181952,48943104,774721536,4.455,1.713,93.489,0.343,0,1459790,202174692
33469267968,100540665856,48943104,774832128,4.490,1.996,93.109,0.405,0,1490362,202281394
33468567552,100541116416,48951296,775073792,3.974,1.877,93.648,0.501,0,1458760,202271410
33467875328,100541665280,48951296,775213056,4.048,1.726,93.379,0.847,0,1480342,201959293
33468358656,100541054976,48951296,775335936,3.366,1.887,94.464,0.283,0,1486488,202134380
33468329984,100540956672,48951296,775454720,4.273,1.809,93.512,0.405,0,1463162,201024673
33471307776,100537827328,48959488,775598080,3.721,1.577,94.324,0.378,0,1494846,203115419
33471324160,100537700352,48967680,775700480,4.152,1.748,93.631,0.468,0,1482318,202406765
33471385600,100537503744,48967680,775831552,4.341,1.718,92.036,1.905,0,1463674,201998354
33472339968,100536426496,48967680,775950336,4.048,1.632,93.976,0.345,0,1456814,202203203
33471168512,100537458688,48967680,776089600,4.462,1.997,93.073,0.468,0,1449390,202052793
33471610880,100536881152,48975872,776212480,3.651,1.700,94.240,0.409,0,1431852,202123865
33473990656,100534370304,48984064,776331264,4.653,1.981,92.675,0.692,0,1466890,201991314
33474400256,100533825536,48984064,776454144,3.843,1.417,94.425,0.315,0,1490537,202228015
33475342336,100532748288,48984064,776585216,4.110,1.789,92.689,1.412,0,1477356,202129893
33475379200,100532588544,48984064,776704000,4.257,1.815,93.552,0.376,0,1479708,202237433
30987042816,103020187648,48988160,776916992,4.609,1.989,92.898,0.505,0,1437536,195692561
27015647232,106992005120,49000448,776687616,3.758,1.597,94.018,0.626,0,1299680,174337067
23823978496,110184665088,49008640,775684096,3.955,1.495,94.207,0.343,0,1154388,152542989
20636147712,113373523968,49008640,774656000,2.854,1.286,93.789,2.070,0,987802,132108836
17414135808,116596207616,49008640,773984256,2.668,1.224,95.794,0.314,0,858006,110785594
14127480832,119883694080,49008640,773152768,2.381,0.877,96.429,0.313,0,670842,89740676
10022367232,123989643264,49020928,772300800,1.756,0.815,97.115,0.314,0,487990,68189057
6582931456,127429931008,49020928,771448832,1.317,0.533,98.025,0.125,0,331370,47728265
3393437696,130620289024,49029120,770576384,0.659,0.408,97.960,0.973,0,152422,26529357
1060413440,132954189824,49029120,769699840,0.344,0.313,99.281,0.063,0,35148,6928399
1034674176,132980813824,49029120,768815104,0.094,0,99.906,0,0,346,220
1034665984,132980822016,49029120,768815104,0,0,100,0,0,528,0
1034395648,132981080064,49041408,768815104,0,0,99.844,0.156,0,768,0
1034387456,132981080064,49049600,768815104,0,0,99.875,0.125,0,752,0
1034387456,132981080064,49049600,768815104,0,0,100,0,0,1218,0
1034387456,132981080064,49049600,768815104,0,0,100,0,0,406,0
1034387456,132981080064,49049600,768815104,0.031,0,99.969,0,0,2024,0
1034129408,132981338112,49049600,768815104,0,0,100,0,0,760,0
1034121216,132981338112,49057792,768815104,0,0,99.875,0.125,0,1166,0
1034121216,132981338112,49057792,768815104,0,0,100,0,0,692,0
1033863168,132981596160,49057792,768815104,0,0,100,0,0,1808,0
1033605120,132981854208,49057792,768815104,0,0,100,0,0,586,0
1033322496,132982136832,49057792,768815104,0,0,100,0,0,528,0
1033064448,132982394880,49057792,768815104,0.031,0.062,99.906,0,0,18377,4136
1032945664,132982505472,49065984,768815104,0,0,99.906,0.094,0,22392,132
1032429568,132983021568,49065984,768815104,0,0,100,0,0,1050,132
1032171520,132983279616,49065984,768815104,0,0,100,0,0,1684,0
1032171520,132983279616,49065984,768815104,0,0,100,0,0,4758,0
1031655424,132983795712,49065984,768815104,0,0,100,0,0,2014,1006
1030864896,132984578048,49082368,768806912,0,0,99.812,0.188,0,1890,802
1030856704,132984578048,49082368,768815104,0,0,100,0,0,904,1676
1030856704,132984578048,49082368,768815104,0,0,100,0,0,692,0
1030856704,132984578048,49082368,768815104,0,0,100,0,0,934,0
1030402048,132985032704,49082368,768815104,0,0,100,0,0,620,0
1030144000,132985290752,49082368,768815104,0,0,99.062,0.938,0,1430,476
1029812224,132985614336,49090560,768815104,0,0,100,0,0,692,148
1029554176,132985872384,49090560,768815104,0,0,100,0,0,866,0
1029296128,132986130432,49090560,768815104,0,0,100,0,0,1128,580
1029296128,132986130432,49090560,768815104,0,0,100,0,0,874,0
1029038080,132986388480,49090560,768815104,0,0,100,0,0,346,0
1029038080,132986388480,49090560,768815104,0,0,99.937,0.063,0,752,0
1028771840,132986646528,49098752,768815104,0,0,99.938,0.062,0,346,148
1028513792,132986904576,49098752,768815104,0,0,100,0,0,1040,84
1028513792,132986904576,49098752,768815104,0,0,100,0,0,692,0
1028255744,132987162624,49098752,768815104,0,0,100,0,0,0,0
1028251648,132987162624,49102848,768815104,0,0.031,99.750,0.219,0,580,0
1028251648,132987162624,49102848,768815104,0,0,100,0,0,874,0
1028243456,132987162624,49111040,768815104,0,0,99.969,0.031,0,3786,0
1027469312,132987936768,49111040,768815104,0.031,0,99.969,0,0,7090,550
1027207168,132988194816,49111040,768819200,0,0,100,0,0,982,2646
1027190784,132988211200,49111040,768819200,0,0,100,0,0,226,220
1026932736,132988469248,49111040,768819200,0,0,100,0,0,806,0
1026932736,132988469248,49111040,768819200,0,0,100,0,0,242,0
1026666496,132988727296,49119232,768819200,0,0,99.938,0.062,0,466,0
1040015360,132973481984,49119232,769273856,1.282,0.657,98.061,0,0,402658,45574
1026818048,132986552320,49119232,768827392,0,0.031,99.969,0,0,2078,1632
