172.16.66.55 : 4.27 4.38 4.35 4.35 4.35 4.36 4.36 4.37 4.39 4.39
172.16.66.56 : 4.30 4.38 4.38 4.35 4.36 4.35 4.38 4.42 - 4.40
172.16.66.57 : 10.33 10.39 10.37 10.30 10.38 10.37 10.33 10.38 10.40 10.38
172.16.66.58 : 10.36 10.38 10.40 - 10.38 10.36 10.27 10.40 10.41 10.40
172.16.66.59 : 15.88 10.33 10.35 10.31 10.36 10.29 10.35 10.39 10.37 10.38
172.16.66.6  : 10.34 10.36 10.38 10.39 10.39 10.36 10.40 10.40 10.39 10.39
172.16.66.60 : 13.21 10.37 10.34 10.30 10.29 10.31 10.29 10.28 10.30 10.29
172.16.66.61 : 14.51 10.36 10.39 10.37 10.37 10.39 10.36 10.40 10.39 10.38
172.16.66.62 : 10.31 10.30 10.23 10.30 - - 10.33 10.31 10.31 10.32
172.16.66.64 : 10.37 10.38 10.37 - 10.38 10.38 10.38 10.38 10.36 10.33
172.16.66.65 : 10.22 10.27 10.26 10.29 10.34 10.31 10.34 10.32 10.30 10.35
172.16.66.66 : 10.34 10.32 10.36 10.34 10.36 10.37 10.36 10.37 10.38 10.35
172.16.66.67 : 10.29 10.31 10.37 10.37 - 10.35 10.31 10.36 10.37 10.39
172.16.66.69 : 10.38 10.39 10.38 10.39 10.36 10.38 10.37 10.39 10.38 10.31
172.16.66.7  : 0.21 0.23 0.22 0.22 0.21 0.23 0.22 0.23 0.22 0.23
172.16.66.70 : 0.21 0.22 0.23 0.22 0.22 0.23 0.22 0.21 0.19 0.19
172.16.66.71 : 0.21 0.22 0.22 0.22 0.22 0.21 0.22 0.22 0.22 0.22
172.16.66.72 : 0.21 0.22 0.22 0.22 0.22 0.23 0.22 0.22 0.22 0.21
172.16.66.73 : 0.21 0.22 0.22 0.20 0.22 0.22 0.22 0.22 0.22 0.20
172.16.66.74 : 0.21 0.23 0.21 0.21 0.22 0.19 0.21 0.22 0.22 0.21
172.16.66.75 : 0.20 0.23 0.22 0.21 0.23 0.22 0.21 0.21 0.22 0.22
172.16.66.76 : 0.19 0.22 0.23 0.22 0.21 0.21 0.23 0.23 0.22 0.24
172.16.66.77 : 0.20 0.21 0.22 0.22 0.22 0.22 0.21 0.22 0.23 0.22
172.16.66.78 : 0.18 0.22 0.22 0.21 0.21 0.22 0.21 0.21 0.22 0.21
172.16.66.79 : 0.14 0.11 0.08 0.07 0.08 0.07 0.08 0.07 0.10 0.15
172.16.66.8  : 0.03 0.03 0.03 0.01 0.03 0.04 0.03 0.03 0.03 0.03
172.16.66.80 : 7.64 4.18 4.17 4.16 4.24 4.27 4.30 4.20 4.32 4.31

      27 targets
      27 alive
       0 unreachable
       0 unknown addresses

       5 timeouts (waiting for response)
     270 ICMP Echos sent
     264 ICMP Echo Replies received
       0 other ICMP received

 0.01 ms (min round trip time)
 5.13 ms (avg round trip time)
 15.8 ms (max round trip time)
       10.133 sec (elapsed real time)

