"Dstat 0.7.3 CSV output"
"Author:","Dag Wieers <dag@wieers.com>",,,,"URL:","http://dag.wieers.com/home-made/dstat/"
"Host:","grisou-44.nancy.grid5000.fr",,,,"User:","root"
"Cmdline:","dstat -m -c -n -o dstat.csv",,,,"Date:","27 May 2020 10:04:35 CEST"
"memory usage",,,,"total cpu usage",,,,,"net/total",
"used","free","buff","cach","usr","sys","idl","wai","stl","recv","send"
1005535232,133064699904,50675712,710291456,0.933,0.210,98.722,0.135,0,0,0
1016942592,133052948480,50675712,710631424,0.687,0.187,98.002,1.124,0,391372,15016
1002897408,133067374592,50675712,710250496,0.438,0.469,99.093,0,0,386216,26368
1000562688,133069770752,50675712,710184960,1.030,0.562,98.408,0,0,6176,15594
1000554496,133069778944,50675712,710184960,0,0.031,99.969,0,0,10806,0
1002389504,133067907072,50700288,710189056,1.154,0.655,98.066,0.125,0,390042,26350
1001308160,133068976128,50704384,710197248,0,0.062,99.031,0.906,0,6672,1094
1000792064,133069492224,50704384,710197248,0,0.031,99.969,0,0,16182,0
1000792064,133069492224,50704384,710197248,0.031,0,99.969,0,0,14040,0
1000267776,133070016512,50704384,710197248,0.031,0,99.969,0,0,3174,0
1000267776,133070016512,50704384,710197248,0,0.031,99.969,0,0,4188,0
999985152,133070274560,50728960,710197248,0,0,99.875,0.125,0,3476,0
999469056,133070790656,50728960,710197248,0,0.031,99.969,0,0,2130,0
999469056,133070790656,50728960,710197248,0,0.031,99.969,0,0,1066,0
999211008,133071048704,50728960,710197248,0,0.031,99.969,0,0,466,0
998178816,133072080896,50728960,710197248,0,0,100,0,0,1158,0
998178816,133072080896,50728960,710197248,0.031,0,99.969,0,0,1638,0
997912576,133072338944,50737152,710197248,0,0,99.969,0.031,0,4178,220
1008394240,133061615616,50737152,710385664,1.124,0.625,98.251,0,0,396564,30510
1004367872,133065830400,50737152,710197248,0,0,100,0,0,4148,132
1007718400,133062246400,50737152,710430720,0.312,0.312,99.375,0,0,191526,11972
1016635392,133052923904,50737152,710799360,0.531,0.187,99.281,0,0,407672,14368
1003520000,133066485760,50737152,710352896,0.656,0.438,98.438,0.469,0,24168,16202
1006100480,133063876608,50761728,710352896,0.970,0.563,98.342,0.125,0,409976,26302
1006002176,133063974912,50761728,710352896,0,0,100,0,0,18074,0
1016324096,133053206528,50761728,710799360,0.782,0.438,98.780,0,0,389464,13306
1008246784,133061730304,50761728,710352896,0.156,0.250,99.594,0,0,39084,13308
1007464448,133062512640,50761728,710352896,0,0,99.687,0.313,0,24582,0
1008500736,133061173248,50786304,710594560,1.627,0.125,98.123,0.125,0,224346,10816
1007947776,133061963776,50786304,710356992,0,0.031,99.969,0,0,3734,2800
1007673344,133062238208,50786304,710356992,0,0,100,0,0,1024,168
1007415296,133062496256,50786304,710356992,0,0,100,0,0,812,0
1006329856,133063581696,50786304,710356992,0.469,0.125,99.406,0,0,342738,15152
1014878208,133054840832,50798592,710537216,0.312,0.125,99.532,0.031,0,179122,21308
1014923264,133054783488,50798592,710549504,0,0,100,0,0,12780,13034
1014652928,133055041536,50810880,710549504,0,0,99.969,0.031,0,12218,12642
1013870592,133055823872,50810880,710549504,0.031,0.031,99.937,0,0,13110,14322
1013854208,133055840256,50810880,710549504,0,0.031,99.562,0.406,0,12600,13352
1013329920,133056356352,50819072,710549504,0,0,99.969,0.031,0,19020,18550
1013329920,133056356352,50819072,710549504,0,0,100,0,0,13066,13132
1013329920,133056356352,50819072,710549504,0,0,100,0,0,13292,13132
1013071872,133056614400,50819072,710549504,0,0,100,0,0,12418,13328
1012555776,133057130496,50819072,710549504,0,0,100,0,0,12842,13328
1004777472,133064888320,50823168,710561792,0.031,0.031,99.500,0.438,0,1772,2220
1005539328,133064192000,50835456,710483968,0.343,0.156,99.438,0.062,0,174092,14448
1004548096,133065293824,50835456,710373376,0,0,100,0,0,66386,0
1004285952,133065551872,50835456,710377472,0,0,100,0,0,5926,2016
1004027904,133065809920,50835456,710377472,0,0,100,0,0,810,0
1003433984,133066403840,50835456,710377472,0,0,100,0,0,528,0
1003421696,133066403840,50847744,710377472,0,0,99.969,0.031,0,692,0
1003409408,133066403840,50860032,710377472,0,0,99.938,0.062,0,646,0
1003151360,133066661888,50860032,710377472,0,0,100,0,0,346,0
1002889216,133066919936,50860032,710381568,0,0,100,0,0,812,0
1002889216,133066919936,50860032,710381568,0,0,100,0,0,1038,0
1002373120,133067436032,50860032,710381568,0,0,100,0,0,1192,662
1002373120,133067436032,50860032,710381568,0,0,100,0,0,692,0
1002106880,133067694080,50868224,710381568,0,0,99.969,0.031,0,346,0
1002098688,133067702272,50868224,710381568,0,0,100,0,0,3520,1508
1002573824,133067214848,50868224,710385664,0.939,0.626,98.436,0,0,391826,30734
1001078784,133068709888,50868224,710385664,0,0,100,0,0,2774,168
1000820736,133068967936,50868224,710385664,0.031,0.031,99.938,0,0,2670,0
1000820736,133068967936,50868224,710385664,0,0,100,0,0,3334,0
1000550400,133069225984,50880512,710385664,0,0,99.938,0.062,0,3210,0
1000550400,133069225984,50880512,710385664,0,0,100,0,0,1304,336
1000280064,133069484032,50892800,710385664,0,0,99.969,0.031,0,346,0
1000022016,133069742080,50892800,710385664,0,0,100,0,0,1730,0
1000013824,133069750272,50892800,710385664,0,0,100,0,0,1098,0
999239680,133070524416,50892800,710385664,0,0,100,0,0,6282,0
998973440,133070782464,50900992,710385664,0,0,99.937,0.063,0,2604,0
998715392,133071040512,50900992,710385664,0,0,100,0,0,346,0
2495401984,131574460416,50900992,710180864,13.641,4.829,81.530,0,0,1657394,67526
5293719552,128773988352,50905088,712056832,30.013,11.376,58.611,0,0,1325414,56152
8256253952,125809922048,50921472,713424896,35.084,13.984,50.870,0.062,0,1326310,55531
11525578752,122539122688,50925568,714743808,37.158,13.612,49.167,0.063,0,1491910,62008
14676271104,119386599424,51015680,716378112,35.044,13.530,50.032,1.394,0,1436662,57652
17745072128,116316020736,51036160,717959168,35.353,13.689,50.706,0.251,0,1397430,59641
20748189696,113311412224,51044352,719327232,37.097,12.637,50.172,0.094,0,1450558,568890
23919841280,110138212352,51064832,720801792,43.606,11.936,44.174,0.284,0,1379198,2042568
26850697216,107205754880,51089408,722300928,39.621,13.849,46.372,0.158,0,1579892,2382089
29930983424,104124710912,51109888,722976768,44.704,13.052,42.024,0.221,0,652112,2538070
30606766080,103448580096,51109888,723283968,16.604,2.617,80.498,0.280,0,203334,3165664
30903754752,103151521792,51122176,723341312,15.087,1.859,82.652,0.403,0,116038,4160201
31103889408,102951317504,51122176,723406848,14.645,1.458,83.432,0.465,0,344056,4655540
31330308096,102724804608,51122176,723488768,17.077,1.807,80.586,0.530,0,259956,5524929
31534776320,102520250368,51130368,723566592,19.084,1.639,77.606,1.670,0,171490,5512652
31745941504,102308986880,51130368,723664896,20.630,2.139,76.834,0.397,0,131840,5471527
31887384576,102167465984,51130368,723742720,17.452,1.592,80.549,0.406,0,148884,4836540
32024432640,102030307328,51130368,723849216,17.720,2.024,79.757,0.498,0,105740,4463148
32102752256,101951909888,51130368,723927040,15.549,1.824,82.164,0.464,0,131852,4148132
32204734464,101849821184,51138560,724025344,16.842,2.074,80.279,0.805,0,102308,4224436
32213344256,101840809984,51232768,724324352,12.589,2.207,72.956,12.247,0,132734,4002224
32178774016,101875294208,51232768,724410368,8.705,1.456,84.665,5.173,0,92680,3738954
32146030592,101907927040,51232768,724520960,7.789,1.095,90.647,0.469,0,92214,3917556
32121888768,101931982848,51232768,724606976,7.507,1.720,90.366,0.407,0,89466,3720452
32075272192,101978501120,51240960,724697088,7.846,1.231,90.246,0.677,0,89696,3605386
32078024704,101975638016,51240960,724807680,8.944,1.465,89.187,0.405,0,84900,3283928
32081965056,101971591168,51249152,724905984,6.789,1.059,91.747,0.405,0,114942,3451270
32080044032,101973422080,51249152,724996096,7.493,0.999,91.133,0.375,0,83972,3592684
32079290368,101973946368,51249152,725213184,6.519,0.624,92.483,0.374,0,114760,3614206
32079708160,101973413888,51257344,725319680,6.964,0.906,91.474,0.656,0,92076,3729626
32082186240,101970849792,51257344,725405696,7.364,0.897,91.306,0.433,0,88518,3522086
32085590016,101967331328,51257344,725512192,5.932,1.056,92.640,0.373,0,117586,3417914
32085889024,101966946304,51257344,725598208,5.958,0.878,92.788,0.376,0,85424,3483658
32087756800,101964976128,51257344,725700608,5.723,0.995,92.846,0.435,0,113220,3579306
32094466048,101958156288,51265536,725803008,7.074,1.346,91.142,0.438,0,83952,3629786
32107749376,101944774656,51265536,725901312,5.524,1.130,92.969,0.377,0,86494,3698012
32115150848,101937270784,51265536,726003712,4.491,1.162,92.211,2.136,0,90168,3624602
32113971200,101938352128,51265536,726102016,5.968,1.554,92.042,0.435,0,125590,3573556
32120401920,101931827200,51265536,726196224,7.136,1.377,91.017,0.469,0,93320,3836348
32124866560,101927231488,51273728,726310912,6.191,1.001,92.308,0.500,0,86930,3786044
32126898176,101925126144,51273728,726376448,5.020,0.935,93.670,0.374,0,90374,3611954
32127180800,101924708352,51273728,726507520,6.256,1.146,90.957,1.641,0,116370,3631158
32128880640,101922938880,51273728,726577152,5.688,0.938,92.125,1.250,0,92960,3694620
32134365184,101917315072,51273728,726679552,5.772,1.004,92.817,0.408,0,120776,3655632
32137564160,101914001408,51281920,726786048,5.770,1.622,92.046,0.561,0,89534,3604408
32137236480,101914222592,51281920,726884352,5.421,0.935,93.209,0.436,0,113290,3487336
32137945088,101913419776,51281920,726978560,5.359,0.595,93.576,0.470,0,85730,3611648
32144089088,101907169280,51281920,727080960,6.425,1.310,89.145,3.119,0,90734,3872456
32145244160,101905928192,51281920,727162880,4.251,0.567,94.836,0.346,0,90354,3849428
32148217856,101902663680,51290112,727404544,4.493,0.749,94.290,0.468,0,94956,3823624
32147394560,101903392768,51290112,727498752,5.488,0.972,93.289,0.251,0,93554,3867548
32157048832,101893619712,51290112,727609344,5.123,1.131,93.432,0.314,0,99382,3778934
32158564352,101892042752,51290112,727666688,5.637,1.028,91.342,1.993,0,382102,3709038
32160776192,101889679360,51298304,727801856,5.091,0.937,93.629,0.344,0,86628,3481208
32163155968,101887197184,51306496,727896064,6.012,1.620,91.651,0.717,0,84042,3246054
32162471936,101887778816,51306496,727994368,5.252,0.813,93.560,0.375,0,86870,3355754
32163315712,101886844928,51306496,728084480,5.600,1.238,92.822,0.340,0,93868,3245706
32166412288,101883650048,51306496,728182784,6.665,1.433,91.436,0.467,0,100172,3415170
32170651648,101879324672,51306496,728268800,6.042,0.747,92.681,0.529,0,104714,3436838
32173821952,101876133888,51314688,728358912,6.594,0.875,92.094,0.438,0,108232,3604618
32175964160,101873872896,51314688,728477696,6.698,0.685,92.150,0.467,0,89894,3423936
32178569216,101871140864,51314688,728600576,7.635,1.055,90.999,0.310,0,102368,3547116
32180305920,101869305856,51314688,728690688,7.913,1.713,90.093,0.280,0,107112,3690792
32185274368,101864222720,51314688,728793088,8.161,1.157,88.649,2.033,0,127704,3427562
32183738368,101865656320,51331072,728875008,8.015,1.212,90.183,0.590,0,95808,3573030
32186851328,101862404096,51331072,729010176,7.358,1.335,90.966,0.342,0,124078,3449888
32187760640,101861412864,51331072,729088000,8.780,1.276,89.633,0.311,0,141622,3393280
32188452864,101860614144,51331072,729194496,6.854,0.966,91.900,0.280,0,130656,3397008
32190644224,101858193408,51331072,729419776,7.383,0.997,86.573,5.047,0,93516,3412482
32191324160,101857345536,51355648,729513984,6.062,0.754,89.824,3.361,0,125034,3495754
32214192128,101834375168,51355648,729616384,8.995,1.484,89.243,0.278,0,134210,3633460
32254607360,101793882112,51355648,729694208,8.268,1.373,89.984,0.374,0,97926,3816378
32330203136,101718159360,51355648,729817088,10.350,1.126,88.149,0.375,0,86316,3827330
32373100544,101675155456,51355648,729923584,8.527,1.567,89.498,0.408,0,88696,3752450
32405692416,101642469376,51372032,729997312,7.125,0.942,91.243,0.691,0,86248,3673188
32452825088,101595238400,51372032,730095616,10.159,1.496,88.002,0.343,0,95190,3900612
32507834368,101540147200,51372032,730177536,9.202,1.127,89.296,0.376,0,89176,3814364
32546951168,101500895232,51372032,730304512,9.009,0.842,89.744,0.405,0,88452,3717200
32589123584,101458640896,51372032,730378240,7.364,0.877,89.251,2.507,0,85474,3669200
32653107200,101394534400,51380224,730488832,11.704,0.941,85.974,1.381,0,87650,3495758
32658112512,101389422592,51380224,730587136,7.069,0.970,91.617,0.344,0,91804,3274064
32653565952,101393858560,51380224,730693632,5.835,0.874,92.949,0.343,0,79078,3088944
32654336000,101392986112,51380224,730791936,5.549,0.592,93.516,0.343,0,75668,3068752
32649216000,101398016000,51380224,730877952,4.068,0.694,94.923,0.315,0,75206,3189622
32643608576,101403500544,51388416,730988544,4.768,0.695,93.211,1.326,0,87230,3236158
32638930944,101408079872,51388416,731086848,5.118,0.691,93.909,0.283,0,76740,3203992
32639475712,101407432704,51388416,731189248,5.332,0.690,93.695,0.282,0,81166,3402968
32632451072,101414371328,51388416,731267072,6.006,0.782,92.868,0.344,0,82292,3399536
32632967168,101413756928,51388416,731365376,5.044,0.725,93.884,0.347,0,78654,3186592
32626749440,101419700224,51404800,731607040,4.483,0.658,91.693,3.166,0,82844,3429558
32622665728,101423702016,51404800,731680768,7.040,0.688,91.990,0.282,0,81962,3500726
32619622400,101426630656,51404800,731791360,4.818,0.870,94.063,0.249,0,87182,3818692
32620040192,101426118656,51404800,731885568,5.421,0.693,93.665,0.221,0,89406,3816986
32619929600,101426118656,51404800,731996160,4.514,0.627,94.639,0.219,0,85960,3520890
32619741184,101426188288,51412992,732102656,4.671,0.784,93.574,0.972,0,82418,3482872
32620101632,101425745920,51412992,732180480,5.798,0.971,92.949,0.282,0,82106,3445136
32619167744,101426573312,51412992,732282880,4.326,0.568,94.601,0.505,0,78870,3308682
32620007424,101425635328,51412992,732381184,5.421,0.909,93.325,0.345,0,78798,3197240
32621248512,101424316416,51412992,732454912,3.990,0.660,95.005,0.346,0,72894,3014318
32620859392,101424570368,51429376,732573696,5.457,1.185,89.679,3.679,0,106738,3150640
32620240896,101425090560,51429376,732672000,5.906,0.625,93.125,0.344,0,83754,3611362
32620322816,101424893952,51429376,732782592,5.201,0.783,93.672,0.345,0,121798,3897780
32620699648,101424443392,51429376,732856320,5.378,0.813,93.527,0.281,0,101414,4130104
32620605440,101424439296,51429376,732950528,3.344,0.694,95.647,0.315,0,128574,4168474
32621498368,101423415296,51437568,733069312,6.834,1.180,91.550,0.435,0,102044,4369946
32625278976,101419544576,51437568,733159424,5.377,0.597,91.415,2.610,0,132812,4423194
32626089984,101418635264,51437568,733257728,5.530,0.594,93.502,0.375,0,101278,4284702
32626749440,101417893888,51437568,733339648,4.984,1.153,93.551,0.312,0,101320,4325346
32625819648,101418696704,51437568,733462528,6.095,0.777,92.724,0.404,0,121178,4048640
32626843648,101417570304,51445760,733556736,5.884,0.908,92.488,0.720,0,99418,4002170
32627388416,101416927232,51453952,733642752,4.659,0.876,92.308,2.158,0,95672,4088000
32628002816,101416214528,51453952,733736960,5.704,0.992,92.901,0.403,0,94630,3843214
32627851264,101416251392,51453952,733847552,4.804,0.691,94.003,0.502,0,90192,3817958
32626765824,101417222144,51453952,733962240,4.197,0.820,94.604,0.379,0,91514,3594772
32627818496,101416075264,51462144,734040064,4.805,0.942,93.719,0.534,0,100700,3692910
32627847168,101415960576,51462144,734121984,5.604,0.809,92.621,0.965,0,86656,3485174
32628822016,101414866944,51462144,734240768,4.642,0.847,94.166,0.345,0,95896,3299818
32629780480,101413793792,51462144,734355456,5.524,0.691,93.440,0.345,0,96804,3422746
32632086528,101411381248,51462144,734457856,4.639,0.841,94.054,0.467,0,82050,3144382
32632602624,101410770944,51470336,734543872,3.913,0.694,94.572,0.820,0,77290,3151854
32633143296,101410041856,51474432,734715904,5.698,1.378,90.232,2.693,0,80526,3386998
32633262080,101409816576,51478528,734818304,5.016,0.658,93.981,0.345,0,84528,3520938
32633331712,101409624064,51478528,734932992,4.865,0.973,93.848,0.314,0,80286,3260162
32633266176,101409599488,51478528,735019008,4.950,1.059,93.587,0.405,0,138570,3248602
32635015168,101407727616,51486720,735125504,6.229,0.872,91.934,0.965,0,82062,3388402
32634372096,101408149504,51486720,735342592,4.036,0.876,94.618,0.469,0,138746,3144390
32634753024,101407633408,51486720,735473664,4.774,0.879,85.616,8.731,0,76696,3160976
32636915712,101405384704,51486720,735559680,3.941,0.883,94.767,0.410,0,144338,3264546
32639111168,101403013120,51486720,735662080,5.397,0.941,93.254,0.408,0,96891,3603058
32641024000,101400985600,51494912,735764480,5.533,0.875,92.154,1.438,0,151722,3793018
32643121152,101398790144,51494912,735862784,6.190,1.182,92.255,0.373,0,92294,3865634
32644759552,101396885504,51503104,736116736,4.699,0.783,92.011,2.506,0,89206,3780948
32645255168,101396307968,51503104,736198656,3.739,1.184,94.702,0.374,0,87196,3667338
32646672384,101394788352,51503104,736301056,6.363,1.154,92.077,0.405,0,104328,3954646
32647561216,101393776640,51511296,736407552,4.905,0.625,93.377,1.093,0,90280,3722652
32647782400,101393457152,51511296,736505856,4.303,0.565,94.881,0.251,0,118648,3723048
32649232384,101391880192,51515392,736616448,6.158,1.068,91.706,1.068,0,102096,3895478
32650276864,101390745600,51515392,736702464,5.217,1.093,93.346,0.344,0,228982,4240718
32651636736,101389283328,51515392,736804864,4.243,1.092,94.353,0.312,0,360522,3794304
32651186176,101389606912,51523584,736923648,5.999,0.989,92.393,0.618,0,352072,3726288
32652378112,101388349440,51523584,736985088,4.178,0.935,94.637,0.249,0,129656,3515256
32653824000,101386764288,51527680,737116160,5.960,1.066,90.590,2.384,0,117366,3597084
32653492224,101386997760,51531776,737206272,4.806,0.718,94.101,0.375,0,80266,3393016
32653238272,101387157504,51531776,737300480,4.389,1.034,94.295,0.282,0,95900,3623164
32654553088,101385736192,51539968,737398784,6.750,1.151,91.571,0.529,0,86452,3685208
32656297984,101383868416,51539968,737521664,5.091,1.031,93.473,0.406,0,88726,3649510
32656670720,101383393280,51539968,737624064,5.748,0.781,93.096,0.375,0,91574,3415924
32658112512,101381836800,51539968,737734656,4.463,0.624,92.228,2.684,0,86770,3365984
32659451904,101380419584,51539968,737808384,3.212,0.819,95.529,0.441,0,87446,3575018
32660672512,101379088384,51548160,737910784,6.115,0.847,92.286,0.753,0,101370,3791300
32661463040,101378170880,51548160,738029568,4.925,1.278,93.485,0.312,0,165518,3859240
32663236608,101376282624,51548160,738131968,5.950,0.841,92.928,0.280,0,325528,3842036
32663830528,101375586304,51556352,738226176,4.630,0.850,92.346,2.173,0,503868,3701658
32663625728,101375549440,51556352,738463744,3.859,0.816,95.011,0.314,0,496850,3728936
32664219648,101374836736,51564544,738570240,4.973,0.970,93.119,0.938,0,409888,3631436
32661245952,101377708032,51564544,738664448,5.899,0.687,93.009,0.406,0,246210,3693400
32661766144,101377052672,51564544,738762752,3.947,1.003,94.643,0.407,0,185328,3649228
32662388736,101376331776,51564544,738861056,5.009,1.058,93.030,0.902,0,171246,3459896
32663277568,101375340544,51564544,738955264,6.764,0.935,92.020,0.281,0,107020,3306896
32663801856,101374697472,51572736,739065856,5.139,0.997,93.367,0.498,0,135078,3458510
32664526848,101373857792,51572736,739180544,5.443,0.778,93.437,0.342,0,86594,3500366
32666398720,101371899904,51572736,739266560,3.608,0.659,95.450,0.282,0,119068,3578834
32665899008,101372276736,51572736,739377152,4.891,0.841,91.589,2.679,0,104064,3636970
32667058176,101371019264,51580928,739467264,5.137,0.662,93.886,0.315,0,151356,3643450
32667688960,101370286080,51589120,739549184,4.624,0.812,93.814,0.750,0,233770,3549990
32667389952,101370454016,51589120,739676160,6.213,0.901,92.606,0.280,0,202456,3548414
32668774400,101368901632,51589120,739774464,5.255,0.719,93.775,0.250,0,277003,3583468
32668401664,101369163776,51589120,739885056,5.635,1.059,92.995,0.311,0,175763,3637254
32669437952,101368033280,51589120,739979264,3.890,0.690,90.590,4.831,0,134696,3672586
32669417472,101367939072,51597312,740081664,4.718,0.503,94.086,0.692,0,124646,3750914
32670724096,101366550528,51597312,740163584,6.843,0.964,91.913,0.280,0,115346,3437746
32671875072,101365288960,51597312,740270080,4.728,1.089,93.966,0.218,0,87562,3231328
32671768576,101365293056,51597312,740372480,4.684,0.754,94.279,0.283,0,83038,3370498
32672129024,101364805632,51597312,740495360,5.595,0.813,91.591,2.001,0,82306,3424704
32672755712,101364068352,51613696,740589568,4.814,0.932,93.634,0.621,0,89534,3576260
32672940032,101363646464,51613696,740827136,4.258,1.221,94.239,0.282,0,87176,3571450
32674115584,101362384896,51613696,740913152,4.317,0.719,94.620,0.344,0,88860,3471274
32674230272,101362159616,51613696,741023744,5.535,1.220,92.933,0.313,0,90562,3511092
32675467264,101360807936,51613696,741138432,5.197,0.877,92.987,0.939,0,91188,3391558
32676360192,101359808512,51621888,741236736,3.713,0.718,94.758,0.811,0,84778,3376442
32677261312,101358809088,51621888,741335040,5.384,0.787,93.419,0.409,0,80534,3419464
32677150720,101358837760,51621888,741416960,4.753,0.938,93.934,0.375,0,85506,3651164
32676724736,101359132672,51621888,741543936,3.961,0.912,94.782,0.346,0,88236,3617818
32677888000,101357875200,51621888,741638144,6.571,0.934,89.754,2.741,0,84902,3550064
32678658048,101357002752,51638272,741720064,4.665,0.720,93.801,0.814,0,84842,3541452
32679059456,101356482560,51638272,741830656,4.607,0.752,94.328,0.313,0,82216,3296022
32679596032,101355843584,51638272,741928960,5.003,0.594,94.059,0.344,0,81838,3455070
32680804352,101354520576,51638272,742039552,5.582,1.129,92.976,0.314,0,85896,3560560
32681824256,101353418752,51638272,742117376,4.980,0.564,94.175,0.282,0,91200,3697922
32683167744,101351936000,51646464,742248448,4.696,0.908,87.977,6.418,0,88966,3776598
32683089920,101351907328,51646464,742350848,4.870,0.943,93.779,0.408,0,93318,3759848
32683962368,101350944768,51646464,742436864,4.013,0.596,95.078,0.313,0,96580,3844164
32683204608,101351452672,51646464,742682624,5.507,0.871,93.311,0.311,0,93700,3760376
32683319296,101351235584,51646464,742776832,4.981,0.872,93.773,0.374,0,95318,3753196
32685637632,101348806656,51662848,742866944,5.802,1.341,92.202,0.655,0,93210,3532690
32686940160,101347385344,51662848,742977536,3.710,0.692,95.316,0.283,0,89826,3679930
32689250304,101344866304,51662848,743084032,5.327,1.034,93.325,0.313,0,149134,3601322
32689815552,101344145408,51662848,743194624,5.038,0.939,93.680,0.344,0,99788,3489082
32690360320,101343502336,51662848,743288832,4.925,1.004,93.726,0.345,0,114912,3605664
32689229824,101344542720,51671040,743370752,6.752,0.871,89.639,2.738,0,88598,3602708
32690069504,101343592448,51671040,743481344,4.696,0.751,94.239,0.313,0,115528,3596930
32689233920,101344309248,51671040,743596032,4.329,0.565,94.762,0.345,0,100898,3874868
32689156096,101344272384,51679232,743698432,3.885,0.821,94.820,0.474,0,121124,3831062
32695066624,101338271744,51679232,743784448,5.827,0.966,92.864,0.343,0,103348,3897900
32695083008,101338144768,51687424,743882752,5.807,0.874,92.132,1.186,0,100274,3935788
32696913920,101336203264,51687424,743981056,4.693,0.814,94.118,0.375,0,95050,3964294
32697294848,101335707648,51687424,744095744,4.008,0.536,95.046,0.410,0,93008,3944054
32697212928,101335678976,51687424,744206336,5.521,0.749,93.356,0.374,0,92836,3867868
32698634240,101334159360,51687424,744300544,4.877,0.598,94.273,0.252,0,91136,3661850
32697917440,101334806528,51695616,744361984,5.472,1.032,88.618,4.878,0,83546,3382748
32699338752,101333217280,51703808,744517632,4.513,0.877,93.826,0.783,0,83662,3427222
32701763584,101330575360,51703808,744734720,5.013,1.003,93.484,0.501,0,80946,3351160
32702517248,101329719296,51703808,744837120,5.346,0.818,93.396,0.440,0,84360,3552716
32702713856,101329432576,51703808,744927232,3.753,0.788,95.049,0.410,0,88430,3499598
32701911040,101330112512,51712000,745041920,5.161,1.157,93.025,0.657,0,91038,3728396
32702832640,101329076224,51712000,745156608,4.908,0.994,93.538,0.559,0,95716,4110240
32703307776,101328523264,51712000,745234432,5.796,0.935,92.895,0.374,0,96148,4017038
32704847872,101326884864,51712000,745332736,4.617,0.974,93.938,0.471,0,97444,3929208
32705257472,101326376960,51712000,745431040,5.148,1.030,93.448,0.374,0,90888,3664444
32706420736,101325107200,51720192,745529344,4.882,0.850,93.701,0.567,0,89128,3354794
32707010560,101324378112,51728384,745660416,5.758,1.152,89.916,3.175,0,96756,3564270
32709935104,101321338880,51728384,745766912,5.739,1.092,92.888,0.281,0,103074,3716682
32710881280,101320282112,51728384,745861120,3.968,0.875,94.877,0.281,0,91638,3846566
32711553024,101319495680,51728384,745971712,5.177,0.659,93.850,0.314,0,88416,3746510
32713134080,101317816320,51736576,746061824,4.980,0.814,93.611,0.595,0,100012,3669072
30364786688,103665491968,51736576,746180608,4.207,0.785,93.626,1.381,0,92262,3489016
26449887232,107580739584,51736576,745832448,5.704,0.868,93.118,0.310,0,79606,3198246
23310585856,110721310720,51736576,744603648,3.993,0.655,95.197,0.156,0,73762,2964980
20168712192,113864011776,51736576,743784448,4.466,0.781,94.597,0.156,0,91730,2741922
16946216960,117087354880,51748864,742961152,4.084,0.779,94.545,0.592,0,55316,2310892
12947722240,121086369792,51748864,742481920,2.544,0.628,95.697,1.131,0,46814,1834094
9738194944,124297216000,51761152,741187584,1.470,0.500,97.216,0.813,0,34102,1238048
6569345024,127466729472,51761152,740564992,1.375,0.625,97.969,0.031,0,54474,883324
3463544832,130573234176,51761152,739909632,1.312,0.281,98.126,0.281,0,17932,513956
1063690240,132974436352,51773440,738590720,0.219,0.157,99.530,0.094,0,36916,173936
1036795904,133001814016,51773440,738148352,0.094,0.062,99.844,0,0,5532,51914
1036521472,133002309632,51773440,737927168,0,0,99.500,0.500,0,15858,0
1035714560,133003116544,51773440,737927168,0,0,100,0,0,15540,1092
1035456512,133003374592,51773440,737927168,0,0,100,0,0,34356,1008
1035456512,133003374592,51773440,737927168,0,0,100,0,0,4386,0
1034670080,133004148736,51785728,737927168,0,0,99.875,0.125,0,2440,0
1034661888,133004156928,51785728,737927168,0,0,100,0,0,598,78
1034145792,133004673024,51789824,737923072,0,0,99.875,0.125,0,4020,132
1033883648,133004931072,51789824,737927168,0,0,100,0,0,25154,0
1033625600,133005189120,51789824,737927168,0.031,0,99.969,0,0,58586,0
1033625600,133005189120,51789824,737927168,0.031,0,99.969,0,0,127618,2472
1031811072,133006995456,51798016,737927168,0.031,0.031,99.906,0.031,0,127508,4050
1031802880,133007003648,51798016,737927168,0.063,0.031,99.906,0,0,111798,2684
1031286784,133007519744,51798016,737927168,0.031,0.031,99.937,0,0,97316,1008
1030770688,133008035840,51798016,737927168,0,0,100,0,0,12648,1008
1030766592,133008035840,51798016,737931264,0,0,100,0,0,33058,1008
1030561792,133008240640,51798016,737931264,0,0,100,0,0,3924,0
1030295552,133008498688,51806208,737931264,0,0,99.969,0.031,0,7224,0
1030037504,133008756736,51806208,737931264,0,0,100,0,0,7942,0
1029521408,133009272832,51806208,737931264,0,0,100,0,0,2518,0
1029521408,133009272832,51806208,737931264,0,0,100,0,0,30738,0
1029263360,133009530880,51806208,737931264,0,0,100,0,0,3500,662
1029005312,133009788928,51806208,737931264,0,0,100,0,0,28806,0
1028669440,133010116608,51814400,737931264,0,0,99.938,0.062,0,3604,0
1028669440,133010116608,51814400,737931264,0,0,100,0,0,8614,0
1028669440,133010116608,51814400,737931264,0,0,100,0,0,3700,0
1028411392,133010374656,51814400,737931264,0,0,99.937,0.063,0,32272,84
1028120576,133010665472,51814400,737931264,0,0.031,99.437,0.531,0,3920,234
1028120576,133010665472,51814400,737931264,0,0,100,0,0,24984,468
1028112384,133010665472,51822592,737931264,0,0,99.906,0.094,0,4752,468
1028112384,133010665472,51822592,737931264,0,0,100,0,0,12576,702
1027854336,133010923520,51822592,737931264,0,0,100,0,0,39918,624
1027596288,133011181568,51822592,737931264,0,0,100,0,0,12186,1024
1027338240,133011439616,51822592,737931264,0,0,100,0,0,68314,1062
1027338240,133011439616,51822592,737931264,0,0,100,0,0,10970,648
1043603456,132994977792,51830784,737931264,1.124,0.187,98.626,0.062,0,473932,18986
1037496320,132998516736,51830784,738050048,0.594,0.500,98.907,0,0,204498,41426
