172.16.66.10  : 4.33 4.34 4.32 4.35 - 4.35 4.32 4.37 4.38 4.39
172.16.66.106 : 4.40 4.39 4.39 4.31 4.33 4.40 4.39 4.38 4.37 4.42
172.16.66.109 : 4.32 4.37 4.37 4.40 4.26 4.38 4.39 4.39 4.36 4.39
172.16.66.110 : 4.40 4.39 4.41 4.39 4.35 4.41 4.42 4.38 4.36 4.26
172.16.66.113 : 4.40 4.39 4.41 4.39 4.38 4.41 4.38 4.39 4.35 4.39
172.16.66.114 : 4.32 4.40 4.39 4.39 4.31 4.40 4.41 4.34 4.33 4.34
172.16.66.49  : 0.21 0.21 0.21 0.21 0.14 0.21 0.21 0.17 0.21 0.21
172.16.66.5   : 0.21 0.22 0.19 0.19 0.19 0.21 0.21 0.18 0.21 0.22
172.16.66.50  : 0.03 0.03 0.03 0.03 0.03 0.03 0.03 0.03 0.03 0.03
172.16.66.51  : 0.22 0.22 0.23 0.24 0.22 0.22 0.22 0.21 0.22 0.22
172.16.66.52  : 4.38 4.39 4.37 4.28 4.27 4.26 4.26 4.26 4.23 4.27

      11 targets
      11 alive
       0 unreachable
       0 unknown addresses

       1 timeouts (waiting for response)
     110 ICMP Echos sent
     109 ICMP Echo Replies received
       0 other ICMP received

 0.03 ms (min round trip time)
 2.81 ms (avg round trip time)
 4.42 ms (max round trip time)
       10.012 sec (elapsed real time)

