"Dstat 0.7.3 CSV output"
"Author:","Dag Wieers <dag@wieers.com>",,,,"URL:","http://dag.wieers.com/home-made/dstat/"
"Host:","parasilo-7.rennes.grid5000.fr",,,,"User:","root"
"Cmdline:","dstat -m -c -n -o dstat.csv",,,,"Date:","22 Jun 2020 23:53:36 CEST"
"memory usage",,,,"total cpu usage",,,,,"net/total",
"used","free","buff","cach","usr","sys","idl","wai","stl","recv","send"
859668480,133245669376,48406528,669216768,0.936,0.241,98.605,0.218,0,0,0
854355968,133250605056,48406528,669560832,0.906,0.562,98.532,0,0,395164,33260
875614208,133229318144,48406528,669585408,0.563,0.188,99.249,0,0,385924,13120
852910080,133252489216,48406528,669118464,0.281,0.344,99.375,0,0,3008,7496
867008512,133237911552,48431104,669569024,0.532,0.219,98.404,0.845,0,384348,12096
853397504,133251969024,48431104,669122560,0.344,0.406,98.844,0.406,0,3430,6272
853807104,133251543040,48443392,669122560,0,0,99.937,0.063,0,234,0
853737472,133251612672,48443392,669122560,0,0,100,0,0,288,0
853737472,133251612672,48443392,669122560,0,0,100,0,0,182,0
853725184,133251612672,48455680,669122560,0,0,99.969,0.031,0,272,0
853467136,133251870720,48455680,669122560,0,0,100,0,0,0,0
861863936,133243473920,48463872,669114368,0.219,0.094,99.656,0.031,0,389000,18484
850788352,133254537216,48463872,669122560,0.657,0.500,98.843,0,0,4372,6924
858898432,133246238720,48463872,669310976,0.188,0.188,99.624,0,0,166084,9496
867246080,133237624832,48463872,669573120,0.813,0.594,98.592,0,0,392494,23244
852623360,133252694016,48463872,669126656,0.063,0.031,99.906,0,0,2254,12576
858243072,133246853120,48488448,669306880,0.875,0.562,98.469,0.094,0,385940,16560
856420352,133248843776,48488448,669134848,0,0,100,0,0,1950,1668
853590016,133251227648,48488448,669581312,0.907,0.532,98.562,0,0,389204,20648
853159936,133252104192,48488448,669134848,0,0,100,0,0,106,132
885440512,133219680256,48488448,669278208,0.812,0.156,98.283,0.749,0,222540,9172
856162304,133249101824,48488448,669134848,0.969,0.125,98.906,0,0,3390,4972
856113152,133249126400,48513024,669134848,0,0,99.906,0.094,0,0,0
862269440,133242892288,48513024,669212672,0.595,0.344,99.061,0,0,514310,29396
861892608,133243158528,48513024,669323264,0,0.125,99.875,0,0,5096,5390
861634560,133243416576,48513024,669323264,0,0,100,0,0,5072,5488
861376512,133243674624,48513024,669323264,0,0,100,0,0,5512,5488
861376512,133243674624,48513024,669323264,0,0,100,0,0,5618,5390
861351936,133243674624,48537600,669323264,0.031,0.031,99.844,0.094,0,5868,6244
861351936,133243674624,48537600,669323264,0,0,100,0,0,7216,6986
861351936,133243674624,48537600,669323264,0,0,100,0,0,5496,5668
861351936,133243674624,48537600,669323264,0,0,100,0,0,5500,5654
860835840,133244190720,48537600,669323264,0,0,100,0,0,5096,5488
852799488,133252407296,48537600,669143040,0.031,0,99.969,0,0,3050,3280
853155840,133252050944,48549888,669130752,0.281,0.062,99.625,0.031,0,172164,14432
852754432,133252435968,48549888,669147136,0,0,99.937,0.063,0,288,0
852754432,133252435968,48549888,669147136,0,0,99.750,0.250,0,0,0
852754432,133252435968,48549888,669147136,0,0,100,0,0,288,0
852496384,133252694016,48549888,669147136,0,0,100,0,0,0,0
852496384,133252694016,48549888,669147136,0,0,100,0,0,106,0
852471808,133252694016,48574464,669147136,0,0,99.906,0.094,0,234,0
852471808,133252694016,48574464,669147136,0,0,99.875,0.125,0,106,0
850702336,133254463488,48574464,669147136,0.876,0.563,98.560,0,0,392390,33588
850661376,133254504448,48574464,669147136,0,0.031,99.969,0,0,288,2696
850378752,133254787072,48574464,669147136,0,0,100,0,0,0,0
850370560,133254795264,48574464,669147136,0,0,100,0,0,574,0
850092032,133255061504,48586752,669147136,0.031,0,99.937,0.031,0,0,0
850079744,133255061504,48599040,669147136,0,0,99.969,0.031,0,394,84
850079744,133255061504,48599040,669147136,0,0,100,0,0,0,0
850079744,133255061504,48599040,669147136,0,0,100,0,0,340,0
850079744,133255061504,48599040,669147136,0,0,100,0,0,234,0
850079744,133255061504,48599040,669147136,0,0,100,0,0,106,0
850071552,133255061504,48607232,669147136,0,0,99.969,0.031,0,348,180
1557655552,132547567616,48607232,668934144,7.090,2.519,90.392,0,0,1324514,59768
4486041600,129617530880,48607232,670289920,30.584,12.465,56.951,0,0,1332724,66380
7430787072,126671208448,48607232,671784960,32.358,13.616,53.994,0.031,0,1332870,64348
10629566464,123471036416,48607232,673062912,32.091,14.152,53.663,0.094,0,1333498,68267
13491597312,120607371264,48676864,674529280,32.398,11.787,55.036,0.780,0,1331888,66096
16517230592,117580230656,48701440,675844096,32.915,12.394,54.534,0.157,0,1335388,69408
19333951488,114762076160,48709632,677175296,34.141,11.463,54.334,0.062,0,1338194,545547
22332710912,111761649664,48713728,678662144,36.481,13.331,50.031,0.157,0,1382720,4207074
25259532288,108833239040,48717824,680140800,38.248,13.075,48.519,0.158,0,1117310,5150975
27985256448,106106122240,48734208,681373696,37.676,11.559,50.234,0.531,0,1393390,4069109
30392860672,103697760256,48750592,682004480,35.483,10.695,52.721,1.101,0,445962,5698212
30922076160,103168495616,48750592,682057728,18.481,2.078,79.194,0.248,0,120312,5838035
31126786048,102963720192,48750592,682123264,13.706,1.280,84.608,0.406,0,115286,5775313
31331442688,102758985728,48750592,682201088,17.251,1.221,81.183,0.344,0,134390,7576857
31484145664,102606217216,48754688,682262528,15.714,1.242,82.671,0.373,0,174584,10859180
31638810624,102451150848,48885760,682524672,18.012,1.584,71.304,9.099,0,198756,10660976
31807414272,102282436608,48885760,682631168,19.856,1.780,74.649,3.715,0,182784,8923616
31915978752,102173782016,48885760,682721280,16.272,1.559,81.671,0.499,0,163304,7247606
32036220928,102053453824,48885760,682807296,17.441,1.983,79.833,0.743,0,149864,6906030
32104747008,101984821248,48885760,682913792,15.406,2.583,81.201,0.809,0,151626,6808906
32217047040,101872402432,48902144,683012096,17.015,2.618,79.152,1.215,0,149274,6714348
32166125568,101923094528,48902144,683237376,10.099,1.425,88.042,0.434,0,151142,6720460
32115716096,101973377024,48902144,683323392,7.291,1.086,91.250,0.372,0,132794,6033394
32102330368,101986652160,48902144,683429888,7.985,1.372,90.143,0.499,0,133482,5926674
32065318912,102023561216,48906240,683528192,6.608,0.908,92.014,0.470,0,139870,6332046
32043999232,102044770304,48910336,683618304,7.286,1.188,90.838,0.688,0,149528,6876652
32055029760,102033633280,48910336,683720704,5.755,0.845,91.617,1.783,0,151898,6821410
32059531264,102029041664,48910336,683810816,8.560,0.927,89.648,0.865,0,146246,6643484
32051998720,102036459520,48910336,683925504,6.236,0.748,92.080,0.935,0,146902,6815838
32054996992,102033367040,48914432,684011520,7.351,1.564,90.272,0.813,0,150016,6719730
32055275520,102032977920,48918528,684118016,7.335,1.066,91.034,0.564,0,151592,6878386
32060190720,102027943936,48926720,684228608,4.860,0.847,90.875,3.418,0,144026,6530626
32062930944,102025105408,48926720,684326912,7.181,0.964,91.265,0.591,0,134070,5961838
32066203648,102021517312,48926720,684425216,5.321,0.845,93.365,0.469,0,128656,5462392
32066224128,102021406720,48926720,684515328,6.098,1.438,91.932,0.532,0,131786,5788686
32070238208,102017277952,48934912,684613632,7.196,1.303,90.850,0.651,0,129352,5988444
32073666560,102013739008,48934912,684724224,5.820,1.220,92.459,0.501,0,140884,6224808
32074633216,102012661760,48943104,684822528,5.999,0.785,92.588,0.628,0,138024,6453702
32079278080,102007918592,48943104,684916736,5.864,0.909,92.850,0.376,0,146004,6601972
32080961536,102006149120,48943104,685002752,6.943,0.965,91.687,0.405,0,134486,6065504
32082563072,102004432896,48951296,685105152,5.087,0.999,93.446,0.468,0,149210,6874376
32083111936,102003789824,48951296,685195264,6.078,1.209,92.310,0.403,0,162000,7491298
32086937600,101999718400,48951296,685436928,5.729,1.228,91.344,1.700,0,159794,7366594
32088518656,101998034944,48951296,685531136,5.677,1.248,92.639,0.437,0,160438,7381072
32088838144,101997617152,48955392,685625344,5.808,1.174,92.709,0.309,0,158782,7232318
32090456064,101995880448,48959488,685735936,4.033,1.292,94.014,0.662,0,154136,7035282
32093237248,101993029632,48959488,685805568,6.299,1.003,92.228,0.470,0,141056,6305772
32097726464,101988425728,48959488,685912064,5.118,1.099,92.057,1.727,0,132462,6054696
32100675584,101985361920,48959488,686026752,6.560,0.937,92.034,0.469,0,141744,6549214
32105054208,101980876800,48959488,686129152,5.844,0.781,93.031,0.344,0,146024,6701680
32104820736,101981003776,48967680,686223360,4.414,0.901,94.125,0.560,0,143254,6477098
32108113920,101977653248,48967680,686305280,6.887,1.278,91.368,0.467,0,149446,6807212
32108380160,101977268224,48975872,686415872,4.513,0.971,93.544,0.971,0,150620,6821812
32109645824,101975908352,48975872,686505984,5.502,1.119,92.664,0.715,0,152460,6808606
32113147904,101972267008,48975872,686608384,6.133,1.314,92.272,0.282,0,144548,6599006
32113434624,101971873792,48984064,686702592,5.301,0.596,93.726,0.376,0,132086,5997694
32113897472,101971316736,48984064,686796800,5.976,0.809,92.904,0.311,0,142658,6532188
32111865856,101973237760,48984064,686903296,4.780,0.937,94.002,0.281,0,144466,6677708
32115892224,101969108992,48984064,686997504,5.278,0.999,92.349,1.374,0,156064,7166490
32116142080,101968756736,48984064,687099904,6.028,1.381,92.245,0.345,0,156798,7309874
32123764736,101961027584,48992256,687194112,7.835,0.971,90.787,0.407,0,162836,7475876
32125808640,101958750208,48992256,687427584,7.287,1.183,91.280,0.249,0,152200,6922522
32130568192,101953904640,48992256,687509504,7.659,0.837,91.070,0.434,0,155492,7125632
32131678208,101952675840,49000448,687611904,7.507,0.876,90.147,1.470,0,149628,6736712
32132214784,101952032768,49004544,687710208,6.322,0.939,92.363,0.376,0,150216,6784890
32134246400,101949886464,49008640,687820800,7.857,1.304,90.373,0.466,0,144464,6409258
32136536064,101947494400,49008640,687919104,7.527,1.649,90.420,0.404,0,147060,6691750
32137367552,101946564608,49008640,688013312,6.727,1.121,91.778,0.374,0,139480,6231400
32138498048,101945344000,49008640,688099328,8.158,1.954,89.485,0.403,0,123874,5652932
32140492800,101943242752,49012736,688197632,6.573,0.939,91.299,1.189,0,137010,6311550
32148983808,101934526464,49016832,688295936,8.757,1.215,89.592,0.436,0,144128,6423542
32191324160,101892079616,49016832,688402432,8.133,1.189,90.210,0.469,0,143802,6450664
32260411392,101822898176,49016832,688496640,10.187,1.121,88.224,0.467,0,153668,7013910
32323149824,101759991808,49016832,688664576,10.386,1.306,87.966,0.342,0,144768,6488610
32367984640,101715050496,49025024,688758784,8.639,1.243,89.093,1.025,0,155372,7207070
32420986880,101661945856,49033216,688852992,11.347,1.278,86.970,0.405,0,154702,7008714
32469884928,101612941312,49033216,688959488,11.348,1.824,86.487,0.340,0,141896,6376252
32511205376,101571522560,49033216,689053696,7.827,0.873,90.988,0.312,0,141934,6499044
32552128512,101530488832,49033216,689156096,9.675,0.905,89.107,0.312,0,133622,6073404
32558190592,101524328448,49037312,689250304,6.452,1.127,89.414,3.007,0,143826,6649520
32615641088,101466775552,49041408,689344512,8.874,0.818,89.836,0.472,0,150374,6930264
32616755200,101465554944,49041408,689446912,6.502,0.719,92.529,0.250,0,151510,6788832
32609361920,101472845824,49041408,689549312,4.291,0.658,94.738,0.313,0,146824,6841506
32609906688,101472198656,49041408,689651712,6.431,0.994,92.389,0.186,0,150680,6742852
32604135424,101477871616,49049600,689737728,5.413,0.814,92.678,1.095,0,141622,6249676
32603987968,101477896192,49057792,689840128,6.026,0.843,90.290,2.841,0,133408,5955694
32605241344,101476540416,49057792,689942528,5.230,0.539,93.946,0.285,0,131554,5861566
32602865664,101478825984,49057792,690032640,5.294,0.779,93.709,0.218,0,134940,6087374
32597184512,101484408832,49057792,690126848,4.449,0.846,94.486,0.219,0,143748,6348412
32581763072,101499715584,49057792,690237440,4.889,0.752,94.171,0.188,0,143186,6574670
32582696960,101498667008,49065984,690339840,5.789,0.996,91.348,1.867,0,143840,6536072
32576389120,101504884736,49065984,690429952,4.303,0.691,94.755,0.251,0,143426,6491286
32575385600,101505798144,49065984,690520064,5.078,0.846,93.918,0.157,0,148764,6990416
32574861312,101506220032,49065984,690622464,4.716,0.687,94.316,0.281,0,165072,7505444
32576147456,101504827392,49070080,690724864,6.364,0.962,92.425,0.248,0,157810,7147616
32576917504,101503959040,49074176,690814976,5.610,0.909,92.291,1.191,0,142522,6388564
32582459392,101498314752,49082368,690909184,3.624,0.788,95.304,0.284,0,140938,6379606
32582828032,101497827328,49098752,691007488,4.838,0.911,90.261,3.990,0,146330,6748470
32583065600,101497475072,49098752,691122176,3.858,0.847,95.075,0.220,0,140762,6600326
32583913472,101496537088,49098752,691212288,3.914,0.884,94.918,0.284,0,146810,6677678
32585465856,101494665216,49098752,691519488,5.285,0.472,90.878,3.366,0,144366,6482442
32586403840,101493628928,49098752,691613696,5.193,0.840,93.719,0.249,0,140450,6238014
32587022336,101492883456,49106944,691724288,7.188,0.750,91.344,0.719,0,139544,6423682
32586694656,101493116928,49106944,691814400,3.845,0.719,95.186,0.250,0,152838,6865258
32587612160,101492113408,49106944,691900416,6.207,0.749,92.795,0.250,0,156190,7158096
32588886016,101490733056,49106944,692006912,5.119,0.624,93.976,0.281,0,166156,7601718
32585678848,101493694464,49115136,692244480,4.314,0.693,93.608,1.385,0,153820,6880356
32585830400,101493432320,49123328,692342784,6.374,0.964,92.351,0.311,0,143328,6596792
32587026432,101492146176,49123328,692432896,5.233,0.721,93.732,0.313,0,152056,7056798
32586498048,101492572160,49123328,692527104,5.286,0.782,93.650,0.282,0,170710,7810012
32586559488,101492404224,49123328,692629504,4.361,0.690,94.729,0.220,0,169460,7818978
32587173888,101491691520,49123328,692723712,5.875,0.901,92.042,1.181,0,158766,7096820
32579764224,101498953728,49131520,692838400,5.490,0.873,93.231,0.405,0,150388,6936310
32581095424,101497532416,49131520,692928512,6.654,0.808,92.257,0.280,0,159106,7213602
32581791744,101496725504,49131520,693026816,4.841,0.629,94.184,0.346,0,153078,6674598
32582295552,101496115200,49131520,693133312,3.727,0.752,95.146,0.376,0,140802,6477918
32583139328,101495181312,49131520,693223424,5.197,0.939,92.893,0.971,0,143324,6590508
32583655424,101494530048,49147904,693342208,4.014,0.659,93.979,1.348,0,158552,6971528
32583389184,101494693888,49147904,693436416,5.818,1.189,92.649,0.344,0,142374,6499212
32584323072,101493657600,49147904,693534720,5.260,0.720,93.550,0.470,0,145226,6634334
32584183808,101493690368,49147904,693641216,4.437,0.993,94.136,0.434,0,149752,6830250
32585940992,101491830784,49147904,693743616,5.613,0.784,93.258,0.345,0,151996,6930102
32587227136,101490429952,49156096,693850112,4.280,0.812,89.691,5.217,0,153276,7105910
32588419072,101489143808,49156096,693944320,4.374,0.724,94.493,0.409,0,153886,6845338
32590016512,101487439872,49156096,694046720,6.356,0.939,92.361,0.344,0,150072,6744554
32592334848,101485010944,49156096,694157312,4.473,0.876,94.213,0.438,0,151246,6925436
32593485824,101483757568,49156096,694247424,4.581,0.722,94.352,0.345,0,142528,6434310
32594259968,101482856448,49172480,694358016,4.692,0.688,93.932,0.688,0,150340,6924980
32592093184,101484916736,49172480,694464512,4.787,1.228,93.606,0.378,0,142988,6476872
32593821696,101483085824,49172480,694558720,4.415,0.820,94.355,0.410,0,144820,6502470
32594726912,101482078208,49172480,694661120,5.053,0.717,93.855,0.374,0,130190,5715686
32595890176,101480816640,49172480,694759424,5.407,0.808,93.412,0.373,0,126492,5713062
32596709376,101479882752,49180672,694861824,6.081,0.714,91.716,1.489,0,139930,6136720
32598585344,101477896192,49180672,694968320,6.543,0.806,92.124,0.527,0,150574,6785234
32599949312,101476438016,49180672,695062528,4.508,0.689,94.490,0.313,0,153486,6964208
32601423872,101474852864,49180672,695173120,4.834,0.942,93.848,0.377,0,153110,7005486
32604540928,101471645696,49180672,695263232,4.763,0.694,94.101,0.442,0,160300,7494554
32605073408,101470998528,49188864,695361536,4.589,0.874,93.756,0.781,0,158434,7165708
32604278784,101471666176,49188864,695476224,3.633,0.940,95.177,0.251,0,148272,6759418
32605179904,101470666752,49188864,695574528,5.529,0.880,93.371,0.220,0,139572,6290190
32606658560,101469081600,49188864,695681024,4.359,0.721,94.732,0.188,0,133830,6177532
32607268864,101468356608,49188864,695779328,4.504,0.970,94.307,0.219,0,139238,6324454
32607100928,101468352512,49197056,695943168,4.814,0.901,93.975,0.311,0,144476,6617526
32607309824,101468033024,49197056,696053760,5.066,0.719,93.840,0.375,0,149522,6741128
32608104448,101467127808,49205248,696152064,3.910,0.688,95.027,0.375,0,149766,6739920
32608288768,101466836992,49205248,696254464,6.162,0.813,92.712,0.313,0,154518,7131252
32608796672,101466218496,49205248,696360960,4.490,0.628,94.443,0.440,0,150358,6708186
32610209792,101464571904,49213440,696586240,4.805,1.099,93.687,0.408,0,146492,6782260
32610967552,101463703552,49213440,696696832,4.094,0.719,94.094,1.094,0,142924,6579216
32610942976,101463638016,49213440,696786944,4.523,0.749,94.417,0.312,0,139620,6269154
32611483648,101462913024,49213440,696889344,5.831,0.868,92.959,0.341,0,141068,6561484
32611168256,101463105536,49213440,697004032,4.558,0.812,94.380,0.250,0,134246,5885364
32607514624,101466652672,49221632,697098240,5.353,0.990,93.224,0.433,0,135624,6089402
32608849920,101465067520,49225728,697335808,4.253,0.756,93.447,1.544,0,131126,5883584
32608567296,101465235456,49225728,697442304,4.545,0.721,94.326,0.408,0,140690,6573714
32610480128,101463232512,49225728,697528320,4.374,0.881,94.368,0.378,0,151286,6918636
32611819520,101461782528,49225728,697638912,5.240,0.847,93.599,0.314,0,149364,6801464
32611643392,101461848064,49233920,697737216,3.686,0.914,94.833,0.567,0,141304,6586674
32612364288,101461012480,49238016,697847808,4.669,0.909,93.168,1.254,0,139852,6211920
32613314560,101459968000,49242112,697937920,3.665,0.909,94.925,0.501,0,124698,5514022
32613916672,101459263488,49242112,698040320,4.460,0.879,94.347,0.314,0,143230,6760908
32616804352,101456265216,49242112,698142720,3.989,0.722,94.943,0.345,0,160862,7369054
32617398272,101455556608,49250304,698245120,5.319,0.594,93.680,0.407,0,161358,7335976
32617758720,101455073280,49250304,698359808,5.125,0.875,93.625,0.375,0,152694,7176782
32618442752,101454299136,49250304,698449920,4.034,0.969,93.590,1.407,0,153726,6970036
32619081728,101453557760,49250304,698552320,6.563,1.084,92.012,0.341,0,141674,6511274
32618758144,101453778944,49250304,698654720,3.192,0.595,95.837,0.376,0,139790,6214222
32619552768,101452881920,49258496,698748928,5.105,1.096,93.141,0.658,0,140302,6358398
32620474368,101451845632,49258496,698859520,4.902,1.093,93.569,0.437,0,145316,6681482
32621518848,101450682368,49266688,698961920,3.566,1.032,95.089,0.313,0,152634,6967940
32621670400,101450428416,49266688,699064320,4.743,1.061,93.916,0.281,0,143380,6415442
32621203456,101450784768,49266688,699166720,3.888,0.815,94.951,0.345,0,155786,7203344
32621961216,101449912320,49274880,699269120,4.650,0.848,94.031,0.471,0,162592,7386708
32623251456,101448527872,49274880,699363328,4.689,0.844,94.154,0.313,0,148390,6648156
32623693824,101447970816,49274880,699469824,4.873,0.781,93.065,1.281,0,146244,6761028
32623480832,101447946240,49274880,699699200,4.531,0.656,94.531,0.281,0,141688,6330758
32623079424,101448232960,49274880,699813888,3.870,0.749,95.162,0.218,0,127564,5794590
32623751168,101447458816,49283072,699908096,4.105,0.971,94.579,0.345,0,144606,6517790
32624168960,101446946816,49283072,700002304,3.169,1.004,95.482,0.345,0,139206,6343420
32625741824,101445267456,49283072,700104704,6.094,0.812,92.781,0.312,0,137986,6076500
32625770496,101445136384,49283072,700207104,3.605,0.690,92.194,3.511,0,134162,6120028
32626900992,101443903488,49283072,700309504,4.710,0.780,94.167,0.343,0,137904,6290692
32627318784,101443362816,49291264,700420096,5.358,1.308,92.897,0.436,0,137486,6300988
32627462144,101443133440,49291264,700506112,3.863,0.722,95.069,0.345,0,140514,6491704
32628240384,101442244608,49291264,700612608,4.998,0.937,93.783,0.281,0,140968,6348718
32628822016,101441540096,49299456,700719104,3.656,0.662,93.823,1.859,0,131674,5985822
32630099968,101440147456,49299456,700825600,5.557,0.900,93.294,0.248,0,137642,6266180
32630403072,101439725568,49307648,700932096,4.338,0.624,94.663,0.375,0,136710,6170428
32631660544,101438373888,49307648,701022208,5.171,1.215,93.271,0.343,0,132106,6072110
32632094720,101437825024,49307648,701128704,4.568,1.001,94.149,0.282,0,135686,6119728
32633311232,101436506112,49307648,701222912,4.695,1.026,93.501,0.777,0,137364,6363498
32635072512,101434630144,49307648,701337600,4.293,0.877,94.547,0.282,0,140594,6300924
32635535360,101433925632,49315840,701562880,3.219,0.757,95.551,0.473,0,138530,6440688
32636268544,101433085952,49315840,701669376,5.155,0.875,93.627,0.344,0,147800,6680776
32635969536,101433282560,49315840,701771776,5.375,1,93.344,0.281,0,146072,6700212
32637210624,101431922688,49324032,701878272,4.671,0.533,93.448,1.348,0,150012,6855878
32636915712,101432119296,49324032,701972480,4.456,0.810,94.328,0.405,0,165982,7662338
32637157376,101431734272,49332224,702103552,4.308,0.749,94.474,0.468,0,437866,6942110
32637763584,101431025664,49332224,702205952,4.211,0.686,94.791,0.312,0,153894,7011188
32638857216,101429833728,49332224,702304256,5.352,0.751,93.584,0.313,0,149882,6820152
32639942656,101428637696,49332224,702410752,7.043,1.148,91.406,0.403,0,145486,6720782
32641040384,101427445760,49332224,702500864,4.281,1.219,91.500,3,0,151730,6919218
32641331200,101427027968,49340416,702611456,3.823,0.658,95.049,0.470,0,146582,6582394
32643747840,101424508928,49340416,702713856,5.171,1.065,93.450,0.313,0,140670,6325494
32643801088,101424345088,49340416,702824448,4.577,0.972,94.107,0.345,0,136146,6074340
32643465216,101424574464,49340416,702922752,4.383,0.657,94.521,0.438,0,124120,5554752
32644096000,101423865856,49344512,702996480,4.440,0.782,93.308,1.470,0,140634,6569174
32644513792,101423316992,49356800,703115264,4.048,0.722,94.697,0.533,0,140484,6186578
32644218880,101423509504,49356800,703213568,3.964,0.692,95.093,0.252,0,151174,6890954
32643289088,101424316416,49356800,703332352,3.827,1.066,94.824,0.282,0,156106,7175178
32645148672,101422346240,49356800,703430656,5.458,0.816,93.413,0.314,0,161918,7449938
32645656576,101421608960,49356800,703660032,3.472,0.813,94.651,1.063,0,142534,6465864
32645877760,101421273088,49364992,703758336,4.270,0.785,94.568,0.377,0,152416,6946616
32647331840,101419724800,49364992,703848448,4.833,1.123,93.670,0.374,0,146440,6658176
32646557696,101420371968,49364992,703967232,4.584,0.717,94.387,0.312,0,133630,6016064
32647176192,101419663360,49364992,704057344,4.416,0.658,94.582,0.345,0,140188,6334600
32647933952,101418790912,49364992,704172032,4.217,0.562,94.002,1.218,0,146380,6776952
32648269824,101418336256,49381376,704274432,5.245,0.869,93.482,0.403,0,137320,6128036
32648425472,101418082304,49381376,704368640,3.575,0.659,95.453,0.314,0,142062,6544132
32647991296,101418409984,49381376,704466944,5.760,1.183,92.746,0.311,0,161100,7527418
32649895936,101416398848,49381376,704573440,3.235,0.722,95.791,0.251,0,155392,7200188
32652574720,101413609472,49381376,704675840,6.153,0.653,92.884,0.311,0,153820,7065448
32652173312,101413888000,49389568,704782336,4.718,0.931,92.613,1.738,0,148960,6816866
32652623872,101413339136,49389568,704876544,3.943,0.599,95.174,0.284,0,141714,6467796
32653422592,101412438016,49389568,704974848,5.047,0.784,93.856,0.313,0,134638,6086606
31093260288,102972493824,49389568,705081344,3.086,0.724,95.875,0.315,0,132162,5871604
27878264832,106187849728,49389568,704720896,3.940,0.813,95.028,0.219,0,136742,6282324
24708407296,109358481408,49410048,703926272,3.727,0.758,94.378,1.137,0,130500,5927204
21521965056,112545742848,49410048,703102976,4.356,0.815,94.673,0.157,0,99566,4478784
18339643392,115728891904,49410048,702267392,3.372,0.718,95.754,0.156,0,82990,3746984
15194644480,118874595328,49410048,701562880,2.131,0.533,97.242,0.094,0,71020,3254506
11927867392,122142216192,49410048,700719104,2.907,0.531,96.468,0.094,0,61274,2862810
8774795264,125296119808,49434624,699858944,2.251,0.594,96.717,0.438,0,41628,1824044
5627641856,128444137472,49434624,698994688,1.283,0.375,98.342,0,0,30156,1349960
2498093056,131574341632,49434624,698339328,1.156,0.281,98.531,0.031,0,20364,839860
913584128,133159952384,49434624,697237504,0.188,0.094,99.718,0,0,6722,272804
895078400,133178900480,49434624,696795136,0.063,0,99.937,0,0,288,0
894812160,133179166720,49455104,696774656,0,0,99.844,0.156,0,340,0
894787584,133179166720,49455104,696795136,0,0,100,0,0,166,180
894779392,133179174912,49455104,696795136,0.031,0.031,99.938,0,0,106,0
894779392,133179174912,49455104,696795136,0,0,100,0,0,548,0
894259200,133179691008,49455104,696799232,0,0,100,0,0,446,168
894259200,133179691008,49455104,696799232,0,0,100,0,0,106,0
893992960,133179949056,49463296,696799232,0,0,99.969,0.031,0,106,0
893734912,133180207104,49463296,696799232,0,0,100,0,0,182,0
893734912,133180207104,49463296,696799232,0,0,100,0,0,340,0
893468672,133180473344,49463296,696799232,0,0,100,0,0,0,0
893210624,133180731392,49463296,696799232,0,0,100,0,0,106,0
893210624,133180731392,49463296,696799232,0,0,100,0,0,0,0
893202432,133180731392,49471488,696799232,0,0,99.969,0.031,0,106,0
892944384,133180989440,49471488,696799232,0,0,100,0,0,182,0
894935040,133178925056,49471488,696799232,0.094,0.063,99.844,0,0,396412,23120
895037440,133176836096,49471488,697069568,1.251,0.438,98.311,0,0,16426,31682
892899328,133179002880,49471488,696811520,0,0,99.344,0.656,0,106,0
