"Dstat 0.7.3 CSV output"
"Author:","Dag Wieers <dag@wieers.com>",,,,"URL:","http://dag.wieers.com/home-made/dstat/"
"Host:","grisou-43.nancy.grid5000.fr",,,,"User:","root"
"Cmdline:","dstat -m -c -n -o dstat.csv",,,,"Date:","24 May 2020 18:42:50 CEST"
"memory usage",,,,"total cpu usage",,,,,"net/total",
"used","free","buff","cach","usr","sys","idl","wai","stl","recv","send"
997834752,132934279168,52076544,835522560,1.420,0.448,97.925,0.207,0,0,0
1009905664,132921876480,52076544,835784704,0.562,0.219,99.219,0,0,386940,15118
994258944,132937904128,52076544,835338240,0.438,0.375,99.187,0,0,4306,14800
1008594944,132923273216,52101120,835604480,0.500,0.094,99.251,0.156,0,382820,10772
996339712,132935786496,52101120,835346432,0.500,0.531,98.968,0,0,12090,14998
996225024,132935888896,52105216,835354624,0,0.031,98.530,1.439,0,2530,2568
993546240,132938563584,52105216,835354624,0.907,0.625,98.468,0,0,385566,23054
993697792,132938412032,52105216,835354624,0,0,100,0,0,768,148
993689600,132938420224,52105216,835354624,0,0,100,0,0,1790,0
993665024,132938420224,52129792,835354624,0,0,99.875,0.125,0,992,0
993665024,132938420224,52129792,835354624,0,0,100,0,0,874,0
993665024,132938420224,52129792,835354624,0,0,100,0,0,406,0
993398784,132938686464,52129792,835354624,0,0,100,0,0,580,0
993398784,132938686464,52129792,835354624,0,0,100,0,0,466,0
993325056,132938760192,52129792,835354624,0,0,100,0,0,754,0
993316864,132938760192,52137984,835354624,0,0,99.969,0.031,0,346,148
993316864,132938760192,52137984,835354624,0,0,100,0,0,5072,676
993296384,132938780672,52137984,835354624,0,0,100,0,0,5198,0
993296384,132938780672,52137984,835354624,0,0,100,0,0,6968,652
993611776,132938465280,52137984,835354624,0,0.031,99.969,0,0,7992,2788
996970496,132935061504,52137984,835358720,0.844,0.750,98.406,0,0,393756,26974
996941824,132935077888,52150272,835358720,0,0,99.969,0.031,0,9938,0
1001111552,132930871296,52150272,835379200,0.375,0.188,99.438,0,0,171732,11900
1011585024,132919947264,52150272,835825664,0.875,0.531,98.594,0,0,389562,16414
1000652800,132931293184,52150272,835379200,0.188,0.094,99.719,0,0,4468,13644
1013743616,132918190080,52162560,835379200,0.438,0.188,99.281,0.094,0,382954,11406
1002803200,132928929792,52162560,835567616,0.438,0.500,99.062,0,0,3900,14480
999256064,132932648960,52174848,835379200,0.998,0.624,98.315,0.062,0,386226,25754
999247872,132932657152,52174848,835379200,0,0,100,0,0,806,84
999239680,132932665344,52174848,835379200,0,0,100,0,0,978,0
999927808,132931715072,52187136,835629056,1.748,0.219,97.939,0.094,0,223096,10988
1000165376,132931723264,52187136,835383296,0.031,0,99.969,0,0,15178,3350
999763968,132932112384,52199424,835383296,0,0,99.969,0.031,0,4592,84
999505920,132932370432,52199424,835383296,0,0,100,0,0,1036,550
1000886272,132930981888,52199424,835391488,0.406,0.156,99.438,0,0,342218,15004
1008291840,132923584512,52199424,835387392,0.188,0.125,99.687,0,0,180088,21504
1007509504,132924039168,52207616,835575808,0,0,99.218,0.782,0,13188,13328
1007341568,132924207104,52207616,835575808,0,0.031,99.969,0,0,13474,15708
1007058944,132924477440,52219904,835575808,0,0,99.969,0.031,0,13132,13824
1007050752,132924485632,52219904,835575808,0,0,100,0,0,12956,13548
1006645248,132924891136,52219904,835575808,0,0,100,0,0,19900,18872
1006387200,132925149184,52219904,835575808,0,0.031,99.969,0,0,13100,13496
1006366720,132925169664,52219904,835575808,0.031,0,99.844,0.125,0,12660,13328
1006366720,132925169664,52219904,835575808,0,0,100,0,0,13408,13328
1006366720,132925169664,52228096,835567616,0.031,0,99.906,0.062,0,12964,13328
998932480,132932595712,52228096,835575808,0.031,0.031,99.938,0,0,2310,2236
1002438656,132929269760,52228096,835391488,0.219,0.094,99.687,0,0,172396,14156
1002127360,132929581056,52228096,835391488,0,0.031,99.969,0,0,1216,0
1002106880,132929601536,52228096,835391488,0,0,100,0,0,950,0
1001590784,132930117632,52228096,835391488,0,0.031,99.969,0,0,718,0
1001320448,132930375680,52240384,835391488,0,0,99.969,0.031,0,874,0
1001205760,132930478080,52252672,835391488,0,0,99.969,0.031,0,1384,0
1000947712,132930736128,52252672,835391488,0,0,100,0,0,6282,0
1000935424,132930744320,52252672,835395584,0,0,100,0,0,1246,662
1000935424,132930744320,52252672,835395584,0,0,100,0,0,466,0
1000935424,132930744320,52252672,835395584,0,0,100,0,0,858,0
1000652800,132931002368,52277248,835395584,0,0,99.531,0.469,0,1038,0
1000263680,132931391488,52277248,835395584,0,0,100,0,0,1610,0
999424000,132932206592,52285440,835399680,1.094,0.500,98.343,0.063,0,390326,30110
999116800,132932513792,52285440,835399680,0,0,100,0,0,806,220
998850560,132932780032,52285440,835399680,0,0,100,0,0,826,550
998850560,132932780032,52285440,835399680,0,0,100,0,0,1416,476
998850560,132932780032,52285440,835399680,0,0,100,0,0,880,148
998838272,132932780032,52297728,835399680,0,0,99.969,0.031,0,934,84
998838272,132932780032,52310016,835387392,0,0.031,99.938,0.031,0,300,148
998825984,132932780032,52310016,835399680,0,0,100,0,0,1152,0
998817792,132932788224,52310016,835399680,0,0,100,0,0,1098,84
998817792,132932788224,52310016,835399680,0,0,100,0,0,2676,0
998817792,132932788224,52310016,835399680,0,0,100,0,0,3142,148
998817792,132932788224,52310016,835399680,0,0,100,0,0,1684,0
1799303168,132132200448,52318208,835330048,7.552,2.570,89.846,0.031,0,1327436,54638
4994019328,128935940096,52318208,836739072,33.479,13.877,52.645,0,0,1489420,61432
8156700672,125771501568,52318208,838291456,36.389,13.658,49.423,0.530,0,1489098,61452
11324313600,122602356736,52355072,839696384,38.624,13.136,47.580,0.660,0,1323824,56514
14469234688,119455772672,52355072,841240576,38.617,12.146,49.206,0.031,0,1323042,55768
17533247488,116390215680,52379648,842665984,35.331,12.425,52.087,0.157,0,1650202,66074
20756721664,113164853248,52387840,844365824,38.077,13.478,48.351,0.094,0,1364676,6023750
23822430208,110097477632,52404224,845918208,42.758,13.161,44.018,0.063,0,1537916,26261551
27004866560,106913673216,52416512,847163392,45.843,14.606,39.393,0.158,0,1746312,47970776
29953302528,103964229632,52416512,848093184,44.536,13.992,41.282,0.190,0,1278998,69146384
30852587520,103064866816,52432896,848150528,19.863,5.137,74.564,0.436,0,757280,91912359
31020331008,102897041408,52432896,848228352,13.254,1.500,84.964,0.281,0,905018,113309251
31184240640,102733062144,52432896,848297984,17.820,2.349,79.486,0.345,0,1050396,134140488
31345684480,102571540480,52432896,848371712,20.056,2.398,74.058,3.488,0,1214486,153957144
31512461312,102404657152,52432896,848474112,21.715,2.796,75.023,0.466,0,1379280,174744881
31694643200,102222356480,52441088,848584704,24.363,2.452,72.713,0.472,0,1533514,196669136
31826657280,102090223616,52441088,848703488,21.575,2.677,75.374,0.374,0,1554088,202048652
31904047104,102012706816,52441088,848830464,20.457,2.757,76.253,0.533,0,1557338,202137154
31972626432,101944008704,52441088,848945152,18.395,3.071,76.966,1.567,0,1567972,202122332
32078958592,101837066240,52559872,849420288,17.352,2.447,66.865,13.335,0,1554998,202329810
32124657664,101791223808,52568064,849555456,16.891,3.510,78.565,1.034,0,1526478,201841130
32124678144,101791092736,52568064,849666048,12.753,3.359,83.142,0.747,0,1514424,202257048
32121548800,101794103296,52568064,849780736,11.292,2.565,85.643,0.500,0,1500850,201901075
32114302976,101801205760,52568064,849920000,11.174,2.134,86.252,0.439,0,1503658,202051839
32143544320,101771825152,52576256,850046976,9.310,2.226,87.900,0.564,0,1468524,202221161
32158912512,101756334080,52584448,850157568,8.388,2.848,88.169,0.595,0,1474960,202144347
32178614272,101736390656,52584448,850395136,7.235,1.793,90.657,0.315,0,1454676,202053383
32184057856,101730816000,52584448,850526208,8.365,2.673,88.428,0.535,0,1485102,201584187
32197050368,101717704704,52584448,850640896,7.965,2.101,89.621,0.314,0,1488542,202545844
32225419264,101689212928,52584448,850759680,8.142,2.455,88.689,0.715,0,1464476,202141651
32237506560,101676986368,52592640,850890752,7.404,1.937,88.004,2.655,0,1453458,202058460
32265703424,101648658432,52592640,851013632,7.418,2.066,90.110,0.407,0,1458534,201992529
32285298688,101628944384,52592640,851132416,7.867,2.394,89.397,0.342,0,1469330,201882490
32311123968,101602996224,52592640,851247104,5.930,1.977,91.779,0.314,0,1455986,202242408
32326414336,101587582976,52592640,851369984,6.525,2.092,91.133,0.250,0,1439846,202156216
32342065152,101571788800,52600832,851496960,6.800,2.444,83.579,7.176,0,1435404,202069517
32362893312,101550829568,52600832,851628032,6.801,2.204,90.649,0.346,0,1432972,201852386
32374398976,101539209216,52600832,851742720,7.172,2.286,90.229,0.313,0,1433174,202036567
32400822272,101512658944,52600832,851857408,7.381,2.242,90.128,0.249,0,1449342,202243200
32426012672,101487235072,52600832,852090880,7.396,2.789,89.439,0.376,0,1466730,202000864
32443629568,101469458432,52617216,852230144,7.758,2.365,89.372,0.505,0,1463802,202188800
32474726400,101438238720,52617216,852348928,7.759,2.680,89.187,0.374,0,1462780,202454945
32497995776,101414834176,52617216,852484096,7.161,2.553,90.006,0.280,0,1461292,202131698
32515342336,101397360640,52617216,852606976,6.291,2.170,91.161,0.377,0,1462594,202300340
32538083328,101374500864,52617216,852717568,6.656,2.543,90.424,0.377,0,1459684,202035674
32559316992,101353127936,52625408,852848640,6.773,2.509,88.868,1.850,0,1454286,201947747
32563335168,101348986880,52625408,852963328,6.227,2.034,90.207,1.533,0,1406834,201720435
32569876480,101342326784,52625408,853078016,5.711,1.851,92.156,0.282,0,1426284,202332167
32577040384,101335048192,52625408,853192704,6.021,2.070,91.627,0.282,0,1470254,202262162
32600760320,101311193088,52625408,853327872,5.217,2.031,92.440,0.312,0,1441200,202184036
32612065280,101299757056,52633600,853446656,5.596,2.498,91.274,0.632,0,1452404,202100591
32614596608,101297102848,52633600,853565440,5.562,1.812,91.188,1.438,0,1436728,202090677
32625737728,101285842944,52633600,853684224,6.328,2.681,90.680,0.312,0,1460742,202090064
32646344704,101265059840,52633600,853819392,4.911,1.838,92.934,0.317,0,1497432,202236790
32650756096,101260541952,52633600,853921792,6.246,2.486,90.957,0.311,0,1450526,202199338
32651595776,101259563008,52641792,854048768,5.498,2.074,91.706,0.723,0,1457886,201685737
32651821056,101259210752,52649984,854167552,5.271,2.573,90.179,1.977,0,1451112,202049782
32651747328,101259149312,52649984,854298624,5.451,2.162,92.074,0.313,0,1410330,202046095
32652447744,101258334208,52649984,854413312,5.497,2.342,91.849,0.312,0,1414548,202206634
32657891328,101252640768,52649984,854654976,5.507,1.919,92.259,0.315,0,1446090,201921493
32671199232,101239185408,52658176,854786048,5.844,1.571,92.052,0.534,0,1457538,202346898
32674553856,101235699712,52666368,854908928,8.892,2.286,87.383,1.440,0,1463750,202091785
32684339200,101225697280,52666368,855027712,9.869,2.304,86.457,1.370,0,1746508,201984039
32688816128,101221093376,52666368,855150592,9.254,2.476,87.929,0.340,0,1456686,202058118
32688271360,101221502976,52666368,855285760,8.671,2.027,89.052,0.250,0,1452448,202264393
32695382016,101214285824,52674560,855379968,8.876,2.460,88.353,0.311,0,1451330,202083046
32698650624,101210890240,52674560,855506944,9.491,2.373,87.824,0.312,0,1442760,202003991
32707993600,101201408000,52682752,855633920,9.873,2.600,84.525,3.002,0,1497414,202276853
32710119424,101199163392,52682752,855752704,8.420,1.822,89.444,0.314,0,1422956,202237722
32714784768,101194301440,52682752,855891968,8.972,2.360,88.389,0.279,0,1450556,201897384
32714362880,101194592256,52690944,856006656,7.740,1.958,89.897,0.404,0,1446582,201961645
32730451968,101178380288,52690944,856125440,9.402,2.677,87.578,0.342,0,1462114,202136614
32742948864,101165752320,52690944,856244224,9.546,2.128,83.599,4.726,0,1433532,199811593
32761204736,101147369472,52690944,856367104,11.858,2.397,85.496,0.249,0,1450034,202513165
32783593472,101124857856,52690944,856481792,8.530,1.565,89.649,0.256,0,1434862,201961916
32797081600,101111242752,52699136,856600576,10.886,1.960,86.750,0.404,0,1454556,202088814
32815124480,101093068800,52699136,856727552,10.359,1.889,87.469,0.283,0,1466874,202081597
32827125760,101080952832,52699136,856838144,8.467,2.455,88.826,0.252,0,1432650,202182564
32837025792,101070905344,52707328,856977408,7.878,1.915,86.315,3.892,0,1466684,202057676
32843976704,101063712768,52707328,857219072,10.336,2.086,87.267,0.311,0,1442288,202002498
32844738560,101062807552,52715520,857354240,7.172,2.120,90.084,0.624,0,1451358,202364378
32890957824,101016489984,52715520,857452544,11.534,2.011,86.109,0.346,0,1459934,202152827
32926859264,100980445184,52715520,857595904,9.906,1.661,88.119,0.313,0,1454850,202006349
32999673856,100907495424,52723712,857718784,12.235,2.060,82.459,3.246,0,1442410,201195676
33053093888,100853956608,52723712,857837568,10.648,2.224,86.721,0.407,0,1457578,201982533
33118318592,100788604928,52731904,857948160,11.013,1.632,86.916,0.439,0,1457356,202054407
33162309632,100744478720,52731904,858079232,9.762,1.909,88.079,0.250,0,1496764,202441991
33195257856,100711415808,52731904,858193920,9.860,2.364,87.496,0.280,0,1462078,202056867
33262821376,100643721216,52740096,858316800,12.582,1.883,85.158,0.377,0,1457854,202188705
33306664960,100599758848,52740096,858435584,9.633,2.641,87.446,0.280,0,1431514,202167883
33349242880,100557049856,52748288,858558464,9.559,2.079,87.616,0.745,0,1463152,201939244
33350139904,100556029952,52748288,858681344,5.462,2.154,92.072,0.312,0,1446716,201997634
33348526080,100557533184,52748288,858791936,4.807,2.042,92.837,0.314,0,1402454,202061683
33345929216,100559978496,52748288,858935296,5.221,2.082,91.734,0.963,0,1398006,201947951
33337626624,100568170496,52756480,859037696,4.470,1.876,89.622,4.033,0,1406022,202115428
33338253312,100567379968,52764672,859168768,5.740,2.265,91.468,0.527,0,1389364,202215723
33338740736,100566765568,52764672,859291648,3.898,1.698,94.090,0.314,0,1389614,202001510
33338867712,100566507520,52764672,859406336,4.922,1.505,93.292,0.282,0,1430886,202175288
33344139264,100561121280,52764672,859521024,5.491,1.789,92.438,0.282,0,1406102,201815965
33341853696,100563283968,52764672,859639808,4.060,1.637,88.196,6.106,0,1314288,195786454
33347031040,100557959168,52772864,859770880,5.070,2.066,92.520,0.344,0,1400500,202474192
33345687552,100559056896,52772864,860012544,4.601,2.052,93.068,0.280,0,1432684,202297278
33344528384,100560089088,52772864,860135424,4.486,1.945,93.193,0.376,0,1430880,201872228
33345286144,100559216640,52772864,860250112,4.823,1.816,93.079,0.282,0,1444884,202363833
33341218816,100563124224,52781056,860393472,4.340,1.509,90.692,3.459,0,1430156,202029058
33340948480,100563283968,52789248,860491776,5.342,1.988,92.236,0.435,0,1460310,202157055
33341820928,100562284544,52789248,860614656,4.984,2.586,92.150,0.280,0,1417258,202019299
33342185472,100561801216,52789248,860733440,3.720,1.545,94.451,0.284,0,1425942,202105301
33340559360,100563283968,52789248,860876800,4.809,1.999,92.848,0.344,0,1454170,202282358
33339822080,100563767296,52789248,861126656,4.942,1.731,92.981,0.346,0,1425498,201993605
33340133376,100563329024,52801536,861237248,4.345,1.907,91.966,1.782,0,1416176,202256632
33342062592,100561252352,52801536,861372416,3.823,1.706,94.155,0.316,0,1448766,202028611
33341734912,100561477632,52801536,861474816,3.846,1.450,94.388,0.315,0,1438488,202168469
33341984768,100561092608,52801536,861609984,4.403,1.874,93.442,0.281,0,1415604,202104363
33341149184,100561801216,52801536,861724672,4.112,1.820,93.691,0.377,0,1435054,202311349
33340567552,100562219008,52817920,861868032,4.759,2.457,84.448,8.336,0,1411660,201908022
33342287872,100560379904,52817920,861986816,5.304,2.028,92.356,0.312,0,1442640,202205531
33342861312,100559671296,52817920,862113792,4.223,1.689,93.838,0.250,0,1420622,202233771
33347407872,100554993664,52817920,862236672,4.311,1.874,93.502,0.312,0,1427062,202103054
33346609152,100555669504,52817920,862359552,4.380,2.034,93.179,0.407,0,1437838,202222985
33347018752,100555120640,52826112,862486528,4.615,1.933,91.176,2.276,0,1427908,201865911
33348055040,100553957376,52834304,862605312,4.680,1.966,93.042,0.312,0,1385798,202177457
33349369856,100552507392,52834304,862740480,5.396,2.152,92.171,0.281,0,1398510,201956912
33349599232,100552155136,52834304,862863360,3.903,1.668,94.114,0.315,0,1408434,202041188
33350082560,100551540736,52834304,862990336,4.261,1.705,93.750,0.284,0,1395772,202255635
33350844416,100550668288,52842496,863092736,4.695,1.941,92.394,0.970,0,1422706,201944298
33349668864,100551700480,52850688,863227904,4.425,1.963,91.306,2.306,0,1423072,202499674
33350086656,100551151616,52850688,863358976,4.409,1.970,93.308,0.313,0,1454624,201843775
33349328896,100551766016,52850688,863498240,4.188,1.781,93.781,0.250,0,1446022,202362479
33350574080,100550385664,52850688,863621120,5.025,1.985,92.711,0.279,0,1426630,202036648
33350975488,100549869568,52858880,863727616,4.134,1.848,93.360,0.658,0,1407084,202054969
33351294976,100549259264,52862976,864002048,4.228,1.785,91.982,2.004,0,1410794,202300356
33351766016,100548657152,52871168,864124928,4.659,1.782,93.277,0.281,0,1403914,202215177
33352040448,100548259840,52871168,864243712,4.714,1.780,93.288,0.219,0,1402312,202020899
33349816320,100550356992,52871168,864366592,4.366,1.570,93.844,0.220,0,1418184,202100445
33349644288,100550389760,52879360,864497664,4.474,1.909,93.304,0.313,0,1398050,202229774
33350684672,100549226496,52879360,864620544,4.481,1.786,93.450,0.282,0,1375842,201897134
33352077312,100547710976,52887552,864735232,4.114,1.916,93.624,0.345,0,1416754,202104837
33352167424,100547485696,52887552,864866304,4.431,1.666,93.620,0.283,0,1403486,202215377
33351659520,100547858432,52887552,864989184,4.147,1.477,94.125,0.251,0,1401414,201959739
33352359936,100547018752,52895744,865120256,3.811,1.543,94.236,0.409,0,1396660,201981469
33352310784,100546953216,52895744,865234944,4.762,1.899,91.161,2.179,0,1404190,202399415
33352241152,100546871296,52895744,865378304,4.433,1.842,91.633,2.092,0,1397618,202193321
33352699904,100546293760,52895744,865497088,5.152,2.235,92.365,0.248,0,1419836,201829341
33351831552,100547035136,52895744,865619968,3.754,1.483,94.385,0.379,0,1426300,202328942
33353506816,100545228800,52903936,865738752,4.490,1.570,93.532,0.408,0,1431970,202037270
33352085504,100546519040,52903936,865869824,4.346,1.814,93.527,0.313,0,1428694,202016730
33352306688,100546035712,52903936,866127872,4.676,1.933,91.615,1.777,0,1420362,202269715
33352437760,100545777664,52903936,866250752,4.184,1.967,93.569,0.281,0,1423014,202079505
33352863744,100545228800,52903936,866365440,4.353,1.691,93.611,0.345,0,1403034,202041681
33353445376,100544487424,52912128,866508800,4.433,1.623,93.506,0.437,0,1386362,202188809
33353793536,100544004096,52912128,866627584,4.878,1.782,93.089,0.250,0,1406296,202083319
33354518528,100543004672,52920320,866885632,3.855,1.453,91.722,2.970,0,1441628,202095030
33352654848,100544745472,52920320,867000320,4.224,1.971,92.178,1.627,0,1426412,202069968
33358848000,100538433536,52920320,867119104,4.970,2.032,92.623,0.375,0,1447290,202346056
33355255808,100541874176,52928512,867262464,4.726,2.083,92.724,0.466,0,1451338,200885086
33355902976,100541100032,52928512,867389440,4.217,1.968,93.440,0.375,0,1406152,203188041
33358782464,100537962496,52928512,867643392,4.425,2.181,93.113,0.280,0,1446068,202164938
33356521472,100540100608,52936704,867758080,4.061,1.999,91.596,2.343,0,1423344,201932498
33357594624,100538904576,52936704,867876864,4.223,1.720,93.713,0.344,0,1432662,202025325
33357836288,100538511360,52944896,868020224,4.557,2.310,92.385,0.749,0,1431110,202367612
33356197888,100540026880,52944896,868130816,4.202,1.599,93.917,0.282,0,1421754,201875675
33356808192,100539285504,52944896,868257792,3.890,1.662,94.166,0.282,0,1414626,202338240
33357049856,100538900480,52953088,868388864,3.901,1.730,91.570,2.800,0,1456140,202094878
33356193792,100539633664,52953088,868503552,4.330,1.883,93.411,0.377,0,1481448,202172995
33357660160,100538028032,52961280,868630528,4.001,1.418,93.919,0.662,0,1415588,202171894
33357537280,100538028032,52961280,868753408,3.747,1.795,94.175,0.283,0,1409498,202046216
33357103104,100538277888,52961280,868892672,4.372,1.780,93.535,0.312,0,1420380,202060953
33356955648,100538277888,52961280,869040128,4.091,2.061,92.786,1.062,0,1434622,202193972
33358200832,100536926208,52969472,869138432,3.850,1.609,93.058,1.483,0,1412088,202108560
33358909440,100536082432,52977664,869261312,4.013,1.599,94.013,0.376,0,1424148,201863052
33358327808,100536537088,52977664,869388288,3.798,1.664,94.131,0.408,0,1430056,202125625
33357664256,100537053184,52977664,869531648,4.185,1.843,93.629,0.344,0,1447208,202115815
33358880768,100535730176,52977664,869638144,4.019,1.664,93.972,0.345,0,1442344,202119153
33358962688,100535504896,52985856,869765120,3.770,1.822,91.203,3.205,0,1426788,202025442
33359257600,100535054336,52994048,869904384,4.505,2.112,93.010,0.373,0,1420088,202095527
33360752640,100533440512,52994048,870014976,3.714,1.700,94.240,0.346,0,1408072,202050492
33360625664,100533440512,52994048,870137856,3.936,2.062,93.658,0.344,0,1439374,202026047
33360887808,100532924416,52994048,870391808,4.237,1.838,93.583,0.343,0,1409554,202283598
33360773120,100532903936,53002240,870514688,4.429,2.027,91.921,1.622,0,1426770,201833716
33359863808,100533665792,53010432,870653952,4.006,1.721,93.897,0.376,0,1462710,202303431
33360158720,100533243904,53010432,870780928,3.994,2.059,93.604,0.343,0,1434152,202306490
33359585280,100533698560,53010432,870899712,4.280,1.843,93.565,0.312,0,1420030,201849843
33359990784,100533133312,53010432,871026688,4.006,1.753,93.897,0.344,0,1458940,202204382
33360363520,100532617216,53010432,871165952,4.174,2.087,93.427,0.312,0,1415216,202232197
33360809984,100532068352,53018624,871260160,4.064,1.813,93.717,0.406,0,1421736,202152631
33359667200,100533067776,53018624,871395328,4.221,1.657,93.871,0.250,0,1427828,202290755
33359450112,100533166080,53026816,871505920,3.865,1.697,94.029,0.409,0,1416366,202112148
33359335424,100533100544,53026816,871669760,3.864,1.665,94.219,0.251,0,1399520,201947696
33360359424,100531970048,53026816,871772160,3.643,1.853,94.221,0.283,0,1411062,202296970
33360101376,100532101120,53035008,871890944,5.008,2.133,90.665,2.195,0,1430398,202102662
33360003072,100532068352,53035008,872013824,3.720,1.356,94.641,0.284,0,1458384,202164168
33359532032,100532391936,53043200,872153088,4.645,1.870,93.142,0.343,0,1450222,202189283
33359958016,100531843072,53043200,872271872,4.242,2.059,93.387,0.312,0,1458602,201997125
33360896000,100530778112,53043200,872398848,4.442,1.564,93.744,0.250,0,1428468,202159056
33362337792,100529070080,53051392,872652800,4.513,2.054,91.379,2.054,0,1431780,202386444
33362780160,100528488448,53051392,872787968,3.891,1.632,94.038,0.439,0,1421664,202168403
33362952192,100528197632,53059584,872898560,3.944,1.452,94.099,0.505,0,1405790,202196829
33362567168,100528455680,53059584,873021440,4.689,2.174,92.764,0.373,0,1419784,201951271
33363206144,100527681536,53059584,873144320,4.829,2.118,92.804,0.249,0,1438274,202328325
33363365888,100527374336,53067776,873283584,3.652,1.637,93.797,0.913,0,1438810,202009527
33363488768,100527116288,53067776,873418752,4.304,2.495,89.488,3.712,0,1420378,202039167
33362284544,100528214016,53067776,873521152,3.896,1.508,94.314,0.283,0,1404358,202086476
33363197952,100527181824,53075968,873631744,4.234,1.993,93.431,0.342,0,1442336,202193488
33363267584,100526956544,53075968,873783296,4.139,1.787,93.760,0.314,0,1433664,202244103
33362751488,100527341568,53084160,873902080,4.263,1.724,93.542,0.470,0,1442674,202008969
33362079744,100527890432,53084160,874024960,3.749,1.512,92.880,1.859,0,1485452,202127557
33362825216,100527017984,53084160,874147840,4.768,1.776,93.207,0.249,0,1437388,202319333
33364029440,100525703168,53084160,874295296,4.314,1.719,93.779,0.188,0,1427644,201899670
33362866176,100526735360,53092352,874414080,3.558,1.511,94.647,0.283,0,1420844,202311885
33362751488,100526735360,53100544,874516480,4.329,1.931,93.211,0.529,0,1418440,202218602
33362321408,100527026176,53100544,874651648,4.300,1.932,93.518,0.249,0,1402610,201986246
33362800640,100526411776,53100544,874786816,4.831,1.889,93.032,0.248,0,1426980,202466636
33362636800,100526444544,53100544,874905600,4.125,1.844,93.781,0.250,0,1438974,201943987
33362849792,100526120960,53100544,875016192,3.640,1.914,94.227,0.220,0,1393434,201949010
33362804736,100526026752,53108736,875147264,4.126,1.813,93.779,0.281,0,1424128,202349388
33363075072,100525477888,53116928,875417600,3.812,1.733,92.470,1.985,0,1451970,201958974
33363050496,100525379584,53116928,875536384,4.660,1.988,91.985,1.367,0,1448056,202325984
33363664896,100524638208,53116928,875655168,3.557,1.668,94.555,0.220,0,1407396,202018697
33363316736,100524863488,53116928,875773952,4.994,1.830,92.742,0.434,0,1421686,202003801
33363398656,100524638208,53125120,875905024,3.951,1.881,93.791,0.376,0,1431330,202243722
33362210816,100525670400,53133312,876044288,3.933,1.573,94.147,0.346,0,1433780,201944357
33363148800,100524605440,53133312,876167168,3.923,1.789,92.090,2.197,0,1460882,202117203
33364606976,100523024384,53133312,876281856,3.556,1.762,94.368,0.315,0,1429422,202071194
33364471808,100523024384,53133312,876412928,4.348,1.658,93.713,0.282,0,1387318,202392511
31049306112,102838075392,53141504,876519424,4.177,1.633,93.813,0.377,0,1406654,198955359
27821236224,106066456576,53141504,876204032,3.266,1.790,94.410,0.534,0,1282728,177359974
24558129152,109330542592,53149696,875212800,3.233,1.507,93.032,2.228,0,1125988,155408523
21308870656,112580591616,53149696,874422272,3.061,1.562,95.159,0.219,0,999890,134189479
17277337600,116612939776,53149696,873607168,2.576,0.974,96.230,0.220,0,849040,112396652
14036316160,119855013888,53161984,872542208,2.620,1.216,95.945,0.218,0,697206,90955873
10724679680,123167485952,53161984,871706624,1.417,0.724,97.607,0.252,0,508014,68995458
6744190976,127148818432,53161984,870862848,1.284,0.689,97.338,0.689,0,329736,47177282
3484848128,130409250816,53161984,869773312,0.907,0.438,98.310,0.344,0,159704,25876082
1066496000,132828348416,53170176,869019648,0.313,0.219,99.217,0.251,0,30904,5779982
1039740928,132855754752,53182464,868356096,0.062,0.062,99.688,0.188,0,1876,84
1039466496,132856029184,53182464,868356096,0,0,100,0,0,1144,0
1039208448,132856287232,53182464,868356096,0,0,100,0,0,2388,0
1039208448,132856287232,53182464,868356096,0,0,100,0,0,886,0
1039200256,132856295424,53182464,868356096,0,0,100,0,0,1018,0
1039179776,132856303616,53194752,868356096,0,0,99.875,0.125,0,1506,0
1038921728,132856561664,53194752,868356096,0,0,100,0,0,1788,458
1038655488,132856827904,53194752,868356096,0,0,100,0,0,1658,0
1038655488,132856827904,53194752,868356096,0,0,100,0,0,1528,132
1038655488,132856827904,53194752,868356096,0,0,100,0,0,1718,0
1038397440,132857085952,53194752,868356096,0,0,100,0,0,1522,0
1038389248,132857085952,53202944,868356096,0,0,99.969,0.031,0,512,220
1038131200,132857344000,53202944,868356096,0,0.031,99.969,0,0,1808,1948
1038131200,132857344000,53202944,868356096,0,0,99.187,0.813,0,724,168
1038131200,132857344000,53202944,868356096,0,0,100,0,0,2080,1508
1037873152,132857602048,53202944,868356096,0,0,100,0,0,242,0
1037615104,132857860096,53202944,868356096,0,0,100,0,0,920,0
1037606912,132857860096,53211136,868356096,0,0,99.938,0.062,0,692,0
1037606912,132857860096,53211136,868356096,0,0,100,0,0,1674,0
1037606912,132857860096,53211136,868356096,0,0,100,0,0,512,0
1037082624,132858384384,53211136,868356096,0,0,100,0,0,2140,0
1037340672,132858126336,53211136,868356096,0,0,100,0,0,858,0
1037082624,132858384384,53211136,868356096,0,0,100,0,0,1568,0
1037074432,132858384384,53219328,868356096,0,0,99.969,0.031,0,512,0
1036963840,132858494976,53219328,868356096,0,0,100,0,0,1674,0
1036963840,132858494976,53219328,868356096,0,0,100,0,0,988,0
1036705792,132858753024,53219328,868356096,0,0,100,0,0,1856,0
1036447744,132859011072,53219328,868356096,0,0,100,0,0,858,0
1036447744,132859011072,53219328,868356096,0,0,100,0,0,512,0
1036181504,132859269120,53227520,868356096,0,0,99.812,0.188,0,1092,0
1036181504,132859269120,53227520,868356096,0,0,100,0,0,2426,0
1036181504,132859269120,53227520,868356096,0,0,100,0,0,3686,0
1035923456,132859527168,53227520,868356096,0,0,100,0,0,1794,0
1035923456,132859527168,53227520,868356096,0,0,100,0,0,1384,0
1036734464,132858142720,53239808,868462592,0.094,0.094,99.656,0.156,0,256580,17564
1034530816,132858507264,53239808,868364288,1.281,0.625,98.094,0,0,166781,33704
1034240000,132858798080,53239808,868364288,0,0,100,0,0,3874,0
1034240000,132858798080,53239808,868364288,0,0,100,0,0,5250,0
1033465856,132859572224,53239808,868364288,0,0,100,0,0,2020,0
1033506816,132859490304,53239808,868364288,0.031,0,99.969,0,0,1112,84
1033211904,132859756544,53264384,868368384,0,0,99.906,0.094,0,1024,84
1032945664,132860022784,53264384,868368384,0,0.031,99.969,0,0,580,0
1032945664,132860022784,53264384,868368384,0,0,100,0,0,2726,0
1032945664,132860022784,53264384,868368384,0,0,100,0,0,1052,0
