172.16.66.55 : 4.30 4.34 4.34 4.29 4.31 4.31 4.28 4.32 4.34 4.34
172.16.66.56 : 4.22 4.35 4.26 4.24 4.33 4.32 4.35 4.37 4.39 4.40
172.16.66.57 : 10.39 10.39 10.36 10.36 10.37 10.37 10.36 10.39 10.40 10.33
172.16.66.58 : 10.33 10.39 10.36 10.34 10.35 10.26 10.31 10.30 10.30 10.37
172.16.66.59 : 10.37 - 10.32 10.38 10.38 10.36 10.36 10.37 10.32 10.30
172.16.66.6  : 14.95 10.37 10.34 10.24 10.29 10.30 10.27 10.36 10.34 10.37
172.16.66.60 : 10.74 10.34 10.32 10.35 10.35 10.27 10.37 10.35 10.35 10.34
172.16.66.61 : 11.97 10.38 10.29 10.30 10.30 10.30 10.35 10.36 10.37 10.37
172.16.66.62 : 13.66 - 10.33 10.33 10.34 10.32 10.40 10.38 10.35 10.36
172.16.66.64 : 18.16 10.28 10.31 10.29 10.38 10.36 10.30 10.38 10.30 10.37
172.16.66.65 : 14.40 10.40 10.38 10.38 10.38 - 10.38 10.39 - 10.33
172.16.66.66 : 20.66 10.26 10.22 10.34 10.36 10.38 10.38 - 10.32 10.39
172.16.66.67 : 13.28 10.38 10.38 10.38 10.32 10.35 10.39 10.39 10.38 10.35
172.16.66.69 : - 10.31 10.39 10.38 10.31 10.37 10.34 10.38 10.37 10.38
172.16.66.7  : 0.21 0.23 0.22 0.21 0.23 0.21 0.23 0.22 0.23 0.22
172.16.66.70 : 0.22 0.22 0.22 0.22 0.21 0.23 0.21 0.22 0.22 0.16
172.16.66.71 : 0.02 0.03 0.03 0.03 0.03 0.03 0.03 0.03 0.03 0.03
172.16.66.72 : 0.21 0.21 0.23 0.23 0.22 0.22 0.22 0.22 0.22 0.22
172.16.66.73 : 0.22 0.22 0.21 0.22 0.23 0.22 0.15 0.21 0.22 0.20
172.16.66.74 : 0.22 0.22 0.21 0.22 0.22 0.17 0.16 0.21 0.21 0.21
172.16.66.75 : 0.22 0.20 0.19 0.21 0.22 0.22 0.19 0.22 0.22 0.23
172.16.66.76 : 0.23 0.22 0.22 0.22 0.22 0.21 0.22 0.21 0.21 0.21
172.16.66.77 : 0.19 0.22 0.19 0.22 0.21 0.20 0.19 0.20 0.17 0.19
172.16.66.78 : 0.20 0.21 0.23 0.22 0.22 0.19 0.22 0.23 0.22 0.22
172.16.66.79 : 0.23 0.21 0.22 0.19 0.21 0.19 0.21 0.20 0.19 0.21
172.16.66.8  : 0.21 0.22 0.21 0.21 0.15 0.23 0.21 0.22 0.21 0.19
172.16.66.80 : 11.15 4.34 4.34 4.31 4.33 4.35 4.35 4.37 4.39 4.39

      27 targets
      27 alive
       0 unreachable
       0 unknown addresses

       5 timeouts (waiting for response)
     270 ICMP Echos sent
     264 ICMP Echo Replies received
       0 other ICMP received

 0.02 ms (min round trip time)
 5.20 ms (avg round trip time)
 20.6 ms (max round trip time)
       10.143 sec (elapsed real time)

