172.16.66.10  : 4.33 4.37 4.31 4.38 4.34 4.30 4.30 4.36 4.36 4.29
172.16.66.106 : 4.38 4.38 4.33 4.37 4.30 4.34 4.32 4.33 4.33 4.32
172.16.66.109 : 4.42 4.41 4.40 4.39 4.37 4.39 4.41 4.33 4.38 4.34
172.16.66.110 : 4.39 4.40 4.33 4.33 4.33 4.34 4.26 4.33 4.34 4.33
172.16.66.113 : 4.38 4.37 4.37 4.40 4.30 4.35 4.37 4.29 4.40 4.37
172.16.66.114 : 4.33 4.27 4.17 4.25 4.30 4.33 4.16 4.31 4.37 4.34
172.16.66.49  : 0.20 0.21 0.22 0.21 0.22 0.20 0.21 0.21 0.22 0.21
172.16.66.5   : 0.22 0.23 0.23 0.21 0.15 0.23 0.21 0.16 0.22 0.23
172.16.66.50  : 0.16 0.17 0.17 0.18 0.12 0.15 0.14 0.15 0.15 0.16
172.16.66.51  : 0.03 0.04 0.03 0.03 0.03 0.03 0.03 0.03 0.03 0.03
172.16.66.52  : 4.39 4.41 4.41 4.39 4.40 4.31 4.33 4.34 4.23 4.37

      11 targets
      11 alive
       0 unreachable
       0 unknown addresses

       0 timeouts (waiting for response)
     110 ICMP Echos sent
     110 ICMP Echo Replies received
       0 other ICMP received

 0.03 ms (min round trip time)
 2.81 ms (avg round trip time)
 4.42 ms (max round trip time)
        9.107 sec (elapsed real time)

