172.16.97.1  : 4.29 4.27 4.24 4.29 4.30 4.27 4.32 4.32 4.30 4.28
172.16.97.16 : 9.48 4.29 4.30 4.32 4.31 4.29 4.32 4.30 4.29 4.27
172.16.97.23 : 100.27 100.30 100.32 - 100.32 - 100.33 100.30 100.31 100.27
172.16.97.24 : 100.25 100.26 100.28 100.32 100.29 100.31 - 100.27 100.33 100.29
172.16.97.25 : 105.07 100.29 100.32 100.30 100.33 100.30 100.31 100.29 100.29 100.20
172.16.97.26 : 100.28 100.27 100.30 100.31 100.31 100.29 100.32 100.29 100.32 100.29
172.16.97.27 : 0.19 0.18 0.19 0.19 0.19 0.17 0.17 0.17 0.19 0.19
172.16.97.28 : 0.17 0.15 0.18 0.20 0.19 0.20 0.19 0.19 0.19 0.20
172.16.97.3  : 0.15 0.14 0.18 0.18 0.20 0.20 0.20 0.19 0.18 0.16
172.16.97.4  : 0.16 0.18 0.17 0.18 0.20 0.13 0.17 0.20 0.17 0.16
172.16.97.5  : 0.15 0.15 0.16 0.17 0.16 0.17 0.19 0.18 0.19 0.17
172.16.97.6  : 0.01 0.02 0.01 0.03 0.03 0.03 0.03 0.03 0.03 0.02
172.16.97.7  : 0.16 0.15 0.18 0.18 0.16 0.19 0.18 0.17 0.15 0.15
172.16.97.8  : 0.16 0.18 0.17 0.18 0.18 0.18 0.19 0.18 0.17 0.17
172.16.97.9  : 4.19 4.27 4.27 4.27 4.30 4.28 4.27 4.27 4.31 4.27

      15 targets
      15 alive
       0 unreachable
       0 unknown addresses

       2 timeouts (waiting for response)
     150 ICMP Echos sent
     147 ICMP Echo Replies received
       0 other ICMP received

 0.01 ms (min round trip time)
 26.2 ms (avg round trip time)
 105 ms (max round trip time)
       10.041 sec (elapsed real time)

