"Dstat 0.7.3 CSV output"
"Author:","Dag Wieers <dag@wieers.com>",,,,"URL:","http://dag.wieers.com/home-made/dstat/"
"Host:","econome-20.nantes.grid5000.fr",,,,"User:","root"
"Cmdline:","dstat -m -c -n -o dstat.csv",,,,"Date:","27 May 2020 03:53:06 CEST"
"memory usage",,,,"total cpu usage",,,,,"net/total",
"used","free","buff","cach","usr","sys","idl","wai","stl","recv","send"
2551033856,62759985152,60522496,1886830592,0.421,0.139,99.263,0.177,0,0,0
2559729664,62751379456,60534784,1886752768,1.125,0.843,97.876,0.156,0,391080,31020
2560126976,62750978048,60534784,1886756864,0.125,0.094,99.688,0.094,0,379966,9008
2560991232,62750089216,60551168,1886765056,1.126,0.751,98.029,0.094,0,6252,15932
2577592320,62733488128,60551168,1886765056,0.594,0.125,99.219,0.062,0,381724,10740
2562809856,62748225536,60551168,1886765056,0.876,0.625,97.436,1.063,0,4262,14820
2562084864,62748938240,60563456,1886765056,0.094,0.031,99.750,0.125,0,0,1564
2570305536,62740447232,60592128,1887006720,0.344,0.094,99.375,0.188,0,387674,14504
2565607424,62745333760,60592128,1886777344,1.190,0.877,97.902,0.031,0,176756,25460
2568429568,62742441984,60608512,1886793728,1.220,0.813,97.842,0.125,0,394734,29684
2570002432,62740869120,60608512,1886793728,0.156,0.094,99.688,0.062,0,386714,10856
2566094848,62744743936,60624896,1886801920,0.908,0.720,98.278,0.094,0,7782,14232
2576445440,62734106624,60649472,1887059968,0.469,0.094,99.219,0.219,0,385854,10592
2577059840,62733746176,60665856,1886785536,1.032,0.750,98.093,0.125,0,227030,23036
2576105472,62734573568,60665856,1886810112,1.907,0.344,97.717,0.031,0,170468,10560
2576850944,62733578240,60698624,1887019008,0.501,0.344,99.029,0.125,0,345424,19108
2576588800,62733840384,60698624,1887019008,0.062,0.031,99.844,0.062,0,4828,1568
2576330752,62734098432,60698624,1887019008,0.031,0.063,99.844,0.063,0,5506,1568
2575790080,62734614528,60723200,1887019008,0.063,0.031,99.625,0.281,0,5148,1568
2575273984,62735130624,60723200,1887019008,0.094,0,99.844,0.062,0,13198,1568
2575273984,62735130624,60727296,1887014912,0.031,0.031,99.781,0.156,0,5228,2420
2574745600,62735646720,60727296,1887027200,0,0.031,99.719,0.250,0,5506,1568
2574495744,62735896576,60727296,1887027200,0.062,0.062,99.812,0.062,0,4792,1748
2573520896,62736863232,60735488,1887027200,0.094,0.094,99.532,0.281,0,5260,1568
2573512704,62736863232,60743680,1887027200,0.094,0.062,99.719,0.125,0,6100,1568
2566062080,62744281088,60760064,1887043584,0.282,0.125,99.562,0.031,0,177648,17240
2576953344,62733447168,60792832,1886953472,1.467,0.874,97.534,0.125,0,556926,40256
2611281920,62481321984,60792832,2098237440,1.916,2.984,95.038,0.063,0,16748,6504
2678689792,62412845056,60821504,2098262016,3.523,1.101,95.219,0.157,0,176264,12656
2836676608,62254669824,60821504,2098286592,6.401,0.565,92.940,0.094,0,3132,0
2965061632,62114385920,60964864,2109870080,8.380,0.688,88.680,2.251,0,206,0
3002937344,62034489344,60964864,2150440960,5.873,1.156,89.878,3.093,0,206,0
2887938048,62149144576,60973056,2150371328,9.259,1.189,89.177,0.375,0,1048,1522
3512782848,61470232576,60973056,2202333184,35.198,3.421,61.349,0.032,0,3440,1164
3733434368,61247877120,60973056,2202943488,20.609,1.445,77.945,0,0,101358,73902
3734896640,61246296064,60973056,2203058176,0.911,0.314,98.744,0.031,0,7958,6456
3737788416,61243392000,60985344,2203058176,1.153,0.623,97.539,0.685,0,8504,8644
3720085504,61261066240,61001728,2203066368,0.407,0.439,94.987,4.167,0,5754,570
3721895936,61259227136,61009920,2203082752,0.314,0.314,96.548,2.824,0,5122,876
3722960896,61258162176,61009920,2203082752,0.655,0.499,98.783,0.062,0,8762,1438
3721412608,61259710464,61009920,2203082752,0.220,0.251,99.434,0.094,0,10172,876
3720638464,61260484608,61009920,2203082752,1.184,0.561,98.224,0.031,0,8738,876
3717636096,61263470592,61026304,2203082752,1.968,0.625,97.096,0.312,0,7106,876
3778371584,61202735104,61026304,2203082752,10,0.500,89.438,0.062,0,3968,876
3775791104,61205315584,61026304,2203082752,0.565,0.314,99.059,0.063,0,9728,1858
3773984768,61207121920,61026304,2203082752,0.189,0.251,99.466,0.094,0,9610,876
3783856128,61197250560,61026304,2203082752,1.636,0.252,98.081,0.031,0,315730,7106
3768254464,61212839936,61034496,2203086848,0.941,0.627,98.307,0.125,0,744460,6924
3784126464,61196959744,61042688,2203086848,1.344,0.688,97.844,0.125,0,891812,8238
3787341824,61193744384,61042688,2203086848,0.535,0.346,99.118,0,0,1099758,10156
3904856064,61076226048,61042688,2203090944,4.577,0.878,94.483,0.063,0,1315830,67720
3906916352,61074165760,61042688,2203090944,1.093,0.656,98.219,0.031,0,1464050,67542
3908587520,61072486400,61050880,2203090944,0.878,0.439,98.588,0.094,0,1668818,15204
4004356096,60976717824,61050880,2203090944,4.654,0.472,94.811,0.063,0,1829336,70748
4010672128,60970393600,61059072,2203090944,1.438,0.563,97.874,0.125,0,1939272,71574
4009897984,60971167744,61059072,2203090944,0.596,0.502,98.840,0.063,0,1920532,16998
4086153216,60894904320,61059072,2203090944,4.488,0.596,94.915,0,0,1991492,399964
4082737152,60898320384,61059072,2203090944,1.500,0.562,97.876,0.062,0,2090910,184056
4088471552,60892577792,61067264,2203090944,0.471,0.440,98.963,0.126,0,1932864,70036
4089020416,60892028928,61067264,2203090944,0.938,0.688,98.343,0.031,0,2021168,70986
4088561664,60892479488,61075456,2203090944,0.627,0.470,98.810,0.094,0,2021804,17346
4092825600,60888215552,61075456,2203090944,0.785,0.502,98.713,0,0,1966558,70342
4100542464,60880498688,61075456,2203090944,1.096,0.658,98.184,0.063,0,1867626,124624
4100542464,60880498688,61083648,2203082752,0.346,0.283,99.182,0.189,0,1874720,15900
4100341760,60880691200,61083648,2203090944,0.565,0.345,96.392,2.698,0,2073200,18130
4099858432,60881174528,61083648,2203090944,0.811,0.562,98.471,0.156,0,1495724,68468
4099334144,60881690624,61091840,2203090944,0.345,0.408,99.090,0.157,0,2321510,24102
4104712192,60876312576,61091840,2203090944,2.312,0.500,97.095,0.094,0,2030642,71246
4104605696,60876419072,61091840,2203090944,0.753,0.377,98.870,0,0,1981464,70420
4103049216,60877967360,61100032,2203090944,0.534,0.314,98.996,0.157,0,2016992,17560
4106559488,60874457088,61100032,2203090944,0.661,0.315,99.025,0,0,2082126,71054
4108398592,60872617984,61100032,2203090944,0.377,0.346,99.245,0.031,0,1972844,17172
4114423808,60866584576,61108224,2203090944,0.376,0.596,98.934,0.094,0,2126240,18090
4123398144,60857610240,61108224,2203090944,1.348,0.470,98.150,0.031,0,2040078,18402
4139319296,60841680896,61116416,2203090944,2.316,0.595,96.901,0.188,0,1923816,17476
4139094016,60841906176,61116416,2203090944,0.502,0.376,99.028,0.094,0,1924556,69432
4139266048,60841734144,61116416,2203090944,0.314,0.408,99.215,0.063,0,2025996,17082
4140040192,60840960000,61116416,2203090944,0.221,0.189,99.527,0.063,0,1959014,16908
4140269568,60840722432,61124608,2203090944,0.283,0.346,99.246,0.126,0,1767402,14892
4140777472,60840206336,61132800,2203090944,0.565,0.251,98.995,0.188,0,2179922,19270
4144254976,60836728832,61132800,2203090944,0.722,0.377,98.839,0.063,0,1986748,71428
4143173632,60837810176,61132800,2203090944,0.408,0.471,99.059,0.063,0,2017508,17214
4144930816,60836052992,61132800,2203090944,0.752,0.439,98.715,0.094,0,2050770,17520
4154867712,60826116096,61132800,2203090944,1.225,0.440,98.304,0.031,0,2067350,17916
4169957376,60811018240,61140992,2203090944,2.602,0.502,96.740,0.157,0,2022242,72880
4164005888,60816961536,61149184,2203090944,1.416,0.252,98.143,0.189,0,1987862,16908
4164595712,60816371712,61149184,2203090944,0.847,0.377,98.776,0,0,2080684,17748
4166664192,60814303232,61149184,2203090944,0.720,0.407,98.811,0.063,0,2071440,18314
4168245248,60812722176,61149184,2203090944,0.345,0.596,99.060,0,0,2027138,17742
4178075648,60802883584,61149184,2203090944,2.912,0.595,96.462,0.031,0,2029450,74522
4178059264,60802883584,61165568,2203090944,0.565,0.377,98.808,0.251,0,2067184,17520
4179202048,60801740800,61165568,2203090944,0.408,0.439,99.121,0.031,0,2069324,17520
4181417984,60799524864,61165568,2203090944,0.408,0.345,99.152,0.094,0,1919306,71980
4193304576,60787580928,61165568,2203090944,0.630,0.252,99.118,0,0,2182192,18792
4198596608,60782288896,61165568,2203090944,0.689,0.470,98.809,0.031,0,1980760,17290
4209590272,60771287040,61173760,2203090944,0.220,0.409,99.276,0.094,0,1775340,14892
4214030336,60766834688,61181952,2203095040,0.377,0.314,98.900,0.408,0,1593468,13710
4225257472,60755607552,61181952,2203095040,0.913,0.252,98.835,0,0,2593814,73764
4234194944,60746670080,61181952,2203095040,0.564,0.407,98.966,0.063,0,2079162,68936
4243554304,60737310720,61181952,2203095040,0.786,0.346,98.805,0.063,0,2138156,70958
4252975104,60727889920,61181952,2203095040,0.849,0.252,98.805,0.094,0,2016070,17082
4259549184,60721307648,61190144,2203095040,3.136,0.502,96.206,0.157,0,1883032,68422
4262154240,60718694400,61198336,2203095040,0.974,0.471,98.429,0.126,0,1969346,17076
4280446976,60700401664,61198336,2203095040,0.567,0.346,99.024,0.063,0,2012638,71096
4292898816,60687949824,61198336,2203095040,1.280,0.750,97.876,0.094,0,2026812,17692
4311912448,60668936192,61198336,2203095040,3.550,0.440,95.947,0.063,0,2122472,18486
4327292928,60653547520,61206528,2203095040,2.070,0.627,97.114,0.188,0,1983854,73618
4333326336,60647514112,61206528,2203095040,0.843,0.593,98.471,0.094,0,2083882,17520
4344496128,60636336128,61214720,2203095040,1.064,0.469,98.372,0.094,0,1933296,69480
4351750144,60629082112,61214720,2203095040,1.223,0.564,98.119,0.094,0,2083864,71092
4354912256,60625920000,61214720,2203095040,0.533,0.502,98.903,0.063,0,2029946,17082
4361203712,60619628544,61214720,2203095040,0.314,0.409,99.246,0.031,0,1969446,16644
4366970880,60613853184,61222912,2203095040,0.345,0.565,98.839,0.251,0,2075684,17652
4390010880,60590813184,61222912,2203095040,1.757,0.439,97.773,0.031,0,2009962,68682
4402515968,60578299904,61231104,2203095040,1.320,0.220,98.365,0.094,0,1789966,15766
4415811584,60565004288,61231104,2203095040,0.471,0.408,99.090,0.031,0,2283608,19404
4422524928,60558192640,61231104,2203095040,0.314,0.377,99.277,0.031,0,1927520,19948
4431077376,60549562368,61239296,2203090944,0.753,0.408,98.651,0.188,0,1911134,67278
4443340800,60537290752,61239296,2203099136,0.563,0.626,98.811,0,0,2023700,17082
4455600128,60525031424,61239296,2203099136,0.723,0.346,98.900,0.031,0,1981060,69464
4461625344,60518998016,61247488,2203099136,0.377,0.408,99.121,0.094,0,2063722,17520
4470042624,60510576640,61251584,2203099136,0.502,0.377,99.027,0.094,0,2012196,17298
4475506688,60505112576,61251584,2203099136,0.408,0.502,99.059,0.031,0,1928502,16470
4492533760,60488077312,61259776,2203099136,0.816,0.282,98.713,0.188,0,1925628,68234
4499083264,60481527808,61259776,2203099136,0.659,0.377,98.932,0.031,0,1920266,16900
4513021952,60467589120,61259776,2203099136,0.911,0.471,98.556,0.063,0,2015168,69186
4518719488,60461883392,61267968,2203099136,0.657,0.595,98.654,0.094,0,1905304,16566
4525268992,60455333888,61267968,2203099136,0.657,0.594,98.717,0.031,0,1819248,15462
4531036160,60449558528,61276160,2203099136,0.440,0.377,99.026,0.157,0,2318564,19842
4537032704,60443561984,61276160,2203099136,0.438,0.564,98.966,0.031,0,2018134,17560
4545409024,60435185664,61276160,2203099136,0.940,0.595,98.434,0.031,0,2023318,17082
4553281536,60427313152,61276160,2203099136,0.252,0.220,99.528,0,0,1974710,68748
4570210304,60410376192,61284352,2203099136,1.785,0.407,97.682,0.125,0,1769478,14892
4581986304,60398600192,61284352,2203099136,0.721,0.470,98.777,0.031,0,2026056,17346
4596846592,60383731712,61292544,2203099136,1.003,0.376,98.495,0.125,0,2390452,74672
4603396096,60377182208,61292544,2203099136,0.593,0.687,98.658,0.062,0,1303730,10950
4609404928,60371173376,61292544,2203099136,0.283,0.220,99.465,0.031,0,2710144,22776
4617773056,60362805248,61292544,2203099136,0.376,0.502,99.060,0.063,0,1966066,16908
4621701120,60358868992,61300736,2203099136,0.252,0.252,99.402,0.094,0,2023486,17082
4627222528,60353339392,61308928,2203099136,0.501,0.563,98.780,0.156,0,2029986,71210
4639805440,60340756480,61308928,2203099136,0.252,0.252,99.402,0.094,0,1978600,16644
4654227456,60326334464,61308928,2203099136,0.500,0.688,98.780,0.031,0,2060092,17652
4662595584,60317966336,61308928,2203099136,0.376,0.533,99.028,0.063,0,1863714,15768
4673888256,60306673664,61308928,2203099136,0.534,0.440,98.964,0.063,0,1973762,16776
4688302080,60292251648,61325312,2203090944,0.377,0.471,98.902,0.251,0,1975048,17122
4697935872,60282605568,61325312,2203103232,1.064,0.470,98.372,0.094,0,2129988,71870
4708147200,60272394240,61325312,2203103232,0.565,0.188,99.246,0,0,2056822,20164
4713922560,60266618880,61325312,2203103232,0.406,0.813,98.718,0.063,0,2013174,17082
4720668672,60259872768,61325312,2203103232,0.221,0.126,99.622,0.032,0,2016842,17214
4729057280,60251484160,61325312,2203103232,0.815,0.345,98.808,0.031,0,2027050,72000
4735143936,60245381120,61341696,2203103232,0.252,0.189,99.275,0.284,0,2010496,17214
4740820992,60239704064,61341696,2203103232,0.408,0.408,99.153,0.031,0,1499050,13050
4748619776,60231905280,61341696,2203103232,0.157,0.346,99.433,0.063,0,2547850,21906
4767944704,60212580352,61341696,2203103232,0.972,0.470,98.495,0.063,0,2042950,72248
4773720064,60206804992,61341696,2203103232,0.408,0.251,99.309,0.031,0,2045454,72718
4777656320,60202868736,61349888,2203095040,0.437,0.812,98.594,0.156,0,1974002,16644
4791189504,60189319168,61358080,2203103232,0.818,0.283,98.836,0.063,0,2026228,69066
4797997056,60182511616,61358080,2203103232,0.408,0.346,99.215,0.031,0,1918438,65866
4808998912,60171509760,61358080,2203103232,0.408,0.439,99.121,0.031,0,1970940,16644
4816646144,60163862528,61358080,2203103232,0.314,0.314,99.308,0.063,0,2017108,17992
4828872704,60151635968,61358080,2203103232,0.533,0.407,98.997,0.063,0,2085052,17652
4834897920,60145602560,61366272,2203103232,0.220,0.565,99.059,0.157,0,1906646,16206
4843212800,60137279488,61374464,2203103232,0.597,0.283,99.026,0.094,0,1560528,65472
4855590912,60124901376,61374464,2203103232,0.688,0.438,98.811,0.063,0,2187122,18528
4861640704,60118851584,61374464,2203103232,0.314,0.440,99.215,0.031,0,2179228,71072
4868190208,60112302080,61374464,2203103232,0.502,0.439,99.028,0.031,0,2032480,17346
4874481664,60106010624,61382656,2203095040,0.471,0.439,98.996,0.094,0,1957496,17664
4889108480,60091375616,61382656,2203103232,0.377,0.502,99.058,0.063,0,2009908,17214
4901359616,60079116288,61390848,2203103232,0.814,0.751,98.341,0.094,0,1861570,69650
4911742976,60068732928,61390848,2203103232,0.533,0.470,98.934,0.063,0,2026954,17824
4918521856,60061954048,61390848,2203103232,0.377,0.346,99.246,0.031,0,1968898,16776
4925911040,60054564864,61390848,2203103232,0.499,0.905,98.565,0.031,0,2077850,17520
4932087808,60048379904,61399040,2203103232,0.564,0.345,98.903,0.188,0,1770960,68644
4944666624,60035801088,61399040,2203103232,0.502,0.439,99.027,0.031,0,2267830,19668
4953980928,60026478592,61407232,2203103232,0.377,0.377,99.152,0.094,0,1868980,16510
4961046528,60019412992,61407232,2203103232,0.939,0.501,98.529,0.031,0,2062036,17652
4986449920,59994009600,61407232,2203103232,1.974,0.501,97.494,0.031,0,2025876,70492
5021851648,59958599680,61415424,2203103232,0.907,0.938,98.029,0.125,0,1978814,16644
5032120320,59948331008,61415424,2203103232,0.720,0.376,98.841,0.063,0,2028254,17082
5031899136,59948552192,61415424,2203103232,0.314,0.314,99.372,0,0,1985856,17122
5031890944,59948552192,61423616,2203103232,0.658,0.376,98.873,0.094,0,2079258,69606
5036085248,59944357888,61423616,2203103232,0.691,0.314,98.931,0.063,0,2072924,17868
5040271360,59940171776,61431808,2203095040,0.501,0.376,98.873,0.250,0,2060486,18048
5053878272,59926556672,61431808,2203103232,1.941,0.532,97.496,0.031,0,1802498,66400
5053784064,59926650880,61431808,2203103232,0.753,0.439,98.777,0.031,0,2070502,18262
5056139264,59924295680,61431808,2203103232,0.220,0.408,99.309,0.063,0,1961368,16644
5058465792,59921960960,61440000,2203103232,0.345,0.314,99.215,0.126,0,2058820,71288
5058207744,59922219008,61440000,2203103232,0.469,0.688,98.812,0.031,0,2072616,17652
5062393856,59918024704,61448192,2203103232,0.346,0.315,99.119,0.220,0,2073140,17784
5064204288,59916214272,61448192,2203103232,0.596,0.408,98.965,0.031,0,1923416,16684
5065838592,59914579968,61448192,2203103232,0.469,0.532,98.967,0.031,0,1812978,15330
5065580544,59914838016,61448192,2203103232,0.408,0.376,99.153,0.063,0,2236412,19098
5066330112,59914080256,61456384,2203103232,0.754,0.377,98.680,0.189,0,1965774,67050
5076299776,59904110592,61464576,2203095040,0.565,0.282,98.934,0.220,0,1916180,16206
5075955712,59904442368,61464576,2203107328,0.126,0.283,99.559,0.031,0,1876044,16378
5075333120,59905064960,61464576,2203107328,0.283,0.126,99.528,0.063,0,1854538,15900
5074817024,59905581056,61464576,2203107328,0.220,0.377,99.372,0.031,0,2014064,17346
5074817024,59905581056,61464576,2203107328,0.314,0.283,99.371,0.031,0,1914032,16338
5076647936,59903741952,61480960,2203099136,0.283,0.346,99.151,0.220,0,2027902,17742
5080027136,59900354560,61480960,2203107328,0.189,0.503,99.277,0.031,0,2029466,17824
5083963392,59896418304,61480960,2203107328,0.501,0.438,99.029,0.031,0,1987792,67444
5087899648,59892482048,61480960,2203107328,0.440,0.314,99.184,0.063,0,2088394,17652
5087899648,59892482048,61480960,2203107328,1.194,0.377,98.397,0.031,0,1913208,68574
5096013824,59884359680,61489152,2203107328,0.564,0.595,98.528,0.313,0,2181884,19188
5095702528,59884662784,61497344,2203107328,0.720,0.376,98.716,0.188,0,2078504,18130
5097799680,59882565632,61497344,2203107328,0.376,0.564,99.028,0.031,0,1974944,68748
5103820800,59876544512,61497344,2203107328,1.601,0.408,97.960,0.031,0,1760726,67264
5103783936,59876581376,61497344,2203107328,0.502,0.408,99.027,0.063,0,2286414,19272
5104041984,59876323328,61497344,2203107328,0.314,0.502,99.152,0.031,0,1970240,16908
5104025600,59876323328,61513728,2203107328,0.408,0.470,98.840,0.282,0,2076620,70406
5104685056,59875663872,61513728,2203107328,0.596,0.314,99.090,0,0,2076206,17652
5104685056,59875663872,61513728,2203107328,0.941,0.439,98.557,0.063,0,1288686,64040
5104668672,59875672064,61521920,2203107328,0.688,0.407,98.780,0.125,0,2849458,24222
5106352128,59873988608,61521920,2203107328,0.283,0.314,99.340,0.063,0,1922134,16338
5107920896,59872387072,61521920,2203107328,3.024,0.623,96.353,0,0,2176792,72756
5108551680,59871748096,61530112,2203107328,3.197,0.533,96.113,0.157,0,1964516,17436
5110616064,59869683712,61530112,2203107328,1.160,0.439,98.308,0.094,0,2080888,71856
5110616064,59869683712,61530112,2203107328,0.220,0.346,99.402,0.031,0,2027710,17214
5110607872,59869683712,61538304,2203107328,0.781,0.625,98.501,0.094,0,2076976,18048
5110349824,59869941760,61538304,2203107328,0.502,0.408,99.090,0,0,1932338,70984
5109567488,59870715904,61546496,2203107328,0.315,0.315,99.150,0.220,0,1988978,16908
5109825536,59870457856,61546496,2203107328,0.378,0.315,99.244,0.063,0,2124754,18618
5111115776,59869167616,61546496,2203107328,1.345,0.563,98.030,0.063,0,1855156,65316
5110857728,59869425664,61546496,2203107328,0.472,0.346,99.151,0.031,0,2078294,66936
5110591488,59869683712,61554688,2203107328,0.315,0.409,99.182,0.094,0,1980206,17254
5110358016,59869908992,61562880,2203107328,0.472,0.346,98.994,0.189,0,2089450,17748
5110050816,59870216192,61562880,2203107328,0.409,0.377,99.183,0.031,0,1974156,19364
5113364480,59866902528,61562880,2203107328,1.163,0.346,98.460,0.031,0,1929316,68538
5113622528,59866644480,61562880,2203107328,0.221,0.315,99.464,0,0,1714980,14454
5113880576,59866386432,61562880,2203107328,0.441,0.378,99.119,0.063,0,2235460,19576
5113860096,59866398720,61571072,2203107328,0.408,0.440,98.964,0.188,0,2021530,69148
5113593856,59866656768,61579264,2203107328,0.408,0.502,98.870,0.220,0,2058400,17652
5121847296,59858403328,61579264,2203107328,0.879,0.502,98.557,0.063,0,2012800,67688
5130649600,59849601024,61579264,2203107328,0.189,0.252,99.527,0.032,0,1982342,16908
5136777216,59843473408,61579264,2203107328,0.283,0.377,99.277,0.063,0,2126014,69042
5136777216,59843473408,61579264,2203107328,0.439,0.627,98.935,0,0,2022056,17214
5136510976,59843731456,61595648,2203099136,0.692,0.377,98.679,0.252,0,1937088,68332
5136760832,59843473408,61595648,2203107328,0.687,0.625,98.657,0.031,0,1974076,16644
5136502784,59843731456,61595648,2203107328,0.221,0.126,99.622,0.032,0,2077650,69646
5135831040,59844403200,61595648,2203107328,0.655,0.655,98.596,0.094,0,2080254,18130
5135831040,59844403200,61595648,2203107328,0.252,0.315,99.434,0,0,2069248,17520
5135831040,59844403200,61595648,2203107328,0.902,0.716,98.351,0.031,0,2006132,17082
5136560128,59843657728,61612032,2203107328,0.781,0.750,98.187,0.281,0,2025006,70450
5138653184,59841560576,61612032,2203111424,0.626,0.594,98.718,0.063,0,1970830,16776
5138395136,59841818624,61612032,2203111424,0.345,0.471,99.121,0.063,0,1952354,17122
5137920000,59842293760,61612032,2203111424,0.220,0.378,99.370,0.031,0,2113888,18090
5137915904,59842297856,61612032,2203111424,0.439,0.471,99.028,0.063,0,2021826,72426
5137657856,59842555904,61620224,2203103232,0.283,0.283,99.244,0.189,0,1926300,16470
5137383424,59842813952,61628416,2203111424,0.439,0.502,98.934,0.125,0,1852334,16080
5143572480,59836624896,61628416,2203111424,0.882,0.315,98.740,0.063,0,2027880,68098
5143830528,59836366848,61628416,2203111424,0.565,0.376,99.028,0.031,0,1969918,17040
5143572480,59836624896,61628416,2203111424,0.563,0.594,98.780,0.063,0,1915620,16470
5144866816,59835289600,61628416,2203111424,0.534,0.220,99.183,0.063,0,2026176,17214
5148950528,59831197696,61636608,2203111424,0.627,0.376,98.810,0.188,0,2088444,17604
5148893184,59831246848,61644800,2203111424,0.439,0.439,98.996,0.126,0,1866644,16246
5148893184,59831246848,61644800,2203111424,0.440,0.283,99.214,0.063,0,2077248,68056
5148626944,59831513088,61644800,2203111424,0.596,0.408,98.934,0.063,0,1971006,16644
5148884992,59831255040,61644800,2203111424,0.502,0.408,99.027,0.063,0,1863938,15768
5148876800,59831255040,61652992,2203111424,0.965,0.592,98.257,0.187,0,1980410,16776
5148876800,59831255040,61652992,2203111424,0.189,0.377,99.371,0.063,0,2121166,18700
5160296448,59819827200,61661184,2203111424,1.944,0.533,97.429,0.094,0,2010972,69092
5160038400,59820085248,61661184,2203111424,0.438,0.532,98.966,0.063,0,1976486,16644
5160038400,59820085248,61661184,2203111424,0.376,0.533,99.029,0.063,0,2093128,17784
5161795584,59818319872,61669376,2203111424,0.408,0.564,98.903,0.125,0,2079726,69134
5161709568,59818405888,61669376,2203111424,0.158,0.158,99.653,0.032,0,1664536,14494
5170950144,59809165312,61669376,2203111424,1.854,0.314,97.832,0,0,1310172,65308
5171421184,59808686080,61677568,2203111424,0.314,0.346,99.183,0.157,0,2060422,94448
5171593216,59808514048,61677568,2203111424,0.251,0.502,99.184,0.063,0,1186434,10074
5184647168,59795427328,61677568,2203111424,1.690,0.438,97.810,0.063,0,998650,61214
5184872448,59795189760,61685760,2203111424,0.315,0.189,99.308,0.189,0,766510,59942
5184872448,59795189760,61685760,2203111424,0.625,0.688,98.625,0.063,0,520060,54788
5185122304,59794939904,61685760,2203111424,0.158,0.221,99.559,0.063,0,464808,54180
5184856064,59795197952,61693952,2203111424,0.624,0.624,98.626,0.125,0,102814,1710
5186953216,59793100800,61693952,2203111424,0.595,0.407,98.904,0.094,0,51878,1008
5186945024,59793100800,61702144,2203111424,0.717,0.686,98.410,0.187,0,2920,1354
5186899968,59793145856,61702144,2203111424,0.220,0.283,99.465,0.031,0,3778,876
5188304896,59791740928,61702144,2203111424,0.626,0.500,98.780,0.094,0,3152,876
5188304896,59791740928,61702144,2203111424,0.251,0.533,99.153,0.063,0,3728,1044
5187960832,59792076800,61710336,2203111424,0.313,0.657,98.842,0.188,0,2224,876
5187952640,59792076800,61718528,2203111424,0.566,0.251,98.994,0.189,0,5064,1354
5187436544,59792592896,61718528,2203111424,0.750,0.500,98.751,0,0,2312,876
5187194880,59792834560,61718528,2203111424,0.408,0.408,99.121,0.063,0,2906,1056
5187194880,59792834560,61718528,2203111424,0.189,0.377,99.371,0.063,0,1892,876
5189001216,59791028224,61718528,2203111424,0.720,0.563,98.717,0,0,2160,876
5189246976,59790770176,61726720,2203111424,0.438,0.688,98.780,0.094,0,1866,1354
5188968448,59791040512,61734912,2203111424,0.220,0.346,99.277,0.157,0,1464,876
5188968448,59791040512,61734912,2203111424,0.439,0.439,99.091,0.031,0,3686,1188
5188968448,59791040512,61734912,2203111424,0.377,0.345,99.247,0.031,0,7304,876
5223190528,59756294144,61743104,2203234304,1.658,0.876,97.340,0.125,0,401430,20692
