"Dstat 0.7.3 CSV output"
"Author:","Dag Wieers <dag@wieers.com>",,,,"URL:","http://dag.wieers.com/home-made/dstat/"
"Host:","grisou-30.nancy.grid5000.fr",,,,"User:","root"
"Cmdline:","dstat -m -c -n -o dstat.csv",,,,"Date:","24 May 2020 18:42:50 CEST"
"memory usage",,,,"total cpu usage",,,,,"net/total",
"used","free","buff","cach","usr","sys","idl","wai","stl","recv","send"
1196523520,132322406400,55848960,1221902336,1.818,0.228,97.847,0.107,0,0,0
1207672832,132310904832,55848960,1222246400,0.594,0.156,98.625,0.625,0,386490,15002
1193283584,132325740544,55848960,1221799936,0.469,0.500,99.031,0,0,4546,15552
1204686848,132314324992,55861248,1221799936,0.281,0.125,99.531,0.063,0,382538,10624
1194172416,132324831232,55861248,1221804032,0.594,0.688,98.718,0,0,10826,15350
1193947136,132325056512,55861248,1221804032,0,0,100,0,0,2856,336
1197174784,132321812480,55873536,1221804032,0.938,0.781,96.906,1.375,0,386882,25638
1197133824,132321853440,55873536,1221804032,0,0,100,0,0,828,220
1197125632,132321861632,55873536,1221804032,0,0,100,0,0,1670,0
1197096960,132321878016,55885824,1221804032,0,0,99.969,0.031,0,1052,0
1197051904,132321923072,55885824,1221804032,0,0.031,99.969,0,0,588,0
1197039616,132321923072,55898112,1221804032,0,0,99.969,0.031,0,406,0
1197039616,132321923072,55898112,1221804032,0,0,100,0,0,580,0
1197039616,132321923072,55898112,1221804032,0,0,100,0,0,466,0
1197039616,132321923072,55898112,1221804032,0,0,100,0,0,406,0
1196765184,132322197504,55898112,1221804032,0,0,100,0,0,694,0
1196765184,132322197504,55898112,1221804032,0,0,100,0,0,3912,264
1196756992,132322197504,55906304,1221804032,0.031,0,99.906,0.062,0,6356,0
1196756992,132322197504,55906304,1221804032,0,0,100,0,0,5346,0
1196498944,132322455552,55906304,1221804032,0,0,100,0,0,7646,432
1196740608,132322209792,55906304,1221804032,1.033,0.689,98.279,0,0,392886,29878
1195679744,132323270656,55906304,1221804032,0,0,100,0,0,7978,168
1195053056,132323733504,55906304,1221963776,0.282,0.595,99.123,0,0,177680,12152
1213460480,132304863232,55918592,1222410240,0.626,0.438,98.905,0.031,0,389248,16282
1196556288,132322213888,55918592,1221963776,0.313,0.219,99.468,0,0,4468,13884
1208381440,132309921792,55930880,1222410240,0.531,0.250,99.188,0.031,0,383140,11394
1194696704,132324052992,55930880,1221963776,0.407,0.500,99.093,0,0,3554,16796
1193865216,132324864000,55934976,1221971968,0.876,0.688,97.966,0.469,0,386580,27482
1193304064,132325412864,55947264,1221971968,0,0,99.969,0.031,0,466,0
1192771584,132325945344,55947264,1221971968,0,0,100,0,0,862,0
1192112128,132326346752,55959552,1222209536,1.718,0.219,98.001,0.062,0,222408,9916
1191366656,132327329792,55959552,1221971968,0,0,100,0,0,13994,4382
1190592512,132328103936,55959552,1221971968,0,0,100,0,0,6184,550
1190592512,132328103936,55959552,1221971968,0,0,100,0,0,976,0
1189064704,132329586688,55988224,1221988352,0.407,0.156,99.375,0.063,0,342674,15020
1197268992,132321193984,55988224,1222176768,0.251,0.439,99.311,0,0,179756,21146
1197240320,132321210368,56000512,1222176768,0.031,0,99.937,0.031,0,12946,13132
1196466176,132321984512,56000512,1222176768,0,0.031,99.969,0,0,13470,13980
1195368448,132323082240,56000512,1222176768,0.343,0,99.158,0.499,0,13008,13508
1195098112,132323340288,56012800,1222176768,0,0.031,99.937,0.031,0,12956,13328
1195098112,132323340288,56012800,1222176768,0,0,100,0,0,20094,19450
1194917888,132323520512,56012800,1222176768,0.031,0.031,99.938,0,0,13040,13580
1194659840,132323778560,56012800,1222176768,0,0,100,0,0,12944,13328
1194389504,132324036608,56016896,1222184960,0,0.063,99.937,0,0,12956,13328
1186762752,132331663360,56016896,1222184960,0.063,0.031,99.906,0,0,14946,16060
1186361344,132332236800,56029184,1222000640,0,0,99.937,0.063,0,1988,1050
1184665600,132333932544,56029184,1222000640,0.344,0.094,99.563,0,0,172606,24048
1184649216,132333948928,56029184,1222000640,0,0,100,0,0,884,966
1184133120,132334465024,56029184,1222000640,0,0,99.719,0.281,0,1026,614
1183854592,132334731264,56041472,1222000640,0,0,99.969,0.031,0,858,746
1183244288,132335341568,56041472,1222000640,0,0,100,0,0,690,0
1183232000,132335341568,56053760,1222000640,0,0,99.938,0.062,0,2030,0
1183227904,132335341568,56053760,1222004736,0,0,100,0,0,346,0
1183227904,132335341568,56053760,1222004736,0,0,100,0,0,6352,614
1187749888,132330811392,56053760,1222004736,1.031,0.781,98.062,0.125,0,389872,30230
1187725312,132330835968,56053760,1222004736,0,0,100,0,0,692,0
1187459072,132331102208,56053760,1222004736,0,0,100,0,0,1200,0
1335685120,132182609920,56066048,1222311936,3.121,0.281,96.567,0.031,0,339586,17574
1337720832,132180787200,56066048,1222123520,0,0,100,0,0,914,0
1337192448,132181303296,56078336,1222123520,0,0,99.219,0.781,0,1364,348
1336418304,132182077440,56078336,1222123520,0,0.031,99.969,0,0,850,614
1336406016,132182089728,56078336,1222123520,0,0,100,0,0,812,0
1335623680,132182863872,56086528,1222123520,1.219,0,98.718,0.063,0,794,84
1334992896,132183494656,56086528,1222123520,3.125,0,96.875,0,0,1182,0
1335021568,132183445504,56086528,1222127616,3.126,0.031,96.812,0.031,0,1204,1026
1334505472,132183961600,56086528,1222127616,3.125,0,96.875,0,0,1104,0
1333989376,132184477696,56086528,1222127616,3.156,0,96.844,0,0,748,2528
1333645312,132184813568,56094720,1222127616,3.126,0.031,96.780,0.063,0,1984,220
1333645312,132184813568,56094720,1222127616,3.125,0,96.875,0,0,3996,148
1333637120,132184821760,56102912,1222119424,3.126,0,96.468,0.406,0,1292,0
1333293056,132185157632,56102912,1222127616,3.125,0,96.875,0,0,1396,0
1333035008,132185415680,56102912,1222127616,3.156,0,96.844,0,0,3234,420
1332559872,132185751552,56111104,1222258688,3.127,0,96.842,0.031,0,4630,3334
1332301824,132186009600,56111104,1222258688,3.126,0,96.874,0,0,3476,3148
1332551680,132185751552,56119296,1222254592,3.156,0.031,96.781,0.031,0,2762,1680
1332543488,132185743360,56119296,1222262784,3.126,0,96.874,0,0,3132,2270
1350610944,132167675904,56119296,1222262784,4.276,0.062,95.662,0,0,859174,859950
1476472832,132041756672,56127488,1222270976,11.512,0.498,87.928,0.062,0,14838908,12873500
1640554496,131877634048,56127488,1222270976,12.909,0.405,86.685,0,0,36968466,28785024
2038812672,131479326720,56135680,1222270976,6.642,0.592,92.735,0.031,0,58556110,44088024
2092851200,131425284096,56135680,1222275072,8.092,0.654,91.254,0,0,80198214,44158426
2155937792,131362197504,56135680,1222275072,7.491,0.874,91.635,0,0,102248322,43621468
2204958720,131313168384,56143872,1222275072,8.417,0.469,91.083,0.031,0,124093633,40979036
2276810752,131241316352,56143872,1222275072,7.772,0.874,91.355,0,0,143528781,38046772
2345062400,131173060608,56143872,1222279168,7.548,0.689,91.763,0,0,163862191,44975268
2423681024,131094433792,56152064,1222279168,6.142,0.846,92.980,0.031,0,185716714,46875812
2518720512,130999390208,56152064,1222283264,4.571,1.033,94.396,0,0,201165012,33250968
2619793408,130898305024,56160256,1222283264,4.070,0.689,95.178,0.063,0,201471594,12777026
2709311488,130808786944,56160256,1222283264,5.722,0.750,93.527,0,0,201435239,47252330
2796957696,130721140736,56160256,1222283264,5.039,0.782,94.178,0,0,201111840,46449502
2887340032,130630754304,56160256,1222287360,6.662,0.876,92.462,0,0,201821488,44928348
2977472512,130540621824,56160256,1222287360,4.986,0.596,94.418,0,0,201468269,42987198
3065556992,130452529152,56168448,1222287360,5.102,0.814,94.053,0.031,0,201616231,46473322
3155267584,130362818560,56168448,1222287360,4.889,0.752,94.359,0,0,201357849,45270104
3243167744,130274914304,56168448,1222291456,5.296,0.689,94.014,0,0,201390568,46039982
3333521408,130184560640,56168448,1222291456,4.893,0.596,94.511,0,0,201668809,44195344
3419742208,130098339840,56168448,1222291456,5.196,0.751,94.053,0,0,201523516,47427678
3510902784,130007166976,56176640,1222295552,4.953,0.752,94.232,0.063,0,201484935,44762896
3598639104,129919430656,56176640,1222295552,7.731,0.691,91.578,0,0,201468661,47909426
3699961856,129818107904,56176640,1222295552,4.353,0.595,95.052,0,0,201337158,22905742
3802648576,129715421184,56176640,1222295552,4.232,0.596,95.172,0,0,201433093,21132748
3890491392,129627578368,56176640,1222295552,5.116,0.565,94.319,0,0,201542240,49562824
3980541952,129537515520,56184832,1222299648,5.006,0.688,94.243,0.063,0,201600047,44490450
4070854656,129447198720,56184832,1222303744,5.415,0.595,93.991,0,0,201600422,44845120
4158738432,129359314944,56184832,1222303744,5.202,0.689,94.108,0,0,200380498,47900732
4250861568,129267187712,56193024,1222299648,4.978,0.814,93.895,0.313,0,202557815,41638346
4345565184,129172475904,56193024,1222307840,4.641,0.659,94.701,0,0,201269965,37459560
4431880192,129086152704,56201216,1222307840,5.601,0.751,93.586,0.063,0,201715722,49153360
4529143808,128988889088,56201216,1222307840,4.847,0.813,94.340,0,0,201305128,34746924
4617969664,128900063232,56201216,1222307840,5.022,0.659,94.319,0,0,201860068,47084684
4711006208,128807022592,56201216,1222311936,4.941,0.688,94.371,0,0,201437360,40039672
4801687552,128716341248,56201216,1222311936,5.382,0.626,93.992,0,0,201452534,44164044
4896976896,128621043712,56209408,1222311936,4.453,0.815,94.701,0.031,0,201282249,35852304
4991975424,128526045184,56209408,1222311936,4.702,0.721,94.577,0,0,201706546,41242390
5085114368,128432902144,56209408,1222316032,5.099,0.719,94.182,0,0,201341017,39124948
5174509568,128343506944,56209408,1222316032,5.111,0.596,94.293,0,0,201327724,44340224
5273128960,128244887552,56209408,1222316032,5.017,0.690,94.293,0,0,201436510,39627782
5367087104,128150921216,56217600,1222316032,4.925,0.659,94.385,0.031,0,201279790,38953426
5456318464,128061685760,56217600,1222320128,5.580,0.690,93.730,0,0,201506604,43751808
5573898240,127944105984,56217600,1222320128,5.184,0.968,93.848,0,0,201497462,41824876
5643689984,127874314240,56217600,1222320128,5.665,0.563,93.772,0,0,201428590,39737062
5736022016,127781982208,56217600,1222320128,5.191,0.719,94.090,0,0,201492848,39807824
5831553024,127686434816,56225792,1222324224,4.786,0.782,94.370,0.063,0,201382475,36669534
5940277248,127577710592,56225792,1222324224,4.416,0.658,94.926,0,0,201524695,12791154
6039703552,127478284288,56225792,1222324224,4.473,0.782,94.745,0,0,201628656,28922838
6127263744,127390724096,56225792,1222324224,5.127,0.875,93.998,0,0,201377458,49160938
6218563584,127299424256,56225792,1222324224,5.301,0.784,93.915,0,0,201400768,42254050
6309228544,127208747008,56233984,1222328320,4.704,0.815,94.450,0.031,0,200573906,41907940
6401085440,127116890112,56233984,1222328320,5.592,0.628,93.779,0,0,201766490,41932440
6490071040,127027904512,56233984,1222328320,4.981,0.658,94.361,0,0,201290635,43926428
6579122176,126938853376,56233984,1222328320,5.280,0.597,94.123,0,0,201607970,47520554
6674337792,126843633664,56233984,1222332416,4.677,0.691,94.633,0,0,201228763,38530440
6766166016,126751764480,56242176,1222332416,5.387,0.814,93.768,0.031,0,201668912,46761018
6859776000,126658154496,56242176,1222332416,4.950,0.815,94.236,0,0,201372954,44570320
6948851712,126569078784,56242176,1222332416,5.334,0.722,93.944,0,0,201530408,47847674
7039078400,126478848000,56242176,1222336512,5.064,0.813,94.123,0,0,201557845,44012320
7142248448,126375669760,56250368,1222336512,4.854,0.595,94.018,0.532,0,201522248,20057968
7252029440,126265880576,56258560,1222336512,4.011,0.564,95.362,0.063,0,201307073,12706048
7340457984,126177452032,56258560,1222336512,4.989,0.659,94.352,0,0,201541909,47887472
7431495680,126086414336,56258560,1222336512,5.418,0.814,93.768,0,0,201492954,46246526
7525859328,125992046592,56258560,1222340608,4.820,0.782,94.397,0,0,201387177,40129414
7616438272,125901467648,56258560,1222340608,5.265,0.658,94.077,0,0,201527651,44978306
7724449792,125793439744,56274944,1222340608,4.163,0.595,95.149,0.094,0,201314262,12479246
7837315072,125680574464,56274944,1222340608,3.728,0.564,95.708,0,0,201405042,3645508
7950639104,125567225856,56299520,1222340608,3.694,0.720,95.147,0.438,0,201468857,3305554
8064630784,125453234176,56299520,1222340608,3.699,0.596,95.705,0,0,201159181,3973190
8178302976,125339561984,56299520,1222340608,3.788,0.626,95.585,0,0,201288958,4265558
8291868672,125225988096,56307712,1222340608,3.732,0.533,95.673,0.063,0,201556284,3642236
8404041728,125113815040,56307712,1222340608,3.936,0.687,95.376,0,0,201263638,3920442
8517562368,125000294400,56307712,1222340608,3.661,0.782,95.557,0,0,201310834,3702340
8630325248,124887527424,56307712,1222344704,3.882,0.501,95.617,0,0,201539697,2830052
8744476672,124773376000,56307712,1222344704,3.940,0.532,95.310,0.219,0,201393153,3390252
8858054656,124659789824,56315904,1222344704,3.786,0.657,95.463,0.094,0,201303616,3098714
8973352960,124544491520,56315904,1222344704,3.821,0.532,95.647,0,0,201576531,2974934
9086918656,124430925824,56315904,1222344704,3.816,0.657,95.527,0,0,201190373,3055624
9201385472,124316459008,56315904,1222344704,3.727,0.564,95.709,0,0,201317083,3060850
9315024896,124202819584,56324096,1222336512,3.879,0.563,95.027,0.532,0,201260523,3529140
9418956800,124098871296,56332288,1222344704,4.412,0.626,94.931,0.031,0,201582037,22388124
9514205184,124003622912,56332288,1222344704,5.118,0.597,94.286,0,0,201568350,37658626
9604411392,123913412608,56332288,1222348800,4.915,0.783,94.302,0,0,201236892,45596448
9693102080,123824721920,56332288,1222348800,5.477,0.908,93.615,0,0,201132171,44609400
9787990016,123729833984,56332288,1222348800,4.671,0.690,94.639,0,0,201371866,35497508
9877725184,123640082432,56348672,1222348800,5.460,0.659,93.505,0.377,0,201577344,46264510
9968791552,123549011968,56348672,1222352896,4.720,0.535,94.745,0,0,201294838,44767044
10057670656,123460132864,56348672,1222352896,5.359,0.689,93.952,0,0,201515747,46092986
10146471936,123371331584,56348672,1222352896,4.945,0.782,94.272,0,0,201352035,44627236
10238660608,123279142912,56348672,1222352896,5.405,0.687,93.908,0,0,201347925,44457884
10327285760,123190497280,56365056,1222356992,4.951,0.689,93.983,0.376,0,201300667,45082950
10418339840,123099443200,56365056,1222356992,5.521,0.753,93.726,0,0,201578632,43244376
10509713408,123008069632,56365056,1222356992,4.831,0.690,94.479,0,0,201305700,43856494
10601193472,122916589568,56365056,1222356992,5.252,0.875,93.873,0,0,201447474,40746952
10692534272,122825244672,56365056,1222361088,4.792,0.720,94.488,0,0,201412857,41064526
10783240192,122734522368,56381440,1222361088,5.674,0.596,93.323,0.408,0,201623461,44059010
10872438784,122645323776,56381440,1222361088,5.066,0.876,94.059,0,0,201022790,46713782
10963517440,122554245120,56381440,1222361088,5.420,0.752,93.828,0,0,201347925,45265564
11058413568,122459344896,56381440,1222365184,4.578,0.627,94.795,0,0,201833560,35534402
11149938688,122367819776,56381440,1222365184,4.696,0.845,94.458,0,0,201086464,42150468
11238924288,122278817792,56397824,1222365184,5.427,0.596,93.507,0.471,0,201515897,44932826
11330842624,122186899456,56397824,1222365184,4.944,0.657,94.399,0,0,201670772,42743862
11424694272,122093043712,56397824,1222369280,5.146,0.690,94.164,0,0,201231400,37477280
11520258048,121997479936,56397824,1222369280,4.822,0.626,94.552,0,0,201458827,37414968
11610312704,121907425280,56397824,1222369280,4.919,1.034,94.048,0,0,201636340,40156444
11704172544,121813549056,56414208,1222369280,4.669,0.783,94.422,0.125,0,201297479,39753692
11795697664,121722023936,56414208,1222369280,5.047,0.721,94.232,0,0,201405698,44748390
11887816704,121629900800,56414208,1222373376,4.970,0.844,94.186,0,0,201658422,41728958
11985432576,121532284928,56414208,1222373376,4.726,0.782,94.491,0,0,201386833,34753170
12075614208,121442103296,56414208,1222373376,5.458,0.565,93.977,0,0,201204100,43653914
12170350592,121347358720,56422400,1222373376,4.912,0.751,94.274,0.063,0,201071125,38933174
12263342080,121254363136,56422400,1222377472,5.340,0.781,93.879,0,0,201867180,38335408
12354625536,121163075584,56422400,1222381568,4.729,0.846,94.425,0,0,200316874,40246068
12447264768,121070436352,56422400,1222381568,5.094,0.781,94.125,0,0,202491066,42431360
12539482112,120978219008,56422400,1222381568,5.306,0.718,93.976,0,0,201319918,42650624
12638429184,120879263744,56430592,1222381568,4.604,0.689,94.488,0.219,0,201152108,29233182
12732502016,120785186816,56430592,1222385664,5.119,0.780,94.101,0,0,201639658,39108804
12822749184,120694939648,56430592,1222385664,4.877,0.813,94.311,0,0,201499863,40590510
12914831360,120602857472,56430592,1222385664,5.304,0.659,94.036,0,0,201436436,42145512
13004316672,120513372160,56430592,1222385664,4.970,0.875,94.154,0,0,201425423,44366692
13095043072,120422629376,56446976,1222385664,5.312,0.688,93.625,0.375,0,201296291,42596690
13194584064,120323080192,56446976,1222393856,4.541,0.595,94.864,0,0,201621159,26563110
13283917824,120233746432,56446976,1222393856,5.290,0.814,93.897,0,0,201105870,47279428
13375762432,120141901824,56446976,1222393856,4.881,0.688,94.431,0,0,201751136,42954190
13468901376,120048758784,56446976,1222397952,5.045,0.627,94.328,0,0,201242874,41846270
13558431744,119959216128,56463360,1222389760,5.099,0.751,93.901,0.250,0,201554376,44970966
13653561344,119864078336,56463360,1222397952,4.732,0.627,94.516,0.125,0,201320630,36606302
13752819712,119764819968,56463360,1222397952,4.367,0.785,94.848,0,0,201316729,29918328
13844271104,119673368576,56463360,1222397952,4.887,0.658,94.455,0,0,201510342,42015890
13934604288,119583031296,56463360,1222402048,5.273,0.842,93.885,0,0,201348526,42581972
14024388608,119493238784,56471552,1222402048,5.095,0.844,93.998,0.063,0,201550745,45683042
14116573184,119401046016,56479744,1222402048,5.224,0.688,93.744,0.344,0,201340414,40512294
14218969088,119298650112,56479744,1222402048,4.257,0.720,95.023,0,0,201370152,20675604
14309597184,119208017920,56479744,1222406144,4.944,0.720,94.337,0,0,201382125,43797220
14401568768,119116046336,56479744,1222406144,4.884,0.845,94.271,0,0,201585579,40699704
14493544448,119024062464,56487936,1222406144,4.977,0.657,94.304,0.063,0,201407403,42348254
14584561664,118933037056,56496128,1222406144,5.227,0.563,94.147,0.063,0,201475952,43407092
14685564928,118832029696,56496128,1222410240,4.349,0.782,94.869,0,0,201565109,26435468
14779727872,118737866752,56496128,1222410240,4.899,0.565,94.535,0,0,201237912,40133826
14870978560,118646616064,56496128,1222410240,5.105,0.752,94.143,0,0,201636540,46283940
14963130368,118554456064,56504320,1222410240,5.161,0.813,93.994,0.031,0,201406339,43562092
15057338368,118460243968,56504320,1222414336,4.662,0.845,94.243,0.250,0,201305301,37313882
15149543424,118368038912,56504320,1222414336,4.789,0.782,94.429,0,0,201554578,40433554
15254192128,118263390208,56504320,1222414336,4.382,0.782,94.836,0,0,201293522,21044102
15341862912,118175719424,56504320,1222414336,4.973,0.782,94.245,0,0,201304201,44985614
15430541312,118087028736,56512512,1222418432,5.116,0.753,94.068,0.063,0,201425643,45835232
15519997952,117997563904,56520704,1222418432,5.099,0.719,93.807,0.375,0,201368595,45438762
15612620800,117904941056,56520704,1222418432,5,0.844,94.156,0,0,201651814,38971946
15717253120,117800308736,56520704,1222418432,4.104,0.689,95.207,0,0,201027444,20438722
15809732608,117707825152,56520704,1222422528,4.735,0.753,94.512,0,0,201596811,38772404
15907508224,117610041344,56528896,1222422528,5.099,0.813,94.026,0.063,0,201436546,41848610
15999758336,117517783040,56537088,1222422528,4.793,0.689,94.236,0.282,0,201353916,41074438
16101724160,117415817216,56537088,1222422528,4.353,0.752,94.895,0,0,201297193,26067436
16208650240,117308891136,56537088,1222422528,4.467,0.719,94.814,0,0,201696572,14557774
16319176704,117198360576,56537088,1222426624,3.823,0.658,95.519,0,0,201299244,8182464
16426831872,117090697216,56545280,1222426624,4.034,0.813,95.059,0.094,0,201275415,16224296
16537055232,116980465664,56553472,1222426624,3.976,0.626,95.085,0.313,0,201218598,11285644
16647942144,116869578752,56553472,1222426624,3.945,0.689,95.366,0,0,201408615,11402648
16757264384,116760256512,56553472,1222426624,4.036,0.626,95.338,0,0,201272805,8663716
16866258944,116651261952,56553472,1222426624,3.986,0.596,95.417,0,0,201269160,15666396
16975429632,116542083072,56561664,1222426624,3.911,0.782,95.244,0.063,0,201247987,10296342
17082568704,116434944000,56569856,1222418432,4.462,0.686,94.540,0.312,0,201657253,15729822
17192697856,116324802560,56569856,1222426624,3.999,0.843,95.158,0,0,201550498,11517206
17299025920,116218474496,56569856,1222426624,4.041,0.658,95.301,0,0,201323820,15247798
17406377984,116111122432,56569856,1222426624,3.972,0.782,95.246,0,0,201329794,13801962
17514450944,116003037184,56578048,1222430720,4.251,0.625,95.030,0.094,0,201551347,14533362
17622765568,115894710272,56586240,1222434816,4.043,0.627,95.017,0.313,0,201236379,14628806
17729785856,115787685888,56586240,1222438912,3.979,0.689,95.332,0,0,201211521,14767558
17839497216,115677974528,56586240,1222438912,4.038,0.782,95.180,0,0,201540157,10589706
17946009600,115571462144,56586240,1222438912,3.985,0.628,95.388,0,0,201339451,15747080
18056810496,115460653056,56594432,1222438912,3.852,0.595,95.459,0.094,0,201340576,6393918
18160967680,115356495872,56594432,1222438912,4.133,0.720,95.147,0,0,201380479,20855326
18268438528,115249016832,56602624,1222438912,4.382,0.720,94.867,0.031,0,201612256,14966083
18372382720,115145072640,56602624,1222438912,4.075,0.658,95.266,0,0,201374255,19090085
18480160768,115037294592,56602624,1222438912,4.501,0.625,94.873,0,0,201462421,16224076
18588094464,114929352704,56610816,1222438912,4.001,0.875,95.061,0.063,0,201181813,14636810
18695987200,114821459968,56610816,1222438912,4.131,0.657,95.211,0,0,201742474,15248603
18804793344,114712653824,56610816,1222438912,3.984,0.690,95.232,0.094,0,201221082,13846566
18913226752,114604216320,56610816,1222443008,4.172,0.533,95.295,0,0,201295255,13184450
19019702272,114497740800,56610816,1222443008,3.950,0.721,95.329,0,0,201301600,15978510
19129765888,114387668992,56619008,1222443008,3.951,0.659,95.328,0.063,0,201709822,14614042
19238739968,114278694912,56619008,1222443008,4.318,0.751,94.931,0,0,201190614,13017186
19345227776,114172198912,56627200,1222443008,4.079,0.596,94.917,0.408,0,201448780,17920416
19447246848,114070179840,56627200,1222443008,4.135,0.721,95.144,0,0,201112283,20996014
19552571392,113964855296,56627200,1222443008,4.288,0.814,94.898,0,0,201584840,17885948
19658219520,113859198976,56635392,1222443008,4.039,0.720,95.178,0.063,0,201416751,15477914
19768291328,113749127168,56635392,1222443008,4.074,0.658,95.268,0,0,201116638,12136820
19872763904,113644646400,56643584,1222443008,4.261,0.627,94.862,0.251,0,201489146,19378006
19980357632,113537052672,56643584,1222443008,4.073,0.627,95.301,0,0,201469618,16269880
20086566912,113430773760,56643584,1222447104,4.071,0.689,95.240,0,0,201378212,16131383
20191924224,113325408256,56651776,1222447104,4.071,0.689,95.146,0.094,0,201483743,16863787
20296732672,113220599808,56651776,1222447104,4.171,0.596,95.234,0,0,201314177,20528242
20399378432,113117945856,56659968,1222447104,4.753,0.719,94.278,0.250,0,200358267,17855442
20507705344,113009618944,56659968,1222447104,4.133,0.657,95.210,0,0,202564179,16259458
20614496256,112902828032,56659968,1222447104,3.975,0.720,95.305,0,0,201478406,11363090
20722962432,112794353664,56668160,1222447104,3.888,0.627,95.422,0.063,0,201357420,14558446
20829892608,112687423488,56668160,1222447104,4.104,0.627,95.269,0,0,201326330,15456740
20938272768,112579043328,56676352,1222438912,4.158,0.719,94.842,0.281,0,201282496,14006196
21043318784,112473985024,56676352,1222451200,4.664,0.563,94.773,0,0,201495458,16048742
21151981568,112365318144,56676352,1222455296,3.982,0.721,95.296,0,0,201184734,13312934
21261778944,112255512576,56684544,1222455296,4.040,0.501,95.396,0.063,0,201732262,14035390
21371559936,112145731584,56684544,1222455296,3.945,0.845,95.210,0,0,201131129,11455892
21476855808,112040427520,56692736,1222455296,4.194,0.782,94.554,0.469,0,201575776,18664974
21587484672,111929798656,56692736,1222455296,3.942,0.720,95.338,0,0,201302163,10835426
21693022208,111824261120,56692736,1222455296,4.128,0.813,95.059,0,0,201202919,16087774
21804867584,111712407552,56700928,1222455296,4.073,0.689,95.175,0.063,0,201331406,6773286
21914415104,111602860032,56700928,1222455296,4.033,0.781,95.186,0,0,201379645,12664654
22020300800,111496974336,56709120,1222447104,4.075,0.627,94.953,0.345,0,201372695,15969008
22123655168,111393611776,56709120,1222455296,4.035,0.782,95.183,0,0,196976577,16053276
22235697152,111281569792,56709120,1222455296,3.768,0.534,95.699,0,0,201244560,8769778
22338371584,111178887168,56717312,1222455296,4.389,0.627,94.922,0.063,0,201247943,25510554
22446182400,111071076352,56717312,1222455296,4.474,0.720,94.806,0,0,201361219,14701930
22556135424,110961115136,56717312,1222459392,3.951,0.721,95.328,0,0,201636453,13208400
22664286208,110852952064,56725504,1222463488,3.890,0.690,95.075,0.345,0,201190828,15970546
22769573888,110747664384,56725504,1222463488,4.104,0.689,95.207,0,0,201208006,17147046
22877356032,110639874048,56733696,1222463488,4.129,0.688,95.120,0.063,0,201304835,15332036
22981971968,110535258112,56733696,1222463488,4.225,0.657,95.117,0,0,201713193,19542124
23087144960,110430085120,56733696,1222463488,4.446,0.720,94.834,0,0,201210499,17608178
23193063424,110324158464,56741888,1222463488,4.014,0.596,95.045,0.345,0,201542084,15466686
23294283776,110222938112,56741888,1222463488,3.850,0.563,95.587,0,0,183648096,6476570
23375650816,110141562880,56750080,1222463488,4.456,0.533,94.948,0.063,0,165327663,25180882
23448883200,110068330496,56750080,1222463488,4.065,0.594,95.341,0,0,144548219,17078286
23511097344,110006112256,56750080,1222467584,3.975,0.407,95.618,0,0,122317524,15647930
23561150464,109956050944,56758272,1222467584,4.129,0.407,95.152,0.313,0,100315017,14488052
23597498368,109919698944,56758272,1222471680,3.808,0.562,95.630,0,0,78030353,14459564
23620554752,109896634368,56766464,1222471680,3.877,0.281,95.747,0.094,0,56195852,18374706
23630557184,109886631936,56766464,1222471680,3.754,0.156,96.090,0,0,35423764,16444808
23633149952,109884039168,56766464,1222471680,3.533,0.125,96.341,0,0,14985028,11466046
23630635008,109886545920,56774656,1222471680,3.502,0.031,96.279,0.188,0,655442,15405260
23627010048,109890170880,56774656,1222471680,3.996,0.031,95.973,0,0,43606,15486206
23623847936,109893316608,56782848,1222475776,3.442,0.031,96.464,0.063,0,45588,14624826
23620378624,109896781824,56782848,1222479872,3.501,0,96.499,0,0,38874,14605724
23615504384,109901656064,56782848,1222479872,3.626,0.063,96.311,0,0,50392,19524482
23613566976,109903585280,56791040,1222479872,3.409,0,96.309,0.282,0,36694,11899200
23608512512,109908639744,56791040,1222479872,3.722,0.063,96.215,0,0,54758,20558892
23599685632,109917458432,56799232,1222479872,3.559,0.062,96.316,0.062,0,40422,12946364
23597228032,109919916032,56799232,1222479872,3.379,0,96.621,0,0,37266,9879822
23593336832,109923807232,56799232,1222479872,3.375,0.062,96.562,0,0,33104,10213308
23589298176,109927845888,56807424,1222471680,3.472,0.063,96.090,0.375,0,47548,17409814
23586635776,109930500096,56807424,1222479872,3.284,0,96.716,0,0,15540,5022190
23583268864,109933858816,56815616,1222479872,3.975,0.063,95.900,0.063,0,65650,22627124
23578722304,109938405376,56815616,1222479872,3.538,0,96.462,0,0,53438,19252280
23578144768,109938978816,56815616,1222483968,3.470,0.063,96.468,0,0,39474,13280004
23575498752,109941616640,56823808,1222483968,3.348,0.031,96.277,0.344,0,35980,11435172
23573504000,109943611392,56823808,1222483968,3.567,0.031,96.402,0,0,63826,19454176
15884537856,117632569344,56832000,1222483968,2.283,1.032,96.623,0.063,0,23382,6536192
15023771648,118493556736,56832000,1222262784,0.063,0.125,99.812,0,0,1642,0
15023767552,118493560832,56832000,1222262784,0,0,100,0,0,674,180
15023251456,118494076928,56840192,1222254592,0.031,0,99.406,0.563,0,2048,456
15023239168,118494081024,56840192,1222262784,0,0,100,0,0,914,0
15023239168,118494081024,56840192,1222262784,0,0,100,0,0,1540,1508
15024807936,118492499968,56852480,1222262784,0,0,99.969,0.031,0,508,0
15024549888,118492758016,56852480,1222262784,0,0,100,0,0,1642,0
15024549888,118492758016,56852480,1222262784,0,0,100,0,0,988,0
15024545792,118492762112,56852480,1222262784,0,0,100,0,0,1824,0
15024545792,118492762112,56852480,1222262784,0,0,100,0,0,854,0
15024545792,118492762112,56852480,1222262784,0,0.031,99.969,0,0,508,0
15024537600,118492762112,56860672,1222262784,0,0,99.969,0.031,0,508,0
15024537600,118492762112,56860672,1222262784,0,0,100,0,0,2914,0
15024021504,118493278208,56860672,1222262784,0,0,100,0,0,2275,728
15024017408,118493282304,56860672,1222262784,0,0,100,0,0,3108,148
15026212864,118491086848,56860672,1222262784,0,0,100,0,0,952,0
15027769344,118489530368,56860672,1222262784,0.031,0,99.969,0,0,10348,4586
15054856192,118459883520,56868864,1222717440,1.282,0.813,97.842,0.063,0,413265,46534
15054168064,118460780544,56868864,1222279168,0,0,100,0,0,3898,168
15054163968,118460780544,56872960,1222279168,0,0,99.687,0.313,0,5814,0
15054163968,118460780544,56872960,1222279168,0,0,100,0,0,1562,0
15053897728,118461046784,56872960,1222279168,0,0,100,0,0,1012,148
15053615104,118461304832,56897536,1222279168,0,0,99.875,0.125,0,1094,84
15053271040,118461648896,56897536,1222279168,0,0,100,0,0,986,1948
15053271040,118461648896,56897536,1222279168,0,0,100,0,0,1746,1508
15055491072,118459428864,56897536,1222279168,0,0.031,99.875,0.094,0,1460,0
