172.16.66.55 : 14.52 10.29 10.27 10.27 10.25 10.26 10.28 10.28 10.22 10.29
172.16.66.56 : 16.25 10.40 10.40 10.40 10.39 10.35 10.39 10.40 10.36 10.40
172.16.66.57 : 0.17 0.25 0.24 0.20 0.23 0.24 0.24 0.23 0.22 0.24
172.16.66.58 : 0.19 0.17 0.18 0.15 0.17 0.18 0.11 0.13 0.18 0.18
172.16.66.59 : 0.23 0.23 0.22 0.22 0.22 0.23 0.21 0.23 0.22 0.21
172.16.66.6  : 0.04 0.03 0.03 0.03 0.03 0.03 0.03 0.03 0.03 0.01
172.16.66.60 : 0.25 0.24 0.22 0.23 0.22 0.23 0.22 0.17 0.22 0.20
172.16.66.61 : 0.25 0.23 0.23 0.23 0.22 0.23 0.24 0.22 0.21 0.23
172.16.66.62 : 0.25 0.19 0.23 0.16 0.24 0.23 0.23 0.20 0.12 0.20
172.16.66.64 : 0.27 0.23 0.22 0.22 0.20 0.19 0.23 0.22 0.23 0.15
172.16.66.65 : 0.19 0.21 0.23 0.23 0.22 0.23 0.23 0.16 0.22 0.23
172.16.66.66 : 0.25 0.23 0.23 0.21 0.21 0.20 0.20 0.21 0.20 0.21
172.16.66.67 : 0.14 0.22 0.20 0.23 0.20 0.22 0.22 0.24 0.22 0.22
172.16.66.69 : 0.23 0.22 0.22 0.24 0.22 0.22 0.22 0.23 0.23 0.21
172.16.66.7  : 12.32 10.39 10.40 10.39 10.35 10.38 10.41 10.41 10.39 10.42
172.16.66.70 : 11.07 10.31 10.33 10.35 10.31 10.36 10.33 10.35 10.34 10.31
172.16.66.71 : 11.14 10.38 10.39 10.38 10.40 10.41 10.38 10.30 10.41 10.41
172.16.66.72 : 15.60 10.30 10.32 10.31 10.31 10.31 - 10.31 10.33 10.31
172.16.66.73 : 11.12 10.37 10.39 10.38 10.37 10.38 10.36 10.37 10.37 10.39
172.16.66.74 : 11.10 10.33 10.38 10.35 10.30 10.29 10.30 10.31 10.31 10.29
172.16.66.75 : 11.13 10.36 10.35 10.38 - 10.40 10.36 10.36 10.40 10.37
172.16.66.76 : 11.16 10.38 10.38 10.32 10.30 10.30 10.31 10.30 10.31 10.31
172.16.66.77 : 11.13 10.36 10.37 10.39 10.37 10.37 10.36 10.34 10.37 10.37
172.16.66.78 : 11.05 10.30 10.30 10.31 10.32 10.30 10.30 10.29 10.31 10.30
172.16.66.79 : 11.10 10.32 10.34 10.38 10.38 10.34 10.36 10.35 10.36 10.35
172.16.66.8  : 11.12 10.21 10.30 10.23 10.37 10.37 - 10.38 10.37 10.37
172.16.66.80 : 11.04 4.33 4.40 4.43 4.42 4.37 4.38 4.38 4.38 4.37

      27 targets
      27 alive
       0 unreachable
       0 unknown addresses

       3 timeouts (waiting for response)
     270 ICMP Echos sent
     267 ICMP Echo Replies received
       0 other ICMP received

 0.01 ms (min round trip time)
 5.67 ms (avg round trip time)
 16.2 ms (max round trip time)
       10.267 sec (elapsed real time)

