172.16.72.14 : 10.22 10.28 10.27 10.29 10.29 10.28 10.24 10.29 10.29 10.24
172.16.72.23 : 10.27 10.26 10.25 10.29 10.27 10.24 10.21 10.27 10.22 10.28
172.16.72.25 : 0.21 0.17 0.20 0.19 0.17 0.17 0.20 0.17 0.19 0.19
172.16.72.26 : 0.17 0.19 0.20 0.18 0.20 0.20 0.16 0.19 0.18 0.16
172.16.72.27 : 0.04 0.03 0.03 0.03 0.03 0.03 0.03 0.03 0.01 0.01
172.16.72.28 : 0.24 0.20 0.21 0.17 0.20 0.21 0.20 0.21 0.18 0.15
172.16.72.29 : 0.15 0.19 0.20 0.20 0.21 0.19 0.19 0.20 0.19 0.20
172.16.72.3  : 0.19 0.20 0.21 0.19 0.20 0.19 0.16 0.17 0.20 0.19
172.16.72.30 : 0.14 0.12 0.13 0.17 0.19 0.19 0.18 0.19 0.21 0.19
172.16.72.31 : 0.15 0.21 0.21 0.19 0.20 0.20 0.21 0.18 0.20 0.20
172.16.72.32 : 0.12 0.21 0.19 0.19 0.20 0.20 0.22 0.19 0.20 0.21
172.16.72.33 : 0.13 0.18 0.20 0.17 0.21 0.21 0.20 0.22 0.20 0.19
172.16.72.34 : 0.14 0.20 0.21 0.19 0.20 0.22 0.18 0.19 0.20 0.19
172.16.72.35 : 0.15 0.18 0.16 0.20 0.19 0.12 0.20 0.19 0.22 0.20
172.16.72.36 : 0.19 0.21 0.20 0.21 0.17 0.19 0.20 0.21 0.20 0.19
172.16.72.37 : 0.19 0.18 0.18 0.19 0.20 0.19 0.22 0.19 0.20 0.19
172.16.72.38 : 0.17 0.22 0.13 0.14 0.15 0.21 0.20 0.17 0.19 0.16
172.16.72.39 : 0.19 0.19 0.19 0.19 0.18 0.20 0.19 0.21 0.21 0.20
172.16.72.4  : 10.25 10.29 10.26 10.30 10.28 10.25 10.24 10.27 10.26 10.30
172.16.72.40 : 10.28 10.26 10.28 10.24 10.24 10.28 - 10.23 10.26 10.21
172.16.72.41 : 10.28 10.29 10.31 10.29 10.27 10.29 10.27 10.27 10.28 10.30
172.16.72.42 : 10.25 10.28 10.28 10.27 10.25 10.25 10.26 10.24 10.26 10.25
172.16.72.43 : 10.30 10.27 - 10.28 10.29 10.29 10.26 10.29 10.26 10.27
172.16.72.44 : 10.30 10.28 10.23 10.25 10.29 10.24 10.29 10.28 10.29 10.28
172.16.72.46 : 10.30 10.27 10.29 10.28 10.29 10.26 10.30 10.30 10.30 10.29
172.16.72.47 : 10.28 10.24 10.28 10.26 10.29 10.27 10.30 10.22 10.27 10.25
172.16.72.48 : 10.29 10.30 10.25 10.28 10.29 10.28 - 10.28 10.28 10.28
172.16.72.49 : 10.26 10.28 10.29 10.26 - 10.28 10.31 10.30 10.27 10.29
172.16.72.5  : 10.28 10.28 10.30 - 10.25 10.29 10.30 10.30 10.27 10.27
172.16.72.50 : 10.28 10.27 10.28 10.27 10.26 10.27 10.29 10.28 10.26 10.28
172.16.72.51 : 10.27 10.30 10.27 10.29 10.28 10.25 10.26 10.28 10.28 -
172.16.72.6  : 10.28 10.29 10.28 10.27 10.25 10.24 10.26 10.26 10.27 10.27
172.16.72.7  : - 10.27 10.27 10.27 10.27 10.27 10.28 10.26 10.29 10.29
172.16.72.8  : 10.25 10.26 10.24 10.23 10.22 10.25 10.25 10.27 10.26 10.28
172.16.72.9  : 4.28 4.28 4.33 4.29 4.31 4.29 4.31 4.30 4.32 4.31

      35 targets
      35 alive
       0 unreachable
       0 unknown addresses

       7 timeouts (waiting for response)
     350 ICMP Echos sent
     343 ICMP Echo Replies received
       0 other ICMP received

 0.01 ms (min round trip time)
 5.38 ms (avg round trip time)
 10.3 ms (max round trip time)
       10.335 sec (elapsed real time)

