"Dstat 0.7.3 CSV output"
"Author:","Dag Wieers <dag@wieers.com>",,,,"URL:","http://dag.wieers.com/home-made/dstat/"
"Host:","grisou-4.nancy.grid5000.fr",,,,"User:","root"
"Cmdline:","dstat -m -c -n -o dstat.csv",,,,"Date:","27 May 2020 10:57:51 CEST"
"memory usage",,,,"total cpu usage",,,,,"net/total",
"used","free","buff","cach","usr","sys","idl","wai","stl","recv","send"
1032278016,132784582656,60506112,920416256,2.069,0.443,97.247,0.241,0,0,0
1049829376,132766679040,60506112,920760320,0.873,0.405,98.722,0,0,392034,16648
1026555904,132790390784,60506112,920313856,0.406,0.187,99.407,0,0,18316,14144
1050783744,132765712384,60506112,920760320,0.812,0.375,98.814,0,0,394020,12904
1029537792,132787380224,60530688,920313856,0.375,0.219,98.126,1.281,0,8792,13260
1043025920,132773629952,60530688,920571904,0.811,0.156,98.971,0.062,0,391712,13516
1028968448,132787945472,60530688,920313856,0.469,0.406,99.125,0,0,5584,15248
1028968448,132787945472,60530688,920313856,0,0,100,0,0,6500,0
1028960256,132787953664,60530688,920313856,0.031,0,99.969,0,0,15506,0
1028935680,132787953664,60555264,920313856,0,0,99.906,0.094,0,7236,0
1028935680,132787953664,60555264,920313856,0,0.031,99.969,0,0,17880,496
1028870144,132788019200,60555264,920313856,0.031,0,99.969,0,0,18498,0
1028870144,132788019200,60555264,920313856,0,0,100,0,0,14572,0
1028767744,132788121600,60555264,920313856,0,0.062,99.938,0,0,31262,0
1028767744,132788121600,60555264,920313856,0.031,0,99.969,0,0,47534,0
1028759552,132788121600,60563456,920313856,0,0,99.937,0.063,0,39742,0
1028759552,132788121600,60563456,920313856,0.031,0,99.969,0,0,20198,0
1028759552,132788121600,60563456,920313856,0,0,100,0,0,18904,0
1028759552,132788121600,60563456,920313856,0,0,100,0,0,10700,0
1070841856,132745584640,60563456,920764416,0.873,0.312,98.815,0,0,400302,16692
1027887104,132788985856,60563456,920317952,0.344,0.344,98.906,0.406,0,8652,13344
1030475776,132786143232,60575744,920526848,0.344,0.250,99.375,0.031,0,172082,11988
1040941056,132775591936,60575744,920592384,0.344,0.156,99.500,0,0,402392,14384
1029513216,132787277824,60575744,920334336,0.780,0.562,98.658,0,0,19600,16052
1029230592,132787560448,60575744,920334336,0.031,0,99.969,0,0,13866,0
1027784704,132788989952,60588032,920334336,1.154,0.655,97.722,0.468,0,414742,26164
1027510272,132789264384,60588032,920334336,0.031,0,99.781,0.188,0,75478,1508
1030426624,132786319360,60600320,920334336,1.402,0.530,98.037,0.031,0,447394,26164
1029632000,132787093504,60620800,920334336,0,0,99.469,0.531,0,18056,0
1029337088,132787388416,60620800,920334336,0.031,0,99.969,0,0,9294,0
1030823936,132785598464,60637184,920588288,1.686,0.219,98.001,0.094,0,225542,10980
1030246400,132786421760,60637184,920342528,0,0,99.844,0.156,0,6220,3220
1030254592,132786413568,60637184,920342528,0,0.031,99.969,0,0,6980,0
1030254592,132786413568,60637184,920342528,0,0,100,0,0,2148,0
1030029312,132786634752,60637184,920346624,0.717,0.094,99.190,0,0,347554,15004
1037139968,132779315200,60657664,920535040,0.188,0.125,99.562,0.125,0,183244,21264
1037115392,132779339776,60657664,920535040,0.031,0,99.969,0,0,15358,13294
1037074432,132779380736,60657664,920535040,0,0,99.500,0.500,0,16462,13230
1036816384,132779638784,60657664,920535040,0,0,100,0,0,17460,13328
1036816384,132779638784,60657664,920535040,0.031,0.031,99.938,0,0,33136,13328
1036550144,132779896832,60665856,920535040,0,0,99.937,0.063,0,23058,18956
1036025856,132780412928,60674048,920535040,0.031,0,99.937,0.031,0,27900,13412
1036025856,132780412928,60674048,920535040,0,0.031,99.969,0,0,16880,13328
1036025856,132780412928,60674048,920535040,0.031,0,99.969,0,0,16710,13254
1036025856,132780412928,60674048,920535040,0,0,100,0,0,25852,13784
1028075520,132788363264,60674048,920535040,0.062,0.031,99.906,0,0,2190,4576
1026482176,132790140928,60674048,920350720,0.406,0.062,99.532,0,0,173650,14472
1025912832,132790697984,60686336,920350720,0,0,99.937,0.063,0,6348,0
1025912832,132790697984,60686336,920350720,0,0,99.687,0.313,0,15690,0
1024880640,132791730176,60686336,920350720,0.031,0,99.969,0,0,4904,0
1024872448,132791738368,60686336,920350720,0.031,0,99.969,0,0,5146,0
1024856064,132791738368,60698624,920354816,0,0,99.937,0.063,0,19910,0
1024589824,132791996416,60706816,920354816,0,0,99.969,0.031,0,1924,0
1024581632,132792004608,60706816,920354816,0,0.031,99.969,0,0,12864,662
1024581632,132792004608,60706816,920354816,0,0,100,0,0,7174,0
1024581632,132792004608,60706816,920354816,0.031,0,99.969,0,0,13462,0
1024581632,132792004608,60706816,920354816,0,0,100,0,0,53142,1000
1023119360,132793016320,60706816,920801280,1.215,0.686,98.099,0,0,389376,29420
1021710336,132794859520,60715008,920358912,0.031,0,99.906,0.062,0,17382,1248
1021710336,132794859520,60715008,920358912,0,0,99.625,0.375,0,6096,0
1027559424,132789010432,60715008,920358912,0.156,0.094,99.750,0,0,333908,12340
3110330368,130705178624,60719104,920809472,17.830,8.728,73.441,0,0,1490164,59732
5929263104,127884648448,60735488,922120192,31.479,12.399,56.060,0.062,0,1500838,61280
8948371456,124864167936,60751872,923336704,34.204,12.562,53.172,0.062,0,1330554,55986
12142215168,121668362240,60751872,925138944,36.406,13.125,50.375,0.094,0,1323122,56174
15213568000,118595616768,60760064,926437376,34.689,12.141,51.845,1.325,0,1509682,63106
18342879232,115464654848,60768256,928043008,36.908,12.763,50.047,0.282,0,1505298,568760
21529587712,112276365312,60792832,929513472,38.132,13.931,47.533,0.403,0,1466214,9981556
24214376448,109590392832,60805120,930660352,36.986,12.465,50.267,0.283,0,1671134,23042470
27393720320,106409369600,60817408,932188160,44.323,13.841,41.649,0.187,0,1840148,29661646
30180720640,103621492736,60829696,932986880,41.486,13.031,42.241,3.242,0,1142680,46119438
30707359744,103094784000,60829696,933052416,18.353,3.300,76.928,1.419,0,965174,53152142
30901723136,102900363264,60829696,933109760,18.255,1.651,79.720,0.374,0,1259470,70035427
31105101824,102696890368,60850176,933179392,20.410,1.615,77.384,0.590,0,1420366,80230173
31281385472,102520524800,60850176,933261312,22.646,2.221,74.632,0.500,0,1683274,94761316
31474774016,102326915072,60850176,933478400,22.803,2.096,74.664,0.438,0,1896674,103279785
31619592192,102181867520,60850176,933707776,24.929,2.132,70.147,2.791,0,2054702,114034154
31775166464,102026194944,60850176,933801984,23.795,2.286,73.419,0.501,0,2188600,120211972
31855673344,101945552896,60858368,933928960,22.727,3.103,72.884,1.285,0,2018414,113374106
31932809216,101868179456,60858368,934166528,21.626,2.511,74.765,1.099,0,2137414,119132792
32060502016,101740363776,60858368,934281216,23.246,2.421,73.650,0.683,0,2059528,120534122
32041041920,101759721472,60858368,934383616,18.207,2.495,76.001,3.296,0,1987044,111689944
31989899264,101810753536,60858368,934490112,9.478,1.439,83.234,5.849,0,2121090,114946626
31973842944,101826674688,60866560,934612992,11.232,1.841,83.682,3.245,0,2192190,121183312
31939616768,101860790272,60866560,934723584,10.454,1.502,87.387,0.657,0,2072410,113143510
31946588160,101853724672,60866560,934813696,10.350,1.470,87.711,0.469,0,2137008,115807648
31980683264,101819523072,60866560,934920192,10.106,1.622,87.617,0.655,0,2105620,114673408
31973597184,101826478080,60874752,935038976,12.019,1.180,86.118,0.683,0,2186858,119010000
31965360128,101834600448,60882944,935145472,7.806,1.034,90.376,0.784,0,2199552,119779282
31952678912,101847138304,60882944,935288832,10.161,1.642,87.732,0.465,0,2144010,115058648
31953063936,101846671360,60882944,935370752,9.607,1.061,88.833,0.499,0,2262842,126751412
31961427968,101838200832,60882944,935473152,7.351,1.345,90.866,0.438,0,2204280,124866394
31960743936,101838766080,60882944,935591936,7.959,1.217,88.920,1.904,0,2155966,116086806
31967928320,101831458816,60891136,935702528,8.362,1.127,89.759,0.752,0,2182032,117730056
31987310592,101811961856,60891136,935817216,8.946,1.309,89.433,0.312,0,2153104,122969728
31986024448,101813137408,60891136,935919616,8.220,1.520,89.857,0.403,0,2041062,112740038
31987933184,101811101696,60891136,936046592,7.873,1.437,90.159,0.531,0,2069756,112648094
31989485568,101809299456,60891136,936292352,6.840,1.098,90.493,1.569,0,2030752,116702446
31992713216,101805948928,60899328,936402944,8.616,1.369,82.986,7.030,0,2141838,116604018
31995535360,101803020288,60899328,936505344,6.631,1.069,91.986,0.314,0,2077046,111995278
31996911616,101801525248,60899328,936620032,7.496,1.089,90.980,0.435,0,2092422,119133982
31997456384,101800726528,60899328,936869888,8.427,1.786,89.098,0.689,0,1981856,109042432
32007421952,101790638080,60899328,936988672,7.453,1.863,90.217,0.466,0,2049172,115624648
32010907648,101787037696,60915712,937086976,7.639,1.698,88.054,2.609,0,2128768,118537830
32013287424,101784539136,60915712,937201664,5.094,1.069,93.491,0.346,0,2134670,116738086
32037146624,101760573440,60915712,937308160,8.414,1.814,89.365,0.407,0,2093576,115913470
32046792704,101750710272,60915712,937525248,6.899,1.348,91.345,0.408,0,2098478,113386016
32050069504,101747286016,60915712,937660416,7.176,1.310,91.201,0.312,0,2214838,121838764
32050663424,101746581504,60923904,937762816,7.006,1.037,90.355,1.602,0,2111732,116423766
32057786368,101739343872,60923904,937877504,7.348,0.938,91.432,0.281,0,2076538,112838856
32059027456,101737861120,60923904,938119168,5.676,0.972,92.850,0.502,0,2090106,112863492
32059666432,101737103360,60923904,938233856,6.379,1.251,92.058,0.313,0,2093618,118037290
32069611520,101727047680,60923904,938340352,6.589,1.381,91.622,0.408,0,2206620,120133978
32076599296,101719924736,60932096,938455040,7.190,1.276,88.017,3.517,0,2101086,113322004
32082395136,101714022400,60940288,938549248,6.960,1.155,90.387,1.498,0,2048960,113446902
32088313856,101707976704,60940288,938672128,7.112,1.372,91.204,0.312,0,2180906,119815222
32091492352,101704675328,60940288,938782720,7.015,1.267,91.347,0.371,0,2149224,118088504
32092004352,101704052736,60940288,938893312,7.174,1.248,91.173,0.405,0,2024006,111550824
32093196288,101702725632,60948480,939020288,5.803,0.915,92.558,0.725,0,2101184,114717416
32094564352,101701238784,60948480,939134976,6.022,1.342,85.897,6.739,0,2109036,115108114
32116977664,101678739456,60948480,939220992,7.634,1.073,91.009,0.284,0,2168936,118379732
32119005184,101676523520,60948480,939466752,8.333,1.217,90.106,0.343,0,2170032,121667136
32123707392,101671710720,60948480,939573248,8.607,1.033,90.047,0.313,0,2076772,113994824
32134565888,101660737536,60956672,939675648,9.359,1.116,88.875,0.651,0,2151420,121042076
32161685504,101633359872,60964864,939925504,9.648,1.214,88.702,0.436,0,2012238,109720182
32166969344,101627961344,60964864,940040192,9.345,0.909,88.962,0.784,0,2073452,114289962
32171737088,101623103488,60964864,940130304,9.267,1.252,89.136,0.344,0,2100548,116894024
32170668032,101624037376,60964864,940261376,8.401,1.991,89.203,0.404,0,2071062,113136730
32180301824,101614280704,60973056,940376064,9.207,1.248,87.890,1.654,0,2084744,117561624
32200880128,101593612288,60973056,940462080,9.831,1.561,87.266,1.342,0,2053356,111748996
32202555392,101591670784,60973056,940728320,7.927,1.101,90.060,0.912,0,2123282,118021132
32238014464,101555822592,60973056,941117440,10.456,1.623,87.360,0.562,0,2121864,116280946
32310677504,101483081728,60973056,941195264,11.405,1.088,87.197,0.311,0,2109046,117297832
32361689088,101431934976,60981248,941318144,9.752,1.003,86.736,2.509,0,2134600,117906244
32412184576,101381328896,60981248,941424640,10.433,1.920,86.966,0.681,0,2147588,117948844
32470343680,101323071488,60981248,941522944,12.062,2.156,83.906,1.875,0,2199628,120668260
32510480384,101282668544,60981248,941785088,9.139,1.061,89.457,0.343,0,2184530,120705778
32572252160,101220777984,60981248,941903872,14.143,2.087,83.396,0.374,0,2112034,116842816
32581926912,101211025408,60989440,941969408,8.824,1.377,89.393,0.407,0,2064950,113944612
32627863552,101164945408,60989440,942108672,8.677,0.975,89.626,0.723,0,2096850,116345750
32663023616,101129658368,60997632,942227456,9.975,1.032,85.491,3.502,0,2038928,112546936
32655900672,101136551936,60997632,942452736,6.819,1.251,91.273,0.657,0,2163172,120413280
32659582976,101132750848,60997632,942567424,5.879,1.383,92.298,0.440,0,2207846,118961608
32656019456,101136183296,61005824,942686208,5.263,1.190,93.139,0.407,0,2190584,120342232
32654991360,101137100800,61005824,942796800,6.180,0.936,92.291,0.593,0,2221402,120100922
32658546688,101133410304,61005824,942919680,6.723,1.276,91.348,0.654,0,2179186,123392522
32668635136,101123207168,61014016,943022080,6.172,1.247,91.334,1.247,0,2064569,111150842
32663552000,101128187904,61014016,943120384,7.002,0.938,91.685,0.375,0,2330705,109277648
32662990848,101128486912,61022208,943366144,5.024,1.036,90.801,3.140,0,2170160,120596458
32660881408,101130465280,61022208,943493120,4.445,1.040,94.105,0.410,0,2134326,116415822
32665485312,101125758976,61022208,943591424,6.236,1.216,92.205,0.343,0,2233434,123214262
32670679040,101120425984,61030400,943718400,6.991,1.186,91.479,0.343,0,2258318,124677328
32671690752,101119311872,61030400,943816704,6.621,0.995,92.042,0.342,0,2085042,116105682
32671551488,101119209472,61038592,944046080,4.657,0.755,93.518,1.070,0,2095506,113939382
32665051136,101125586944,61038592,944168960,5.644,1.091,92.953,0.312,0,2222312,121960792
32665100288,101125439488,61038592,944267264,5.209,1.224,93.222,0.345,0,2193124,119946884
32665608192,101124820992,61038592,944373760,5.317,1.063,91.242,2.377,0,2195928,121817842
32665018368,101125259264,61038592,944521216,5.432,0.999,93.007,0.562,0,2159656,118858774
32668499968,101121540096,61046784,944750592,5.723,1.006,92.484,0.786,0,2162346,117526746
32664715264,101125222400,61046784,944852992,5.969,1.344,92.312,0.375,0,2148980,116633996
32665362432,101124444160,61046784,944984064,5.589,1.124,92.944,0.343,0,2253228,124567234
32665600000,101124096000,61046784,945090560,5.934,1.499,83.979,8.588,0,2151574,119271200
32666742784,101122863104,61046784,945176576,5.089,1.062,93.412,0.437,0,2094434,114626764
32665432064,101124038656,61050880,945295360,7.707,1.316,88.001,2.976,0,2210778,120140084
32666755072,101122572288,61050880,945438720,10.022,1.467,88.074,0.437,0,2126838,117703018
32665300992,101123686400,61050880,945766400,6.615,1.242,91.770,0.373,0,2242966,123713392
32666173440,101122682880,61050880,945893376,6.546,1.060,92.082,0.312,0,2090822,114808130
32667455488,101121273856,61059072,946008064,6.706,1.087,88.358,3.850,0,2129054,117649504
32668131328,101120487424,61063168,946114560,6.708,1.279,91.357,0.655,0,2163092,119558758
32668860416,101119631360,61063168,946237440,6.495,1.130,91.403,0.973,0,2186640,121558944
32669540352,101118713856,61063168,946475008,6.766,1.216,91.550,0.468,0,2197144,119885964
32669384704,101118763008,61063168,946581504,6.541,1.127,91.674,0.657,0,2240442,122548808
32671404032,101116608512,61071360,946708480,5.864,1.223,89.213,3.700,0,2180724,117312550
32672477184,101115420672,61079552,946810880,6.055,1.498,91.729,0.718,0,2084548,113235494
32672649216,101115138048,61079552,946917376,5.495,1.342,92.819,0.343,0,2111342,119882930
32673607680,101114044416,61079552,947048448,5.418,0.846,93.486,0.251,0,2185852,119485052
32673759232,101113659392,61079552,947277824,5.829,0.945,92.880,0.347,0,2106466,116770972
32673779712,101113511936,61079552,947400704,4.822,1.221,93.363,0.595,0,2185946,119217724
32673554432,101113610240,61091840,947511296,7.203,1.284,89.821,1.691,0,2194706,121539594
32676401152,101110632448,61091840,947642368,5.528,1.124,92.567,0.781,0,2148492,118151378
32677179392,101109747712,61091840,947740672,7.628,1.339,90.411,0.623,0,2170662,118901160
32678854656,101107965952,61091840,947847168,6.341,0.915,92.366,0.379,0,2114684,117057084
32683839488,101102862336,61091840,947961856,10.987,1.578,86.815,0.619,0,2138854,116241908
32687620096,101098926080,61108224,948097024,11.118,0.968,78.264,9.650,0,2156840,118606490
32688218112,101098221568,61108224,948199424,7.214,1.337,90.827,0.622,0,2179764,119490160
32692817920,101093478400,61108224,948338688,8.057,1.124,90.631,0.187,0,2073538,116110336
32694636544,101091545088,61108224,948453376,10.386,1.130,88.233,0.251,0,2118470,120412408
32695300096,101090807808,61108224,948527104,6.124,1.005,92.651,0.220,0,2144322,118996476
32696651776,101089292288,61124608,948670464,8.268,1.315,88.569,1.848,0,2064130,113205810
32697380864,101088448512,61124608,948781056,6.592,1.455,91.458,0.495,0,2551370,116609272
32698925056,101086781440,61124608,948903936,6.103,0.970,92.332,0.595,0,2260896,117620226
32697892864,101087711232,61124608,949006336,5.748,1.031,92.440,0.781,0,2182162,113829784
32699367424,101086109696,61124608,949129216,5.197,1.096,93.049,0.657,0,2266052,122245594
32710508544,101074849792,61132800,949235712,6.793,1.272,91.470,0.465,0,2177516,114073970
32709918720,101075324928,61136896,949346304,5.280,1.069,91.892,1.760,0,2204096,119252328
32711778304,101073334272,61136896,949469184,5.805,1.373,92.509,0.312,0,2258420,119028812
32713674752,101071310848,61136896,949583872,5.036,1.039,93.421,0.504,0,2184882,116395806
32713170944,101071716352,61136896,949682176,5.479,1.252,92.893,0.376,0,2203260,116527110
32705306624,101079310336,61140992,949944320,5.327,1.191,92.698,0.783,0,2190124,113905548
32706433024,101078061056,61149184,950050816,4.706,0.997,92.583,1.714,0,2296900,122543452
32705060864,101079318528,61149184,950165504,5.201,1.152,93.304,0.343,0,2315166,122480766
32703868928,101080387584,61149184,950284288,5.075,1.253,92.920,0.752,0,2264144,119104862
32707448832,101076557824,61149184,950530048,7.250,1.344,90.594,0.812,0,2202074,116855742
32705679360,101078208512,61157376,950640640,4.817,1.282,92.993,0.907,0,2298458,122138300
32705720320,101078048768,61157376,950759424,4.598,1.008,92.945,1.449,0,2317302,126198986
32706514944,101077135360,61157376,950878208,4.786,1.126,93.807,0.282,0,2199820,121060346
32706727936,101076807680,61157376,950992896,3.566,0.907,95.183,0.344,0,2186210,118661340
32708014080,101075423232,61157376,951091200,4.674,0.847,93.915,0.565,0,2133132,116562010
32707014656,101076258816,61165568,951238656,6.482,1.091,91.835,0.592,0,2188178,118219118
32708694016,101074464768,61173760,951341056,5.701,1.134,92.787,0.378,0,2241082,121325542
32708468736,101074583552,61173760,951443456,4.486,0.847,92.691,1.976,0,2115246,111339450
32707612672,101075300352,61173760,951582720,4.658,0.938,93.779,0.625,0,2155962,119680198
32710242304,101072568320,61173760,951685120,4.368,0.974,94.375,0.283,0,2178034,118516124
32709005312,101073686528,61181952,951791616,4.974,1.150,93.255,0.622,0,2160670,116378104
32709550080,101073006592,61181952,951922688,4.701,1.003,93.638,0.658,0,2301900,122680918
32710574080,101071867904,61190144,952029184,4.101,0.751,87.289,7.858,0,2161330,114896036
32710168576,101072166912,61190144,952135680,4.987,0.972,93.319,0.721,0,2157764,113224010
32709210112,101072986112,61190144,952270848,6.135,1.534,91.706,0.626,0,2234798,115397000
32711663616,101070413824,61198336,952373248,6.465,1.218,91.880,0.437,0,2341732,123687584
32712994816,101068972032,61198336,952479744,4.224,1.001,94.524,0.250,0,2216714,121144134
32713363456,101068369920,61198336,952713216,3.795,0.784,94.542,0.878,0,2129076,119157886
32713322496,101068247040,61206528,952856576,3.752,1.063,93.246,1.939,0,2119480,113976052
32712130560,101069307904,61206528,952987648,4.090,1.124,94.474,0.312,0,2231662,122894162
32712220672,101069135872,61214720,953061376,4.649,0.998,91.451,2.902,0,2210782,118867522
32713003008,101068206080,61214720,953204736,4.142,0.879,94.697,0.282,0,2228782,119073290
32713269248,101067837440,61214720,953307136,5.255,1.133,93.172,0.441,0,2209040,117353626
32717434880,101063557120,61222912,953405440,5.893,0.819,91.491,1.796,0,2144084,113713522
32717037568,101063823360,61222912,953532416,3.867,0.912,94.530,0.692,0,2299816,124160236
32716943360,101063774208,61231104,953659392,5.006,1.033,93.398,0.563,0,2243744,122810618
32718073856,101062549504,61231104,953753600,5.448,1.276,92.902,0.374,0,2124932,115231354
32717496320,101062987776,61231104,953892864,5.079,1.278,93.175,0.467,0,2215388,120698334
32718966784,101061394432,61239296,954003456,4.112,1.004,93.346,1.538,0,2205596,119000742
32718053376,101062201344,61239296,954109952,4.833,0.904,93.608,0.655,0,2000628,114400448
32717307904,101062819840,61247488,954224640,4.040,1.096,94.081,0.783,0,2246804,123429596
32718036992,101061963776,61247488,954347520,5.340,1.218,93.129,0.312,0,2074712,112935222
32719400960,101060505600,61247488,954441728,4.340,0.975,94.308,0.377,0,2159564,117897224
32718594048,101061173248,61247488,954572800,5.661,1.244,92.691,0.404,0,2110444,115936626
32719544320,101060083712,61255680,954695680,4.235,0.816,88.018,6.932,0,2115840,114209538
32718954496,101060542464,61263872,954810368,3.633,0.664,94.471,1.232,0,2185514,119351728
32719081472,101060296704,61263872,954920960,5.012,0.996,93.618,0.374,0,2258118,124399916
32719212544,101059895296,61263872,955187200,5.074,1.034,93.454,0.438,0,2249612,122117826
32720191488,101058838528,61263872,955265024,3.687,0.914,94.516,0.882,0,2239666,122018844
32722653184,101056245760,61272064,955387904,5.156,1.156,92.406,1.281,0,2273034,122935326
32720773120,101057982464,61280256,955523072,4.135,1.003,94.236,0.627,0,2154146,115318142
32719499264,101059145728,61280256,955633664,4.161,1.126,94.337,0.375,0,2078534,111746478
32722247680,101056294912,61280256,955736064,5.493,1.436,92.665,0.406,0,2269004,123441352
32723402752,101055016960,61280256,955850752,4.499,0.968,93.596,0.937,0,2245368,120821638
32723767296,101054500864,61284352,955990016,4.555,0.943,87.308,7.194,0,2298560,126351776
32724955136,101053198336,61292544,956096512,4.408,1.032,94.092,0.469,0,2197518,120205394
32723369984,101054672896,61292544,956203008,4.412,0.907,94.337,0.344,0,2116356,113991158
32723279872,101054640128,61292544,956321792,4.040,0.689,94.738,0.532,0,2162202,115443146
32724697088,101053104128,61292544,956436480,4.946,0.977,93.226,0.851,0,2269006,119825924
32723042304,101054636032,61300736,956551168,5.151,0.999,93.444,0.406,0,2129154,117114340
32724725760,101052821504,61308928,956674048,5.083,0.935,91.425,2.557,0,2118618,115462420
32727597056,101049843712,61308928,956776448,6.556,1.623,91.477,0.343,0,2141624,117557244
32728502272,101048791040,61308928,956878848,4.648,1.131,93.562,0.660,0,2214906,121404714
32728551424,101048594432,61308928,957026304,5.088,1.005,93.530,0.377,0,2218380,122120820
32727732224,101049180160,61308928,957259776,3.387,0.784,95.108,0.721,0,2076084,113037984
32727949312,101048856576,61325312,957349888,4.213,0.968,93.102,1.717,0,1988692,108921718
32728338432,101048340480,61325312,957472768,3.793,0.878,94.545,0.784,0,2049044,113834580
32729866240,101046689792,61325312,957591552,4.124,1.062,94.252,0.562,0,2025428,112814520
32731095040,101045350400,61325312,957702144,4.919,0.909,93.766,0.407,0,2227908,123164288
32732413952,101043892224,61325312,957829120,5.510,0.882,93.356,0.252,0,2156384,115070766
32732471296,101043691520,61341696,957956096,4.835,0.936,92.483,1.747,0,2087070,115449168
32730767360,101045284864,61341696,958062592,5.114,1.060,92.641,1.185,0,2137068,117470160
32731963392,101043982336,61341696,958169088,4.719,0.969,93.719,0.594,0,2084112,112814432
32732733440,101043089408,61341696,958291968,6.072,0.908,92.676,0.344,0,2176236,119746326
32733216768,101042499584,61341696,958398464,3.841,0.787,95.088,0.283,0,2146444,112059346
32731951104,101043519488,61349888,958636032,4.440,0.938,91.370,3.252,0,2208468,118203542
32732389376,101042941952,61349888,958767104,4.133,0.595,93.550,1.722,0,2112266,115425496
32732860416,101042343936,61358080,958881792,5.080,0.721,93.728,0.470,0,2168538,121050836
32735215616,101039882240,61358080,958988288,4.332,1.091,93.955,0.623,0,2235920,121640650
32734380032,101040582656,61358080,959119360,5.105,1.096,93.173,0.626,0,2184030,121087912
32737538048,101037301760,61366272,959225856,4.413,0.751,94.178,0.657,0,2059434,112265112
32736894976,101037830144,61366272,959328256,4.533,0.969,92.998,1.500,0,2241598,121815538
32733560832,101041025024,61374464,959451136,5.008,0.939,93.584,0.469,0,2138352,114963658
32733696000,101040754688,61374464,959586304,5.289,1.089,93.124,0.498,0,2178358,120381650
32735531008,101038829568,61374464,959672320,4.052,0.879,94.441,0.628,0,2147112,118513832
32738013184,101036068864,61382656,959938560,4.052,0.848,93.907,1.193,0,2120036,117682632
32738832384,101035118592,61382656,960065536,4.499,1.031,94.064,0.406,0,2086618,112519194
32738971648,101034893312,61390848,960143360,5.302,1.116,92.124,1.457,0,2103456,114912360
32738349056,101035384832,61390848,960270336,5.316,1.203,92.690,0.791,0,2180170,118320816
32738480128,101035143168,61390848,960372736,3.873,1.062,94.722,0.344,0,2097132,114377414
32738181120,101035274240,61399040,960528384,4.266,0.847,94.260,0.627,0,2095412,112475676
32738680832,101034680320,61399040,960618496,4.215,0.912,94.495,0.377,0,2079728,116099596
32738959360,101034217472,61399040,960724992,4.765,1.097,92.038,2.100,0,2310784,123553832
29694971904,104078069760,61407232,960851968,4.023,0.849,94.217,0.911,0,2067676,114454066
26455957504,107317878784,61407232,960057344,3.512,0.847,94.920,0.721,0,1921304,101203624
22499581952,111275016192,61419520,959283200,3.514,0.941,95.105,0.439,0,1638490,90706778
19377180672,114398216192,61419520,958476288,3.118,0.598,95.717,0.567,0,1364506,76106180
16214458368,117561774080,61419520,957640704,2.383,0.564,95.328,1.725,0,1227330,69045638
12994293760,120782987264,61419520,956592128,1.633,0.471,97.708,0.188,0,969714,52111006
9025327104,124752805888,61419520,955740160,1.540,0.346,97.926,0.189,0,661030,36656598
6536663040,127242317824,61440000,954871808,1.563,0.281,97.842,0.313,0,481358,26846994
2662412288,131117428736,61440000,954011648,0.439,0.314,99.028,0.220,0,234358,13870560
1086513152,132694208512,61440000,953131008,0.188,0.094,99.562,0.156,0,29186,1305150
1069375488,132712009728,61440000,952467456,0.094,0,99.906,0,0,35262,1288
1069375488,132712009728,61440000,952467456,0,0.031,99.969,0,0,38534,0
1068838912,132712534016,61452288,952467456,0.031,0,99.844,0.125,0,97364,0
1068056576,132713308160,61460480,952467456,0,0,99.875,0.125,0,36928,0
1068056576,132713308160,61460480,952467456,0,0,100,0,0,37752,0
1068048384,132713316352,61460480,952467456,0.031,0.031,99.938,0,0,3890,0
1068040192,132713324544,61460480,952467456,0,0,100,0,0,2464,0
1068040192,132713324544,61460480,952467456,0,0,100,0,0,46324,0
1067257856,132714098688,61468672,952467456,0.031,0,99.938,0.031,0,45806,0
1066999808,132714356736,61468672,952467456,0,0,100,0,0,82364,0
1066741760,132714614784,61468672,952467456,0.031,0,99.969,0,0,52378,1508
1065959424,132715397120,61468672,952467456,0.031,0,99.969,0,0,33606,0
1065443328,132715913216,61468672,952467456,0,0.031,99.969,0,0,31968,0
1064927232,132716429312,61468672,952467456,0,0,100,0,0,64026,0
1064660992,132716687360,61476864,952467456,0.031,0,99.937,0.031,0,55250,0
1064394752,132716953600,61476864,952467456,0,0,100,0,0,57064,0
1063878656,132717469696,61476864,952467456,0,0.031,99.969,0,0,18384,0
1063620608,132717727744,61476864,952467456,0.031,0,99.969,0,0,12634,132
1063104512,132718243840,61476864,952467456,0.031,0,99.969,0,0,17140,0
1062330368,132719017984,61476864,952467456,0,0,100,0,0,44610,0
1061765120,132719575040,61485056,952467456,0,0,99.250,0.750,0,43236,0
1061765120,132719575040,61485056,952467456,0.062,0.031,99.906,0,0,79664,0
1061507072,132719833088,61485056,952467456,0,0,100,0,0,51464,168
1060732928,132720607232,61485056,952467456,0.031,0,99.969,0,0,53676,0
1060732928,132720607232,61485056,952467456,0,0,100,0,0,49962,0
1060474880,132720865280,61493248,952459264,0.031,0,99.625,0.344,0,84434,0
1060208640,132721123328,61493248,952467456,0,0,100,0,0,69730,0
1060208640,132721123328,61493248,952467456,0,0,100,0,0,98770,0
1059835904,132721496064,61493248,952467456,0,0,100,0,0,41730,0
1059319808,132722012160,61493248,952467456,0.062,0,99.938,0,0,16392,2380
1059319808,132722012160,61493248,952467456,0,0,99.906,0.094,0,34332,220
1059307520,132722012160,61505536,952467456,0,0.031,99.906,0.062,0,35612,0
1059049472,132722270208,61505536,952467456,0.031,0,99.969,0,0,72222,0
1059049472,132722270208,61505536,952467456,0.031,0.031,99.938,0,0,183616,0
1059041280,132722270208,61513728,952467456,0,0,99.937,0.063,0,91626,0
1058816000,132722495488,61513728,952467456,0.031,0,99.969,0,0,31766,0
1058557952,132722753536,61513728,952467456,0,0,100,0,0,65118,0
1058557952,132722753536,61513728,952467456,0.031,0,99.969,0,0,6360,0
1058557952,132722753536,61513728,952467456,0,0,100,0,0,74894,0
1058557952,132722753536,61513728,952467456,0,0,100,0,0,33218,0
1058549760,132722753536,61521920,952467456,0.062,0,99.875,0.062,0,85660,0
1058549760,132722753536,61521920,952467456,0,0,100,0,0,4580,0
1058549760,132722753536,61521920,952467456,0.031,0,99.969,0,0,2486,0
1058078720,132723220480,61521920,952471552,0,0.031,99.969,0,0,18710,0
1075048448,132704755712,61530112,952926208,1.125,0.188,98.625,0.062,0,457159,22404
1059979264,132719181824,61530112,952479744,0.562,0.406,99.032,0,0,147800,28610
