"Dstat 0.7.3 CSV output"
"Author:","Dag Wieers <dag@wieers.com>",,,,"URL:","http://dag.wieers.com/home-made/dstat/"
"Host:","gros-60.nancy.grid5000.fr",,,,"User:","root"
"Cmdline:","dstat -m -c -n -o dstat.csv",,,,"Date:","23 May 2020 23:59:15 CEST"
"memory usage",,,,"total cpu usage",,,,,"net/total",
"used","free","buff","cach","usr","sys","idl","wai","stl","recv","send"
1507864576,96975425536,51253248,1044385792,0.939,0.103,98.924,0.034,0,0,0
1517076480,96965881856,51253248,1044738048,0.611,0.416,98.973,0,0,390126,17608
1503125504,96980279296,51253248,1044291584,0.056,0.028,99.917,0,0,15186,17772
1503129600,96980254720,51253248,1044295680,0.639,0.445,98.916,0,0,390518,17674
1502281728,96981090304,51265536,1044295680,0.611,0.417,98.972,0,0,390374,16866
1502027776,96981258240,51277824,1044295680,0,0,100,0,0,11579,2600
1502027776,96981258240,51277824,1044295680,0,0,100,0,0,17020,220
1502027776,96981258240,51277824,1044295680,0,0,100,0,0,6902,0
1502052352,96981192704,51277824,1044295680,0,0.028,99.972,0,0,5662,0
1502052352,96981192704,51277824,1044295680,0,0,100,0,0,4051,0
1499860992,96983371776,51290112,1044295680,0.584,0.445,98.971,0,0,391596,20826
1499066368,96984158208,51298304,1044295680,0.028,0.028,99.944,0,0,3146,1164
1500807168,96982368256,51298304,1044312064,0.223,0.390,99.388,0,0,176400,11716
1498034176,96985133056,51298304,1044312064,0.584,0.501,98.915,0,0,400302,30366
1496367104,96986791936,51298304,1044316160,0.584,0.417,98.999,0,0,395976,17246
1500438528,96982716416,51310592,1044303872,0.667,0.444,98.889,0,0,391222,17394
1500254208,96982876160,51322880,1044316160,0,0.028,99.972,0,0,2534,0
1501511680,96981475328,51322880,1044459520,1.140,0.167,98.694,0,0,229938,12296
1501216768,96981876736,51322880,1044316160,0,0,100,0,0,3970,2816
1501601792,96981446656,51322880,1044316160,0.306,0.167,99.528,0,0,344988,15680
1508790272,96974041088,51322880,1044504576,0.167,0.278,99.554,0,0,184064,18896
1508777984,96974041088,51351552,1044488192,0,0,99.972,0.028,0,13604,10192
1508753408,96974041088,51351552,1044512768,0,0.028,99.972,0,0,14128,10094
1508753408,96974041088,51351552,1044512768,0,0,100,0,0,12144,10294
1508745216,96974049280,51351552,1044512768,0.028,0.028,99.944,0,0,15173,9800
1508745216,96974049280,51351552,1044512768,0,0.056,99.944,0,0,27678,15904
1508745216,96974049280,51351552,1044512768,0,0.056,99.944,0,0,23542,10314
1508737024,96974049280,51367936,1044504576,0,0.028,99.972,0,0,25194,10192
1508728832,96974049280,51367936,1044512768,0.028,0.028,99.944,0,0,13266,10192
1508728832,96974049280,51367936,1044512768,0.028,0,99.972,0,0,13588,9898
1502330880,96980447232,51367936,1044512768,0.167,0.111,99.722,0,0,175590,15328
1500819456,96982138880,51367936,1044332544,0,0.028,99.972,0,0,2904,1164
1500819456,96982138880,51367936,1044332544,0.028,0,99.972,0,0,6884,0
1500807168,96982138880,51380224,1044332544,0.028,0,99.972,0,0,3204,148
1500807168,96982138880,51380224,1044332544,0,0.028,99.972,0,0,1982,0
1510776832,96971898880,51392512,1044586496,0.640,0.334,99.027,0,0,390982,17390
1501282304,96981639168,51392512,1044340736,0.139,0.056,99.806,0,0,5226,14396
1549185024,96933396480,51396608,1044643840,0.863,0.167,98.970,0,0,331880,12900
1653047296,96829579264,51396608,1044643840,0.943,0.083,98.973,0,0,4070,680
1653174272,96829595648,51408896,1044512768,0,0,100,0,0,3858,0
1653174272,96829595648,51408896,1044512768,0,0.028,99.972,0,0,3756,306
1653161984,96829595648,51421184,1044512768,0,0,100,0,0,5478,2100
1653161984,96829595648,51425280,1044508672,0.028,0,99.972,0,0,5940,2100
1653657600,96829079552,51425280,1044525056,2.418,0,97.582,0,0,4024,2100
1653657600,96829079552,51433472,1044516864,2.806,0,97.194,0,0,5772,1820
1653645312,96829079552,51433472,1044529152,2.805,0.028,97.167,0,0,8266,4282
1696567296,96786108416,51441664,1044529152,4.118,0.362,95.520,0,0,6660136,1908288
1790021632,96692609024,51441664,1044533248,7.491,0.334,92.175,0,0,22786860,3501956
1876930560,96605581312,51441664,1044537344,5.889,0.639,93.472,0,0,35277200,3351948
1901268992,96581238784,51449856,1044533248,3.290,0.112,96.599,0,0,49549690,3953288
1941561344,96540938240,51449856,1044541440,3.369,0.139,96.492,0,0,57841758,3477680
2029617152,96452878336,51458048,1044537344,3.202,0.752,96.046,0,0,77677050,4541708
2065248256,96417239040,51458048,1044545536,3.127,0.223,96.650,0,0,90729838,5086952
2121281536,96361205760,51458048,1044545536,3.297,0.391,96.312,0,0,110537096,6140514
2184622080,96297869312,51466240,1044533248,3.080,0.364,96.557,0,0,117817759,4963462
2248867840,96233611264,51466240,1044545536,3.297,0.391,96.312,0,0,117407652,4675218
2315091968,96167387136,51466240,1044545536,3.156,0.475,96.369,0,0,122864692,5162162
2383921152,96098557952,51466240,1044545536,3.163,0.308,96.530,0,0,124610722,5327394
2442846208,96039624704,51474432,1044545536,3.299,0.308,96.394,0,0,111214986,5322454
2503626752,95978803200,51482624,1044537344,3.080,0.280,96.641,0,0,115026434,4329874
2569273344,95913144320,51482624,1044549632,3.274,0.308,96.419,0,0,117936746,5502802
2647199744,95835217920,51482624,1044549632,3.469,0.308,96.224,0,0,123174498,4557150
2750447616,95731970048,51482624,1044549632,3.247,0.756,95.997,0,0,114599932,5706214
2812575744,95669833728,51490816,1044549632,3.187,0.280,96.505,0.028,0,116955352,5840756
2873581568,95608827904,51499008,1044541440,3.186,0.335,96.478,0,0,117370196,5535236
2934185984,95548215296,51499008,1044549632,3.188,0.308,96.504,0,0,115878188,4824252
2995183616,95487217664,51499008,1044549632,3.270,0.307,96.423,0,0,114604308,5670792
3056685056,95425716224,51499008,1044549632,3.105,0.336,96.559,0,0,114451372,5087226
3118469120,95363932160,51507200,1044541440,3.157,0.307,96.535,0,0,113008008,4165470
3181723648,95300665344,51515392,1044545536,3.347,0.391,96.262,0,0,118502534,5143900
3241242624,95241138176,51515392,1044553728,3.073,0.419,96.507,0,0,111264446,4712124
3305365504,95177015296,51515392,1044553728,3.297,0.279,96.424,0,0,118841416,4928644
3366285312,95116095488,51515392,1044553728,3.185,0.307,96.507,0,0,112346248,4740366
3424858112,95057522688,51523584,1044545536,3.073,0.363,96.563,0,0,110592074,4431680
3486777344,94995595264,51531776,1044545536,3.130,0.363,96.506,0,0,115109836,4168142
3573710848,94908653568,51531776,1044553728,3.320,0.363,96.317,0,0,116415992,5368892
3677630464,94804733952,51531776,1044553728,3.408,1.061,95.531,0,0,118156770,5235332
3737915392,94744449024,51531776,1044553728,3.160,0.336,96.504,0,0,114153046,5091594
3797299200,94685061120,51539968,1044549632,3.296,0.391,96.313,0,0,113293072,5500474
3860217856,94622126080,51548160,1044557824,3.188,0.364,96.449,0,0,118062226,5508086
3924934656,94557409280,51548160,1044557824,3.212,0.363,96.425,0,0,119975080,6544630
3986489344,94495854592,51548160,1044557824,3.159,0.391,96.450,0,0,118115308,5154220
4050599936,94431744000,51548160,1044557824,3.158,0.391,96.451,0,0,116911682,6120628
4110962688,94371373056,51556352,1044557824,3.238,0.391,96.371,0,0,116350878,5997274
4174233600,94308098048,51564544,1044553728,3.078,0.308,96.614,0,0,118583281,4632176
4235468800,94246858752,51564544,1044557824,3.188,0.308,96.504,0,0,114597066,5561954
4298166272,94184161280,51564544,1044557824,3.185,0.419,96.396,0,0,114860932,4454046
4368031744,94113857536,51761152,1044619264,3.327,0.587,96.058,0.028,0,117752708,4826834
4429221888,94052077568,51920896,1044594688,3.213,0.419,96.340,0.028,0,115534186,4501052
4490203136,93991096320,51920896,1044594688,3.187,0.280,96.533,0,0,115400210,4823214
4569280512,93912018944,51920896,1044594688,3.185,0.391,96.424,0,0,114851736,5328438
4649656320,93831643136,51920896,1044594688,3.100,0.419,96.481,0,0,110959848,5363790
4736913408,93744381952,51920896,1044598784,3.408,0.307,96.285,0,0,113670000,5840346
4822114304,93659160576,51941376,1044598784,3.157,0.391,96.424,0.028,0,118309444,5211244
4900790272,93580484608,51941376,1044598784,3.161,0.280,96.559,0,0,118642678,4415886
4986257408,93495017472,51941376,1044598784,3.108,0.252,96.641,0,0,115782718,5789720
5074841600,93406429184,51941376,1044602880,3.108,0.196,96.696,0,0,116263302,4495312
5151842304,93329383424,51941376,1044606976,3.135,0.252,96.613,0,0,116836544,4967926
5236813824,93244403712,51949568,1044606976,3.241,0.447,96.312,0,0,119221956,5110864
5325082624,93156122624,51957760,1044611072,3.269,0.447,96.284,0,0,120898128,4952620
5412315136,93068890112,51957760,1044611072,3.435,0.391,96.174,0,0,116440668,5342966
5485469696,92995735552,51957760,1044611072,3.218,0.308,96.475,0,0,113112408,5000336
5573533696,92907671552,51957760,1044611072,3.213,0.419,96.368,0,0,117625666,4877370
5649760256,92831436800,51965952,1044611072,3.105,0.308,96.587,0,0,116789134,4646378
5760233472,92720955392,51974144,1044611072,3.241,1.006,95.753,0,0,113247762,4538666
5818056704,92663132160,51974144,1044611072,3.078,0.252,96.670,0,0,109542638,4453886
5879836672,92601352192,51974144,1044611072,3.107,0.308,96.586,0,0,115297456,5584598
5942181888,92539002880,51974144,1044615168,3.324,0.307,96.369,0,0,115976186,5813704
6007197696,92474101760,51982336,1044606976,3.243,0.335,96.422,0,0,120259560,5823660
6071721984,92409569280,51990528,1044606976,3.133,0.364,96.503,0,0,121788450,6061436
6136233984,92345057280,51990528,1044606976,3.244,0.336,96.421,0,0,118270662,5502440
6199898112,92281393152,51990528,1044606976,3.027,0.280,96.693,0,0,118386120,5087234
6263754752,92217536512,51990528,1044606976,3.270,0.363,96.367,0,0,120884308,4946724
6330716160,92150558720,51998720,1044606976,3.246,0.336,96.419,0,0,124827432,5236580
6393024512,92088242176,52006912,1044606976,3.409,0.391,96.200,0,0,117387269,5798710
6453886976,92027375616,52006912,1044611072,3.160,0.336,96.504,0,0,114777934,4515000
6519074816,91962187776,52006912,1044611072,3.103,0.363,96.533,0,0,119704514,4642130
6580150272,91901112320,52006912,1044611072,3.158,0.419,96.423,0,0,117421366,5104874
6640177152,91841077248,52015104,1044611072,3.211,0.307,96.481,0,0,109973118,5329002
6702034944,91779211264,52023296,1044611072,3.715,0.363,95.922,0,0,113528946,4906256
6761766912,91719479296,52023296,1044611072,3.106,0.280,96.614,0,0,114725100,5120756
6818947072,91662299136,52023296,1044611072,3.321,0.363,96.316,0,0,108932762,6182950
6883520512,91597725696,52023296,1044611072,3.157,0.363,96.479,0,0,117313408,4354032
6948061184,91533176832,52031488,1044611072,3.025,0.308,96.667,0,0,121264092,4715448
7009722368,91471515648,52039680,1044602880,3.186,0.363,96.451,0,0,117626628,4819958
7071576064,91409616896,52039680,1044615168,3.159,0.391,96.450,0,0,116307760,5974934
7133208576,91347984384,52039680,1044615168,3.267,0.391,96.342,0,0,113585652,4997324
7226253312,91254939648,52039680,1044615168,6.430,0.391,93.179,0,0,124177160,6186248
7288365056,91192819712,52047872,1044615168,3.576,0.363,96.060,0,0,114969698,5493444
7350349824,91130822656,52056064,1044615168,3.271,0.252,96.450,0.028,0,117193576,4978782
7415169024,91065995264,52056064,1044623360,3.242,0.363,96.395,0,0,119602084,5343020
7494684672,90986479616,52056064,1044623360,3.356,0.671,95.973,0,0,117252038,6805778
7556472832,90924687360,52056064,1044627456,3.189,0.308,96.503,0,0,116763396,5732420
7620337664,90860814336,52064256,1044627456,3.857,0.335,95.808,0,0,118329912,5660656
7686635520,90794508288,52072448,1044627456,3.129,0.503,96.368,0,0,121688682,4777378
7751888896,90729254912,52072448,1044627456,3.218,0.392,96.391,0,0,122123128,5296094
7817134080,90664009728,52072448,1044627456,4.112,0.420,95.469,0,0,118609848,5304086
7879589888,90601553920,52072448,1044627456,3.132,0.447,96.421,0,0,118868786,5075514
7937835008,90543308800,52080640,1044619264,3.131,0.503,96.366,0,0,116480938,4709616
8002117632,90479017984,52080640,1044627456,3.300,0.447,96.253,0,0,121998858,4530650
8062906368,90418221056,52088832,1044627456,3.215,0.363,96.422,0,0,116567288,4196098
8129802240,90351325184,52088832,1044627456,3.108,0.364,96.528,0,0,120872562,4689442
8193495040,90287632384,52088832,1044627456,3.156,0.363,96.480,0,0,116894394,5226974
8257105920,90224013312,52097024,1044627456,3.103,0.391,96.505,0,0,119703622,4407686
8324501504,90156613632,52097024,1044631552,3.024,0.448,96.529,0,0,126417455,5087016
8385884160,90095222784,52105216,1044631552,3.080,0.336,96.585,0,0,114608364,5412130
8451272704,90029834240,52105216,1044631552,3.130,0.447,96.423,0,0,121607870,4522200
8515698688,89965408256,52105216,1044631552,3.191,0.364,96.445,0,0,120115428,4979514
8579485696,89901608960,52113408,1044635648,3.241,0.279,96.479,0,0,120264004,5477574
8644636672,89836457984,52113408,1044635648,3.105,0.392,96.503,0,0,120374822,5896016
8706306048,89774788608,52121600,1044627456,3.189,0.364,96.448,0,0,118030910,6625720
8763904000,89717182464,52121600,1044635648,3.155,0.391,96.454,0,0,110855418,4629658
8851058688,89630023680,52121600,1044639744,6.620,0.447,92.933,0,0,115193868,5322130
8909467648,89571598336,52129792,1044639744,4.226,0.336,95.438,0,0,115085258,4796750
8971665408,89509400576,52129792,1044639744,3.080,0.280,96.641,0,0,116324874,4400416
9032757248,89448308736,52137984,1044631552,3.212,0.419,96.369,0,0,113030424,4731642
9094000640,89387057152,52137984,1044639744,3.189,0.336,96.476,0,0,115767900,5901080
9154224128,89326833664,52137984,1044639744,3.481,0.306,96.213,0,0,112021916,4623694
9207615488,89273442304,52146176,1044631552,3.434,0.279,96.287,0,0,117049472,5663716
9267040256,89214009344,52146176,1044639744,2.995,0.308,96.697,0,0,112713974,5057054
9332568064,89148481536,52154368,1044631552,3.216,0.475,96.309,0,0,117159304,5707970
9396666368,89084370944,52154368,1044643840,3.052,0.392,96.556,0,0,123041206,5490302
9458524160,89022513152,52154368,1044643840,3.244,0.336,96.421,0,0,115481130,4707284
9517527040,88963502080,52162560,1044643840,3.132,0.391,96.477,0,0,112321246,5462702
9581879296,88899149824,52162560,1044643840,3.184,0.447,96.369,0,0,119999288,4442788
9641291776,88839737344,52170752,1044635648,3.321,0.363,96.316,0,0,112662200,5834006
9700052992,88780967936,52170752,1044643840,3.211,0.419,96.370,0,0,111171166,4981316
9763643392,88717377536,52170752,1044643840,3.240,0.391,96.369,0,0,119279758,5129638
9822859264,88658157568,52178944,1044639744,3.101,0.391,96.508,0,0,109002682,4772240
9881436160,88599572480,52178944,1044647936,3.075,0.419,96.505,0,0,114674478,4792746
9946050560,88534958080,52187136,1044639744,3.242,0.335,96.395,0.028,0,121187330,5344466
10012618752,88468381696,52187136,1044647936,3.163,0.308,96.530,0,0,122446776,5858620
10075713536,88405286912,52187136,1044647936,3.104,0.419,96.477,0,0,120646828,4626280
10138083328,88342917120,52195328,1044639744,3.133,0.308,96.559,0,0,119122228,5011528
10200064000,88280928256,52195328,1044647936,3.163,0.308,96.530,0,0,118634555,5882908
10261061632,88219930624,52203520,1044639744,3.184,0.419,96.397,0,0,114622526,5258334
10325532672,88155447296,52203520,1044652032,3.190,0.308,96.503,0,0,119244262,5751766
10383900672,88097079296,52203520,1044652032,3.105,0.308,96.587,0,0,111924928,4712202
10444296192,88036675584,52211712,1044652032,3.183,0.419,96.398,0,0,116915944,5570304
10506170368,87974801408,52211712,1044652032,2.996,0.336,96.668,0,0,117221904,6138476
10567970816,87913000960,52211712,1044652032,3.164,0.308,96.528,0,0,118993446,6523114
10626072576,87854891008,52219904,1044652032,3.219,0.252,96.530,0,0,108652664,4585100
10688372736,87792590848,52219904,1044652032,3.129,0.279,96.591,0,0,114757100,4610330
10749124608,87731830784,52228096,1044652032,3.080,0.308,96.612,0,0,117462122,5271020
10811883520,87669071872,52228096,1044652032,3.076,0.364,96.560,0,0,114564550,4532532
10874372096,87606579200,52228096,1044656128,3.135,0.308,96.558,0,0,119524944,4959890
10934501376,87546441728,52236288,1044656128,3.187,0.363,96.450,0,0,114474262,4921106
10995367936,87485575168,52236288,1044656128,3.156,0.419,96.426,0,0,115346704,4632348
11058065408,87422869504,52244480,1044656128,3.163,0.336,96.502,0,0,118360526,5041178
11120644096,87360290816,52244480,1044656128,3.108,0.308,96.584,0,0,116907074,5151688
11183435776,87297499136,52244480,1044656128,3.215,0.419,96.366,0,0,119181584,5576786
11248361472,87232573440,52252672,1044647936,3.157,0.391,96.452,0,0,118906380,4358974
11310084096,87170842624,52252672,1044656128,3.238,0.447,96.316,0,0,117323372,5585660
11371798528,87109115904,52260864,1044660224,3.051,0.364,96.586,0,0,117603964,5066970
11432435712,87048478720,52260864,1044660224,3.105,0.476,96.420,0,0,115784756,9543744
11491291136,86989623296,52260864,1044660224,3.153,0.530,96.317,0,0,113164456,5246884
11551330304,86929567744,52269056,1044664320,3.019,0.419,96.561,0,0,114117372,3827280
11613335552,86867562496,52269056,1044664320,3.108,0.280,96.613,0,0,117912416,5191764
11676057600,86804840448,52277248,1044656128,3.135,0.252,96.613,0,0,115956442,5022364
11738324992,86742564864,52277248,1044664320,3.212,0.391,96.397,0,0,116642074,4416786
11803930624,86676959232,52277248,1044664320,3.052,0.280,96.668,0,0,119576554,4079472
11866726400,86614159360,52285440,1044660224,3.107,0.308,96.586,0,0,118551040,4434016
11929591808,86551285760,52285440,1044668416,3.185,0.363,96.452,0,0,115975784,4211314
11990036480,86490832896,52293632,1044668416,3.183,0.419,96.398,0,0,113853868,5370832
12053569536,86427299840,52293632,1044668416,3.162,0.308,96.530,0,0,117781647,5794770
12111482880,86369386496,52293632,1044668416,3.239,0.335,96.426,0,0,110797032,5341744
12175474688,86305386496,52301824,1044668416,3.462,0.363,96.175,0,0,117095874,4176666
12237508608,86243352576,52301824,1044668416,3.108,0.392,96.501,0,0,118297260,5187914
12298465280,86182387712,52310016,1044668416,3.156,0.307,96.536,0,0,115752866,4324160
12361838592,86119014400,52310016,1044668416,3.107,0.280,96.613,0,0,116269082,4637160
12426309632,86054539264,52310016,1044672512,3.163,0.252,96.586,0,0,121818138,4151110
12487462912,85993385984,52318208,1044664320,3.185,0.279,96.507,0.028,0,114316390,4337694
12544847872,85935992832,52318208,1044672512,3.412,0.308,96.281,0,0,109342650,4950366
12608638976,85872201728,52326400,1044664320,3.135,0.336,96.530,0,0,118892362,5628214
12672610304,85808218112,52326400,1044672512,3.164,0.308,96.528,0,0,119517550,5943920
12731035648,85749792768,52326400,1044672512,3.162,0.252,96.586,0,0,110342132,4763372
12795789312,85685039104,52334592,1044664320,3.134,0.420,96.447,0,0,120865986,5134896
12856115200,85624705024,52334592,1044672512,3.185,0.363,96.452,0,0,113110500,5046960
12913893376,85566926848,52342784,1044664320,3.132,0.308,96.560,0,0,108840348,4734132
12974759936,85506048000,52342784,1044676608,3.241,0.307,96.452,0,0,113297384,5019884
13032890368,85447917568,52342784,1044676608,3.158,0.363,96.478,0,0,112162524,5058360
13095510016,85385297920,52350976,1044668416,3.190,0.280,96.530,0,0,118332524,5023388
13158912000,85321887744,52350976,1044676608,3.244,0.252,96.504,0,0,118250310,4785772
13223264256,85257531392,52359168,1044672512,3.183,0.503,96.314,0,0,118734538,4548182
13285335040,85195456512,52359168,1044676608,3.101,0.363,96.535,0,0,114872938,5031850
13345316864,85135474688,52359168,1044676608,3.213,0.363,96.424,0,0,116725380,4296778
13408280576,85072510976,52359168,1044676608,3.266,0.335,96.399,0,0,115591928,4443492
13469917184,85010866176,52367360,1044676608,3.266,0.363,96.371,0,0,115139188,4437972
13532135424,84948635648,52375552,1044680704,3.159,0.363,96.477,0,0,118034418,5257770
13595525120,84885245952,52375552,1044680704,3.080,0.280,96.640,0,0,120339390,3938358
13657034752,84823736320,52375552,1044680704,3.183,0.419,96.399,0,0,113557854,4174048
13721030656,84759740416,52375552,1044680704,3.108,0.364,96.529,0,0,120141256,5736894
13778812928,84701949952,52383744,1044680704,3.135,0.280,96.586,0,0,109370278,4952108
13843599360,84637155328,52391936,1044680704,2.992,0.364,96.644,0,0,118508600,4017790
13900828672,84579926016,52391936,1044680704,3.189,0.280,96.531,0,0,110062987,6136812
13963218944,84517535744,52391936,1044680704,3.107,0.336,96.558,0,0,118261652,5166016
14025895936,84454858752,52391936,1044680704,3.103,0.391,96.505,0,0,117883458,5047576
14087684096,84393062400,52400128,1044680704,3.108,0.280,96.613,0,0,117280158,5080298
14153351168,84327383040,52408320,1044684800,3.024,0.336,96.640,0,0,122707960,4439488
14215823360,84264910848,52408320,1044684800,3.189,0.336,96.476,0,0,118852990,5177850
14278258688,84202475520,52408320,1044684800,3.245,0.336,96.420,0,0,120510612,6933596
14341611520,84139122688,52408320,1044684800,3.104,0.364,96.532,0,0,115912282,4123830
14404050944,84076683264,52416512,1044676608,3.107,0.392,96.502,0,0,116827850,5803126
14467670016,84013056000,52424704,1044676608,3.189,0.336,96.476,0,0,120078066,6492192
14532911104,83947806720,52424704,1044684800,3.159,0.363,96.477,0,0,120326798,4657912
14597107712,83883601920,52424704,1044692992,3.135,0.392,96.474,0,0,121640268,4527222
14655836160,83824873472,52424704,1044692992,3.104,0.336,96.560,0,0,110109432,5007948
14712598528,83768102912,52436992,1044688896,3.078,0.308,96.614,0,0,108269066,4181038
14772260864,83708407808,52445184,1044697088,3.048,0.336,96.616,0,0,111626696,4498472
14833573888,83647094784,52445184,1044697088,3.296,0.335,96.369,0,0,116508138,5511706
14894362624,83586306048,52445184,1044697088,2.994,0.420,96.586,0,0,116007604,5085410
14956224512,83524444160,52445184,1044697088,3.021,0.392,96.587,0,0,114660018,4580582
15016067072,83464601600,52453376,1044688896,3.102,0.391,96.478,0.028,0,113670216,5307366
15081902080,83398754304,52461568,1044692992,3.191,0.308,96.501,0,0,124972784,5810180
15143325696,83337322496,52461568,1044701184,3.077,0.364,96.559,0,0,115792324,4451998
15205974016,83274674176,52461568,1044701184,3.186,0.335,96.478,0,0,116526840,4742818
15270797312,83209850880,52461568,1044701184,3.130,0.447,96.423,0,0,121888916,4881080
15331680256,83148967936,52469760,1044692992,3.103,0.391,96.505,0,0,113249400,5779948
15394226176,83086405632,52477952,1044701184,3.135,0.308,96.557,0,0,119335210,5793328
15455576064,83025055744,52477952,1044701184,3.075,0.447,96.477,0,0,116797642,4357772
15520063488,82960568320,52477952,1044701184,3.022,0.364,96.614,0,0,117803972,4197304
15583834112,82896797696,52477952,1044701184,3.107,0.308,96.586,0,0,121439674,4982372
15647031296,82833600512,52486144,1044692992,3.159,0.447,96.394,0,0,117793228,4625338
15710236672,82770374656,52494336,1044705280,3.102,0.391,96.506,0,0,115453108,4484896
15770959872,82709651456,52494336,1044705280,3.187,0.308,96.505,0,0,114112683,4912424
15834308608,82646302720,52494336,1044705280,3.295,0.363,96.342,0,0,118845054,4996090
15886151680,82594459648,52494336,1044705280,3.402,0.307,96.291,0,0,100259579,5761404
15931019264,82549592064,52494336,1044705280,3.479,0.223,96.298,0,0,86051946,5371742
15969714176,82510888960,52510720,1044697088,3.066,0.334,96.600,0,0,76250006,5556232
16000753664,82479837184,52510720,1044709376,3.172,0.139,96.689,0,0,59104576,4247620
16024936448,82455650304,52518912,1044705280,3.087,0.195,96.719,0,0,48596757,4439844
16040964096,82439614464,52518912,1044713472,3.110,0.083,96.806,0,0,29272562,2789934
16049152000,82431426560,52518912,1044713472,2.864,0.056,97.080,0,0,17152852,2191528
16048635904,82431926272,52535296,1044713472,3.107,0.028,96.865,0,0,1377890,3590338
16047292416,82433269760,52535296,1044713472,2.890,0,97.110,0,0,31132,2750862
16048603136,82431959040,52535296,1044713472,2.943,0,97.057,0,0,32178,3980124
16046505984,82434056192,52535296,1044713472,2.890,0,97.110,0,0,41940,3573534
16048517120,82432045056,52535296,1044713472,2.806,0.028,97.166,0,0,29918,2369346
16046891008,82433654784,52551680,1044713472,2.834,0.028,97.138,0,0,29576,3745664
16045604864,82434936832,52551680,1044717568,2.944,0.028,97.029,0,0,35838,4226180
16044654592,82435887104,52551680,1044717568,2.834,0.028,97.138,0,0,32294,3112172
16045461504,82435080192,52551680,1044717568,2.889,0,97.111,0,0,23438,2644556
16044216320,82436325376,52551680,1044717568,2.835,0,97.165,0,0,33182,3303654
16044679168,82435846144,52568064,1044717568,2.835,0,97.165,0,0,20506,2098150
16044122112,82436403200,52568064,1044717568,2.833,0.028,97.139,0,0,27928,2647980
16045481984,82435043328,52568064,1044717568,2.916,0.028,97.056,0,0,28826,2673990
16045187072,82435338240,52568064,1044717568,2.861,0,97.139,0,0,34634,2170118
16043380736,82437140480,52568064,1044721664,2.862,0,97.138,0,0,37444,2412922
16044732416,82435780608,52584448,1044713472,2.833,0.028,97.139,0,0,27644,2105918
16043151360,82437353472,52584448,1044721664,2.916,0,97.084,0,0,23240,2772784
16042528768,82437976064,52584448,1044721664,2.890,0,97.110,0,0,25278,2945504
16041742336,82438762496,52584448,1044721664,2.834,0,97.166,0,0,15290,1422398
16043220992,82437283840,52584448,1044721664,2.971,0.028,97.001,0,0,36778,3390146
16042131456,82438365184,52600832,1044713472,2.833,0,97.139,0.028,0,19552,1420620
16042258432,82438225920,52600832,1044725760,2.863,0,97.137,0,0,28219,2653640
16040718336,82439766016,52600832,1044725760,2.862,0,97.138,0,0,30000,3116846
16040710144,82439770112,52600832,1044729856,2.862,0,97.138,0,0,27168,3436684
16040185856,82440294400,52600832,1044729856,2.833,0.028,97.139,0,0,22116,2412328
16039129088,82441342976,52617216,1044721664,2.834,0,97.166,0,0,20248,2221110
16039890944,82440572928,52617216,1044729856,2.781,0,97.219,0,0,20294,2131332
16038055936,82442407936,52617216,1044729856,2.861,0.028,97.111,0,0,24620,3028642
16037564416,82442899456,52617216,1044729856,2.807,0,97.193,0,0,25350,2797400
16038879232,82441584640,52617216,1044729856,2.836,0.028,97.136,0,0,27430,2942476
9772421120,88708026368,52633600,1044729856,0.804,0.499,98.696,0,0,4328,477162
9769431040,88711155712,52633600,1044512768,0.083,0.111,99.806,0,0,20115,12130
9781731328,88697208832,52633600,1044516864,0.834,0.472,98.694,0,0,404852,38724
