172.16.72.14 : 10.23 10.26 10.22 10.28 10.27 10.29 10.30 10.31 10.28 10.28
172.16.72.23 : 10.28 10.28 10.26 10.27 10.28 10.26 10.30 10.27 10.29 10.24
172.16.72.25 : 0.12 0.18 0.19 0.17 0.20 0.18 0.20 0.18 0.18 0.19
172.16.72.26 : 0.18 0.16 0.15 0.21 0.19 0.20 0.21 0.19 0.20 0.19
172.16.72.27 : 0.13 0.20 0.21 0.20 0.21 0.16 0.21 0.17 0.20 0.17
172.16.72.28 : 0.16 0.18 0.19 0.17 0.19 0.20 0.19 0.19 0.20 0.20
172.16.72.29 : 0.17 0.20 0.17 0.18 0.20 0.20 0.18 0.20 0.20 0.20
172.16.72.3  : 0.17 0.17 0.14 0.17 0.13 0.18 0.17 0.17 0.14 0.19
172.16.72.30 : 0.17 0.19 0.20 0.17 0.19 0.21 0.20 0.21 0.20 0.22
172.16.72.31 : 0.11 0.15 0.09 0.08 0.13 0.08 0.07 0.12 0.13 0.14
172.16.72.32 : 0.01 0.03 0.01 0.03 0.01 0.01 0.03 0.03 0.03 0.03
172.16.72.33 : 0.15 0.17 0.20 0.14 0.17 0.14 0.17 0.15 0.15 0.17
172.16.72.34 : 0.16 0.17 0.16 0.21 0.17 0.16 0.13 0.16 0.17 0.16
172.16.72.35 : 0.16 0.16 0.16 0.20 0.17 0.16 0.19 0.17 0.17 0.16
172.16.72.36 : 0.15 0.20 0.15 0.12 0.20 0.13 0.12 0.14 0.20 0.16
172.16.72.37 : 0.16 0.16 0.20 0.21 0.17 0.19 0.16 0.16 0.17 0.20
172.16.72.38 : 0.10 0.06 0.08 0.10 0.07 0.08 0.09 0.10 0.11 0.09
172.16.72.39 : 0.18 0.19 0.16 0.15 0.17 0.15 0.19 0.20 0.20 0.20
172.16.72.4  : 200.29 200.29 200.30 200.32 200.30 200.31 200.31 200.30 200.26 200.32
172.16.72.40 : - 200.30 - 200.35 - 200.29 200.29 200.31 200.32 200.32
172.16.72.41 : 200.27 200.34 200.32 200.31 200.31 200.33 200.32 200.29 200.30 -
172.16.72.42 : - 200.31 200.28 200.29 200.31 200.29 200.31 200.30 200.30 200.33
172.16.72.43 : 200.33 200.27 200.30 200.29 200.30 200.30 200.33 - 200.33 200.31
172.16.72.44 : 200.27 - - 200.31 - 200.26 200.26 200.30 200.30 200.30
172.16.72.46 : 200.32 200.31 200.32 - 200.31 - 200.33 200.27 200.34 200.30
172.16.72.47 : 200.26 200.25 200.26 200.30 200.29 200.34 - 200.26 200.31 200.32
172.16.72.48 : 200.30 200.33 200.33 200.33 200.33 200.33 200.32 200.30 200.31 200.34
172.16.72.49 : - - - 200.31 200.30 200.31 200.33 200.28 - 200.28
172.16.72.5  : 200.30 200.33 200.34 200.34 200.34 200.33 200.31 200.32 200.27 200.27
172.16.72.50 : 200.29 200.31 200.31 200.30 200.32 200.27 200.33 200.31 200.31 200.31
172.16.72.51 : 200.30 200.31 200.32 200.30 200.33 200.31 200.34 200.29 200.26 200.30
172.16.72.6  : 200.26 200.24 200.26 - 200.28 200.22 200.28 200.25 200.29 200.27
172.16.72.7  : 200.28 200.31 200.34 200.33 200.30 200.22 200.30 200.29 200.29 200.31
172.16.72.8  : 200.29 200.33 200.29 200.25 200.30 200.31 200.27 200.33 200.32 200.24
172.16.72.9  : 4.29 4.31 4.27 4.34 4.33 4.29 4.32 4.32 4.32 4.25

      35 targets
      35 alive
       0 unreachable
       0 unknown addresses

       9 timeouts (waiting for response)
     350 ICMP Echos sent
     333 ICMP Echo Replies received
       0 other ICMP received

 0.01 ms (min round trip time)
 86.8 ms (avg round trip time)
 200 ms (max round trip time)
       10.325 sec (elapsed real time)

