172.16.66.55 : 19.38 10.33 10.34 10.35 10.34 10.36 10.37 10.36 10.35 10.36
172.16.66.56 : 16.58 10.32 10.37 10.36 10.32 10.32 10.28 10.30 10.30 10.32
172.16.66.57 : 2.77 0.24 0.22 0.23 0.23 0.23 0.23 0.23 0.22 0.22
172.16.66.58 : 1.09 0.22 0.23 0.20 0.22 0.23 0.21 0.22 0.23 0.23
172.16.66.59 : 0.17 0.18 0.19 0.17 0.18 0.16 0.17 0.16 0.18 0.18
172.16.66.6  : 3.21 0.23 0.22 0.21 0.22 0.23 0.22 0.20 0.23 0.22
172.16.66.60 : 0.24 0.24 0.22 0.22 0.22 0.22 0.22 0.21 0.21 0.23
172.16.66.61 : 0.24 0.24 0.25 0.23 0.23 0.25 0.23 0.21 0.21 0.24
172.16.66.62 : 0.24 0.21 0.23 0.22 0.20 0.22 0.18 0.21 0.23 0.17
172.16.66.64 : 0.23 0.22 0.21 0.23 0.23 0.21 0.23 0.20 0.20 0.21
172.16.66.65 : 0.21 0.22 0.22 0.23 0.22 0.22 0.23 0.12 0.22 0.22
172.16.66.66 : 0.04 0.03 0.03 0.03 0.03 0.03 0.03 0.03 0.03 0.03
172.16.66.67 : 0.27 0.23 0.21 0.25 0.23 0.22 0.23 0.23 0.23 0.25
172.16.66.69 : 0.22 0.17 0.20 0.22 0.23 0.23 0.22 0.22 0.25 0.22
172.16.66.7  : 11.11 10.38 10.37 10.31 10.36 - 10.31 10.29 10.30 10.30
172.16.66.70 : 13.43 10.37 10.37 10.37 10.36 10.36 10.37 10.35 10.38 10.35
172.16.66.71 : 11.06 10.25 10.29 10.30 10.32 10.30 10.29 10.31 10.26 10.22
172.16.66.72 : 11.11 10.32 10.32 10.33 10.33 10.35 10.35 10.34 - 10.34
172.16.66.73 : 11.12 10.35 - 10.27 10.31 10.29 10.28 10.30 10.35 10.33
172.16.66.74 : 10.65 - 10.33 10.36 10.32 10.30 10.30 10.36 10.37 10.35
172.16.66.75 : 11.10 10.37 10.29 10.32 10.32 10.28 10.38 10.32 10.37 10.36
172.16.66.76 : 11.10 10.38 10.39 10.35 10.37 10.37 10.36 10.34 10.40 10.34
172.16.66.77 : 11.09 10.31 10.23 10.29 10.33 10.35 10.34 10.34 10.36 10.35
172.16.66.78 : 11.11 10.31 10.32 10.35 10.34 10.36 10.37 - 10.36 10.36
172.16.66.79 : 11.09 - 10.23 10.31 10.26 10.27 10.27 10.31 10.30 10.31
172.16.66.8  : 11.11 10.34 10.36 10.36 10.37 10.37 10.36 10.36 10.35 10.35
172.16.66.80 : 11.08 4.36 4.37 4.40 4.37 4.39 4.39 4.39 4.41 4.40

      27 targets
      27 alive
       0 unreachable
       0 unknown addresses

       6 timeouts (waiting for response)
     270 ICMP Echos sent
     264 ICMP Echo Replies received
       0 other ICMP received

 0.03 ms (min round trip time)
 5.65 ms (avg round trip time)
 19.3 ms (max round trip time)
       10.255 sec (elapsed real time)

