"Dstat 0.7.3 CSV output"
"Author:","Dag Wieers <dag@wieers.com>",,,,"URL:","http://dag.wieers.com/home-made/dstat/"
"Host:","grisou-33.nancy.grid5000.fr",,,,"User:","root"
"Cmdline:","dstat -m -c -n -o dstat.csv",,,,"Date:","27 May 2020 10:35:04 CEST"
"memory usage",,,,"total cpu usage",,,,,"net/total",
"used","free","buff","cach","usr","sys","idl","wai","stl","recv","send"
1214930944,132339458048,54632448,1194565632,0.955,0.091,98.896,0.057,0,0,0
1225646080,132328423424,54632448,1194909696,0.593,0.218,99.189,0,0,400060,14986
1220612096,132333834240,54632448,1194532864,0.564,0.470,98.967,0,0,400366,27268
1217499136,132336812032,54632448,1194659840,0.999,0.625,98.001,0.375,0,83640,15914
1214656512,132339830784,54644736,1194471424,0,0,99.937,0.063,0,25018,0
1216245760,132338208768,54657024,1194475520,0.970,0.719,98.280,0.031,0,437640,26570
1215877120,132338577408,54657024,1194475520,0,0,100,0,0,8384,1324
1215610880,132338843648,54657024,1194475520,0,0,100,0,0,36648,2600
1215602688,132338851840,54657024,1194475520,0,0.031,98.937,1.032,0,20412,0
1215352832,132339101696,54657024,1194475520,0,0.031,98.625,1.344,0,55710,220
1215094784,132339359744,54681600,1194450944,0,0,99.812,0.188,0,21138,84
1215053824,132339376128,54681600,1194475520,0,0,100,0,0,23480,0
1214537728,132339892224,54681600,1194475520,0,0,100,0,0,15630,0
1214279680,132340150272,54681600,1194475520,0,0.031,99.969,0,0,42676,264
1213763584,132340666368,54681600,1194475520,0,0,100,0,0,13704,0
1213763584,132340666368,54681600,1194475520,0,0,100,0,0,25498,0
1213239296,132341182464,54689792,1194475520,0,0,99.969,0.031,0,22014,0
1212981248,132341440512,54689792,1194475520,0,0,100,0,0,18040,0
1216274432,132338147328,54689792,1194475520,0.094,0.094,99.812,0,0,391596,14576
1215426560,132338987008,54689792,1194475520,0.969,0.656,98.374,0,0,11536,16030
1219047424,132335366144,54689792,1194475520,0.031,0.063,99.906,0,0,574706,8244
1216544768,132337823744,54706176,1194504192,0.375,0.219,99.375,0.031,0,226868,4888
1215553536,132338798592,54718464,1194504192,1.126,0.688,98.155,0.031,0,547660,29478
1214230528,132340121600,54718464,1194504192,0.062,0,99.938,0,0,128786,1236
1214480384,132339851264,54730752,1194508288,1.093,0.781,98.063,0.062,0,457196,25386
1213755392,132340576256,54730752,1194508288,0.031,0,99.969,0,0,117166,0
1223663616,132330409984,54730752,1194762240,0.657,0.188,99.156,0,0,471844,11158
1213235200,132340641792,54743040,1194942464,0.532,0.532,98.874,0.063,0,164666,15280
1212821504,132341489664,54743040,1194508288,0,0,100,0,0,96166,132
1214263296,132339965952,54755328,1194508288,1.876,0.188,97.624,0.313,0,361752,11520
1212284928,132341944320,54755328,1194508288,0,0.031,99.781,0.188,0,95066,2652
1211494400,132342734848,54755328,1194508288,0.031,0.031,99.938,0,0,75564,0
1210916864,132343312384,54755328,1194508288,0.062,0,99.938,0,0,93062,0
1211883520,132342329344,54767616,1194512384,0.500,0.125,99.343,0.031,0,448866,14628
1220468736,132333547520,54779904,1194700800,0.250,0.125,99.562,0.063,0,268574,21286
1219698688,132334305280,54784000,1194708992,0.031,0.031,99.500,0.438,0,91405,13230
1218924544,132335079424,54784000,1194708992,0.031,0.031,99.937,0,0,41775,13132
1218408448,132335595520,54784000,1194708992,0.031,0,99.969,0,0,35498,13268
1218150400,132335853568,54784000,1194708992,0.031,0,99.969,0,0,29976,14030
1217622016,132336369664,54796288,1194708992,0,0.063,99.906,0.031,0,97570,19954
1217474560,132336508928,54804480,1194708992,0.031,0,99.906,0.063,0,131614,13796
1217458176,132336525312,54804480,1194708992,0,0.063,99.844,0.094,0,140566,13698
1217196032,132336787456,54804480,1194708992,0.031,0.062,99.906,0,0,117206,13644
1217196032,132336787456,54804480,1194708992,0.031,0,99.969,0,0,92632,14374
1209692160,132344397824,54804480,1194602496,0.031,0,99.969,0,0,108646,6316
1207848960,132346232832,54816768,1194557440,0.250,0.156,99.562,0.031,0,324796,14580
1208250368,132345860096,54816768,1194528768,0,0,100,0,0,114614,936
1207742464,132346368000,54845440,1194500096,0,0,99.656,0.344,0,133618,2380
1207197696,132346884096,54845440,1194528768,0,0,100,0,0,112580,0
1206681600,132347400192,54845440,1194528768,0,0,100,0,0,145142,304
1206390784,132347674624,54857728,1194532864,0.031,0,99.937,0.031,0,82280,0
1206374400,132347691008,54857728,1194532864,0,0,100,0,0,86858,468
1217286144,132336779264,54865920,1194524672,0.469,0.156,99.186,0.188,0,467808,15448
1207799808,132346249216,54865920,1194532864,0.563,0.532,98.906,0,0,121986,16798
1207508992,132346540032,54865920,1194532864,0,0,100,0,0,89490,234
1255350272,132298604544,54865920,1194618880,1.376,0.219,98.405,0,0,417382,14052
1363083264,132190830592,54865920,1194713088,2.063,0.063,97.874,0,0,147850,852
1362804736,132191096832,54882304,1194708992,0.031,0.062,99.562,0.344,0,130422,390
1362481152,132191391744,54894592,1194721280,0,0,99.937,0.063,0,158626,546
1361850368,132192022528,54894592,1194721280,0,0.031,99.969,0,0,112342,0
1360572416,132193300480,54894592,1194721280,0,0.031,99.969,0,0,173924,0
1359749120,132194123776,54894592,1194721280,2.469,0,97.531,0,0,117854,84
1359491072,132194381824,54894592,1194721280,3.127,0,96.873,0,0,217158,496
1359024128,132194832384,54910976,1194721280,3.126,0,96.249,0.625,0,60592,0
1358741504,132195115008,54910976,1194721280,3.126,0,96.874,0,0,166290,0
1358471168,132195385344,54910976,1194721280,3.126,0,96.874,0,0,84222,0
1357950976,132195901440,54910976,1194725376,3.156,0,96.844,0,0,112930,0
1357692928,132196159488,54910976,1194725376,3.156,0,96.844,0,0,37542,0
1357406208,132196429824,54927360,1194725376,3.156,0.031,96.094,0.719,0,86528,0
1357148160,132196687872,54927360,1194725376,3.156,0,96.844,0,0,74462,2796
1357148160,132196687872,54927360,1194725376,3.127,0,96.873,0,0,85860,840
1357148160,132196687872,54927360,1194725376,3.126,0,96.874,0,0,74470,1482
1356632064,132197203968,54927360,1194725376,3.126,0,96.874,0,0,61972,2100
1356333056,132197474304,54943744,1194729472,3.126,0,96.343,0.531,0,50528,1532
1356148736,132197617664,54943744,1194729472,3.125,0.031,96.844,0,0,22914,1408
1361293312,132192473088,54943744,1194729472,3.411,0.031,96.558,0,0,1528100,19326
1478995968,132074762240,54943744,1194737664,9.448,0.655,89.897,0,0,11444922,239442
1553289216,132000387072,54943744,1194737664,9.440,0.469,90.091,0,0,24765568,514746
1658388480,131895226368,54960128,1194741760,4.850,0.532,94.337,0.282,0,34864106,726906
1680404480,131873206272,54960128,1194745856,3.502,0.250,96.248,0,0,47374548,957714
1710698496,131842912256,54960128,1194745856,3.471,0.438,96.091,0,0,61060874,1299300
1728053248,131825557504,54960128,1194745856,3.657,0.500,95.842,0,0,76013920,1615308
1771532288,131782078464,54960128,1194745856,3.781,0.500,95.719,0,0,84645318,1738548
1823952896,131729645568,54976512,1194741760,3.727,0.501,95.396,0.376,0,100381296,2083196
1883578368,131670016000,54976512,1194745856,3.844,0.750,95.375,0.031,0,107804410,2359292
1943252992,131610341376,54976512,1194745856,3.788,0.657,95.554,0,0,110798808,2406332
2002993152,131550601216,54976512,1194745856,3.909,0.657,95.435,0,0,110790924,2281970
2066989056,131486605312,54976512,1194745856,3.880,0.688,95.432,0,0,119114220,2569570
2129338368,131424247808,54984704,1194745856,3.858,0.533,95.577,0.031,0,116340650,2551536
2188603392,131364974592,54992896,1194745856,3.851,0.626,95.304,0.219,0,112814240,2413452
2253615104,131299962880,54992896,1194745856,4.277,0.531,95.192,0,0,119002150,2569524
2315018240,131238559744,54992896,1194745856,4.034,0.563,95.403,0,0,115348674,2391364
2377392128,131176185856,54992896,1194745856,3.696,0.689,95.615,0,0,113064380,2461094
2440294400,131113275392,55001088,1194745856,4.087,0.686,95.195,0.031,0,116028332,2540206
2502447104,131051114496,55009280,1194745856,3.906,0.656,95,0.438,0,115012174,2393448
2564407296,130989154304,55009280,1194745856,3.910,0.719,95.371,0,0,114475858,2490782
2624733184,130928828416,55009280,1194745856,3.790,0.658,95.553,0,0,112871732,2440130
2685292544,130868269056,55009280,1194745856,3.790,0.564,95.647,0,0,111772076,2407116
2744733696,130808819712,55017472,1194745856,3.914,0.532,95.554,0,0,110823468,2411002
2805252096,130748301312,55025664,1194737664,3.970,0.625,95.061,0.344,0,113674618,2507636
2867294208,130686251008,55025664,1194745856,3.969,0.594,95.438,0,0,114525718,2484886
2928558080,130624983040,55025664,1194749952,3.915,0.470,95.615,0,0,113071286,2372016
2989371392,130564169728,55025664,1194749952,3.849,0.594,95.557,0,0,112023760,2471130
3050311680,130503221248,55033856,1194749952,3.916,0.470,95.551,0.063,0,112351480,2479746
3114774528,130438750208,55042048,1194749952,3.971,0.625,95.091,0.313,0,118731280,2547498
3176972288,130376552448,55042048,1194749952,3.938,0.656,95.406,0,0,113014942,2491494
3236622336,130316902400,55042048,1194749952,4.185,0.656,95.159,0,0,112436386,2424190
3420409856,130133110784,55042048,1194754048,4.911,0.813,94.276,0,0,116065976,2455196
3614859264,129938653184,55050240,1194754048,4.784,0.844,94.340,0.031,0,120155838,2669798
3767820288,129785679872,55058432,1194758144,4.537,0.782,94.305,0.375,0,114991062,2535888
3831914496,129721585664,55058432,1194758144,3.970,0.656,95.374,0,0,114244550,2420468
3893583872,129659916288,55058432,1194758144,3.790,0.658,95.553,0,0,113753270,2426892
3951493120,129602007040,55058432,1194758144,3.852,0.532,95.615,0,0,108992826,2343052
4017119232,129536372736,55066624,1194758144,3.881,0.689,95.430,0,0,117174546,2535806
4082438144,129471045632,55074816,1194758144,3.914,0.595,95.085,0.407,0,120450624,2521216
4144148480,129409294336,55074816,1194758144,3.792,0.627,95.581,0,0,111426638,2404928
4206161920,129347272704,55074816,1194758144,3.912,0.532,95.556,0,0,110660574,2402288
4269744128,129283690496,55074816,1194758144,3.940,0.625,95.435,0,0,116028268,2520788
4332707840,129220718592,55083008,1194758144,3.823,0.533,95.613,0.031,0,114991016,2454306
4403539968,129149886464,55091200,1194749952,3.815,0.876,94.684,0.625,0,121370092,2625988
4465836032,129087582208,55091200,1194758144,3.939,0.656,95.405,0,0,114718408,2503168
4529676288,129023741952,55091200,1194758144,4.008,0.595,95.398,0,0,114311772,2495370
4597669888,128955846656,55091200,1194749952,4.154,0.718,95.128,0,0,117228296,2523040
4663971840,128889470976,55099392,1194749952,3.936,0.719,95.314,0.031,0,118483902,2518728
4728590336,128824852480,55107584,1194741760,3.885,0.533,95.175,0.407,0,119040272,2516666
4791373824,128762060800,55107584,1194749952,3.850,0.595,95.556,0,0,112319852,2399654
4852973568,128700461056,55107584,1194749952,3.881,0.563,95.556,0,0,112660350,2428318
4920889344,128632545280,55107584,1194749952,4.034,0.594,95.372,0,0,120271488,2636194
4982972416,128570454016,55115776,1194749952,3.970,0.594,95.405,0.031,0,116010136,2521552
5043900416,128509526016,55119872,1194745856,3.881,0.626,95.493,0,0,114252388,2503972
5113163776,128440254464,55123968,1194749952,3.853,0.627,95.144,0.376,0,120294036,2652400
5176659968,128376758272,55123968,1194749952,3.818,0.657,95.524,0,0,116281896,2429476
5237784576,128315633664,55123968,1194749952,3.905,0.719,95.376,0,0,114357480,2490634
5300539392,128252870656,55132160,1194749952,3.942,0.594,95.432,0.031,0,115729310,2525620
5363458048,128189952000,55132160,1194749952,3.970,0.594,95.436,0,0,115584542,2433146
5423296512,128130101248,55140352,1194749952,3.818,0.595,95.149,0.438,0,110824046,2326010
5529464832,128023932928,55140352,1194749952,4.221,1.470,94.309,0,0,110948100,2429396
5588217856,127965179904,55140352,1194749952,4.439,0.750,94.811,0,0,118060412,2557802
5631782912,127921606656,55148544,1194749952,5.086,0.780,94.103,0.031,0,113723572,2456868
5691863040,127861518336,55148544,1194758144,4.722,0.688,94.590,0,0,119868088,2690318
5753663488,127799709696,55156736,1194758144,3.977,0.470,95.240,0.313,0,113744886,2530856
5816303616,127737069568,55156736,1194758144,3.790,0.626,95.584,0,0,113826824,2492774
5878759424,127674613760,55156736,1194758144,3.996,0.718,95.286,0,0,116226140,2545968
5943922688,127609442304,55164928,1194758144,4.029,0.750,95.191,0.031,0,121454124,2730684
6009352192,127544012800,55164928,1194758144,3.877,0.782,95.341,0,0,118213800,2611704
6072283136,127481073664,55173120,1194758144,3.912,0.595,95.055,0.438,0,117260028,2606660
6134497280,127418859520,55173120,1194758144,3.905,0.750,95.345,0,0,113047612,2458218
6200107008,127353249792,55173120,1194758144,4.096,0.657,95.247,0,0,119584120,2609648
6264057856,127289286656,55181312,1194762240,3.880,0.657,95.432,0.031,0,119297302,2480782
6329229312,127224115200,55181312,1194762240,3.850,0.626,95.524,0,0,118557912,2506140
6394195968,127159148544,55189504,1194754048,4.223,0.532,94.901,0.344,0,119647938,2564256
6459428864,127093907456,55189504,1194762240,3.942,0.657,95.401,0,0,120182336,2548004
6521102336,127032233984,55189504,1194762240,3.756,0.720,95.524,0,0,113382994,2481554
6582304768,126971023360,55197696,1194762240,3.784,0.688,95.466,0.063,0,111886956,2446818
6642995200,126910332928,55197696,1194762240,3.906,0.688,95.406,0,0,113805510,2536594
6704119808,126849208320,55205888,1194754048,3.756,0.626,95.274,0.344,0,110838416,2402166
6764494848,126788825088,55205888,1194762240,3.821,0.532,95.647,0,0,112225978,2500812
6825971712,126727348224,55205888,1194762240,3.944,0.501,95.556,0,0,113202614,2453546
6890885120,126662426624,55214080,1194762240,4.036,0.532,95.401,0.031,0,119384660,2596950
6955003904,126598307840,55214080,1194762240,3.826,0.564,95.610,0,0,116700990,2508294
7016837120,126536466432,55222272,1194762240,4.001,0.625,95.061,0.313,0,114232710,2515048
7081799680,126471503872,55222272,1194762240,3.818,0.751,95.430,0,0,119742648,2624224
7145697280,126407606272,55222272,1194762240,3.793,0.627,95.580,0,0,116591514,2449542
7207559168,126345732096,55230464,1194762240,3.812,0.719,95.406,0.062,0,112366840,2478146
7269715968,126283575296,55230464,1194762240,3.939,0.625,95.436,0,0,114541488,2507564
7333462016,126219829248,55238656,1194754048,3.914,0.501,95.116,0.470,0,116134638,2422434
7393087488,126160195584,55238656,1194762240,4.003,0.563,95.435,0,0,111257766,2437864
7455657984,126097625088,55238656,1194762240,3.969,0.719,95.312,0,0,117355658,2557434
7492374528,126060896256,55246848,1194766336,5.069,0.688,94.212,0.031,0,110261902,2463402
7561367552,125991903232,55246848,1194766336,5.864,0.686,93.450,0,0,109216936,2423130
7621558272,125931704320,55250944,1194770432,4.816,0.563,94.278,0.344,0,105422426,2414600
7685206016,125868052480,55255040,1194770432,3.822,0.627,95.269,0.282,0,117168838,2592714
7750266880,125802991616,55255040,1194770432,3.909,0.719,95.372,0,0,119893892,2527100
7815118848,125738131456,55263232,1194770432,4.030,0.687,95.251,0.031,0,118135700,2583944
7877525504,125675724800,55263232,1194770432,4.095,0.563,95.342,0,0,114459126,2538096
7936757760,125616492544,55263232,1194770432,3.944,0.532,95.524,0,0,108617162,2463758
7999692800,125553557504,55271424,1194762240,3.762,0.533,95.674,0.031,0,115899966,2453512
8062926848,125490315264,55271424,1194770432,4.121,0.624,95.254,0,0,117478490,2526578
8121802752,125431431168,55279616,1194770432,3.910,0.594,95.464,0.031,0,107897480,2403214
8186773504,125366460416,55279616,1194770432,3.845,0.781,95.374,0,0,120270072,2545578
8249823232,125303410688,55279616,1194770432,3.999,0.594,95.408,0,0,116863528,2432202
8315125760,125238108160,55279616,1194770432,3.883,0.564,95.553,0,0,119612046,2534986
8377229312,125176004608,55279616,1194770432,3.881,0.626,95.493,0,0,115364154,2485750
8439332864,125113892864,55287808,1194770432,3.846,0.625,95.466,0.063,0,113344532,2361400
8500846592,125052379136,55287808,1194770432,3.787,0.595,95.618,0,0,112027858,2391360
8562655232,124990570496,55287808,1194770432,4.030,0.656,95.314,0,0,115222190,2516262
8625385472,124927840256,55287808,1194770432,3.875,0.750,95.250,0.125,0,113329906,2434884
8687284224,124865941504,55287808,1194770432,3.821,0.564,95.615,0,0,113977090,2425764
8752345088,124800872448,55296000,1194770432,3.941,0.563,95.464,0.031,0,118643656,2507132
8814051328,124739166208,55296000,1194770432,3.873,0.750,95.378,0,0,111722998,2416184
8876789760,124676427776,55296000,1194770432,3.907,0.625,95.467,0,0,115082256,2398530
8941555712,124611387392,55304192,1195020288,3.968,0.719,95.251,0.062,0,120190478,2575124
9005002752,124547940352,55304192,1195020288,4.034,0.500,95.466,0,0,115935390,2536502
9068331008,124484603904,55312384,1195020288,3.976,0.470,95.523,0.031,0,116608846,2547718
9128423424,124424511488,55312384,1195020288,3.844,0.719,95.438,0,0,110837032,2479170
9194151936,124358651904,55312384,1195151360,4.065,0.594,95.341,0,0,119900186,2589434
9250738176,124302061568,55312384,1195155456,3.752,0.657,95.591,0,0,105313312,2252290
9311752192,124241047552,55312384,1195155456,4.262,0.627,95.111,0,0,112706022,2391682
9353826304,124198965248,55320576,1195155456,6.862,0.811,92.296,0.031,0,117889612,2576902
9418010624,124134772736,55320576,1195163648,8.401,0.531,91.068,0,0,111639216,2467288
9481142272,124071641088,55320576,1195163648,4.215,0.500,95.286,0,0,113897538,2462402
9542901760,124009881600,55324672,1195159552,3.701,0.596,95.577,0.125,0,112763916,2498550
9605816320,123946962944,55324672,1195163648,3.815,0.750,95.435,0,0,116404012,2528578
9668775936,123883995136,55332864,1195163648,3.816,0.719,95.433,0.031,0,115312750,2472092
9727045632,123825725440,55332864,1195163648,3.843,0.687,95.470,0,0,108647508,2356048
9789841408,123762929664,55332864,1195163648,3.726,0.626,95.648,0,0,113541566,2315596
9850740736,123702030336,55332864,1195163648,3.757,0.657,95.585,0,0,112210674,2451734
9915277312,123637485568,55341056,1195163648,3.729,0.658,95.550,0.063,0,120318532,2561114
9974517760,123578236928,55349248,1195163648,3.881,0.626,95.493,0,0,108517166,2361032
10034208768,123518545920,55349248,1195163648,3.909,0.594,95.497,0,0,109658172,2385474
10096406528,123456348160,55349248,1195163648,3.975,0.563,95.462,0,0,112416474,2462890
10159505408,123393249280,55349248,1195163648,3.725,0.657,95.618,0,0,115093096,2446634
10223476736,123329277952,55349248,1195163648,3.969,0.656,95.375,0,0,116524270,2549750
10287800320,123264946176,55357440,1195163648,4.008,0.532,95.429,0.031,0,119681450,2553508
10353635328,123199111168,55357440,1195163648,3.877,0.688,95.435,0,0,119282874,2503444
10415771648,123136974848,55357440,1195163648,3.788,0.626,95.585,0,0,113156130,2431060
10478829568,123073916928,55357440,1195163648,3.849,0.626,95.526,0,0,116663524,2530536
10545307648,123007438848,55357440,1195163648,3.784,0.907,95.310,0,0,122016398,2578940
10608979968,122943758336,55365632,1195163648,3.821,0.501,95.647,0.031,0,115185368,2363224
10668138496,122884599808,55365632,1195163648,3.940,0.532,95.528,0,0,108027276,2319822
10732158976,122820579328,55365632,1195163648,3.882,0.595,95.523,0,0,118232960,2513808
10793926656,122758811648,55365632,1195163648,3.936,0.687,95.376,0,0,114176472,2364562
10857070592,122695667712,55365632,1195163648,3.969,0.594,95.438,0,0,114747324,2454632
10917019648,122635710464,55373824,1195163648,3.972,0.500,95.496,0.031,0,109243938,2323328
10976563200,122576166912,55373824,1195163648,3.912,0.501,95.587,0,0,111081532,2416404
11039043584,122513686528,55373824,1195163648,3.942,0.501,95.557,0,0,113312258,2436036
11099389952,122453336064,55373824,1195167744,3.876,0.656,95.467,0,0,111384610,2437916
11162189824,122390532096,55373824,1195171840,4.030,0.687,95.189,0.094,0,118508872,2577602
11210244096,122342469632,55382016,1195171840,7.507,0.594,91.836,0.063,0,109189466,2306096
11269844992,122282864640,55382016,1195175936,4.346,0.657,94.997,0,0,114425186,2470500
11325669376,122227040256,55382016,1195175936,4.131,0.595,95.274,0,0,115545116,2486672
11385110528,122167595008,55382016,1195180032,3.852,0.532,95.615,0,0,110558948,2372398
11446276096,122106429440,55390208,1195171840,3.816,0.657,95.120,0.407,0,112728776,2342410
11506548736,122046140416,55398400,1195180032,3.757,0.626,95.585,0.031,0,111040658,2394130
11569709056,121982980096,55398400,1195180032,3.727,0.689,95.584,0,0,114854534,2454934
11632013312,121920671744,55398400,1195184128,3.755,0.720,95.526,0,0,114131626,2415496
11693604864,121859080192,55398400,1195184128,3.911,0.563,95.526,0,0,115284134,2478578
11757293568,121795383296,55406592,1195184128,3.850,0.657,95.336,0.156,0,116561952,2554390
11818217472,121734369280,55414784,1195184128,3.879,0.688,95.402,0.031,0,113770431,2552344
11881463808,121671122944,55414784,1195184128,3.816,0.626,95.558,0,0,115559482,2389102
11944968192,121607618560,55414784,1195184128,3.971,0.657,95.372,0,0,116439684,2609446
12009041920,121543544832,55414784,1195184128,3.756,0.751,95.493,0,0,115943398,2626280
12069781504,121482797056,55422976,1195184128,4.036,0.720,95.088,0.156,0,113240654,2511376
12139851776,121412444160,55435264,1195188224,4.182,0.811,94.975,0.031,0,120898322,2745008
12202246144,121349869568,55435264,1195188224,3.788,0.626,95.585,0,0,112362168,2478728
12266225664,121285890048,55435264,1195188224,3.849,0.688,95.463,0,0,118597234,2488014
12329504768,121222610944,55435264,1195188224,3.906,0.688,95.406,0,0,116053066,2498010
12394295296,121157808128,55447552,1195188224,3.909,0.657,94.841,0.594,0,119155610,2566002
12458242048,121093844992,55459840,1195188224,3.939,0.625,95.405,0.031,0,116251566,2523780
12518494208,121033592832,55459840,1195188224,3.879,0.594,95.527,0,0,112058606,2384376
12581031936,120971055104,55459840,1195188224,3.820,0.564,95.617,0,0,113754532,2438978
12641542144,120910544896,55459840,1195188224,3.849,0.563,95.588,0,0,109750448,2469304
12699353088,120852733952,55468032,1195180032,3.907,0.594,94.998,0.500,0,107588988,2398330
12760977408,120791093248,55476224,1195188224,3.727,0.626,95.615,0.031,0,111595756,2315926
12825964544,120726106112,55476224,1195188224,3.942,0.563,95.494,0,0,118798750,2553616
12888281088,120663789568,55476224,1195188224,3.882,0.595,95.523,0,0,114896810,2512360
12955873280,120596197376,55476224,1195188224,4.034,0.625,95.341,0,0,123978192,2619100
13020274688,120531791872,55480320,1195188224,3.970,0.750,95.280,0,0,120277412,2558658
13081968640,120470085632,55492608,1195188224,4.005,0.501,95.056,0.438,0,113996252,2493294
13123018752,120429035520,55492608,1195188224,5.288,0.626,94.086,0,0,115575702,2515292
13172387840,120379658240,55492608,1195196416,4.659,0.625,94.715,0,0,112415122,2422960
13233844224,120318201856,55492608,1195196416,3.846,0.750,95.403,0,0,113739998,2478238
13295091712,120256954368,55492608,1195196416,3.755,0.720,95.526,0,0,110915846,2451526
13355765760,120196263936,55508992,1195196416,3.845,0.688,94.905,0.563,0,112673420,2474002
13419888640,120132141056,55508992,1195196416,3.882,0.564,95.554,0,0,116783296,2566684
13482012672,120070017024,55508992,1195196416,3.874,0.719,95.408,0,0,113050958,2462676
13540507648,120011517952,55508992,1195200512,3.881,0.501,95.618,0,0,108385946,2348364
13605163008,119946862592,55508992,1195200512,4.001,0.594,95.405,0,0,118962932,2556124
13668577280,119883431936,55525376,1195200512,3.880,0.688,94.931,0.501,0,117463340,2603542
13731921920,119820087296,55525376,1195200512,4.126,0.531,95.342,0,0,116721470,2598998
13791100928,119760908288,55525376,1195200512,3.852,0.501,95.647,0,0,109173900,2401410
13853458432,119698550784,55525376,1195200512,4.035,0.469,95.496,0,0,115114202,2522010
13916446720,119635562496,55525376,1195200512,3.910,0.594,95.496,0,0,114533904,2500846
13981265920,119570735104,55541760,1195192320,3.974,0.626,94.994,0.407,0,120699118,2626980
14043414528,119508578304,55541760,1195200512,3.936,0.656,95.408,0,0,115111884,2431126
14105829376,119446163456,55541760,1195200512,3.665,0.658,95.677,0,0,113960132,2457596
14167597056,119384395776,55541760,1195200512,3.879,0.626,95.496,0,0,114297980,2544632
14230175744,119321817088,55541760,1195200512,3.966,0.687,95.347,0,0,114363106,2480998
14292967424,119259025408,55558144,1195184128,4.001,0.625,94.811,0.563,0,115897064,2477858
14357233664,119194742784,55558144,1195200512,4.008,0.532,95.460,0,0,118145782,2552308
14419066880,119132971008,55558144,1195139072,4.059,0.656,95.286,0,0,114389370,2509930
14481936384,119070040064,55558144,1195200512,3.849,0.626,95.526,0,0,114228026,2461832
14546075648,119005900800,55558144,1195200512,3.788,0.751,95.460,0,0,118531890,2584680
14612033536,118939942912,55574528,1195184128,3.942,0.657,94.931,0.469,0,121447050,2648554
14673141760,118878818304,55574528,1195200512,3.814,0.688,95.499,0,0,109602330,2404652
14737670144,118814289920,55574528,1195200512,3.936,0.687,95.376,0,0,118393052,2445762
14799470592,118752489472,55574528,1195200512,3.820,0.626,95.554,0,0,113765710,2449260
14859776000,118692184064,55574528,1195200512,3.788,0.626,95.585,0,0,112194930,2480050
14917623808,118634319872,55590912,1195200512,4.030,0.594,94.845,0.531,0,108258584,2298630
14956843008,118595096576,55590912,1195204608,5.248,0.437,94.314,0,0,111813584,2470988
15006576640,118545354752,55590912,1195212800,4.624,0.594,94.783,0,0,112454192,2528774
15065985024,118485942272,55590912,1195212800,3.845,0.719,95.436,0,0,110224006,2435378
15126695936,118425231360,55590912,1195212800,3.812,0.719,95.469,0,0,112388310,2413922
15191199744,118360727552,55607296,1195196416,3.761,0.658,95.205,0.376,0,119515736,2545890
15256014848,118295896064,55607296,1195212800,3.965,0.749,95.286,0,0,118400780,2542820
15311720448,118240190464,55607296,1195212800,3.667,0.533,95.801,0,0,103371036,2207020
15361880064,118190030848,55607296,1195212800,3.844,0.500,95.656,0,0,91784276,2039892
15405404160,118146506752,55607296,1195212800,3.632,0.438,95.930,0,0,81891404,1848906
15443451904,118108450816,55623680,1195204608,3.688,0.375,95.656,0.281,0,70504030,1596846
15476162560,118075727872,55623680,1195212800,3.594,0.312,95.875,0.219,0,57654344,1295712
15500476416,118051409920,55623680,1195216896,3.440,0.250,96.310,0,0,43920760,921472
15520075776,118031810560,55623680,1195216896,3.439,0.156,96.405,0,0,35580188,701170
15531847680,118020038656,55623680,1195216896,3.254,0.125,96.621,0,0,21012698,413024
15537106944,118014771200,55631872,1195216896,3.220,0.063,96.655,0.063,0,9260330,212180
15537340416,118014529536,55640064,1195216896,3.156,0,96.688,0.156,0,374170,76498
15537188864,118014681088,55640064,1195216896,3.156,0,96.844,0,0,17202,90114
15537389568,118014480384,55640064,1195216896,3.156,0,96.844,0,0,13320,87350
15537291264,118014578688,55640064,1195216896,3.126,0,96.874,0,0,3858,83926
15537311744,118014550016,55648256,1195216896,3.126,0,96.812,0.063,0,4774,120196
15537262592,118014590976,55656448,1195216896,3.125,0,96.625,0.250,0,4136,126142
15541448704,118010404864,55656448,1195216896,3.406,0,96.594,0,0,4252,108300
15541133312,118010716160,55656448,1195220992,3.155,0.031,96.813,0,0,2548,34972
15541133312,118010716160,55656448,1195220992,3.187,0,96.813,0,0,1928,55556
15541145600,118010695680,55664640,1195220992,3.126,0,96.812,0.063,0,3406,87284
15541145600,118010695680,55672832,1195212800,3.156,0,96.719,0.125,0,2490,34690
15541104640,118010728448,55672832,1195220992,3.126,0,96.874,0,0,2796,39364
15540711424,118011121664,55672832,1195220992,3.187,0,96.813,0,0,2712,64442
15540744192,118011088896,55672832,1195220992,3.126,0,96.874,0,0,2040,31794
15540727808,118011097088,55681024,1195220992,3.155,0,96.751,0.094,0,20936,77936
15533064192,118018760704,55689216,1195212800,4.188,0.031,95.531,0.250,0,14342,69314
15522136064,118029672448,55689216,1195229184,3.841,0.031,96.127,0,0,9680,105056
9360162816,124191645696,55689216,1195229184,0.594,0.751,98.655,0,0,14214,49476
9356185600,124195844096,55689216,1195008000,0.031,0.031,99.938,0,0,20576,0
9355997184,124196032512,55689216,1195008000,0,0,100,0,0,13016,0
9355976704,124196032512,55709696,1195008000,0,0,99.438,0.562,0,4064,0
9355976704,124196032512,55709696,1195008000,0.031,0,99.969,0,0,8534,0
9355956224,124196052992,55709696,1195008000,0,0,100,0,0,1386,84
9355939840,124196069376,55709696,1195008000,0,0,100,0,0,1444,2404
9355911168,124196098048,55709696,1195008000,0,0,100,0,0,1730,0
9355911168,124196098048,55709696,1195008000,0,0,100,0,0,1564,1508
9355874304,124196122624,55721984,1195008000,0,0.031,99.875,0.094,0,13700,0
9355874304,124196122624,55721984,1195008000,0,0,100,0,0,5370,0
9359454208,124192542720,55721984,1195008000,0,0.031,99.969,0,0,2802,0
9359126528,124192870400,55721984,1195008000,0,0,100,0,0,3074,0
9359126528,124192870400,55721984,1195008000,0,0,100,0,0,9336,0
9359126528,124192870400,55721984,1195008000,0,0,100,0,0,1650,0
9359110144,124192878592,55730176,1195008000,0,0,99.938,0.062,0,1020,0
9359110144,124192878592,55730176,1195008000,0,0,100,0,0,1470,0
9359110144,124192878592,55730176,1195008000,0,0,100,0,0,1870,0
9378942976,124172832768,55730176,1195139072,0.844,0.281,98.875,0,0,415796,21994
9388044288,124161744896,55730176,1195147264,0.719,0.500,98.437,0.344,0,180140,37230
