172.16.66.55 : 4.40 4.35 4.34 4.32 4.36 4.38 4.32 4.34 4.26 4.33
172.16.66.56 : 4.37 4.39 4.38 4.32 4.39 4.40 4.39 4.32 4.37 4.41
172.16.66.57 : 10.37 10.35 10.38 10.32 10.39 10.36 10.37 10.39 10.37 10.32
172.16.66.58 : 14.88 10.33 10.38 10.27 10.31 10.39 10.39 10.38 10.30 10.39
172.16.66.59 : 10.22 10.35 10.30 10.35 10.38 10.37 10.32 10.34 10.33 10.35
172.16.66.6  : 10.29 10.30 10.32 10.28 10.30 10.30 10.32 10.31 10.30 10.31
172.16.66.60 : 10.39 10.37 10.37 10.37 10.35 10.27 10.37 10.38 10.38 10.32
172.16.66.61 : 10.34 10.37 10.38 10.37 10.38 10.36 - 10.38 10.38 10.36
172.16.66.62 : 10.37 10.39 10.31 10.32 10.38 10.31 10.32 10.31 10.31 10.30
172.16.66.64 : 14.19 - 10.35 10.32 10.36 10.36 10.38 10.39 10.38 10.34
172.16.66.65 : 10.31 10.35 10.38 10.30 10.39 10.30 10.31 10.31 10.30 10.37
172.16.66.66 : 10.37 10.35 10.38 10.16 10.36 10.37 10.28 10.35 10.31 10.31
172.16.66.67 : 10.39 10.35 10.31 10.22 10.30 10.27 10.30 10.30 10.36 10.38
172.16.66.69 : 14.30 10.26 10.33 10.33 10.38 10.32 10.37 10.40 10.37 10.31
172.16.66.7  : 0.21 0.22 0.21 0.21 0.22 0.22 0.23 0.23 0.22 0.22
172.16.66.70 : 0.21 0.22 0.22 0.21 0.23 0.19 0.22 0.19 0.22 0.21
172.16.66.71 : 0.17 0.16 0.17 0.16 0.16 0.14 0.16 0.16 0.16 0.15
172.16.66.72 : 0.15 0.24 0.21 0.21 0.21 0.19 0.22 0.21 0.22 0.22
172.16.66.73 : 0.20 0.23 0.23 0.21 0.22 0.22 0.15 0.20 0.19 0.21
172.16.66.74 : 0.16 0.24 0.20 0.21 0.21 0.22 0.21 0.22 0.22 0.21
172.16.66.75 : 0.22 0.22 0.22 0.20 0.23 0.22 0.20 0.22 0.22 0.22
172.16.66.76 : 0.21 0.23 0.21 0.21 0.22 0.23 0.20 0.22 0.22 0.22
172.16.66.77 : 0.21 0.22 0.22 0.21 0.22 0.22 0.22 0.20 0.21 0.21
172.16.66.78 : 0.24 0.22 0.21 0.21 0.19 0.21 0.21 0.21 0.23 0.17
172.16.66.79 : 0.24 0.23 0.21 0.21 0.22 0.21 0.21 0.22 0.21 0.21
172.16.66.8  : 0.03 0.03 0.03 0.03 0.03 0.03 0.03 0.03 0.03 0.03
172.16.66.80 : 7.60 4.30 4.38 4.38 4.38 4.35 4.35 4.37 4.33 4.30

      27 targets
      27 alive
       0 unreachable
       0 unknown addresses

       2 timeouts (waiting for response)
     270 ICMP Echos sent
     268 ICMP Echo Replies received
       0 other ICMP received

 0.03 ms (min round trip time)
 5.18 ms (avg round trip time)
 14.8 ms (max round trip time)
       10.103 sec (elapsed real time)

