172.16.97.1  : 15.65 10.26 10.24 10.29 10.27 10.23 10.21 10.18 10.22 10.23
172.16.97.16 : 12.85 10.28 10.30 - 10.28 10.23 10.28 10.31 10.24 10.27
172.16.97.23 : 0.14 0.20 0.19 0.20 0.20 0.19 0.21 0.20 0.16 0.20
172.16.97.24 : 0.19 0.20 0.21 0.19 0.19 0.18 0.15 0.21 0.20 0.19
172.16.97.25 : 0.16 0.21 0.20 0.13 0.22 0.20 0.20 0.17 0.17 0.20
172.16.97.26 : 0.03 0.03 0.01 0.01 0.03 0.03 0.04 0.03 0.03 0.03
172.16.97.27 : 100.24 100.28 100.26 100.21 100.26 100.25 100.28 100.27 100.29 100.26
172.16.97.28 : 100.23 - 100.25 - 100.24 100.29 100.25 100.32 100.30 100.25
172.16.97.3  : 100.26 100.26 100.29 100.26 100.28 100.28 100.29 100.29 100.28 100.31
172.16.97.4  : 100.24 100.27 - 100.24 100.31 100.28 100.29 100.29 100.28 100.28
172.16.97.5  : 100.30 100.33 100.33 100.28 100.31 100.24 100.30 100.26 - 100.27
172.16.97.6  : 100.23 100.25 - 100.31 100.27 100.29 - - 100.29 100.27
172.16.97.7  : 100.28 100.31 100.34 100.28 100.33 100.33 100.29 100.30 100.29 100.34
172.16.97.8  : 100.26 100.33 100.31 100.31 100.31 100.33 - - 100.29 100.29
172.16.97.9  : 4.16 4.26 4.26 4.27 4.30 4.28 4.33 4.30 4.29 4.32

      15 targets
      15 alive
       0 unreachable
       0 unknown addresses

       6 timeouts (waiting for response)
     150 ICMP Echos sent
     140 ICMP Echo Replies received
       0 other ICMP received

 0.01 ms (min round trip time)
 52.6 ms (avg round trip time)
 100 ms (max round trip time)
       10.143 sec (elapsed real time)

