172.16.66.5  : 0.19 0.07 0.12 0.14 0.15 0.12 0.14 0.12 0.12 0.10
172.16.66.50 : 0.04 0.03 0.03 0.03 0.03 0.03 0.03 0.03 0.03 0.03
172.16.66.51 : 16.14 4.35 4.25 4.37 4.20 4.34 4.29 4.23 4.30 4.24
172.16.66.52 : 11.17 4.34 4.28 4.35 4.34 4.34 4.26 4.34 4.36 4.40
172.16.66.56 : 7.95 4.38 4.31 4.30 4.37 4.36 4.34 4.36 4.22 4.34

       5 targets
       5 alive
       0 unreachable
       0 unknown addresses

       0 timeouts (waiting for response)
      50 ICMP Echos sent
      50 ICMP Echo Replies received
       0 other ICMP received

 0.03 ms (min round trip time)
 3.06 ms (avg round trip time)
 16.1 ms (max round trip time)
        9.053 sec (elapsed real time)

