"Dstat 0.7.3 CSV output"
"Author:","Dag Wieers <dag@wieers.com>",,,,"URL:","http://dag.wieers.com/home-made/dstat/"
"Host:","grisou-49.nancy.grid5000.fr",,,,"User:","root"
"Cmdline:","dstat -m -c -n -o dstat.csv",,,,"Date:","27 May 2020 10:57:51 CEST"
"memory usage",,,,"total cpu usage",,,,,"net/total",
"used","free","buff","cach","usr","sys","idl","wai","stl","recv","send"
1040125952,132774563840,58261504,924413952,2.039,0.446,97.298,0.216,0,0,0
1054388224,132759953408,58261504,924753920,0.811,0.437,98.753,0,0,390796,16738
1036525568,132778246144,58261504,924307456,0.313,0.188,99.500,0,0,15022,13884
1056014336,132758290432,58273792,924758016,0.750,0.281,98.906,0.063,0,390264,12910
1033453568,132781268992,58286080,924311552,0.344,0.219,97.781,1.656,0,7822,13180
1046171648,132768030720,58286080,924758016,0.656,0.156,99.188,0,0,390434,13522
1037189120,132777459712,58286080,924311552,0.531,0.500,98.970,0,0,6026,14964
1037189120,132777459712,58286080,924311552,0,0,100,0,0,9174,220
1036918784,132777717760,58298368,924311552,0,0,99.937,0.063,0,9956,0
1036648448,132777975808,58310656,924311552,0,0,99.969,0.031,0,9386,0
1036390400,132778233856,58310656,924311552,0,0,100,0,0,12092,0
1036132352,132778491904,58310656,924311552,0,0,100,0,0,16613,0
1035874304,132778749952,58310656,924311552,0,0,100,0,0,11800,0
1035616256,132779008000,58310656,924311552,0,0,100,0,0,28263,0
1035452416,132779167744,58314752,924311552,0,0,99.938,0.062,0,43224,0
1035444224,132779175936,58314752,924311552,0,0.031,99.969,0,0,30395,496
1035444224,132779175936,58314752,924311552,0,0,100,0,0,16273,0
1034928128,132779692032,58314752,924311552,0,0,100,0,0,16869,0
1034928128,132779692032,58314752,924311552,0,0,100,0,0,8873,0
1051746304,132762419200,58314752,924762112,0.936,0.468,98.596,0,0,401972,17034
1032486912,132782120960,58318848,924315648,0.344,0.125,99.500,0.031,0,5164,13196
1035145216,132779335680,58318848,924442624,0.437,0.218,99.345,0,0,171818,11856
1046933504,132767105024,58318848,924774400,0.406,0.219,99.375,0,0,399555,14532
1031397376,132783087616,58318848,924327936,0.624,0.531,98.845,0,0,16892,16042
1031380992,132783095808,58327040,924327936,0,0,98.624,1.376,0,22733,84
1031000064,132783448064,58343424,924327936,1.310,0.499,97.285,0.905,0,414242,26122
1030967296,132783480832,58343424,924327936,0,0,100,0,0,63437,0
1032728576,132781228032,58343424,924774400,1.370,0.654,97.976,0,0,429958,26310
1032429568,132781973504,58343424,924327936,0,0.031,99.969,0,0,14793,0
1032429568,132781973504,58343424,924327936,0,0,100,0,0,4070,0
1076281344,132737802240,58368000,924585984,1.716,0.250,97.285,0.749,0,224040,9164
1032749056,132781551616,58368000,924336128,0.219,0.031,99.750,0,0,9638,3068
1033555968,132780744704,58368000,924336128,0,0.031,99.969,0,0,3184,1836
1033555968,132780744704,58368000,924336128,0,0,100,0,0,1538,0
1032273920,132782026752,58368000,924340224,0.500,0.125,99.375,0,0,346981,15394
1039785984,132774305792,58388480,924528640,0.250,0.063,99.124,0.563,0,182414,21558
1039769600,132774322176,58388480,924528640,0,0,100,0,0,15650,13132
1039769600,132774322176,58388480,924528640,0,0,100,0,0,15802,13328
1039761408,132774330368,58388480,924528640,0,0,100,0,0,32376,13132
1039372288,132774719488,58388480,924528640,0,0.031,99.969,0,0,12872,13216
1039372288,132774719488,58396672,924520448,0,0,99.969,0.031,0,32496,18606
1039101952,132774977536,58400768,924528640,0,0,99.937,0.063,0,15222,13566
1038843904,132775235584,58400768,924528640,0,0,100,0,0,16104,13230
1039101952,132774977536,58400768,924528640,0,0.031,99.969,0,0,15808,13548
1039101952,132774977536,58400768,924528640,0,0,100,0,0,24290,13784
1031098368,132783165440,58400768,924344320,0.062,0.031,99.906,0,0,1652,4184
1030447104,132783804416,58413056,924344320,0.437,0.094,99.345,0.125,0,173560,14400
1030180864,132784070656,58413056,924344320,0,0,100,0,0,4922,1508
1030180864,132784070656,58413056,924344320,0,0,100,0,0,12990,0
1030180864,132784070656,58413056,924344320,0,0,100,0,0,4350,0
1030180864,132784070656,58413056,924344320,0,0,100,0,0,14376,0
1029902336,132784328704,58433536,924344320,0,0,99.844,0.156,0,6290,0
1029898240,132784328704,58433536,924348416,0,0,100,0,0,1806,0
1029898240,132784328704,58433536,924348416,0,0,100,0,0,11620,662
1029898240,132784328704,58433536,924348416,0,0,100,0,0,7012,0
1029885952,132784336896,58433536,924348416,0.031,0,99.969,0,0,9928,1008
1029885952,132784336896,58433536,924348416,0,0,99.656,0.344,0,43500,0
1029611520,132784603136,58441728,924348416,0,0,99.969,0.031,0,526,0
1024655360,132789542912,58441728,924352512,1,0.688,98.312,0,0,406063,30874
1024638976,132789559296,58441728,924352512,0,0,100,0,0,3596,0
1024638976,132789559296,58441728,924352512,0,0,100,0,0,4078,84
1024638976,132789559296,58441728,924352512,0,0,100,0,0,3732,0
1024372736,132789825536,58441728,924352512,0,0,99.750,0.250,0,17741,0
1024352256,132789825536,58462208,924352512,0,0,99.906,0.094,0,876,516
1024094208,132790083584,58462208,924352512,0,0,100,0,0,5815,0
1024094208,132790083584,58462208,924352512,0,0,100,0,0,16587,0
1023827968,132790349824,58462208,924352512,0,0,100,0,0,7531,0
1023569920,132790607872,58462208,924352512,0,0,100,0,0,3614,872
1023287296,132790890496,58462208,924352512,0,0,99.875,0.125,0,6387,0
1023021056,132791148544,58470400,924352512,0,0,99.969,0.031,0,16873,0
1050710016,132763807744,58470400,924000256,0.594,0.281,99.125,0,0,507929,23206
3342913536,130470359040,58474496,925138944,22.702,8.724,68.574,0,0,1485322,58860
6411145216,127400919040,58478592,926195712,33.406,13.493,53.101,0,0,1651178,65426
9551962112,124258193408,58486784,928022528,38.003,14.604,47.362,0.031,0,1325012,56664
12729012224,121079627776,58499072,929472512,39.141,14.530,45.271,1.058,0,1323810,55377
16045232128,117761810432,58531840,930926592,37.958,14.246,47.610,0.186,0,1325114,56848
19045244928,114760065024,58535936,932589568,36.514,12.390,51.001,0.094,0,1334774,1002430
21981691904,111822278656,58548224,933781504,37.301,11.904,50.639,0.156,0,1449664,8139344
25138565120,108663758848,58572800,935321600,40.044,15.186,44.581,0.189,0,1657824,20371102
28191801344,105609117696,58589184,936583168,44.619,13.531,41.693,0.157,0,1859594,32167116
30658048000,103141961728,58601472,937385984,39.341,11.815,48.622,0.222,0,1208186,51470902
31127158784,102672785408,58613760,937439232,18.647,2.495,78.453,0.405,0,1116948,62108490
31304069120,102495821824,58613760,937492480,16.983,1.804,80.840,0.373,0,1266918,71172808
31477592064,102322229248,58613760,937562112,20.131,1.717,77.840,0.312,0,1442124,80147004
31627620352,102171987968,58613760,937775104,20.443,1.839,76.005,1.714,0,1626590,91036814
31783350272,102016167936,58621952,937857024,23.237,2.175,73.812,0.777,0,1884772,108599626
31924199424,101875204096,58621952,937971712,24.456,2.144,73.120,0.280,0,1962462,113057226
32061263872,101738020864,58621952,938090496,21.803,1.809,76.138,0.250,0,2098046,116236216
32179023872,101620146176,58621952,938205184,20.350,2.313,76.868,0.469,0,2268093,124659672
32244854784,101554204672,58621952,938311680,18.936,2.567,77.997,0.501,0,2105760,117621998
32335360000,101463576576,58630144,938409984,24.303,3.534,62.430,9.733,0,2166220,121674112
32323842048,101474988032,58630144,938512384,15.435,2.276,76.146,6.143,0,2069572,114717574
32275320832,101523390464,58630144,938631168,10.953,1.924,86.783,0.341,0,2156370,119899428
32242905088,101555703808,58630144,938729472,10.720,1.589,87.286,0.405,0,2193676,117664120
32202854400,101595611136,58630144,938860544,8.692,1.475,89.457,0.377,0,2137724,116052914
32211693568,101586644992,58642432,938971136,10.622,2.093,86.567,0.719,0,1986574,113049230
32225423360,101572812800,58642432,939073536,10.424,1.507,87.724,0.345,0,2040756,111996868
32220073984,101578059776,58642432,939175936,9.800,1.467,88.296,0.437,0,2165960,119154254
32226758656,101571248128,58642432,939302912,9.142,1.440,89.167,0.250,0,2104701,115579886
32216199168,101581705216,58642432,939405312,7.822,0.876,91.083,0.219,0,2052516,116245660
32216678400,101581107200,58650624,939515904,9.376,1.286,88.680,0.659,0,2093467,116510562
32217526272,101580140544,58650624,939630592,7.712,0.940,88.652,2.696,0,2135650,117090406
32221478912,101576089600,58650624,939728896,7.692,1.251,90.744,0.313,0,2122182,118168188
32224923648,101572513792,58650624,939847680,7.463,1.003,91.283,0.251,0,2144620,118260692
32226086912,101571231744,58650624,939966464,6.875,1.188,91.719,0.219,0,2056276,111924986
32227106816,101570101248,58654720,940068864,8.735,1.597,88.885,0.783,0,2077502,114678158
32231882752,101565079552,58654720,940310528,6.683,1.349,88.171,3.797,0,1997834,111310564
32235601920,101561241600,58654720,940425216,7.484,1.553,88.696,2.267,0,2108040,116415526
32235216896,101561511936,58654720,940531712,9.801,1.706,88.058,0.434,0,2107786,119336878
32236744704,101559861248,58654720,940650496,7.321,1.340,90.997,0.343,0,2012486,110884726
32242094080,101554266112,58662912,940888064,7.538,1.439,90.272,0.751,0,2093194,115152744
32241487872,101554769920,58662912,940990464,6.886,1.158,91.612,0.344,0,2086358,115001072
32241008640,101555122176,58667008,941109248,7.611,1.367,90.587,0.435,0,2131622,118740440
32242778112,101553250304,58667008,941207552,8.140,1.879,89.543,0.438,0,2153204,117346098
32242925568,101552971776,58667008,941334528,7.297,1.278,90.957,0.468,0,2078086,115618542
32245428224,101550342144,58675200,941445120,6.424,1.316,91.695,0.564,0,2154448,119904178
32246697984,101548838912,58675200,941678592,7.349,1.099,91.206,0.345,0,2134116,119132870
32252477440,101542948864,58675200,941785088,8.864,1.231,87.504,2.401,0,2063196,113835670
32254918656,101540392960,58675200,941899776,5.583,1.631,92.440,0.345,0,2178960,119574400
32258772992,101536428032,58675200,942006272,7.558,1.374,90.756,0.312,0,2151800,119086042
32262152192,101532786688,58683392,942256128,5.379,1.195,92.985,0.440,0,2205316,124088148
32270221312,101524602880,58683392,942370816,6.839,1.312,91.568,0.281,0,1970744,112558432
32272564224,101522149376,58683392,942477312,6.450,1.064,91.954,0.532,0,2072716,115727594
32275460096,101519134720,58683392,942592000,5.556,1.036,93.095,0.314,0,2172142,119436458
32274268160,101520224256,58683392,942690304,6.818,1.027,91.843,0.311,0,2095664,116078088
32279011328,101515358208,58691584,942804992,5.587,0.979,92.835,0.600,0,2141890,119925486
32282656768,101511602176,58691584,942915584,5.884,1.322,92.417,0.378,0,2062384,116715294
32298393600,101495721984,58691584,943050752,7.597,1.364,90.202,0.837,0,2131984,119050532
32307843072,101486186496,58699776,943128576,6.546,1.660,89.164,2.631,0,2070128,115190880
32318435328,101475475456,58699776,943247360,7.477,1.477,90.732,0.314,0,2146770,117228188
32318443520,101475340288,58707968,943366144,6.579,1.310,91.519,0.592,0,2186336,120888254
32318840832,101474697216,58707968,943607808,7.336,1.119,91.265,0.280,0,2120301,118293394
32329990144,101463437312,58707968,943714304,9.864,1.799,88.120,0.217,0,2090362,114450712
32332566528,101460877312,58707968,943820800,9.438,1.812,88.125,0.625,0,2130704,116088942
32334823424,101458501632,58707968,943935488,7.237,1.190,91.322,0.251,0,2064052,113178406
32345608192,101447475200,58716160,944168960,8.768,1.778,88.861,0.593,0,2026348,113989452
32362889216,101430071296,58716160,944291840,9.140,1.387,89.190,0.284,0,2135612,118576978
32362344448,101430517760,58716160,944390144,7.925,1.092,90.702,0.281,0,2036144,115449230
32371638272,101421101056,58724352,944500736,8.239,1.347,87.500,2.914,0,2130520,118579498
32380841984,101411790848,58724352,944607232,8.112,1.716,89.860,0.312,0,2125406,118359512
32402632704,101389717504,58732544,944869376,8.463,1.556,89.608,0.373,0,2079788,119455452
32449695744,101342261248,58732544,945221632,11.532,1.160,86.932,0.376,0,2072168,114425444
32536604672,101255225344,58732544,945344512,12.226,2.001,85.428,0.344,0,2099022,121405622
32604487680,101187223552,58732544,945463296,9.869,1.468,86.508,2.155,0,2032060,113745768
32637792256,101153816576,58732544,945561600,9.774,1.728,88.215,0.283,0,2141268,118326984
32701743104,101089742848,58740736,945676288,11.778,1.874,85.879,0.469,0,2143693,118616780
32717221888,101074010112,58740736,945922048,9.815,1.512,88.364,0.309,0,2202848,122730014
32791265280,100999852032,58740736,946032640,12.265,1.690,85.670,0.375,0,2398596,116321696
32882208768,100908781568,58740736,946147328,10.779,1.682,86.729,0.810,0,2235090,123953368
32929296384,100861583360,58748928,946249728,11.743,1.499,84.166,2.592,0,2187230,118801898
32968597504,100822163456,58757120,946356224,10.244,1.655,87.633,0.468,0,2129760,116937884
32961695744,100828938240,58757120,946483200,6.875,1.219,91.625,0.281,0,2063582,114294658
32958656512,100831739904,58757120,946720768,5.779,1.125,92.752,0.344,0,2072902,114402888
32927182848,100863107072,58757120,946827264,6.887,1.246,91.648,0.218,0,2047550,113249676
32931901440,100858253312,58757120,946950144,5.972,1.182,92.442,0.404,0,2111994,115905332
32942133248,100847910912,58765312,947048448,8.344,1.812,89.406,0.438,0,2176570,119399960
32949190656,100840763392,58765312,947134464,4.575,1.065,94.108,0.251,0,2109636,116379088
32945803264,100844011520,58765312,947265536,6.516,1.347,91.886,0.251,0,2219984,123090656
32946450432,100843114496,58765312,947515392,4.983,1.152,93.647,0.218,0,2139684,116973796
32946552832,100842905600,58773504,947609600,6.332,1.123,88.490,4.055,0,2064954,113043584
32943177728,100846141440,58781696,947740672,6.053,1.324,92.119,0.504,0,2114038,116529362
32939515904,100849696768,58781696,947847168,6.219,1.244,92.257,0.280,0,2107168,114904906
32932171776,100856819712,58781696,948068352,5.086,1.030,93.635,0.250,0,2079854,114264190
32929894400,100858966016,58781696,948199424,5.080,1.254,93.415,0.251,0,1992682,107794464
32918392832,100870356992,58781696,948310016,5.713,0.874,93.038,0.375,0,2066050,113555018
32918331392,100870299648,58793984,948412416,5.403,1.187,88.351,5.059,0,2079588,115027252
32919576576,100868939776,58793984,948523008,5.864,1.427,92.491,0.217,0,2008274,112263624
32918831104,100869562368,58793984,948645888,5.829,1.247,92.675,0.249,0,2084694,116078410
32919527424,100868636672,58793984,948875264,5.500,1.125,93.094,0.281,0,2025532,113455516
32917651456,100870389760,58793984,948994048,7.230,0.966,91.462,0.343,0,2044388,112295568
32916787200,100871131136,58810368,949096448,5.676,1.334,90.074,2.916,0,2074772,114469020
32925392896,100862410752,58810368,949207040,7.468,1.271,90.982,0.279,0,2105734,115581682
32927846400,100859842560,58810368,949317632,6.102,1.401,92.248,0.249,0,2164594,118057922
32937811968,100849737728,58810368,949448704,7.964,1.333,90.487,0.217,0,2109364,116335234
32938385408,100849074176,58810368,949538816,5.338,1.130,93.281,0.251,0,2196650,121492786
32938610688,100848451584,58818560,949919744,7.924,1.398,89.869,0.808,0,2240510,123053204
32937164800,100849790976,58818560,950022144,7.302,1.454,90.934,0.309,0,2145508,116598018
32939528192,100847308800,58818560,950140928,7.922,1.449,90.351,0.277,0,2084602,117237190
32940445696,100846268416,58818560,950255616,7.067,1.094,91.557,0.281,0,2142236,119733538
32938901504,100847702016,58818560,950366208,7.123,1.487,91.050,0.341,0,2113474,116602026
32939941888,100846534656,58826752,950484992,7.205,1.366,88.261,3.168,0,2082300,114054706
32942485504,100843753472,58834944,950714368,7.496,1.462,90.482,0.560,0,2013326,111618058
32943546368,100842569728,58834944,950824960,6.242,1.398,92.050,0.311,0,2199896,122906312
32943595520,100842422272,58834944,950923264,5.303,1.216,93.138,0.343,0,2048378,111159460
32944906240,100840968192,58834944,951058432,5.511,1.214,92.902,0.374,0,2127490,117109454
32945639424,100840116224,58843136,951169024,5.670,1.371,92.523,0.436,0,2063620,113463940
32945135616,100840501248,58843136,951287808,6.768,1.366,91.183,0.683,0,2096310,115481138
32945463296,100839915520,58843136,951533568,5.788,1.408,92.459,0.344,0,2195370,122646854
32944939008,100840312832,58843136,951660544,7.697,1.714,90.277,0.312,0,2185202,117389562
32946335744,100838813696,58843136,951762944,5.881,1.369,92.533,0.218,0,2448637,116341504
32947961856,100837068800,58851328,951873536,7.380,1.178,90.946,0.496,0,2312062,119274834
32953315328,100831600640,58859520,951980032,7.996,1.213,88.239,2.551,0,2247543,121663114
32953606144,100831174656,58859520,952107008,9.099,1.424,89.291,0.186,0,2117378,114888684
32953090048,100831580160,58859520,952217600,7.642,1.002,91.074,0.282,0,2117898,116094592
32954413056,100830126080,58859520,952348672,8.121,1.151,90.510,0.218,0,1998781,111142820
32962609152,100821807104,58867712,952455168,9.184,1.526,88.667,0.623,0,2155417,117606126
32976945152,100807368704,58880000,952541184,10.505,1.602,86.568,1.325,0,2139846,115844248
32978804736,100805242880,58880000,952803328,9.051,1.395,89.306,0.248,0,2152810,113743732
32986034176,100797882368,58880000,952930304,10.411,1.340,87.999,0.249,0,2266287,122641584
32985907200,100797882368,58880000,953049088,5.621,1.031,93.161,0.187,0,2216903,118241532
32985681920,100797980672,58888192,953163776,6.569,1.370,91.781,0.280,0,2234844,119581760
32986517504,100797026304,58888192,953282560,5.588,1.397,90.655,2.360,0,2256073,119720040
32988934144,100794503168,58896384,953380864,6.080,1.403,92.080,0.437,0,2267712,120024100
32989114368,100794200064,58896384,953503744,4.847,0.913,93.925,0.315,0,2135837,115820042
32989941760,100793253888,58896384,953618432,5.721,1.088,92.879,0.311,0,2103440,114361974
32988274688,100794789888,58904576,953741312,4.618,1.061,93.635,0.686,0,2104796,116921232
32989925376,100793016320,58920960,953847808,5.285,1.188,87.023,6.504,0,2108528,115358832
32992088064,100790738944,58920960,953958400,5.112,1.434,92.737,0.717,0,2177656,119705930
32994607104,100788097024,58920960,954077184,5.804,1.273,92.675,0.248,0,2055312,112673378
32993263616,100789182464,58929152,954327040,6.295,1.426,92,0.279,0,2162840,118137534
32992768000,100789559296,58929152,954441728,3.939,1.063,94.780,0.219,0,2042258,109271870
32992940032,100789264384,58937344,954556416,5.890,1.271,92.436,0.403,0,2076162,112528570
32991518720,100790571008,58937344,954667008,4.421,1.003,91.659,2.916,0,2150474,110036834
32993787904,100788195328,58937344,954773504,5.511,1.276,93.026,0.187,0,2198676,122505714
32994344960,100787490816,58945536,954912768,4.694,1.088,93.845,0.373,0,2174966,113589142
32996007936,100785737728,58945536,954998784,5.661,1.244,92.877,0.218,0,2172458,117921846
32996552704,100785053696,58949632,955117568,5.726,1.627,91.959,0.688,0,2273642,117601910
32997572608,100783898624,58949632,955248640,5.033,1.125,93.279,0.563,0,2292132,117598588
32996413440,100784947200,58949632,955355136,5.294,1.121,93.273,0.311,0,2300366,124520722
32996577280,100784676864,58949632,955457536,4.585,1.185,93.886,0.343,0,2092472,115382416
32997130240,100783996928,58949632,955584512,6.351,1.152,92.186,0.311,0,2221404,119974376
32996417536,100784570368,58957824,955715584,4.458,1.153,93.797,0.592,0,2269052,124574722
32998690816,100782194688,58961920,955805696,4.306,1.217,90.296,4.181,0,2329936,124595686
32998305792,100782448640,58966016,955928576,4.301,1.005,93.312,1.381,0,2120602,116267088
32998658048,100781953024,58966016,956071936,4.880,1.157,93.713,0.250,0,2098990,114044484
32998039552,100782481408,58966016,956162048,5.859,1.060,92.708,0.374,0,2262636,121163854
32999501824,100780900352,58974208,956264448,5.681,1.420,91.973,0.926,0,2136268,113070024
32999821312,100780453888,58974208,956391424,5.036,1.181,93.379,0.404,0,2283128,124923226
32999870464,100780281856,58982400,956502016,4.914,1.064,85.884,8.138,0,2176130,116093250
33000685568,100779352064,58982400,956612608,6.507,1.432,91.656,0.405,0,2081690,110849562
33001250816,100778655744,58982400,956735488,4.918,1.058,93.651,0.373,0,2164710,116926134
33002209280,100777431040,58990592,956985344,4.669,1.245,93.557,0.529,0,2156936,117254696
33001529344,100778012672,58990592,957083648,4.704,0.972,94.011,0.314,0,2015078,111384986
33003282432,100776128512,58998784,957206528,4.622,1.124,90.725,3.529,0,2007632,110399510
33001791488,100777504768,58998784,957321216,4.245,0.968,94.476,0.312,0,2073502,115069970
33003163648,100776034304,58998784,957415424,4.297,0.816,94.636,0.251,0,2137928,121827302
32999940096,100779118592,59006976,957542400,5.391,1.122,92.615,0.873,0,2096460,115954930
33002012672,100776914944,59006976,957669376,5.588,1.087,92.952,0.373,0,2104374,117899752
33003237376,100775571456,59015168,957775872,4.772,1.092,93.200,0.936,0,2179336,123746240
33004687360,100773998592,59015168,957898752,4.860,1.308,93.551,0.280,0,1988328,111945562
33006444544,100772106240,59015168,958033920,5.426,1.216,93.015,0.343,0,2082020,116826948
33005174784,100773277696,59023360,958119936,5.495,1.186,92.382,0.937,0,1983260,111653580
33005768704,100772569088,59023360,958234624,4.281,1.094,94.281,0.344,0,2075720,114692518
33005723648,100772347904,59027456,958496768,4.152,0.912,89.902,5.033,0,2122042,117054050
33005907968,100772048896,59031552,958603264,3.873,1.156,94.347,0.625,0,2149278,118591978
33005989888,100771852288,59031552,958713856,5.114,1.091,93.389,0.405,0,2161486,117927068
33006604288,100771115008,59035648,958832640,5.030,0.968,93.065,0.937,0,2105622,116495302
33006649344,100770942976,59035648,958959616,6.056,1.273,92.267,0.404,0,2206598,123627416
33007595520,100769898496,59035648,959053824,4.250,1.125,94.281,0.344,0,2128702,117606784
33008709632,100768636928,59043840,959193088,4.695,1.189,92.833,1.283,0,2161818,118570756
33007661056,100769570816,59043840,959307776,4.380,1.158,94.055,0.407,0,2041434,115063106
33007255552,100769755136,59047936,959520768,3.352,1.034,95.269,0.345,0,2193732,118279676
33008607232,100768268288,59047936,959655936,4.857,1.152,93.649,0.342,0,1999130,111571882
33011257344,100765470720,59047936,959787008,4.989,1.247,93.389,0.374,0,2133410,118646436
33011011584,100765622272,59056128,959868928,4.494,1.100,90.792,3.614,0,2120558,117579350
33011249152,100765257728,59056128,959995904,6.858,1.434,91.334,0.374,0,2032096,114133592
33011310592,100765061120,59060224,960122880,4.550,1.278,93.643,0.530,0,2112558,115302794
33012170752,100764094464,59060224,960229376,4.506,0.994,94.251,0.249,0,2197904,119712090
33012117504,100764033024,59060224,960339968,5.292,1.300,93.098,0.310,0,2106818,116152674
33021509632,100754505728,59068416,960458752,4.817,0.907,88.896,5.380,0,2094906,116362374
33019285504,100756635648,59068416,960552960,5.103,0.877,93.770,0.250,0,2068934,114965132
33018109952,100757684224,59076608,960667648,3.971,1.001,94.153,0.876,0,2184202,118053930
33021800448,100753870848,59076608,960790528,4.346,0.969,94.434,0.250,0,2148814,114974894
33017761792,100757655552,59076608,961036288,5.168,1.183,93.275,0.374,0,2064728,113337044
33020719104,100754579456,59080704,961146880,5.312,1.025,90.867,2.796,0,2054776,114245288
33020751872,100754407424,59084800,961273856,4.819,1.158,93.554,0.469,0,2012748,112095676
33021693952,100753313792,59088896,961409024,5.537,1.182,92.753,0.529,0,2100880,119748628
33022988288,100751933440,59088896,961490944,5.703,1.465,92.615,0.218,0,2136768,116457966
33022042112,100752646144,59088896,961724416,4.329,0.941,94.448,0.282,0,2125122,117743676
33024880640,100749656064,59088896,961875968,4.732,0.971,93.983,0.313,0,2050800,112809554
33024790528,100749635584,59097088,961974272,4.057,1.092,91.479,3.371,0,2117702,119314930
33024077824,100750221312,59101184,962093056,4.848,1.220,92.993,0.938,0,2140870,119419492
33023893504,100750282752,59101184,962211840,4.899,0.936,93.978,0.187,0,2106436,118602662
33022869504,100751192064,59101184,962326528,5.721,1.000,93.092,0.188,0,2128066,115756050
33023344640,100750622720,59101184,962420736,4.006,0.908,94.867,0.219,0,2089536,113538452
33024102400,100749725696,59109376,962547712,3.408,0.844,93.246,2.502,0,2078940,115559282
33025630208,100748066816,59117568,962666496,3.970,1.344,93.998,0.688,0,2068746,114092414
33025540096,100748050432,59117568,962772992,5.245,1.124,93.381,0.250,0,2107290,115710766
33023672320,100749795328,59117568,962895872,4.967,1.031,93.783,0.219,0,2078102,113754304
33027715072,100745621504,59117568,963026944,4.623,1.132,93.962,0.283,0,2178422,118474396
33027239936,100745998336,59117568,963117056,4.500,1.007,93.770,0.724,0,2187432,121623580
33026674688,100746412032,59133952,963244032,4.289,1.096,93.895,0.720,0,2059646,112153558
33026482176,100746502144,59133952,963346432,5.153,1.343,93.223,0.281,0,2034496,110391436
33030160384,100742692864,59133952,963469312,4.614,1.099,93.911,0.377,0,2253708,119810670
33028939776,100743798784,59133952,963584000,4.474,0.970,94.274,0.282,0,2093874,114650050
33029640192,100742971392,59133952,963706880,4.983,0.965,90.688,3.363,0,2221278,120479916
33031417856,100741099520,59142144,963792896,3.677,0.911,94.657,0.754,0,2061848,112962272
33030897664,100741476352,59150336,963928064,4.494,1.124,93.945,0.437,0,2104290,111766542
33030721536,100741525504,59150336,964055040,4.091,0.999,94.535,0.375,0,2129642,117265260
33030971392,100741046272,59150336,964284416,5.178,1.085,93.395,0.341,0,2295134,125274060
33029722112,100742172672,59150336,964403200,4.637,1.152,93.900,0.311,0,2188048,123076040
33031057408,100740718592,59154432,964517888,4.870,1.124,92.757,1.249,0,2088906,115455242
33032339456,100739301376,59154432,964644864,5.879,0.907,92.871,0.344,0,2141798,118033012
33031323648,100740202496,59162624,964751360,5.075,1.152,93.244,0.529,0,2099416,112221118
33033682944,100737732608,59162624,964861952,6.195,1.189,92.209,0.407,0,2159572,119963986
33033629696,100737675264,59162624,964972544,4.567,1.220,93.838,0.375,0,2195616,120813812
29080281088,104690888704,59170816,965095424,4.440,1.282,93.433,0.844,0,2019500,109641584
25972961280,107798986752,59170816,964317184,4.081,1.121,94.486,0.312,0,1774614,96436074
22859845632,110913105920,59179008,963297280,2.873,0.843,95.909,0.375,0,1563282,81726116
18828410880,114945372160,59179008,962465792,2.479,0.879,96.517,0.126,0,1414922,76856934
15682105344,118092488704,59179008,961654784,1.790,0.660,97.236,0.314,0,1097950,59515480
12566331392,121209311232,59187200,960598016,1.844,0.750,95.688,1.719,0,881672,49996304
9217654784,124558843904,59187200,959741952,1.288,0.408,98.084,0.220,0,606678,35257822
5912502272,127864631296,59187200,959107072,0.691,0.220,98.838,0.251,0,466450,25955392
2720899072,131057315840,59195392,958017536,0.909,0.188,98.777,0.125,0,238950,12296332
1082761216,132696338432,59195392,957132800,0.157,0.063,99.781,0,0,112976,2646934
1065312256,132714217472,59207680,956690432,0.094,0,99.312,0.594,0,39108,0
1065312256,132714217472,59207680,956690432,0,0,100,0,0,29818,220
1065054208,132714475520,59207680,956690432,0,0.031,99.969,0,0,20704,0
1064538112,132714991616,59207680,956690432,0,0,100,0,0,61414,0
1064538112,132714991616,59207680,956690432,0.031,0,99.969,0,0,41296,0
1064013824,132715515904,59207680,956690432,0,0,100,0,0,51104,0
1063727104,132715790336,59219968,956690432,0,0,99.844,0.156,0,11794,0
1063469056,132716048384,59219968,956690432,0.031,0,99.969,0,0,10454,0
1063211008,132716306432,59219968,956690432,0,0,100,0,0,15652,0
1062952960,132716564480,59219968,956690432,0,0,100,0,0,41091,0
1062694912,132716822528,59219968,956690432,0,0,100,0,0,33469,0
1062436864,132717080576,59219968,956690432,0,0,100,0,0,76019,2072
1062170624,132717338624,59228160,956690432,0,0,99.969,0.031,0,45526,0
1061912576,132717596672,59228160,956690432,0.031,0,99.969,0,0,51517,0
1061654528,132717854720,59228160,956690432,0,0,100,0,0,47271,0
1061654528,132717854720,59228160,956690432,0,0,100,0,0,79864,0
1061138432,132718370816,59228160,956690432,0,0,100,0,0,63058,0
1060622336,132718886912,59228160,956690432,0,0,100,0,0,91222,168
1060614144,132718886912,59236352,956690432,0,0,99.969,0.031,0,41005,0
1059840000,132719661056,59236352,956690432,0,0,100,0,0,23068,2380
1059840000,132719661056,59236352,956690432,0,0,100,0,0,20062,0
1059323904,132720177152,59236352,956690432,0.031,0,99.969,0,0,36256,1508
1059323904,132720177152,59236352,956690432,0,0,100,0,0,77460,180
1059065856,132720435200,59236352,956690432,0,0,100,0,0,163836,0
1058799616,132720693248,59244544,956690432,0,0.031,99.906,0.062,0,52114,0
1058541568,132720951296,59244544,956690432,0.031,0,99.969,0,0,70994,0
1058508800,132720984064,59244544,956690432,0,0,99.437,0.563,0,16484,0
1058250752,132721242112,59244544,956690432,0,0.031,99.969,0,0,67158,84
1058250752,132721242112,59244544,956690432,0,0,100,0,0,21492,0
1058095104,132721397760,59244544,956690432,0.031,0,99.969,0,0,75880,0
1058086912,132721397760,59252736,956690432,0,0,99.938,0.062,0,15610,0
1058086912,132721397760,59252736,956690432,0,0,99.875,0.125,0,2740,0
1057828864,132721655808,59252736,956690432,0,0,100,0,0,11026,0
1057828864,132721655808,59252736,956690432,0,0,100,0,0,34056,0
1075228672,132702728192,59252736,957145088,1.188,0.344,98.469,0,0,441879,22178
1055805440,132721893376,59252736,956698624,0.250,0.312,99.438,0,0,132052,28674
