172.16.72.21 : 4.30 4.32 4.30 4.31 4.32 4.26 4.28 4.31 4.30 4.32
172.16.72.22 : 4.34 4.29 4.32 4.32 4.32 4.30 4.30 4.30 4.32 4.32
172.16.72.23 : 4.31 4.31 4.27 4.29 4.33 4.30 4.31 4.31 4.33 4.31
172.16.72.24 : 4.27 4.31 4.30 4.28 4.29 4.26 4.29 4.27 4.27 4.28
172.16.72.25 : 4.29 4.31 4.32 4.33 4.31 4.29 4.32 4.29 4.28 4.22
172.16.72.26 : 4.31 4.32 4.31 4.31 4.31 4.28 4.33 4.25 4.33 4.29
172.16.72.27 : 4.30 4.31 4.32 4.30 4.28 4.30 4.25 4.30 4.29 4.27
172.16.72.28 : 4.32 4.31 4.32 4.34 4.30 4.31 4.31 4.33 4.29 4.30
172.16.72.29 : 4.31 4.27 4.31 4.31 4.26 4.24 4.22 4.28 4.29 4.29
172.16.72.3  : 4.30 4.31 4.28 4.29 4.33 4.30 4.32 4.30 4.32 4.30
172.16.72.30 : 4.81 4.31 4.28 4.27 4.30 4.29 4.29 4.31 4.31 4.21
172.16.72.31 : 4.27 4.31 4.29 4.30 4.30 4.28 4.31 4.31 4.33 4.30
172.16.72.32 : 4.22 4.29 4.30 4.29 4.30 4.30 4.31 4.31 4.32 4.31
172.16.72.33 : 4.28 4.27 4.27 4.30 4.28 4.29 4.31 - 4.31 4.29
172.16.72.34 : 4.28 4.27 4.27 4.29 4.31 4.32 4.31 4.29 4.30 4.30
172.16.72.35 : 4.29 4.30 4.31 4.31 4.30 4.31 4.30 4.27 4.33 4.30
172.16.72.36 : 4.30 4.29 4.31 4.29 4.29 4.29 4.27 4.27 4.31 4.31
172.16.72.37 : 4.33 4.27 4.31 4.32 4.31 4.32 4.32 4.32 4.30 4.34
172.16.72.38 : 0.16 0.15 0.20 0.20 0.21 0.19 0.20 0.19 0.19 0.16
172.16.72.39 : 0.19 0.19 0.19 0.20 0.22 0.20 0.19 0.20 0.19 0.19
172.16.72.4  : 0.19 0.18 0.19 0.20 0.21 0.19 0.18 0.21 0.21 0.19
172.16.72.40 : 0.19 0.20 0.19 0.19 0.19 0.20 0.19 0.19 0.19 0.19
172.16.72.41 : 0.15 0.16 0.13 0.20 0.19 0.18 0.20 0.16 0.16 0.13
172.16.72.43 : 0.03 0.03 0.03 0.03 0.03 0.03 0.03 0.03 0.03 0.03
172.16.72.44 : 0.17 0.19 0.21 0.20 0.17 0.21 0.17 0.18 0.20 0.22
172.16.72.45 : 0.21 0.17 0.19 0.20 0.22 0.19 0.20 0.21 0.21 0.19
172.16.72.46 : 0.21 0.18 0.18 0.18 0.19 0.20 0.18 0.16 0.20 0.15
172.16.72.47 : 0.21 0.17 0.19 0.19 0.19 0.18 0.21 0.19 0.18 0.18
172.16.72.49 : 0.18 0.12 0.14 0.18 0.15 0.19 0.19 0.16 0.18 0.19
172.16.72.5  : 0.16 0.16 0.17 0.18 0.18 0.18 0.19 0.18 0.18 0.16
172.16.72.50 : 0.17 0.20 0.19 0.19 0.19 0.19 0.20 0.21 0.19 0.18
172.16.72.51 : 0.19 0.19 0.17 0.19 0.19 0.19 0.18 0.19 0.18 0.18
172.16.72.6  : 0.18 0.19 0.19 0.18 0.19 0.18 0.19 0.19 0.20 0.16
172.16.72.7  : 0.20 0.16 0.18 0.17 0.20 0.16 0.19 0.18 0.19 0.19
172.16.72.8  : 4.28 4.29 4.29 4.28 4.28 4.27 4.28 4.28 4.31 4.24

      35 targets
      35 alive
       0 unreachable
       0 unknown addresses

       1 timeouts (waiting for response)
     350 ICMP Echos sent
     349 ICMP Echo Replies received
       0 other ICMP received

 0.03 ms (min round trip time)
 2.40 ms (avg round trip time)
 4.81 ms (max round trip time)
       10.143 sec (elapsed real time)

