172.16.66.55 : 8.15 4.35 4.39 4.36 4.37 4.31 4.39 4.41 4.42 4.40
172.16.66.56 : 8.86 4.38 4.36 4.39 4.36 4.38 4.36 4.39 4.38 4.37
172.16.66.57 : 19.93 10.34 10.27 10.22 10.31 10.32 10.29 - 10.36 10.29
172.16.66.58 : 11.23 10.28 10.35 10.34 10.31 10.35 10.33 10.33 10.34 10.34
172.16.66.59 : 11.35 - 10.30 - 10.31 10.28 10.24 10.25 10.22 10.20
172.16.66.6  : 19.39 10.32 10.39 10.39 10.30 10.31 10.28 10.36 10.37 10.34
172.16.66.60 : 14.77 10.27 10.30 10.30 10.35 10.37 10.38 10.35 10.39 10.38
172.16.66.61 : 15.90 10.33 10.35 10.34 10.32 10.32 10.34 10.41 10.29 10.33
172.16.66.62 : 10.30 10.25 10.29 10.24 10.31 10.33 10.33 10.35 10.31 10.33
172.16.66.64 : 27.27 10.38 - 10.34 10.36 10.32 10.30 10.30 10.38 10.39
172.16.66.65 : 16.59 10.40 10.40 10.29 10.40 10.38 10.41 10.38 10.38 10.34
172.16.66.66 : 12.01 10.37 10.36 10.35 10.36 10.30 - 10.34 10.34 10.36
172.16.66.67 : 16.48 10.25 10.28 10.19 10.29 10.29 10.31 10.28 10.28 10.30
172.16.66.69 : 13.73 10.38 10.38 10.32 10.39 10.41 10.40 10.34 10.39 10.22
172.16.66.7  : 0.22 0.22 0.21 0.23 0.22 0.21 0.22 0.23 0.21 0.21
172.16.66.70 : 0.17 0.21 0.23 0.22 0.21 0.22 0.21 0.17 0.18 0.22
172.16.66.71 : 0.03 0.03 0.03 0.04 0.03 0.03 0.03 0.03 0.01 0.03
172.16.66.72 : 0.19 0.22 0.22 0.23 0.21 0.22 0.22 0.22 0.22 0.22
172.16.66.73 : 0.22 0.22 0.21 0.22 0.22 0.22 0.22 0.22 0.22 0.23
172.16.66.74 : 0.21 0.21 0.22 0.22 0.21 0.21 0.21 0.22 0.18 0.22
172.16.66.75 : 0.22 0.22 0.21 0.21 0.21 0.21 0.20 0.21 0.21 0.21
172.16.66.76 : 0.16 0.20 0.19 0.22 0.22 0.21 0.23 0.23 0.21 0.22
172.16.66.77 : 0.25 0.22 0.21 0.21 0.22 0.21 0.22 0.22 0.20 0.21
172.16.66.78 : 0.23 0.21 0.21 0.22 0.23 0.21 0.18 0.20 0.20 0.22
172.16.66.79 : 0.20 0.19 0.17 0.18 0.20 0.19 0.19 0.22 0.21 0.19
172.16.66.8  : 0.19 0.20 0.19 0.17 0.20 0.19 0.19 0.19 0.19 0.21
172.16.66.80 : 11.05 4.36 4.37 4.38 4.36 4.37 4.39 4.25 4.28 4.29

      27 targets
      27 alive
       0 unreachable
       0 unknown addresses

       4 timeouts (waiting for response)
     270 ICMP Echos sent
     265 ICMP Echo Replies received
       0 other ICMP received

 0.01 ms (min round trip time)
 5.36 ms (avg round trip time)
 27.2 ms (max round trip time)
       10.125 sec (elapsed real time)

