"Dstat 0.7.3 CSV output"
"Author:","Dag Wieers <dag@wieers.com>",,,,"URL:","http://dag.wieers.com/home-made/dstat/"
"Host:","grisou-36.nancy.grid5000.fr",,,,"User:","root"
"Cmdline:","dstat -m -c -n -o dstat.csv",,,,"Date:","24 May 2020 18:19:52 CEST"
"memory usage",,,,"total cpu usage",,,,,"net/total",
"used","free","buff","cach","usr","sys","idl","wai","stl","recv","send"
1164042240,132366548992,47521792,1241604096,0.710,0.092,99.131,0.068,0,0,0
1173475328,132356767744,47521792,1241948160,0.656,0.125,99.219,0,0,388060,15816
1175392256,132355297280,47521792,1241501696,0.719,0.532,98.749,0,0,387720,27152
1167499264,132363190272,47521792,1241501696,0.781,0.687,97.907,0.625,0,5378,16982
1167728640,132362948608,47534080,1241501696,0,0,99.969,0.031,0,854,0
1170649088,132359741440,47534080,1241763840,0.938,0.781,98.281,0,0,386770,26790
1170903040,132359733248,47546368,1241505792,0,0,99.969,0.031,0,2026,0
1169862656,132360773632,47546368,1241505792,0,0,100,0,0,1298,0
1169604608,132361031680,47546368,1241505792,0,0.031,98.906,1.063,0,1566,148
1169362944,132361273344,47546368,1241505792,0,0.031,98.688,1.281,0,1248,0
1169346560,132361289728,47546368,1241505792,0,0,100,0,0,1200,0
1168818176,132361805824,47558656,1241505792,0,0,99.969,0.031,0,5340,814
1168551936,132362063872,47566848,1241505792,0,0,99.938,0.062,0,2818,1948
1168318464,132362297344,47566848,1241505792,0,0,100,0,0,1896,716
1167544320,132363071488,47566848,1241505792,0,0,100,0,0,854,0
1167544320,132363071488,47566848,1241505792,0,0,100,0,0,3946,0
1167544320,132363071488,47566848,1241505792,0,0,100,0,0,1200,148
1167028224,132363587584,47566848,1241505792,0,0,100,0,0,1396,0
1167278080,132363329536,47575040,1241505792,0,0,99.938,0.062,0,1650,0
1174618112,132355727360,47591424,1241747456,1.063,0.657,98.248,0.031,0,391508,30838
1171984384,132358594560,47591424,1241513984,0,0.031,99.969,0,0,1272,132
1172381696,132358176768,47591424,1241534464,0.313,0.281,99.406,0,0,170642,12036
1180577792,132349489152,47591424,1241985024,0.751,0.532,98.718,0,0,388652,16770
1169993728,132360519680,47591424,1241538560,0.188,0.250,99.562,0,0,3968,14536
1182830592,132347215872,47616000,1241972736,0.531,0.188,99.156,0.125,0,383590,11142
1167405056,132363075584,47616000,1241538560,0.531,0.500,98.969,0,0,11362,15648
1182339072,132348141568,47632384,1241522176,0.531,0.219,99.250,0,0,383750,11274
1168179200,132362276864,47632384,1241546752,0.406,0.563,99.031,0,0,4510,15648
1168162816,132362293248,47632384,1241546752,0,0,100,0,0,7222,0
1166962688,132363468800,47656960,1241546752,0,0,99.375,0.625,0,8218,1236
1167355904,132362985472,47661056,1241554944,1.686,0.250,97.440,0.624,0,222930,9900
1166118912,132364222464,47661056,1241554944,0,0.031,99.969,0,0,3310,2668
1165553664,132364787712,47661056,1241554944,0,0,100,0,0,7060,0
1172553728,132357787648,47661056,1241554944,0.156,0.031,99.812,0,0,166736,5860
1165869056,132364460032,47665152,1241563136,0.312,0.156,99.532,0,0,349584,16756
1172410368,132357636096,47710208,1241767936,0.188,0,99.030,0.782,0,148654,18824
1171378176,132358668288,47710208,1241767936,0,0,100,0,0,10532,13328
1171046400,132359000064,47710208,1241767936,0.031,0.031,99.938,0,0,10952,13328
1170530304,132359516160,47710208,1241767936,0,0,100,0,0,10788,13328
1170530304,132359516160,47710208,1241767936,0.031,0,99.969,0,0,11068,13496
1169997824,132360040448,47718400,1241767936,0,0.031,99.937,0.031,0,17434,18274
1169997824,132360040448,47726592,1241759744,0,0,99.969,0.031,0,13692,13328
1169911808,132360118272,47726592,1241767936,0,0,100,0,0,13594,13328
1169805312,132360224768,47726592,1241767936,0,0,100,0,0,13474,13328
1162280960,132367859712,47726592,1241657344,0,0.031,99.969,0,0,14126,14780
1161519104,132368695296,47726592,1241583616,0,0,100,0,0,2154,1740
1162031104,132368171008,47738880,1241583616,0.250,0.094,99.531,0.125,0,172208,13904
1162063872,132368138240,47738880,1241583616,0,0,100,0,0,1708,0
1161539584,132368662528,47738880,1241583616,0,0,100,0,0,1156,0
1161539584,132368662528,47738880,1241583616,0,0,100,0,0,1098,0
1161527296,132368662528,47751168,1241583616,0,0,99.969,0.031,0,6730,0
1161461760,132368715776,47763456,1241583616,0,0.031,99.594,0.375,0,1544,0
1161457664,132368715776,47763456,1241587712,0,0,100,0,0,682,2380
1161248768,132368924672,47763456,1241587712,0,0,100,0,0,2210,1456
1162571776,132367601664,47763456,1241587712,1.063,0.719,98.218,0,0,389876,29954
1160867840,132369305600,47763456,1241587712,0,0,100,0,0,1196,0
1317523456,132212350976,47792128,1241858048,3.497,0.406,96.004,0.094,0,347126,17650
1319993344,132209979392,47792128,1241759744,0,0.031,99.656,0.312,0,8684,0
1319735296,132210237440,47792128,1241759744,0,0,100,0,0,3630,0
1319477248,132210495488,47804416,1241747456,0,0,99.938,0.062,0,1962,168
1319464960,132210495488,47804416,1241759744,0,0,100,0,0,3816,0
1336303616,132193648640,47812608,1241759744,0.906,0.031,99.032,0.031,0,6252,168
1408266240,132121681920,47812608,1241763840,3.636,0.219,96.144,0,0,3428,476
1466470400,132063477760,47812608,1241763840,3.530,0,96.470,0,0,1322,148
1505394688,132024553472,47812608,1241763840,3.162,0,96.838,0,0,1260,0
1537044480,131992903680,47812608,1241763840,3.221,0,96.779,0,0,730,148
1579630592,131950317568,47820800,1241755648,3.130,0,96.839,0.031,0,1208,0
1638211584,131891728384,47820800,1241763840,3.283,0,96.717,0,0,3402,84
1697181696,131832750080,47828992,1241763840,3.192,0,96.776,0.031,0,1806,0
1726541824,131803389952,47828992,1241763840,3.161,0,96.839,0,0,3188,148
1756192768,131773739008,47828992,1241763840,3.128,0,96.872,0,0,6440,0
1808617472,131721216000,47837184,1241853952,3.190,0.031,96.747,0.031,0,3078,0
1865609216,131664211968,47837184,1241862144,3.859,0.031,96.110,0,0,1618,0
1913581568,131616239616,47837184,1241862144,3.403,0.031,96.566,0,0,1204,3292
1942519808,131587301376,47837184,1241862144,3.129,0,96.871,0,0,3626,0
1959448576,131570372608,47837184,1241862144,3.225,0.157,96.619,0,0,914,0
1961738240,131568082944,47845376,1241853952,3.130,0,96.839,0.031,0,1136,0
1961811968,131568001024,47845376,1241862144,3.583,0,96.417,0,0,690,148
1962360832,131567452160,47845376,1241862144,3.129,0,96.871,0,0,1146,0
1962360832,131567452160,47845376,1241862144,3.127,0,96.873,0,0,2348,0
1962332160,131567480832,47845376,1241862144,3.309,0.062,96.628,0,0,1196,0
1960558592,131569254400,47853568,1241853952,3.583,0,96.355,0.062,0,3460,1680
1960062976,131569737728,47853568,1241866240,3.160,0,96.840,0,0,8776,2100
1971224576,131558576128,47853568,1241866240,4.313,0,95.687,0,0,17542,1680
1970708480,131559084032,47853568,1241866240,3.370,0.031,96.599,0,0,6916,1680
1971355648,131558436864,47853568,1241866240,3.130,0,96.870,0,0,11780,1680
2005573632,131524120576,47869952,1241866240,8.834,0.311,90.793,0.062,0,10200372,191364
2050301952,131479306240,47869952,1241874432,12.449,0.438,87.113,0,0,31560574,594046
2068074496,131461488640,47869952,1241878528,9.077,0.717,90.206,0,0,52012790,952446
2117758976,131411804160,47869952,1241878528,8.951,1.002,90.047,0,0,73267600,1295012
2187497472,131342065664,47869952,1241878528,10.761,1.185,88.054,0,0,95251444,1527812
2239496192,131290054656,47878144,1241878528,12.286,1.091,86.592,0.031,0,114567680,1716566
2310656000,131218812928,47886336,1241878528,11.239,1.280,87.043,0.437,0,133819460,1959528
2391298048,131138170880,47886336,1241878528,12.446,1.587,85.968,0,0,152497276,2135172
2418204672,131111264256,47886336,1241878528,12.145,0.687,87.168,0,0,173108628,2491198
2455937024,131073531904,47886336,1241878528,12.897,1.495,85.607,0,0,195369128,2665088
2475188224,131054272512,47894528,1241878528,13.142,0.747,86.079,0.031,0,201259826,2829140
2704564224,130824896512,47894528,1241878528,12.175,0.782,87.042,0,0,201357387,2853136
2982678528,130546774016,47902720,1241878528,12.932,1.028,85.977,0.062,0,201289027,2898646
3000528896,130528919552,47902720,1241882624,12.781,0.935,86.284,0,0,201300200,2896378
3337306112,130192142336,47902720,1241882624,12.578,1.030,86.392,0,0,201273416,2978326
3356041216,130173394944,47910912,1241886720,12.512,1.279,86.115,0.094,0,201444302,2983988
3753799680,129775636480,47910912,1241886720,12.391,0.872,86.737,0,0,201104992,3035338
3777077248,129752358912,47910912,1241886720,12.719,0.812,86.469,0,0,201591746,3066768
4156747776,129372684288,47910912,1241890816,13.048,0.870,86.083,0,0,201399182,3055032
4279803904,129249628160,47910912,1241890816,11.970,0.998,87.032,0,0,201467680,3071898
4310151168,129219264512,47919104,1241899008,12.652,1.093,86.254,0,0,201332978,3123176
4626485248,128902930432,47919104,1241899008,13.172,0.932,85.896,0,0,201385280,3163294
4883431424,128645984256,47919104,1241899008,12,0.781,87.219,0,0,201470698,3246942
4903927808,128625487872,47919104,1241899008,13.052,0.777,86.172,0,0,200261514,3234644
4911792128,128617623552,47919104,1241899008,12.266,0.749,86.985,0,0,202295322,3246252
4929998848,128599404544,47927296,1241899008,12.884,0.931,86.153,0.031,0,201306948,3275442
4945469440,128583925760,47927296,1241907200,13.377,0.807,85.816,0,0,201473384,3291548
4962656256,128566738944,47927296,1241907200,11.895,0.812,87.293,0,0,201190480,3356812
4980551680,128548843520,47927296,1241907200,13.580,0.901,85.519,0,0,201357086,3388874
4998242304,128531152896,47927296,1241907200,12.597,0.809,86.594,0,0,201217796,3419186
5015072768,128514306048,47935488,1241915392,13.809,0.834,85.326,0.031,0,201258526,3436692
5030187008,128499191808,47935488,1241915392,12.769,0.779,86.453,0,0,201310512,3508052
5054832640,128474533888,47943680,1241919488,12.688,0.719,86.562,0.031,0,201346212,3526160
5076480000,128452882432,47943680,1241923584,13.331,1.181,85.488,0,0,201560818,3530214
5094035456,128435326976,47943680,1241923584,12.911,1.055,86.034,0,0,201403540,3533606
5111623680,128417730560,47951872,1241923584,13.921,0.872,85.145,0.062,0,201206178,3497768
5340835840,128188608512,47951872,1241915392,14.041,0.998,84.961,0,0,201402838,3584168
5662441472,127866994688,47951872,1241923584,13.160,1.986,84.854,0,0,201533722,3616476
6402277376,127127158784,47951872,1241923584,12.449,1.556,85.994,0,0,201280364,3616662
6783848448,126745587712,47951872,1241923584,12.827,2.024,85.149,0,0,201475314,3585052
6938460160,126590959616,47960064,1241923584,13.234,1.771,84.964,0.031,0,201316652,3673469
7100588032,126428831744,47960064,1241923584,13.827,1.059,85.114,0,0,201131714,3724244
8283525120,125245890560,47960064,1241927680,11.288,1.590,86.841,0.281,0,201614744,3667808
9117192192,124412215296,47968256,1241927680,12.449,1.214,86.275,0.062,0,201403290,3819291
9126842368,124402561024,47968256,1241931776,12.723,0.875,86.402,0,0,201543504,3802606
9134391296,124394995712,47976448,1241935872,11.624,0.935,87.442,0,0,201333578,3782666
9316237312,124213149696,47976448,1241935872,14.578,3.784,81.607,0.031,0,201562484,3773140
9317773312,124211609600,47976448,1241939968,12.088,0.932,86.979,0,0,201251270,3840498
9357721600,124171628544,47976448,1241939968,13.988,1.430,84.582,0,0,201196172,3833750
9363103744,124166246400,47976448,1241939968,11.494,0.626,87.880,0,0,201616552,3949930
9366970368,124162379776,47984640,1241931776,12.965,0.812,86.161,0.062,0,201313861,3956192
9378762752,124150575104,47984640,1241944064,13.447,0.714,85.839,0,0,201142001,3946524
9491644416,124037693440,47984640,1241944064,13.743,2.150,84.107,0,0,201397818,3920492
9665474560,123863863296,47984640,1241944064,11.891,3.308,84.800,0,0,201194122,3898260
9665265664,123864072192,47984640,1241944064,12.052,0.685,87.263,0,0,201364078,3979404
9668890624,123860430848,47992832,1241948160,14.259,0.868,84.873,0,0,201403820,4001708
9677889536,123851431936,47992832,1241948160,11.938,0.868,87.194,0,0,201270054,4015766
9689399296,123839922176,47992832,1241948160,13.377,0.745,85.847,0.031,0,201734102,3989112
9699143680,123830177792,47992832,1241948160,14.109,0.837,85.054,0,0,201228324,4100791
9710272512,123819040768,47992832,1241956352,12.943,0.622,86.434,0,0,201319116,4096262
9718566912,123810738176,48001024,1241956352,11.787,0.686,87.496,0.031,0,201380132,4122870
9728688128,123800616960,48001024,1241956352,13.666,0.811,85.523,0,0,201630728,4086634
9736302592,123793002496,48001024,1241956352,12.753,0.747,86.501,0,0,201248626,4103692
9743745024,123785555968,48001024,1241960448,13.319,0.717,85.964,0,0,201373014,4073835
9754816512,123774484480,48001024,1241960448,12.628,0.778,86.594,0,0,201413636,4157994
9767100416,123762192384,48009216,1241960448,13.702,0.718,85.549,0.031,0,201225360,4206424
9771737088,123757547520,48009216,1241968640,12.966,0.871,86.163,0,0,201349202,4132222
9779986432,123749298176,48009216,1241968640,13.773,0.990,85.237,0,0,201697520,4146474
9791930368,123737354240,48009216,1241968640,12.434,0.935,86.631,0,0,201311526,4232794
9803157504,123726127104,48009216,1241968640,14.485,1.207,84.308,0,0,201345350,4207052
9810784256,123718471680,48017408,1241976832,13.292,1.092,85.585,0.031,0,201253056,4293940
9819602944,123709652992,48017408,1241976832,13.329,1.064,85.607,0,0,201400282,4266910
9821802496,123707453440,48017408,1241976832,14.043,1.268,84.689,0,0,201051122,4226884
9826373632,123702882304,48017408,1241976832,13.058,1.218,85.723,0,0,201628890,4234642
9828966400,123700277248,48025600,1241980928,13.877,0.996,85.096,0.031,0,201094776,4228375
9845469184,123683774464,48033792,1241972736,16.449,1.682,81.838,0.031,0,201606212,4231597
9852751872,123676483584,48033792,1241980928,16.182,1.000,82.818,0,0,201536446,4295848
9857134592,123672096768,48033792,1241985024,14.165,1.407,84.428,0,0,201184772,4359115
9867538432,123661692928,48033792,1241985024,14.419,0.965,84.335,0.280,0,201166912,4305155
9878237184,123650977792,48033792,1241985024,13.273,0.874,85.853,0,0,201618042,4415232
9883979776,123645235200,48041984,1241976832,14.174,1.121,84.673,0.031,0,201305552,4410746
9896230912,123632967680,48041984,1241993216,14.949,0.934,84.117,0,0,201402184,4410236
9909063680,123620134912,48041984,1241993216,12.802,0.816,86.382,0,0,201449388,4522558
9918517248,123610681344,48041984,1241993216,14.286,1.248,84.467,0,0,201268982,4413892
9955975168,123573219328,48041984,1241997312,13.192,1.219,85.589,0,0,201067154,4399496
10117865472,123411320832,48050176,1241997312,16.282,2.464,81.223,0.031,0,201787992,4494900
10622840832,122906279936,48050176,1241997312,15.915,2.269,81.815,0,0,201344200,4435656
10693980160,122835136512,48050176,1242001408,17.474,2.235,80.292,0,0,201149304,4470338
10705285120,122823827456,48050176,1242005504,14.396,0.958,84.646,0,0,201340952,4462148
10713706496,122815406080,48050176,1242005504,15.006,0.996,83.998,0,0,201432670,4459690
10717704192,122811408384,48058368,1241997312,13.810,1.213,84.946,0.031,0,201405142,4533350
10798329856,122730770432,48058368,1242009600,13.354,2.298,84.348,0,0,201376922,4588656
10837630976,122691469312,48058368,1242009600,14.223,1.560,84.217,0,0,201413888,4613414
10944163840,122584936448,48058368,1242009600,14.118,2.043,83.839,0,0,201337832,4555632
11048341504,122480754688,48058368,1242013696,14.357,2.377,83.266,0,0,198818596,4559770
11146715136,122382217216,48066560,1242148864,13.396,2.243,84.330,0.031,0,200969194,4635744
11220017152,122308915200,48066560,1242148864,12.594,2.036,85.370,0,0,201584598,4637800
11327041536,122201886720,48066560,1242152960,14.732,2.122,83.146,0,0,200957226,4683360
11434745856,122094182400,48066560,1242152960,13.298,1.993,84.709,0,0,201660872,4720826
11555889152,121973039104,48066560,1242152960,14.281,2.183,83.536,0,0,201175658,4674614
11637559296,121891364864,48074752,1242148864,14.210,1.613,84.114,0.062,0,201496996,4728054
11766620160,121762295808,48074752,1242157056,13.065,1.633,85.302,0,0,201141638,4686910
11888934912,121639976960,48074752,1242161152,13.864,1.834,84.302,0,0,201798602,4698234
11979780096,121549086720,48074752,1242165248,15.005,1.678,83.318,0,0,201099470,4653396
12075405312,121453461504,48082944,1242157056,12.915,1.411,85.643,0.031,0,201134538,4678880
12201709568,121327140864,48091136,1242165248,12.966,1.723,85.280,0.031,0,201445304,4815592
12274798592,121254047744,48091136,1242169344,13.210,1.405,85.384,0,0,201674980,4767878
12403445760,121125396480,48091136,1242173440,15.186,1.434,83.380,0,0,201418948,4827506
12492906496,121035935744,48091136,1242173440,13.607,1.345,85.048,0,0,201387354,4797294
12619845632,120908992512,48091136,1242177536,13.670,2.139,84.191,0,0,201188966,4900302
12711587840,120817242112,48099328,1242177536,13.182,1.745,85.042,0.031,0,201706814,4888748
12844957696,120683872256,48099328,1242177536,15.179,1.970,82.851,0,0,201163068,4824402
12942897152,120585924608,48099328,1242185728,14.062,1.284,84.654,0,0,201568947,4858828
13034786816,120494034944,48099328,1242185728,14.042,1.429,84.529,0,0,201455573,4899242
13174439936,120354377728,48099328,1242189824,13.087,1.972,84.753,0.188,0,201140398,4983222
13269045248,120259760128,48107520,1242193920,13.271,1.651,85.047,0.031,0,201528832,4955398
13366071296,120162734080,48107520,1242193920,13.961,1.275,84.764,0,0,201244950,4928594
13501239296,120027566080,48107520,1242193920,14.335,1.252,84.413,0,0,201425665,4998760
13598060544,119930744832,48107520,1242193920,15.339,1.431,83.230,0,0,201407923,5015948
13693259776,119835541504,48107520,1242198016,13.431,1.861,84.708,0,0,201433440,4970790
13785165824,119743623168,48115712,1242202112,13.766,1.740,84.462,0.031,0,201430504,4939016
13909123072,119619661824,48115712,1242206208,13.555,2.295,84.150,0,0,201374836,5024162
14007721984,119521062912,48115712,1242206208,13.696,1.126,85.178,0,0,201392326,4999414
14106480640,119422300160,48115712,1242210304,13.578,1.588,84.833,0,0,201314870,5162256
14208397312,119320383488,48115712,1242210304,13.545,1.895,84.560,0,0,201381902,5111498
14309277696,119219494912,48123904,1242210304,13.899,1.555,84.515,0.031,0,200629075,5099814
14411431936,119117262848,48123904,1242214400,14.446,1.339,84.215,0,0,201634748,5118174
14513065984,119015624704,48123904,1242218496,14.062,1.344,84.594,0,0,200168923,5098908
14618832896,118909857792,48123904,1242218496,13.945,1.828,84.227,0,0,202528132,5107392
14726508544,118802178048,48123904,1242222592,14.864,1.776,83.359,0,0,201254308,5077768
14843797504,118684872704,48132096,1242222592,14.312,2.120,83.536,0.031,0,201409987,5064018
14993305600,118535364608,48132096,1242222592,14.943,1.771,83.287,0,0,201436685,5116774
15095517184,118433148928,48132096,1242226688,13.394,1.851,84.755,0,0,201525996,5156218
15201427456,118327234560,48132096,1242230784,13.966,1.742,84.292,0,0,201160090,5161076
15293915136,118234730496,48144384,1242234880,13.806,1.772,84.328,0.093,0,201293820,5199116
15398731776,118129905664,48152576,1242234880,13.900,1.506,84.562,0.031,0,201514004,5207322
15506538496,118022098944,48152576,1242234880,13.313,1.617,85.070,0,0,199192484,5178970
15626240000,117902397440,48152576,1242234880,14.281,1.987,83.732,0,0,201670040,5185152
15690395648,117838237696,48152576,1242238976,13.546,1.092,85.362,0,0,201169174,5069990
15803482112,117725151232,48152576,1242238976,14.027,1.468,84.505,0,0,201253970,5146052
15915384832,117613232128,48160768,1242247168,13.793,2.081,84.094,0.031,0,201406920,5223258
16026902528,117501710336,48160768,1242247168,13.983,1.685,84.332,0,0,201454384,5316876
16146845696,117381763072,48160768,1242251264,14.166,1.553,84.281,0,0,201352372,5291137
16263483392,117265125376,48160768,1242251264,13.581,2.171,84.248,0,0,201328338,5278394
16382947328,117145661440,48160768,1242251264,14.450,1.274,84.276,0,0,201356304,5292822
16498642944,117029957632,48168960,1242251264,13.700,1.783,84.454,0.063,0,201331476,5306618
16563204096,116965388288,48168960,1242259456,13.840,1.122,85.037,0,0,201711674,5172718
16652832768,116875755520,48168960,1242263552,14.046,1.740,84.214,0,0,201345060,5270634
16770994176,116757594112,48168960,1242263552,14.044,2.158,83.797,0,0,201308025,5341266
16883691520,116644896768,48168960,1242263552,13.407,1.633,84.961,0,0,201483449,5373326
16990810112,116537765888,48177152,1242267648,14.210,1.506,84.159,0.125,0,201423174,5383049
17103728640,116424847360,48177152,1242267648,13.719,2.031,84.250,0,0,201541820,5390160
17214332928,116314243072,48177152,1242267648,13.688,1.250,85.062,0,0,201052780,5404450
17326108672,116202463232,48177152,1242271744,13.381,1.552,85.067,0,0,201569126,5474252
17394343936,116134227968,48177152,1242271744,13.484,1.098,85.419,0,0,201454342,5475182
17507725312,116020830208,48185344,1242275840,14.134,1.685,83.994,0.187,0,201382048,5474276
17621757952,115906793472,48185344,1242279936,15.091,1.394,83.514,0,0,201196368,5472244
17746112512,115782434816,48185344,1242284032,14.330,2.052,83.618,0,0,201382110,5494132
17810751488,115717795840,48185344,1242284032,14.166,1.619,84.215,0,0,201459584,5480678
17936355328,115592187904,48185344,1242288128,14.214,2.213,83.572,0,0,201478432,5518432
18054950912,115473539072,48193536,1242292224,14.295,1.779,83.895,0.031,0,201341370,5575162
18121199616,115407290368,48193536,1242292224,11.985,1.092,86.923,0,0,201270830,5621304
18258608128,115269877760,48193536,1242296320,14.121,1.562,84.317,0,0,201758554,5612042
18387902464,115140583424,48193536,1242296320,14.727,1.404,83.869,0,0,200928738,5540638
18464137216,115064344576,48193536,1242300416,13.419,1.501,85.080,0,0,201738432,5601166
18590937088,114937532416,48201728,1242304512,13.983,1.748,84.207,0.062,0,201430018,5604816
18725847040,114802614272,48209920,1242304512,11.943,1.653,86.342,0.062,0,201129216,5598728
18793984000,114734473216,48209920,1242308608,14.129,1.375,84.495,0,0,201463104,5621704
18929590272,114598834176,48209920,1242308608,13.926,2.106,83.967,0,0,201337079,5689810
19003052032,114525372416,48209920,1242308608,14.460,1.283,84.257,0,0,201558443,5698326
19128877056,114399531008,48218112,1242316800,14.371,2.281,83.318,0.031,0,201099752,5671880
19203747840,114324660224,48218112,1242316800,12.283,1.795,85.922,0,0,201846134,5695066
19344015360,114184388608,48218112,1242320896,14.188,2.018,83.794,0,0,201241982,5692918
19419557888,114108846080,48218112,1242320896,14.281,1.366,84.353,0,0,201448190,5691638
19560058880,113968340992,48218112,1242324992,13.913,1.665,84.422,0,0,201709788,5711836
19629170688,113899220992,48226304,1242324992,11.946,1.092,86.931,0.031,0,201017834,5738300
19768291328,113760092160,48226304,1242333184,14.734,1.772,83.494,0,0,201501364,5717416
19847192576,113681190912,48226304,1242333184,14.067,1.622,84.311,0,0,201317600,5693074
19997687808,113530695680,48226304,1242333184,14.024,2.482,83.494,0,0,201333418,5642672
20075716608,113452662784,48226304,1242337280,12.209,1.180,86.611,0,0,201498322,5676798
20209197056,113319182336,48234496,1242329088,14.643,1.467,83.734,0.156,0,201027777,5666948
20298649600,113229713408,48234496,1242345472,14.005,2.183,83.780,0.031,0,201793985,5694718
20376514560,113151848448,48234496,1242345472,11.717,0.971,87.312,0,0,201011208,5679134
20530298880,112998060032,48234496,1242349568,14.669,1.498,83.833,0,0,201905968,5658700
20624019456,112904335360,48234496,1242353664,14.344,1.341,84.316,0,0,201467874,5688746
20706783232,112821563392,48242688,1242353664,12.095,0.935,86.908,0.062,0,201206186,5702622
20852428800,112675913728,48242688,1242357760,14.814,1.441,83.746,0,0,201570606,5698580
20933738496,112594604032,48242688,1242357760,14.103,1.401,84.496,0,0,201247839,5668980
21080391680,112447946752,48242688,1242361856,13.091,1.990,84.919,0,0,201564991,5686480
21155930112,112372408320,48242688,1242361856,13.790,1.363,84.847,0,0,201076564,5613638
21234249728,112294072320,48250880,1242370048,14.392,1.430,84.147,0.031,0,201655124,5650486
21378928640,112149393408,48250880,1242370048,14.063,2.178,83.759,0,0,201132150,5606556
21447036928,112081285120,48250880,1242370048,12.046,1.521,86.433,0,0,201362748,5708686
21603328000,111924989952,48250880,1242374144,14.237,2.404,83.359,0,0,201287934,5651984
21696487424,111831830528,48267264,1242357760,14.684,1.735,83.364,0.217,0,201321670,5696538
21774794752,111753490432,48275456,1242382336,12.163,1.396,86.410,0.031,0,201182618,5739794
21867380736,111660904448,48283648,1242374144,14.170,2.523,83.245,0.062,0,201580172,5709390
22038286336,111489986560,48283648,1242386432,14.525,2.483,82.992,0,0,201333100,5655394
22128930816,111399342080,48283648,1242386432,11.998,1.371,86.631,0,0,201484444,5716176
22230827008,111297441792,48283648,1242390528,14.767,1.062,84.171,0,0,201046988,5626072
22321070080,111207178240,48291840,1242398720,11.573,1.501,86.894,0.031,0,201489750,5679756
22455902208,111072346112,48291840,1242398720,14.486,1.931,83.583,0,0,201475200,5666924
22577774592,110950465536,48291840,1242406912,14.419,2.206,83.375,0,0,201418762,5614298
22631890944,110896349184,48291840,1242406912,12.403,1.274,86.323,0,0,200483548,5622660
22783377408,110744858624,48291840,1242411008,15.171,2.181,82.648,0,0,202372319,5628066
22872330240,110655893504,48300032,1242415104,14.739,1.275,83.924,0.062,0,201621773,5675464
22953172992,110575050752,48300032,1242415104,11.920,1.556,86.523,0,0,201071069,5739744
23038590976,110489628672,48300032,1242419200,14.188,1.469,84.344,0,0,201557071,5655512
23208685568,110319534080,48300032,1242419200,14.228,2.251,83.521,0,0,201428982,5629170
23294480384,110233735168,48300032,1242423296,12.275,1.243,86.482,0,0,200934224,5699420
23375433728,110152769536,48308224,1242427392,14.841,1.431,83.665,0.062,0,201661304,5682886
23537971200,109990223872,48308224,1242435584,12.446,2.576,84.823,0.155,0,201398822,5712730
23612547072,109915648000,48308224,1242435584,14.157,1.715,84.128,0,0,201261266,5698200
23702581248,109825613824,48308224,1242435584,14.362,1.690,83.949,0,0,201394368,5655582
23786651648,109741539328,48308224,1242439680,11.835,1.252,86.913,0,0,201548920,5698072
23945908224,109582282752,48316416,1242431488,15.215,2.178,82.576,0.031,0,201402330,5668178
24047816704,109480361984,48316416,1242443776,14.649,1.676,83.426,0.248,0,201505962,5634746
24137408512,109390770176,48316416,1242443776,12.682,1.085,86.233,0,0,201400820,5674406
24232992768,109295177728,48316416,1242451968,14.699,2.206,83.095,0,0,201266348,5608218
24315875328,109212295168,48316416,1242451968,12.279,1.119,86.602,0,0,195172450,5695588
24478863360,109049307136,48324608,1242443776,14.477,2.184,83.307,0.031,0,172263059,5429110
24560558080,108967587840,48332800,1242456064,14.943,1.544,83.359,0.154,0,150810311,5291806
24638578688,108889567232,48332800,1242456064,11.818,1.489,86.694,0,0,128481924,5169020
24718098432,108810002432,48332800,1242460160,13.920,1.436,84.644,0,0,106688540,4972164
24793034752,108734918656,48332800,1242468352,11.374,1.433,87.192,0,0,87498940,4805754
24950341632,108577611776,48340992,1242460160,14.424,1.807,83.738,0.031,0,68138500,4617666
25020592128,108507340800,48349184,1242472448,14.076,0.687,85.175,0.062,0,46886218,4443200
25077727232,108450201600,48353280,1242472448,11.488,1.027,87.235,0.249,0,26017074,4258076
25132404736,108395511808,48353280,1242480640,13.964,0.751,85.285,0,0,5983982,4123916
25241391104,108286525440,48353280,1242480640,11.713,1.371,86.916,0,0,18114,3841416
25278988288,108248911872,48361472,1242484736,13.822,1.123,84.992,0.062,0,18054,4029114
25301725184,108226174976,48361472,1242484736,14.188,0.965,84.848,0,0,19228,3988452
25342582784,108185305088,48369664,1242488832,11.690,1.234,86.552,0.524,0,19380,4110680
25377857536,108150030336,48369664,1242488832,13.719,0.875,85.406,0,0,19132,4099922
25404948480,108122931200,48369664,1242492928,11.695,0.467,87.838,0,0,20962,4091192
2155610112,131372126208,48377856,1242628096,10.653,1.312,88.004,0.031,0,13246,2452772
2147176448,131380559872,48377856,1242628096,0.031,0,99.969,0,0,866,0
2147008512,131380948992,48386048,1242398720,0,0,99.375,0.625,0,1038,0
2146742272,131381207040,48386048,1242406912,0,0,100,0,0,874,0
2146742272,131381207040,48386048,1242406912,0,0.031,99.969,0,0,346,0
2150518784,131377430528,48386048,1242406912,0,0,100,0,0,752,0
2150506496,131377430528,48398336,1242406912,0,0,99.937,0.063,0,346,0
2150248448,131377688576,48398336,1242406912,0,0,100,0,0,588,0
2150248448,131377688576,48398336,1242406912,0,0,100,0,0,692,148
2150248448,131377688576,48398336,1242406912,0,0,100,0,0,346,0
2150248448,131377688576,48398336,1242406912,0,0,100,0,0,580,0
2150023168,131377840128,48398336,1242406912,0,0,100,0,0,874,1948
2150014976,131377840128,48406528,1242406912,0,0,99.969,0.031,0,3772,1508
2150014976,131377840128,48406528,1242406912,0,0.031,99.969,0,0,7076,550
2149552128,131378302976,48406528,1242406912,0,0,100,0,0,982,550
2151002112,131376852992,48406528,1242406912,0,0,100,0,0,226,0
2150682624,131377172480,48406528,1242406912,0,0,100,0,0,806,0
2150424576,131377430528,48406528,1242406912,0,0,100,0,0,242,0
2150416384,131377430528,48414720,1242406912,0,0,99.937,0.063,0,466,0
2192928768,131333017600,48431104,1242873856,1.437,0.656,97.876,0.031,0,401478,32000
2172956672,131352674304,48431104,1242427392,0.094,0,99.906,0,0,3258,15458
