172.16.97.1  : 13.20 10.26 10.28 10.24 10.26 10.30 10.29 10.28 10.24 10.24
172.16.97.16 : 20.47 10.27 10.28 10.24 10.24 10.27 10.26 10.28 10.28 10.23
172.16.97.23 : 0.18 0.20 0.21 0.10 0.17 0.19 0.20 0.20 0.20 0.17
172.16.97.24 : 0.21 0.20 0.17 0.17 0.19 0.19 0.19 0.19 0.20 0.19
172.16.97.25 : 0.03 0.03 0.03 0.03 0.01 0.03 0.03 0.01 0.01 0.03
172.16.97.26 : 0.19 0.20 0.20 0.16 0.20 0.17 0.21 0.19 0.19 0.19
172.16.97.27 : 100.27 100.27 100.28 100.31 100.33 100.32 100.31 100.31 100.31 100.26
172.16.97.28 : 100.27 100.29 100.29 100.30 100.30 100.30 100.29 100.32 100.31 100.27
172.16.97.3  : - 100.30 100.29 100.24 100.28 100.30 100.28 100.25 100.27 100.28
172.16.97.4  : 100.28 100.27 100.31 100.29 100.27 100.28 100.28 100.30 100.27 100.23
172.16.97.5  : 100.21 100.29 - 100.26 100.30 100.27 100.26 100.26 100.23 100.25
172.16.97.6  : 100.28 100.23 100.26 100.26 100.27 100.28 100.25 100.29 100.28 100.28
172.16.97.7  : 100.22 100.27 100.28 100.26 100.27 100.27 100.28 100.30 100.28 100.24
172.16.97.8  : 100.21 100.26 100.26 100.26 100.25 100.28 100.27 100.28 100.25 100.20
172.16.97.9  : 4.25 4.30 4.27 4.30 4.30 4.29 4.30 4.21 4.24 4.27

      15 targets
      15 alive
       0 unreachable
       0 unknown addresses

       2 timeouts (waiting for response)
     150 ICMP Echos sent
     148 ICMP Echo Replies received
       0 other ICMP received

 0.01 ms (min round trip time)
 54.6 ms (avg round trip time)
 100 ms (max round trip time)
       10.113 sec (elapsed real time)

