172.16.66.55 : 14.64 10.28 10.30 10.28 10.28 - 10.30 - 10.37 10.33
172.16.66.56 : 17.59 10.29 10.37 10.27 10.39 10.37 10.39 10.30 10.29 10.27
172.16.66.57 : 0.04 0.02 0.03 0.03 0.03 0.01 0.03 0.01 0.03 0.03
172.16.66.58 : 0.22 0.20 0.22 0.24 0.22 0.20 0.16 0.21 0.23 0.13
172.16.66.59 : 0.26 0.21 0.22 0.23 0.23 0.22 0.23 0.22 0.23 0.23
172.16.66.6  : 0.25 0.19 0.17 0.21 0.20 0.20 0.19 0.22 0.20 0.20
172.16.66.60 : 0.26 0.20 0.18 0.17 0.18 0.18 0.17 0.18 0.18 0.17
172.16.66.61 : 0.13 0.16 0.24 0.22 0.17 0.22 0.22 0.20 0.22 0.23
172.16.66.62 : 0.17 0.24 0.22 0.22 0.20 0.22 0.24 0.23 0.22 0.21
172.16.66.64 : 0.19 0.22 0.22 0.24 0.22 0.21 0.22 0.22 0.22 0.23
172.16.66.65 : 0.17 0.22 0.25 0.22 0.22 0.17 0.21 0.17 0.23 0.20
172.16.66.66 : 0.21 0.22 0.18 0.23 0.22 0.23 0.23 0.22 0.21 0.23
172.16.66.67 : 0.17 0.23 0.22 0.24 0.16 0.23 0.24 0.21 0.24 0.23
172.16.66.69 : 0.18 0.24 0.23 0.22 0.22 0.23 0.22 0.22 0.21 0.22
172.16.66.7  : 11.00 10.40 10.37 10.38 10.38 10.36 10.39 10.37 10.38 10.39
172.16.66.70 : 11.03 10.39 10.37 10.37 10.39 10.36 10.38 10.36 10.34 -
172.16.66.71 : 10.87 10.37 10.29 10.37 10.32 10.30 10.37 10.36 10.37 10.38
172.16.66.72 : 11.15 10.32 10.33 10.33 10.35 10.32 10.32 10.31 10.34 10.34
172.16.66.73 : 11.08 10.38 10.37 10.27 10.37 10.36 10.35 10.38 10.36 10.38
172.16.66.74 : 11.10 10.37 10.39 10.37 10.38 10.35 10.34 10.39 10.36 10.32
172.16.66.75 : 11.13 10.36 10.36 10.35 10.36 10.39 10.37 10.34 10.38 -
172.16.66.76 : 11.06 10.35 10.38 10.29 10.29 10.30 10.33 - 10.31 -
172.16.66.77 : 11.09 10.37 10.38 10.37 10.37 10.35 10.38 10.34 10.40 10.36
172.16.66.78 : 10.76 10.30 10.31 10.30 10.30 10.31 10.31 10.30 10.39 10.44
172.16.66.79 : - 10.39 10.40 10.38 10.30 10.36 10.39 10.35 10.39 10.36
172.16.66.8  : 15.06 10.33 10.24 10.31 10.30 10.32 10.27 10.30 10.31 10.28
172.16.66.80 : 11.16 4.33 4.31 4.30 4.32 4.32 4.40 4.32 4.32 4.33

      27 targets
      27 alive
       0 unreachable
       0 unknown addresses

       5 timeouts (waiting for response)
     270 ICMP Echos sent
     263 ICMP Echo Replies received
       0 other ICMP received

 0.01 ms (min round trip time)
 5.59 ms (avg round trip time)
 17.5 ms (max round trip time)
       10.257 sec (elapsed real time)

