172.16.66.55 : 17.27 10.37 10.29 10.32 10.34 10.29 10.29 10.33 10.33 10.33
172.16.66.56 : 11.15 10.34 10.28 10.30 10.30 10.25 10.29 10.27 10.30 10.28
172.16.66.57 : 0.23 0.22 0.22 0.22 0.23 0.22 0.22 0.20 0.22 0.22
172.16.66.58 : 0.23 0.24 0.20 0.22 0.19 0.22 0.20 0.23 0.23 0.22
172.16.66.59 : 0.04 0.05 0.04 0.04 0.05 0.05 0.05 0.07 0.05 0.05
172.16.66.6  : 0.26 0.16 0.21 0.23 0.22 0.22 0.22 0.13 0.24 0.22
172.16.66.60 : 0.24 0.23 0.22 0.22 0.23 0.22 0.20 0.20 0.20 0.19
172.16.66.61 : 0.24 0.23 0.23 0.23 0.22 0.22 0.22 0.22 0.24 0.23
172.16.66.62 : 0.19 0.20 0.21 0.22 0.20 0.19 0.21 0.22 0.23 0.22
172.16.66.64 : 0.26 0.22 0.20 0.22 0.21 0.20 0.22 0.20 0.22 0.22
172.16.66.65 : 0.16 0.22 0.22 0.15 0.06 0.12 0.22 0.12 0.23 0.22
172.16.66.66 : 0.14 0.24 0.16 0.22 0.23 0.23 0.23 0.24 0.23 0.23
172.16.66.67 : 0.20 0.22 0.22 0.22 0.22 0.23 0.23 0.22 0.20 0.22
172.16.66.69 : 0.15 0.23 0.23 0.26 0.23 0.24 0.26 0.24 0.23 0.22
172.16.66.7  : 11.07 10.35 10.35 10.37 10.37 10.34 10.36 10.36 10.37 10.32
172.16.66.70 : 10.65 10.27 10.28 10.33 10.34 10.34 10.34 10.35 10.35 10.35
172.16.66.71 : 10.64 10.37 10.38 10.37 10.37 10.33 10.33 10.30 10.30 10.31
172.16.66.72 : 14.09 10.36 10.39 10.36 10.38 10.38 10.37 10.32 10.38 10.35
172.16.66.73 : 11.14 10.38 10.36 10.37 10.39 10.37 10.36 10.35 10.35 10.31
172.16.66.74 : 10.97 10.33 10.32 10.31 10.31 10.30 10.30 10.36 10.39 10.39
172.16.66.75 : 11.14 10.37 10.38 10.38 10.37 10.36 10.37 10.36 10.31 10.30
172.16.66.76 : 11.12 10.35 10.38 10.34 10.36 10.37 10.36 10.37 10.36 10.36
172.16.66.77 : 15.56 10.33 10.32 10.33 10.29 10.34 10.35 10.26 10.25 10.25
172.16.66.78 : 11.11 10.36 10.38 10.38 10.32 10.38 10.38 - 10.33 10.32
172.16.66.79 : 11.13 10.38 10.37 10.38 10.34 10.26 10.28 10.31 10.33 10.37
172.16.66.8  : 11.09 10.37 10.37 - 10.34 10.35 10.35 10.34 10.36 10.35
172.16.66.80 : 11.12 4.42 4.40 4.39 4.35 4.35 4.35 4.36 4.39 4.36

      27 targets
      27 alive
       0 unreachable
       0 unknown addresses

       2 timeouts (waiting for response)
     270 ICMP Echos sent
     268 ICMP Echo Replies received
       0 other ICMP received

 0.04 ms (min round trip time)
 5.68 ms (avg round trip time)
 17.2 ms (max round trip time)
       10.266 sec (elapsed real time)

