172.16.72.14 : 4.28 4.31 4.31 4.30 4.31 4.30 4.31 4.27 4.25 4.18
172.16.72.23 : 4.28 4.23 4.27 4.28 4.30 4.20 4.30 4.28 4.26 4.27
172.16.72.25 : 10.30 10.31 10.25 10.27 10.28 10.29 10.31 10.28 10.28 10.30
172.16.72.26 : 10.25 10.27 10.27 10.27 10.29 10.28 10.27 10.31 10.30 10.29
172.16.72.27 : 10.30 10.31 10.26 10.27 10.30 10.29 10.32 10.29 10.25 10.29
172.16.72.28 : 10.30 10.28 10.28 10.27 10.28 10.29 10.30 10.29 10.29 10.23
172.16.72.29 : 10.28 10.27 10.26 10.28 10.30 10.29 10.28 10.26 10.26 10.22
172.16.72.3  : 10.20 10.25 - 10.26 10.25 10.29 10.27 10.26 10.28 10.30
172.16.72.30 : - 10.29 10.25 10.26 10.26 - - 10.25 10.27 10.27
172.16.72.31 : 10.32 10.26 10.28 10.29 10.31 10.28 10.28 10.27 - 10.24
172.16.72.32 : 10.28 10.20 10.28 10.27 10.27 10.25 10.29 10.28 10.27 10.30
172.16.72.33 : 10.27 - 10.28 10.25 10.27 10.29 10.27 - 10.29 10.26
172.16.72.34 : 10.31 10.23 10.22 10.21 - 10.23 10.24 10.24 10.20 10.25
172.16.72.35 : 10.27 10.24 10.30 10.29 10.29 10.29 10.28 10.26 10.26 10.24
172.16.72.36 : 10.26 10.25 10.30 10.24 10.23 10.23 10.28 - 10.28 10.26
172.16.72.37 : 10.30 10.24 10.30 10.27 10.29 10.28 10.27 10.25 10.24 10.28
172.16.72.38 : 10.24 10.25 10.26 10.25 10.27 10.19 10.11 10.18 10.26 10.24
172.16.72.39 : 10.30 10.27 10.25 10.25 10.32 10.28 10.15 10.25 10.14 10.24
172.16.72.4  : 0.16 0.19 0.18 0.19 0.16 0.16 0.16 0.17 0.13 0.15
172.16.72.40 : 0.15 0.15 0.19 0.16 0.16 0.17 0.19 0.18 0.12 0.17
172.16.72.41 : 0.16 0.16 0.20 0.17 0.19 0.15 0.13 0.17 0.13 0.21
172.16.72.42 : 0.18 0.18 0.19 0.22 0.20 0.13 0.19 0.14 0.15 0.15
172.16.72.43 : 0.20 0.20 0.20 0.17 0.23 0.16 0.11 0.18 0.15 0.15
172.16.72.44 : 0.20 0.19 0.20 0.16 0.18 0.17 0.17 0.20 0.19 0.18
172.16.72.46 : 0.19 0.20 0.19 0.16 0.19 0.20 0.20 0.20 0.15 0.19
172.16.72.47 : 0.20 0.18 0.19 0.19 0.18 0.18 0.20 0.16 0.19 0.18
172.16.72.48 : 0.20 0.19 0.18 0.20 0.19 0.21 0.19 0.21 0.18 0.17
172.16.72.49 : 0.20 0.20 0.19 0.20 0.19 0.18 0.15 0.20 0.19 0.20
172.16.72.5  : 0.19 0.17 0.20 0.17 0.20 0.18 0.21 0.16 0.19 0.17
172.16.72.50 : 0.20 0.16 0.15 0.18 0.18 0.19 0.18 0.18 0.16 0.18
172.16.72.51 : 0.18 0.19 0.16 0.17 0.15 0.16 0.17 0.19 0.17 0.16
172.16.72.6  : 0.02 0.03 0.03 0.03 0.01 0.03 0.03 0.03 0.03 0.03
172.16.72.7  : 0.16 0.16 0.17 0.15 0.19 0.19 0.16 0.19 0.20 0.19
172.16.72.8  : 0.21 0.18 0.16 0.16 0.20 0.16 0.18 0.14 0.20 0.20
172.16.72.9  : 4.24 4.27 4.30 4.27 4.27 4.30 4.27 4.31 4.28 4.28

      35 targets
      35 alive
       0 unreachable
       0 unknown addresses

       6 timeouts (waiting for response)
     350 ICMP Echos sent
     341 ICMP Echo Replies received
       0 other ICMP received

 0.01 ms (min round trip time)
 5.00 ms (avg round trip time)
 10.3 ms (max round trip time)
       10.153 sec (elapsed real time)

