"Dstat 0.7.3 CSV output"
"Author:","Dag Wieers <dag@wieers.com>",,,,"URL:","http://dag.wieers.com/home-made/dstat/"
"Host:","grisou-23.nancy.grid5000.fr",,,,"User:","root"
"Cmdline:","dstat -m -c -n -o dstat.csv",,,,"Date:","27 May 2020 10:35:03 CEST"
"memory usage",,,,"total cpu usage",,,,,"net/total",
"used","free","buff","cach","usr","sys","idl","wai","stl","recv","send"
1736089600,101749534720,88813568,30361866240,0.312,0.147,99.429,0.112,0,0,0
1747816448,101737660416,88825856,30362025984,0.563,0.188,99.187,0.063,0,426198,15002
1744019456,101741699072,88825856,30361767936,0.750,0.594,98.657,0,0,397856,27020
1741553664,101744140288,88825856,30361767936,1.030,0.655,98.315,0,0,85540,15798
1741533184,101744148480,88838144,30361767936,0.031,0,99.625,0.344,0,26468,220
1745395712,101740277760,88838144,30361772032,1.063,0.719,98.124,0.094,0,438434,26570
1744023552,101741645824,88850432,30361759744,0.031,0,99.906,0.063,0,8892,264
1743753216,101741903872,88850432,30361772032,0.031,0,99.969,0,0,34476,0
1743753216,101741903872,88850432,30361772032,0,0,100,0,0,18630,0
1741414400,101744242688,88850432,30361772032,0.031,0.031,99.937,0,0,56048,0
1741402112,101744242688,88862720,30361772032,0.031,0,99.937,0.031,0,23514,0
1741144064,101744500736,88870912,30361763840,0,0,99.906,0.094,0,23420,0
1740877824,101744758784,88870912,30361772032,0,0,100,0,0,14722,496
1740619776,101745016832,88870912,30361772032,0,0.031,99.969,0,0,40978,0
1740619776,101745016832,88870912,30361772032,0.031,0.031,99.938,0,0,12246,0
1740103680,101745532928,88879104,30361763840,0.094,0.031,99.781,0.094,0,27192,0
1739042816,101746532352,88895488,30361772032,0,0.031,99.875,0.094,0,22618,0
1738289152,101747286016,88895488,30361772032,0,0,100,0,0,19584,0
1739689984,101745885184,88895488,30361772032,0.063,0.063,99.875,0,0,12866,6504
1738285056,101747290112,88895488,30361772032,1.125,0.594,98.281,0,0,388796,24002
1744064512,101741510656,88895488,30361772032,0.188,0.063,99.750,0,0,523944,8564
1741336576,101744173056,88907776,30361808896,0.469,0.469,98.968,0.094,0,396162,14232
1743466496,101741977600,88936448,30361821184,1.188,0.781,97.968,0.063,0,578840,34730
1740587008,101744857088,88936448,30361821184,0.062,0.031,99.906,0,0,140540,1236
1745321984,101740097536,88936448,30361821184,1.124,0.750,98.126,0,0,452228,26910
1745297408,101740122112,88936448,30361821184,0,0.094,99.093,0.813,0,116018,0
1746481152,101738655744,88948736,30362079232,1.249,0.656,98.001,0.094,0,470002,26554
1744736256,101740646400,88961024,30361821184,0.031,0.031,99.906,0.031,0,162692,0
1744093184,101741289472,88961024,30361821184,0.437,0.031,99.531,0,0,101218,0
1744842752,101740298240,88961024,30361968640,1.719,0.344,97.937,0,0,359674,11814
1744171008,101741113344,88961024,30361825280,0.063,0.031,99.906,0,0,96504,2668
1742848000,101742436352,88965120,30361821184,0,0.031,99.593,0.375,0,73286,0
1743216640,101742063616,88965120,30361825280,0.063,0.031,99.906,0,0,255748,5640
1741148160,101744111616,88977408,30361833472,0.593,0.156,99.189,0.062,0,285852,9380
1748320256,101736751104,88977408,30362025984,0.281,0.125,99.593,0,0,273724,21180
1748062208,101737009152,88977408,30362025984,0.063,0.031,99.906,0,0,97484,12936
1747795968,101737275392,88989696,30362013696,0,0.063,99.406,0.532,0,45716,13132
1747525632,101737533440,88989696,30362025984,0,0.031,99.969,0,0,29390,12740
1746821120,101738225664,89001984,30362025984,0.031,0.031,99.875,0.063,0,30198,13150
1746305024,101738741760,89001984,30362025984,0.031,0.031,99.937,0,0,86794,19352
1746292736,101738754048,89001984,30362025984,0.031,0.031,99.937,0,0,50332,13990
1745510400,101739528192,89010176,30362025984,0.031,0.031,99.562,0.375,0,161220,13600
1745252352,101739786240,89010176,30362025984,0.063,0.031,99.906,0,0,98560,13404
1744736256,101740302336,89010176,30362025984,0.031,0.031,99.937,0,0,118784,13846
1737031680,101748183040,89018368,30361841664,0.031,0.031,99.906,0.031,0,83956,7030
1735868416,101749342208,89018368,30361845760,0.313,0.125,99.562,0,0,348990,14848
1735860224,101749350400,89030656,30361833472,0.031,0,99.531,0.438,0,90244,936
1735622656,101749575680,89030656,30361845760,0,0.031,99.969,0,0,152512,0
1735102464,101750091776,89030656,30361849856,0,0.031,99.969,0,0,101602,0
1734586368,101750607872,89059328,30361821184,0.031,0,99.750,0.219,0,199688,168
1734840320,101750321152,89059328,30361849856,0,0,100,0,0,111352,0
1734574080,101750579200,89067520,30361849856,0.125,0.031,99.781,0.063,0,87720,390
1734057984,101751095296,89067520,30361849856,0.031,0,99.969,0,0,84412,780
1760632832,101724106752,89272320,30361968640,6.870,0.941,90.621,1.568,0,188598,106716
1773588480,101709873152,89718784,30362357760,2.692,0.313,94.742,2.254,0,97602,8006
1772240896,101711130624,89726976,30362439680,0.125,0,99.781,0.094,0,88340,2540
1771847680,101711519744,89731072,30362439680,0.125,0.031,99.781,0.063,0,143744,1604
1771130880,101712236544,89731072,30362439680,0.031,0.031,99.812,0.125,0,130686,2150
1771319296,101712039936,89731072,30362443776,0.156,0.031,99.812,0,0,158022,2204
1768714240,101714644992,89731072,30362443776,0.031,0.063,99.906,0,0,112686,1604
1768456192,101714903040,89731072,30362443776,0.188,0,99.812,0,0,181516,1604
1768181760,101715161088,89747456,30362443776,0.094,0,99.812,0.094,0,118628,1604
1768124416,101715218432,89747456,30362443776,0.031,0.031,99.937,0,0,204684,3552
1767608320,101715734528,89747456,30362443776,0.063,0.031,99.906,0,0,73742,1814
1762652160,101720690688,89747456,30362443776,0,0.063,99.937,0,0,156452,1022
1761816576,101721526272,89747456,30362443776,0.031,0,99.969,0,0,85734,1604
1760329728,101723004928,89755648,30362443776,0.219,0.063,99.656,0.063,0,117878,11842
1759641600,101723230208,89763840,30362857472,0.469,0.094,99.406,0.031,0,629566,427162
1759805440,101722775552,89763840,30363140096,0.469,0.125,99.406,0,0,598312,508685
1758978048,101723353088,89763840,30363365376,0.500,0.062,99.438,0,0,562916,569168
1760014336,101722066944,89763840,30363611136,0.749,0.187,99.063,0,0,582162,518784
1760821248,101721034752,89772032,30363824128,0.125,0.031,99.781,0.063,0,525936,378109
1760612352,101721034752,89772032,30364024832,0.125,0,99.749,0.125,0,507752,520173
1761333248,101720006656,89780224,30364319744,0.219,0.125,99.593,0.063,0,535656,525167
1761370112,101719748608,89780224,30364536832,0.125,0.063,99.812,0,0,599578,524094
1761046528,101719760896,89788416,30364811264,0.282,0.125,99.500,0.094,0,592824,528629
1761103872,101719470080,89796608,30364999680,0.250,0.094,99.562,0.094,0,626042,431193
1761112064,101718953984,89796608,30365495296,0.282,0.094,99.625,0,0,1138674,1052503
1760690176,101718888448,89796608,30365954048,0.407,0.094,99.499,0,0,1094470,1078400
1780576256,101698363392,89812992,30366523392,1.815,0.376,97.621,0.188,0,1157972,1054497
1785430016,101693046784,89812992,30366969856,0.782,0.125,99.093,0,0,1123464,1052030
1786466304,101691535360,89812992,30367432704,1.062,0.125,98.750,0.062,0,1065010,936434
1785106432,101692497920,89812992,30367825920,0.125,0.063,99.718,0.094,0,978266,894148
1784020992,101692764160,89812992,30368632832,0.250,0.125,99.625,0,0,1075218,1008243
1775652864,101700780032,89812992,30368980992,0.251,0.094,99.655,0,0,1076700,957298
1775861760,101699977216,89821184,30369517568,0.313,0.031,99.593,0.063,0,1112604,949248
1775349760,101699956736,89825280,30370013184,0.782,0.125,99.061,0.031,0,1399584,1326085
1776254976,101698211840,89837568,30370803712,0.313,0.094,99.249,0.344,0,1612896,1363178
1776992256,101696581632,89837568,30371606528,0.376,0.125,99.499,0,0,1640370,1718824
1777102848,101695823872,89837568,30372220928,0.439,0.063,99.499,0,0,1460740,1363805
1776488448,101695938560,89837568,30372712448,0.376,0.125,99.499,0,0,1177810,1156048
1775505408,101696253952,89845760,30373351424,0.063,0,99.875,0.063,0,1335528,1166990
1775484928,101695741952,89845760,30373867520,0.125,0.063,99.812,0,0,1271452,1159082
1775136768,101695488000,89853952,30374457344,0.250,0.063,99.656,0.031,0,1261034,1365434
1774256128,101695885312,89853952,30374928384,0.157,0,99.843,0,0,1291208,1117991
1773854720,101695647744,89853952,30375555072,0.406,0.094,99.500,0,0,1404496,1118107
1773961216,101694857216,89862144,30376210432,0.125,0.063,99.718,0.094,0,1599610,1471745
1773699072,101694341120,89862144,30376964096,0.500,0.094,99.407,0,0,1593386,1580150
1773850624,101693374464,89862144,30377811968,0.251,0.157,99.029,0.564,0,1759140,1675571
1775132672,101691133952,89870336,30378721280,0.376,0.125,99.468,0.031,0,1893240,1839062
1777041408,101688266752,89870336,30379642880,1.219,0.094,98.687,0,0,2334996,1410503
1777000448,101687480320,89878528,30380425216,0.282,0.063,99.593,0.063,0,1593268,1847096
1776308224,101687267328,89878528,30381252608,0.313,0.063,99.625,0,0,1921462,1387424
1775906816,101686906880,89878528,30381993984,0.251,0.094,99.436,0.219,0,1732292,1590072
1774895104,101687070720,89886720,30382813184,0.188,0.094,99.656,0.063,0,1747618,1600845
1773391872,101687746560,89886720,30383624192,0.219,0.094,99.687,0,0,1559416,1527684
1792012288,101668376576,89894912,30384328704,1.283,0.094,98.560,0.063,0,1693078,1630859
1792512000,101667086336,89894912,30385098752,0.407,0.063,99.531,0,0,1552132,1522669
1793560576,101665263616,89894912,30385852416,0.156,0.094,99.750,0,0,1522500,1498266
1790681088,101667483648,89894912,30386499584,0.157,0.063,99.781,0,0,1530082,1631624
1789906944,101667336192,89903104,30387388416,0.219,0.094,99.656,0.031,0,1734074,1644932
1792651264,101663981568,89911296,30387978240,0.658,0.063,99.217,0.063,0,1699080,1481429
1791897600,101663977472,89911296,30388715520,0.344,0.031,99.624,0,0,1685388,1569813
1792180224,101663039488,89911296,30389354496,0.063,0.063,99.530,0.345,0,1445774,1274423
1792286720,101662257152,89911296,30389997568,0.219,0.094,99.687,0,0,1322370,1268581
1794207744,101659676672,89911296,30390640640,0.219,0.063,99.718,0,0,1236906,1370737
1793839104,101659439104,89927680,30391201792,0.063,0.094,99.750,0.094,0,1372588,1372756
1793445888,101658992640,89927680,30392020992,0.125,0.031,99.843,0,0,1538406,1574254
1793351680,101658476544,89927680,30392614912,0,0.063,99.499,0.439,0,1567618,1481065
1797419008,101653594112,89927680,30393401344,0.876,0.094,99.030,0,0,1391800,1532843
1797423104,101652832256,89927680,30394150912,0.219,0.031,99.749,0,0,1710672,1589061
1797304320,101652332544,89935872,30394740736,0.094,0.063,99.750,0.094,0,1678718,1523299
1798705152,101649895424,89944064,30395748352,1.096,0.157,98.685,0.063,0,1647696,6489573
1799270400,101648531456,89944064,30396493824,0.313,0.125,99.562,0,0,1862430,29568623
1799643136,101647499264,89944064,30397140992,0.188,0.094,99.279,0.439,0,1786156,29099969
1799135232,101646921728,89944064,30398201856,0.282,0.125,99.593,0,0,1837562,14991844
1798905856,101646405632,89952256,30398918656,0.157,0.063,99.718,0.063,0,1553960,3326488
1798942720,101645631488,89952256,30399635456,0.125,0.063,99.812,0,0,1588298,2719299
1798553600,101645234176,89960448,30400401408,0.250,0.094,99.624,0.031,0,1573064,3338524
1798729728,101644349440,89960448,30401089536,0.344,0.031,99.624,0,0,1635730,2906297
1802395648,101639999488,89960448,30401757184,0.563,0.094,99.343,0,0,1645164,3542095
1802575872,101638967296,89964544,30402572288,0.438,0.031,99.468,0.063,0,1606818,2717750
1801617408,101639225344,89964544,30403264512,0.188,0.125,99.687,0,0,1536278,2930545
1802608640,101637419008,89964544,30404059136,0.407,0.063,99.530,0,0,1726664,3228812
1798402048,101640830976,89972736,30404829184,0.157,0.063,99.750,0.031,0,1551858,2933568
1797885952,101640634368,89972736,30405521408,0.375,0.156,99.374,0.094,0,1597406,3333920
1797742592,101639847936,89976832,30406410240,0.188,0.094,99.655,0.063,0,1880902,3416598
1797812224,101639073792,89976832,30407102464,0.157,0.125,99.718,0,0,1807450,3262514
1798447104,101637509120,89976832,30407991296,0.469,0.094,99.437,0,0,1705916,3239920
1800998912,101634293760,89976832,30408638464,0.688,0.094,98.905,0.313,0,1520704,2930555
1800609792,101634035712,89985024,30409261056,0.125,0.063,99.750,0.063,0,1581316,3343949
1799942144,101633806336,89993216,30410125312,1.500,0.094,98.374,0.031,0,1640992,2929179
1798918144,101634064384,89993216,30410870784,0.125,0.094,99.781,0,0,1525440,3036144
1799200768,101633069056,89993216,30411567104,0.219,0.094,99.687,0,0,1540760,2843506
1798844416,101632692224,89993216,30412288000,0.219,0.031,99.750,0,0,1587758,3038406
1798643712,101632176128,89993216,30412980224,0.219,0,99.781,0,0,1456098,2916009
1805144064,101624950784,90009600,30413672448,0.469,0.094,99.280,0.156,0,1440086,2932843
1813065728,101616443392,90009600,30414245888,2,0.094,97.906,0,0,1260438,2417876
1813745664,101615153152,90009600,30414839808,0.344,0.063,99.593,0,0,1339204,2517361
1815662592,101612572672,90009600,30415486976,2.786,0.188,96.807,0.219,0,1329936,2724972
1827377152,101600186368,90009600,30416134144,0.689,0.125,99.186,0,0,1328483,2734653
1832153088,101594734592,90017792,30416752640,0.563,0.063,99.312,0.063,0,1497727,2619876
1831587840,101594734592,90025984,30417297408,0.094,0.063,99.812,0.031,0,1539624,3338426
1831989248,101593444352,90025984,30418161664,0.063,0.063,99.875,0,0,1490572,2579886
1821446144,101603409920,90025984,30418726912,0.125,0.031,99.843,0,0,1533336,3160889
1820659712,101603323904,90025984,30419570688,0.063,0.031,99.906,0,0,1528890,2831090
1827753984,101595586560,90034176,30420193280,1.629,0.063,98.246,0.063,0,1603202,3042507
1827561472,101595070464,90034176,30420881408,0.188,0.094,99.719,0,0,1403184,2604621
1828278272,101593714688,90042368,30421499904,0.250,0.031,99.687,0.031,0,1391604,2825363
1821315072,101599907840,90042368,30422245376,0.125,0.031,99.843,0,0,1491230,2839140
1820860416,101599649792,90042368,30422941696,0.344,0.094,99.249,0.313,0,1728352,2948259
1821065216,101598617600,90046464,30423744512,0.376,0.094,99.468,0.063,0,2066980,3415884
1822208000,101596520448,90046464,30424678400,0.719,0.219,99.062,0,0,1889940,3386879
1821822976,101596196864,90046464,30425346048,0.156,0.063,99.781,0,0,1538460,2716192
1821958144,101595422720,90054656,30425964544,0.125,0,99.843,0.031,0,1520222,2793914
1820815360,101595873280,90054656,30426644480,0.157,0.125,99.718,0,0,1526316,3201702
1820999680,101594841088,90062848,30427455488,0.250,0.031,99.687,0.031,0,1426200,2919521
1821220864,101594066944,90062848,30427996160,0.031,0.031,99.937,0,0,1435880,2607456
1826414592,101588131840,90062848,30428712960,0.595,0.063,99.343,0,0,1348226,2708371
1824436224,101589422080,90062848,30429384704,0.157,0.063,99.781,0,0,1453852,2934195
1823817728,101589278720,90071040,30430126080,0.094,0.094,99.593,0.219,0,1603010,3235800
1826390016,101585928192,90079232,30430871552,0.563,0.094,99.218,0.125,0,1623998,3136946
1826250752,101585154048,90079232,30431764480,0.156,0.125,99.718,0,0,1823514,3566766
1826418688,101584121856,90079232,30432608256,0.188,0.094,99.718,0,0,1952456,3525126
1824632832,101585117184,90079232,30433378304,0.094,0.094,99.812,0,0,1785682,3499016
1824604160,101584388096,90087424,30434095104,0.094,0.063,99.812,0.031,0,1616080,2915747
1824473088,101583872000,90095616,30434713600,0.125,0.094,99.718,0.063,0,1484904,2837532
1823543296,101583872000,90095616,30435618816,0.188,0.063,99.749,0,0,1757308,3504700
1823150080,101583613952,90095616,30436257792,0.125,0.094,99.781,0,0,1441916,2807391
1823522816,101582581760,90095616,30436900864,0.031,0.063,99.906,0,0,1292822,2604353
1822728192,101582839808,90095616,30437421056,0.063,0.031,99.906,0,0,1134742,2211260
1822597120,101582323712,90112000,30438039552,0.156,0.094,99.656,0.094,0,1333184,2614332
1821675520,101582610432,90112000,30438662144,0.063,0.063,99.875,0,0,1411582,2731017
1823870976,101579698176,90112000,30439358464,0.969,0.094,98.937,0,0,1440868,2826830
1822683136,101580382208,90112000,30439849984,0.125,0.094,99.781,0,0,1363324,2642656
1821863936,101580382208,90112000,30440648704,0.125,0.094,99.562,0.219,0,1362646,2813473
1821843456,101579632640,90120192,30441390080,0.125,0.094,99.718,0.063,0,1470890,3120669
1821749248,101579116544,90128384,30441979904,0.031,0.063,99.875,0.031,0,1335068,2797438
1821245440,101579083776,90128384,30442500096,0.031,0.031,99.937,0,0,1156954,2105273
1820872704,101578825728,90128384,30443118592,0.063,0.031,99.906,0,0,1253952,2415135
1827512320,101571497984,90128384,30443786240,0.469,0.125,99.406,0,0,1330766,2918152
1833123840,101565288448,90136576,30444355584,0.844,0.125,98.968,0.063,0,1383356,2302920
1833570304,101564256256,90136576,30444920832,0.157,0.063,99.781,0,0,1463848,3114250
1833693184,101563224064,90144768,30445809664,1.345,0.063,98.562,0.031,0,1513140,3014517
1830633472,101565591552,90144768,30446481408,0.063,0.063,99.875,0,0,1449218,2946055
1830666240,101564817408,90148864,30447198208,0.219,0.031,99.624,0.125,0,1555072,3135185
1830273024,101564559360,90148864,30447837184,0.250,0.094,99.593,0.063,0,1485270,2832012
1829806080,101564223488,90148864,30448615424,0.125,0.125,99.750,0,0,1535770,2944741
1828978688,101564235776,90148864,30449414144,0.156,0.063,99.781,0,0,1634622,2935827
1824047104,101568417792,90157056,30450130944,0.125,0.031,99.781,0.063,0,1406190,3025759
1823981568,101567885312,90157056,30450720768,0.188,0.063,99.687,0.063,0,1444544,2614423
1824034816,101567111168,90165248,30451412992,0.125,0.031,99.530,0.313,0,1511602,2757937
1823571968,101566853120,90165248,30452113408,0.156,0.125,99.719,0,0,1318082,3259379
1823350784,101566078976,90165248,30453092352,0.125,0.063,99.812,0,0,1494578,2726687
1822515200,101566255104,90165248,30453735424,0.031,0.031,99.937,0,0,1495194,2827815
1823866880,101564157952,90173440,30454452224,0.657,0.063,99.218,0.063,0,1410982,2985776
1824460800,101562867712,90181632,30455119872,0.063,0.094,99.781,0.063,0,1454642,2767732
1824063488,101562609664,90181632,30455767040,0.125,0.063,99.812,0,0,1452950,3126422
1825132544,101560803328,90181632,30456483840,0.094,0.031,99.875,0,0,1341060,2639619
1824784384,101560545280,90181632,30457077760,0.031,0.094,99.875,0,0,1349322,2726360
1824378880,101560287232,90181632,30457720832,0.125,0.063,99.812,0,0,1408942,2570328
1831677952,101552152576,90193920,30458490880,0.470,0.063,99.185,0.282,0,1517782,3186372
1831112704,101551894528,90193920,30459281408,0.125,0.156,99.718,0,0,1831188,3668005
1831567360,101550604288,90193920,30460100608,0.188,0.094,99.718,0,0,1680794,3250023
1830916096,101550575616,90193920,30460768256,0.063,0.094,99.844,0,0,1448626,3004085
1830236160,101550575616,90193920,30461427712,0.094,0.063,99.844,0,0,1398592,2708309
1834221568,101545848832,90193920,30462148608,2.722,0.188,97.028,0.063,0,1436860,2837390
1833938944,101545406464,90202112,30462844928,0.250,0.094,99.593,0.063,0,1535993,2749410
1833598976,101545148416,90202112,30463434752,0.031,0.063,99.906,0,0,1381593,2826431
1833086976,101544878080,90202112,30464192512,0.031,0.125,99.844,0,0,1369678,2904684
1833033728,101544366080,90202112,30464741376,0.156,0.125,99.718,0,0,1294490,2324446
1832845312,101543849984,90210304,30465425408,0.094,0.063,99.781,0.063,0,1413412,2912509
1832206336,101543809024,90210304,30466080768,0.094,0.063,99.843,0,0,1391746,2737051
1831804928,101543555072,90218496,30466723840,0.188,0.031,99.750,0.031,0,1375482,2923410
1831919616,101542821888,90218496,30467317760,0.094,0.063,99.844,0,0,1338302,2411629
1831100416,101542825984,90218496,30468116480,0.094,0.031,99.875,0,0,1380802,3104769
1831018496,101542309888,90226688,30468685824,0.094,0.063,99.781,0.063,0,1388272,2469502
1831116800,101541584896,90226688,30469300224,0.063,0.125,99.812,0,0,1291540,2595786
1830674432,101541322752,90226688,30469967872,0.094,0.031,99.875,0,0,1585522,2864547
1830608896,101540806656,90234880,30470537216,0.063,0.031,99.875,0.031,0,1330960,2620097
1830457344,101540319232,90234880,30471155712,0.094,0.063,99.844,0,0,1335950,2414286
1833316352,101536673792,90243072,30471901184,0.094,0.094,99.373,0.439,0,1366960,2939226
1832697856,101536686080,90243072,30472495104,0.094,0.063,99.844,0,0,1547210,2824081
1837301760,101531201536,90243072,30473359360,0.281,0.094,99.625,0,0,1667694,3645473
1846472704,101521248256,90243072,30474100736,0.407,0.125,99.467,0,0,1702222,3257753
1846439936,101520510976,90251264,30474846208,0.094,0.063,99.812,0.031,0,1721874,3337633
1845960704,101520035840,90259456,30475767808,0.219,0.125,99.344,0.313,0,1595616,3316304
1846046720,101519261696,90259456,30476443648,0.125,0.125,99.750,0,0,1624022,2823355
1845514240,101519003648,90259456,30477213696,0.063,0.063,99.875,0,0,1771374,3463617
1845567488,101517918208,90259456,30478176256,0.063,0.188,99.750,0,0,1974247,3651613
1845571584,101517230080,90259456,30478843904,0.094,0.063,99.843,0,0,1715664,3238054
1845313536,101516460032,90279936,30479806464,0.031,0.031,99.655,0.282,0,1738888,3647282
1845395456,101515702272,90279936,30480461824,0.188,0.125,99.500,0.188,0,1668662,3244330
1845374976,101514805248,90279936,30481358848,0.156,0.094,99.750,0,0,1558450,3255559
1845125120,101514289152,90279936,30482104320,0.094,0.031,99.875,0,0,1511324,3146784
1849393152,101509398528,90279936,30482526208,0.251,0.157,99.593,0,0,1324060,2306613
1850044416,101507895296,90292224,30483349504,0.188,0.031,99.718,0.063,0,1546584,3268666
1849344000,101507829760,90304512,30484062208,0.031,0.094,99.812,0.063,0,1440638,2823766
1849208832,101507366912,90304512,30484635648,0.094,0.031,99.875,0,0,1300088,2625562
1849126912,101506707456,90304512,30485356544,0.094,0.031,99.875,0,0,1411540,2733642
1849425920,101505675264,90304512,30486069248,0.094,0.094,99.812,0,0,1359766,3087282
1849315328,101505167360,90312704,30486667264,0.125,0.031,99.781,0.063,0,1390458,2452021
1849212928,101504659456,90312704,30487261184,0.094,0.063,99.844,0,0,1298048,2515321
1849651200,101503680512,90320896,30487781376,0.125,0.031,99.812,0.031,0,1254334,2417666
1849241600,101503422464,90320896,30488428544,0.157,0.094,99.749,0,0,1197530,2523883
1849815040,101502193664,90329088,30489059328,0.156,0.094,99.656,0.094,0,1357318,2540847
1849712640,101501677568,90337280,30489657344,0.219,0.031,99.687,0.063,0,1168690,2593514
1849176064,101501710336,90337280,30490148864,0.094,0.094,99.468,0.344,0,1097552,1988891
1848897536,101501530112,90337280,30490595328,0.219,0.031,99.750,0,0,1118764,2214506
1849044992,101500755968,90345472,30491197440,0.094,0,99.875,0.031,0,1292566,2425861
1869602816,101479395328,90345472,30491983872,3.063,0.094,96.843,0,0,1743792,3138425
1869266944,101478985728,90353664,30492704768,0.031,0.063,99.843,0.063,0,1632550,3111860
1868697600,101478760448,90353664,30493474816,0.250,0.094,99.531,0.125,0,1633598,3158854
1868972032,101477728256,90353664,30494212096,1.596,0,98.404,0,0,1629030,3255618
1869316096,101476536320,90353664,30495035392,0.094,0.063,99.843,0,0,1619172,3362786
1865826304,101479366656,90361856,30495678464,0.344,0.094,99.531,0.031,0,1587778,3031957
1867546624,101476761600,90370048,30496526336,0.313,0.063,99.562,0.063,0,1656090,3057507
1869905920,101473632256,90370048,30497275904,0.156,0.125,99.718,0,0,1488578,3134455
1872109568,101470797824,90370048,30497894400,0.219,0.094,99.687,0,0,1679076,3220048
1881493504,101460545536,90370048,30498738176,0.501,0.125,99.373,0,0,1551052,2912127
1882337280,101458964480,90370048,30499454976,1.003,0,98.997,0,0,1539052,3056930
1886044160,101454626816,90386432,30500052992,2.001,0.063,97.843,0.094,0,1308744,2519252
1886023680,101453594624,90386432,30501093376,0.031,0.094,99.593,0.282,0,1217878,2499486
1885769728,101453078528,90386432,30501838848,0.125,0.063,99.812,0,0,1404668,2935723
1885999104,101452316672,90386432,30502359040,0.063,0,99.937,0,0,1380592,2523297
1882636288,101454880768,90386432,30503124992,0.063,0.063,99.875,0,0,1467850,2821595
1882492928,101454364672,90394624,30503763968,0.282,0.063,99.562,0.094,0,1354064,2727297
1882996736,101453316096,90402816,30504267776,0.063,0.125,99.749,0.063,0,1361884,2724881
1882681344,101452800000,90402816,30505078784,0.500,0.063,99.437,0,0,1404926,3003897
1882415104,101452541952,90402816,30505594880,0.063,0.031,99.906,0,0,1231820,2288918
1881518080,101452800000,90402816,30506213376,0.031,0.031,99.937,0,0,1139610,2306023
1881272320,101452558336,90411008,30506684416,0.063,0.031,99.844,0.063,0,1187050,1993982
1880887296,101452300288,90411008,30507307008,0.063,0.031,99.906,0,0,1131954,2633012
1880788992,101451784192,90419200,30507900928,0.094,0.094,99.750,0.063,0,1274454,2514357
1880383488,101451530240,90419200,30508544000,0.094,0.063,99.844,0,0,1520056,2725695
1879900160,101451272192,90419200,30509264896,0.063,0.063,99.875,0,0,1363272,2927925
1879982080,101450498048,90427392,30509936640,0.125,0.031,99.781,0.063,0,1666232,2908510
1879912448,101449834496,90427392,30510649344,0.031,0.063,99.906,0,0,1257860,2644754
1879814144,101449318400,90431488,30511243264,0.063,0.031,99.405,0.501,0,1376934,2605241
1879044096,101449347072,90439680,30511960064,0.063,0.094,99.812,0.031,0,1391276,3115050
1878843392,101448945664,90439680,30512529408,0.031,0.063,99.906,0,0,1289886,2212467
1878773760,101448429568,90447872,30513090560,0.188,0.063,99.656,0.094,0,1200666,2409399
1878552576,101447913472,90447872,30513811456,0.031,0.063,99.906,0,0,1263776,3014361
1878147072,101447913472,90447872,30514204672,0.094,0.063,99.844,0,0,1087706,1675176
1878437888,101447139328,90447872,30514679808,0.063,0.031,99.906,0,0,1056954,2208146
1878216704,101446881280,90456064,30515130368,0.094,0.031,99.844,0.031,0,1251598,2437534
1877852160,101446365184,90464256,30515986432,0.094,0.031,99.812,0.063,0,1465412,3032270
1877999616,101445599232,90464256,30516592640,0.125,0.031,99.843,0,0,1403298,2621771
1877921792,101445058560,90484736,30517174272,0.063,0.094,99.468,0.376,0,1301272,2522021
1877856256,101444542464,90484736,30517735424,0.188,0.063,99.750,0,0,1329678,2612600
1877532672,101444030464,90484736,30518554624,0.125,0.063,99.812,0,0,1533400,2925610
1877237760,101443612672,90488832,30519242752,0.125,0.063,99.750,0.063,0,1423840,3058862
1876975616,101443239936,90488832,30519865344,0.125,0,99.875,0,0,1409162,2612487
1876774912,101442752512,90488832,30520532992,0.031,0.063,99.906,0,0,1350056,2820620
1876504576,101442301952,90497024,30521229312,0.125,0.063,99.781,0.031,0,1518990,3048132
1876373504,101441802240,90497024,30521847808,0.063,0.063,99.875,0,0,1547270,2916918
1879052288,101438222336,90505216,30522716160,3.755,0.063,96.120,0.063,0,1628632,3159909
1879015424,101437452288,90505216,30523506688,0.125,0.063,99.812,0,0,1591128,3332388
1878646784,101436960768,90505216,30524342272,0.689,0.031,98.935,0.345,0,1718036,3543192
1889738752,101425201152,90505216,30524989440,0.532,0.250,99.218,0,0,1700894,3352793
1892118528,101421928448,90513408,30525857792,2.001,0.125,97.811,0.063,0,1570106,3045491
1892634624,101420646400,90521600,30526595072,0.125,0.094,99.718,0.063,0,1615542,3159000
1892130816,101420404736,90521600,30527324160,0.157,0,99.843,0,0,1557272,3043991
1892446208,101419372544,90521600,30528020480,0.156,0.031,99.718,0.094,0,1518794,3337788
1892425728,101418598400,90521600,30528798720,0.031,0.031,99.937,0,0,1570902,3104025
1889898496,101420404736,90529792,30529490944,0.188,0.031,99.718,0.063,0,1524958,3029547
1889333248,101420154880,90546176,30530269184,0.031,0.031,99.843,0.094,0,1578200,3020450
1889411072,101419364352,90546176,30530945024,0.063,0.094,99.844,0,0,1459518,2820228
1889239040,101418848256,90546176,30531616768,0.094,0.063,99.843,0,0,1362674,2826419
1889120256,101418332160,90546176,30532235264,0.125,0.063,99.593,0.219,0,1422928,2722855
1888735232,101418090496,90546176,30532849664,0.125,0.094,99.781,0,0,1360182,3024488
1890025472,101416288256,90550272,30533345280,0.094,0.031,99.781,0.094,0,853166,1533901
1889980416,101416292352,90558464,30533373952,0.094,0.031,99.844,0.031,0,58818,108453
1889972224,101416292352,90566656,30533373952,0.031,0,99.906,0.063,0,16268,5346
1889968128,101416259584,90566656,30533373952,0.031,0,99.969,0,0,6686,5848
1889710080,101416517632,90566656,30533373952,0,0.031,99.969,0,0,11572,4984
1889644544,101416583168,90570752,30533369856,0.063,0,99.906,0.031,0,4986,5136
1889640448,101416583168,90570752,30533373952,0.062,0.062,99.875,0,0,4632,5238
1889640448,101416583168,90570752,30533373952,0.031,0.031,99.938,0,0,5006,5026
1889886208,101416325120,90578944,30533373952,0,0,99.937,0.063,0,4624,5136
1889628160,101416583168,90578944,30533373952,0,0.031,99.969,0,0,15668,4816
1889619968,101416591360,90578944,30533373952,0.062,0.031,99.844,0.062,0,8016,4816
1889386496,101416824832,90578944,30533373952,0,0.063,99.937,0,0,7562,5558
1889386496,101416824832,90578944,30533373952,0,0.062,99.938,0,0,5658,5026
1889386496,101416824832,90578944,30533373952,0.031,0,99.969,0,0,12820,5608
1889087488,101417115648,90587136,30533373952,0,0.031,99.906,0.063,0,3162,1604
1889087488,101417115648,90591232,30533369856,0.031,0,99.937,0.031,0,1148,1604
1889067008,101417132032,90591232,30533373952,0,0,100,0,0,2636,1604
1889054720,101417140224,90591232,30533378048,0.031,0.063,99.906,0,0,3080,1814
1903140864,101402869760,90591232,30533378048,0.719,0.156,99.125,0,0,416243,23096
1916674048,101387526144,90591232,30533390336,0.657,0.751,98.592,0,0,181333,39596
