"Dstat 0.7.3 CSV output"
"Author:","Dag Wieers <dag@wieers.com>",,,,"URL:","http://dag.wieers.com/home-made/dstat/"
"Host:","grisou-7.nancy.grid5000.fr",,,,"User:","root"
"Cmdline:","dstat -m -c -n -o dstat.csv",,,,"Date:","27 May 2020 11:13:00 CEST"
"memory usage",,,,"total cpu usage",,,,,"net/total",
"used","free","buff","cach","usr","sys","idl","wai","stl","recv","send"
1040232448,132706349056,61001728,981577728,2.262,0.488,97.000,0.250,0,0,0
1061777408,132684455936,61014016,981839872,0.749,0.406,98.220,0.624,0,388322,16948
1040277504,132706390016,61014016,981397504,0.312,0.281,99.344,0.062,0,4102,13676
1052880896,132693336064,61014016,981843968,0.656,0.156,99.188,0,0,384328,11136
1037152256,132709511168,61026304,981385216,0.469,0.438,99.062,0.031,0,4490,15028
1051435008,132694953984,61026304,981655552,0.438,0.031,99.531,0,0,382842,10888
1037828096,132708810752,61034496,981397504,0.842,0.499,98.597,0.062,0,5764,15556
1036705792,132709904384,61038592,981405696,0,0.031,98.468,1.501,0,632,0
1036189696,132710420480,61038592,981405696,0,0.031,99.969,0,0,632,0
1036189696,132710420480,61038592,981405696,0.031,0,99.969,0,0,730,0
1035911168,132710686720,61050880,981405696,0,0,99.938,0.062,0,1936,662
1035911168,132710686720,61050880,981405696,0.031,0,99.969,0,0,1550,0
1035640832,132710952960,61054976,981405696,0,0,99.969,0.031,0,918,0
1035366400,132711227392,61054976,981405696,0,0.031,99.969,0,0,922,496
1034833920,132711759872,61054976,981405696,0,0,100,0,0,1160,0
1034575872,132712017920,61054976,981405696,0.031,0.031,99.938,0,0,6492,0
1034182656,132712411136,61054976,981405696,0,0.031,99.969,0,0,1038,1948
1033695232,132712898560,61054976,981405696,0.062,0,99.938,0,0,6108,0
1050304512,132696285184,61059072,981405696,0.656,0.125,99.125,0.094,0,387350,15276
1035677696,132710907904,61059072,981405696,0.562,0.437,99.001,0,0,9958,15060
1038671872,132707713024,61059072,981557248,0.250,0.281,99.469,0,0,169706,11988
1040171008,132706209792,61059072,981557248,1.156,0.562,98.282,0,0,394944,30664
1039224832,132707155968,61059072,981557248,0,0.031,99.969,0,0,812,0
1059151872,132686954496,61067264,981819392,0.657,0.438,98.311,0.594,0,384122,12904
1041887232,132704460800,61079552,981561344,0.344,0.250,99.157,0.250,0,6434,13292
1049608192,132696739840,61079552,981561344,0.156,0.031,99.812,0,0,382648,10624
1041866752,132704223232,61079552,981819392,0.905,0.624,98.471,0,0,4828,15640
1040953344,132705386496,61079552,981561344,0.031,0,99.969,0,0,4272,0
1042735104,132703440896,61091840,981561344,1.964,0.312,97.225,0.499,0,222894,11532
1041657856,132704505856,61104128,981561344,0,0.031,99.906,0.062,0,4998,2668
1041866752,132704296960,61104128,981561344,0,0,100,0,0,992,0
1041539072,132704624640,61104128,981561344,0,0.031,99.969,0,0,2542,0
1042796544,132703592448,61104128,981336064,0.469,0.219,99.313,0,0,342720,15208
1049939968,132696018944,61108224,981757952,0.188,0.125,99.687,0,0,186200,21406
1049911296,132696043520,61112320,981757952,0,0,99.531,0.469,0,33420,13034
1049387008,132696567808,61112320,981757952,0,0.031,99.969,0,0,12836,13974
1049112576,132696842240,61112320,981757952,0.031,0.031,99.937,0,0,12886,13132
1048846336,132697108480,61124608,981745664,0.031,0,99.906,0.062,0,13006,13230
1047543808,132698398720,61124608,981757952,0,0,100,0,0,19626,19064
1047281664,132698656768,61128704,981757952,0,0.062,99.906,0.031,0,13940,13328
1047281664,132698656768,61128704,981757952,0,0,100,0,0,13514,13496
1047023616,132698914816,61128704,981757952,0,0,100,0,0,12902,13230
1047023616,132698914816,61128704,981757952,0.062,0,99.938,0,0,12174,12544
1039900672,132706033664,61128704,981762048,0.031,0,99.969,0,0,8462,2236
1040920576,132705116160,61128704,981659648,0.281,0.125,99.594,0,0,173066,14236
1040609280,132705505280,61132800,981577728,0,0,99.938,0.062,0,898,0
1040351232,132705763328,61132800,981577728,0,0,99.719,0.281,0,726,0
1040343040,132705771520,61132800,981577728,0.031,0,99.969,0,0,346,0
1040084992,132706029568,61132800,981577728,0,0.031,99.969,0,0,526,0
1040072704,132706029568,61145088,981577728,0,0,99.969,0.031,0,406,0
1039814656,132706287616,61145088,981577728,0,0,100,0,0,466,0
1039552512,132706529280,61145088,981581824,0.031,0,99.906,0.063,0,467618,0
1039020032,132707061760,61145088,981581824,0.094,0,99.906,0,0,169748,0
1038761984,132707319808,61145088,981581824,0,0,100,0,0,93618,0
1037979648,132708102144,61145088,981581824,0.031,0.031,99.938,0,0,58508,662
1037979648,132708102144,61145088,981581824,0,0,100,0,0,60718,0
1050505216,132695576576,61145088,981581824,0.594,0.281,99.125,0,0,446666,17260
1053241344,132692377600,61149184,982028288,0.312,0.250,99.344,0.094,0,60856,1768
1038569472,132707495936,61149184,981581824,0.250,0.250,99.188,0.312,0,91700,15424
1037766656,132708298752,61149184,981581824,0.094,0.031,99.875,0,0,79274,0
1037508608,132708556800,61149184,981581824,0,0.062,99.938,0,0,86098,0
1037508608,132708556800,61161472,981569536,0,0,99.969,0.031,0,80908,168
1037488128,132708564992,61161472,981581824,0,0.031,99.969,0,0,82616,84
1037213696,132708831232,61169664,981581824,0.031,0.031,99.875,0.062,0,79158,84
1036697600,132709347328,61169664,981581824,0.031,0.062,99.844,0.062,0,69776,0
1036435456,132709609472,61169664,981581824,0.031,0.031,99.938,0,0,79440,0
1036177408,132709867520,61169664,981581824,0.031,0.031,99.938,0,0,41284,0
1035919360,132710125568,61169664,981581824,0,0,100,0,0,5412,0
1035919360,132710125568,61169664,981581824,0.031,0,99.969,0,0,1098,0
1035874304,132710162432,61177856,981581824,0,0,99.938,0.062,0,692,0
1035874304,132710162432,61177856,981581824,0,0.031,99.969,0,0,1850,0
1035874304,132710162432,61177856,981581824,0.031,0,99.969,0,0,2604,0
1035874304,132710162432,61177856,981581824,0,0,100,0,0,1172,0
1035612160,132710420480,61181952,981581824,0,0,99.875,0.125,0,830,496
1035087872,132710944768,61181952,981581824,0.031,0,99.969,0,0,808,78
1035087872,132710944768,61186048,981577728,0,0,99.937,0.063,0,1062,1000
1035083776,132710944768,61186048,981581824,0,0.031,99.969,0,0,1398,0
1076297728,132670296064,61186048,981016576,0.844,0.250,98.906,0,0,668494,29110
3658063872,130087362560,61190144,982155264,24.111,9.420,66.469,0,0,1326546,57534
6671003648,127072657408,61198336,983810048,35.171,12.433,52.365,0.031,0,1650094,64510
9930235904,123811647488,61210624,985456640,35.150,13.941,50.752,0.157,0,1323230,55052
13044322304,120696246272,61218816,986734592,34.447,12.850,52.640,0.064,0,1326060,58556
16133963776,117605052416,61247488,988192768,33.553,13.792,51.367,1.288,0,1654070,64190
19313229824,114424279040,61267968,989614080,34.953,13.480,51.285,0.282,0,1351962,1599640
22155784192,111580512256,61284352,990994432,37.167,12.357,50.190,0.285,0,1473188,9622385
25175117824,108559757312,61292544,992333824,39.555,13.342,46.852,0.251,0,1776902,23803503
28162387968,105571069952,61317120,993673216,42.902,12.626,44.158,0.314,0,1982458,35823719
30800277504,102932598784,61337600,994213888,40.545,11.302,46.337,1.816,0,826726,46977758
31087681536,102645129216,61337600,994271232,14.942,1.688,82.932,0.438,0,995984,58465772
31290523648,102442225664,61337600,994332672,18.775,1.687,79.100,0.437,0,1309952,76065938
31484256256,102248267776,61341696,994549760,19.919,1.865,77.657,0.559,0,1481694,86317059
31670857728,102061576192,61341696,994639872,23.853,1.873,73.775,0.500,0,1788212,97462076
31858810880,101873532928,61341696,994729984,25.101,1.800,72.665,0.434,0,1852754,99565159
31994613760,101737623552,61349888,994828288,23.677,2.192,73.536,0.595,0,2084838,114843458
32094167040,101637951488,61349888,994942976,22.357,2.326,74.636,0.682,0,2115562,115605276
32237891584,101494124544,61349888,995045376,21.469,2.774,74.842,0.914,0,1883872,109058764
32327344128,101404540928,61349888,995176448,24.135,3.276,71.354,1.236,0,2091146,121297714
32449773568,101282017280,61353984,995262464,20.629,2.327,74.182,2.862,0,2080776,113844874
32421543936,101310132224,61353984,995377152,14.259,1.961,83.188,0.592,0,2172496,120302350
32406196224,101325369344,61353984,995487744,10.191,1.657,87.590,0.563,0,2214966,120600070
32362721280,101368713216,61358080,995606528,10.397,1.530,87.293,0.781,0,2195396,121521496
32321527808,101409796096,61358080,995717120,10.464,1.472,87.500,0.564,0,2053050,113298026
32332029952,101399179264,61366272,995823616,11.924,2.210,84.714,1.152,0,2038182,110504338
32354054144,101377040384,61366272,995934208,11.341,1.598,73.747,13.315,0,2241670,122770184
32350285824,101380694016,61366272,996048896,8.401,1.343,87.570,2.686,0,2177092,118826994
32353259520,101377576960,61374464,996171776,8.268,1.069,90.160,0.503,0,2282980,121935440
32355594240,101375148032,61374464,996265984,10.074,1.240,88.283,0.403,0,2250440,119499114
32360779776,101369712640,61374464,996515840,8.367,1.195,90.154,0.283,0,2092588,113352616
32362942464,101367443456,61374464,996622336,8.274,1.213,90.264,0.249,0,2140528,118984214
32366870528,101363404800,61382656,996724736,7.959,1.270,90.214,0.557,0,2030424,109319162
32371191808,101358833664,61386752,996970496,8.398,1.120,89.953,0.529,0,2064740,111375806
32380456960,101349449728,61386752,997085184,8.448,1.351,89.730,0.471,0,2008006,108926754
32398585856,101331226624,61386752,997175296,7.495,1.405,90.568,0.531,0,2074920,112546566
32399351808,101330317312,61386752,997314560,7.649,1.270,90.678,0.403,0,2123370,116709926
32401690624,101327872000,61386752,997421056,8.175,1.279,90.109,0.437,0,2099688,115028084
32412745728,101316710400,61390848,997519360,8.053,1.586,89.739,0.622,0,2099120,115589894
32420397056,101308944384,61390848,997634048,7.062,1.193,91.337,0.408,0,2073112,111072302
32421556224,101307662336,61390848,997752832,7.393,1.316,90.821,0.470,0,2165180,118681704
32427106304,101301997568,61390848,997859328,6.975,0.970,91.586,0.469,0,2081054,115184264
32441180160,101287796736,61390848,997978112,7.783,1.650,88.263,2.304,0,1884488,110919400
32442568704,101286293504,61399040,998084608,6.524,1.223,91.688,0.565,0,1983390,110175508
32454447104,101274320896,61399040,998178816,7.909,1.563,90.216,0.313,0,2047238,112850864
32462106624,101266399232,61399040,998293504,7.989,1.461,90.146,0.404,0,2188764,118678132
32463642624,101264748544,61399040,998408192,6.875,1.469,91.188,0.469,0,2105882,113220438
32474066944,101254217728,61407232,998502400,6.562,1.381,91.115,0.942,0,2090346,114533426
32488742912,101239406592,61415424,998629376,7.299,1.778,90.393,0.530,0,2135666,114547236
32504311808,101223718912,61415424,998748160,5.811,1.656,92.159,0.375,0,2137272,114145186
32508772352,101219160064,61415424,998846464,7.347,1.381,90.801,0.471,0,2194178,118234560
32519356416,101208317952,61415424,999100416,5.531,1.281,92.812,0.375,0,2082574,114378470
32530522112,101197053952,61415424,999194624,6.487,1.335,91.837,0.341,0,2174240,119250226
32543924224,101183528960,61423616,999305216,7.342,1.600,90.336,0.722,0,2141476,119225412
32544387072,101182939136,61423616,999432192,7.270,1.154,91.232,0.343,0,2111244,117334946
32547749888,101179527168,61423616,999530496,6.154,1.570,91.837,0.440,0,2102042,115510100
32551829504,101175349248,61423616,999624704,6.167,1.322,92.070,0.441,0,2141732,117021894
32553009152,101174038528,61423616,999755776,5.833,1.129,92.380,0.659,0,2145030,116406552
32560455680,101166346240,61427712,999989248,5.864,1.404,90.643,2.090,0,2143764,117558886
32574640128,101152051200,61427712,1000099840,7.459,1.529,90.481,0.531,0,2157106,118979378
32580050944,101146521600,61427712,1000210432,8.599,1.330,89.700,0.371,0,2218244,121147150
32601464832,101124984832,61427712,1000333312,8.429,1.275,89.891,0.404,0,2148704,117850208
32624386048,101101948928,61427712,1000443904,9.416,1.523,88.658,0.404,0,2138812,116624928
32638803968,101087416320,61440000,1000546304,9.621,1.428,88.051,0.900,0,2106410,115732686
32649609216,101076504576,61440000,1000652800,10.510,1.679,87.376,0.435,0,2167468,122376958
32657813504,101068193792,61440000,1000755200,8.388,1.528,89.554,0.530,0,2132440,121113512
32662011904,101063868416,61440000,1000882176,8.492,1.623,89.447,0.437,0,2257262,122618130
32662904832,101062860800,61440000,1000996864,7.331,1.034,91.259,0.376,0,2181360,119883012
32667926528,101057736704,61440000,1001095168,9.842,1.335,88.140,0.683,0,2198170,115698416
32681213952,101044318208,61440000,1001209856,10.549,1.862,87.062,0.527,0,2162448,114580992
32693481472,101031817216,61440000,1001443328,7.591,1.312,90.565,0.531,0,2156354,117505696
32729260032,100995915776,61440000,1001566208,9.522,1.592,88.448,0.437,0,2152904,116977252
32804528128,100920545280,61440000,1001668608,13.090,1.031,85.411,0.469,0,2065160,113773884
32858800128,100866146304,61440000,1001795584,11.765,1.920,81.238,5.077,0,2131822,117749944
32922857472,100801986560,61440000,1001893888,11.438,1.536,86.650,0.376,0,2227128,124436194
32974102528,100750622720,61440000,1002012672,9.522,1.186,88.917,0.375,0,2024026,111252842
33054224384,100670382080,61440000,1002127360,14.383,1.608,83.607,0.402,0,2119616,118148408
33066274816,100658233344,61440000,1002221568,10.040,1.797,87.667,0.496,0,2134460,118227494
33095213056,100629159936,61448192,1002344448,8.250,1.250,89.688,0.812,0,2302452,128626224
33126309888,100597936128,61452288,1002467328,8.294,1.721,89.296,0.689,0,2161374,117770546
33142910976,100581236736,61452288,1002557440,8.852,1.095,89.553,0.500,0,2147478,117151054
33138401280,100585631744,61452288,1002672128,5.177,1.263,93.056,0.505,0,2101758,113994392
33136168960,100587724800,61452288,1002803200,5.265,0.820,93.380,0.536,0,2144644,117373724
33135955968,100587827200,61456384,1002897408,7.121,1.119,91.138,0.622,0,2061666,112802716
33137491968,100586164224,61456384,1003020288,4.901,1.005,91.800,2.293,0,2094752,115309560
33145511936,100578037760,61456384,1003126784,5.709,1.349,92.566,0.376,0,2050424,113100898
33137745920,100585701376,61456384,1003229184,5.090,0.974,93.497,0.440,0,2054980,111057612
33131757568,100591579136,61456384,1003335680,6.039,1.033,92.459,0.469,0,2063588,111833692
33136168960,100587044864,61460480,1003454464,5.787,1.462,92.066,0.685,0,2204074,117848612
33131536384,100591562752,61468672,1003552768,5.965,1.062,92.067,0.906,0,2149082,116571364
33130041344,100592918528,61468672,1003683840,5.825,1.071,92.601,0.504,0,2078386,114612320
33131220992,100591632384,61468672,1003786240,4.850,0.850,93.858,0.441,0,2097628,114488372
33128882176,100593737728,61468672,1004015616,5.020,1.091,93.452,0.437,0,2169402,120122482
33129971712,100592504832,61472768,1004146688,6.244,1.342,91.789,0.624,0,2287276,120695750
33130340352,100592041984,61472768,1004240896,4.151,1.030,92.322,2.497,0,2124680,114111438
33131016192,100591267840,61480960,1004331008,5.694,1.120,92.813,0.373,0,2151682,113228886
33130680320,100591448064,61480960,1004474368,4.704,1.098,93.823,0.376,0,2230954,122098684
33130852352,100591165440,61480960,1004584960,6.976,1.183,91.405,0.436,0,2286748,122956376
33130471424,100591439872,61489152,1004679168,6.047,1.060,92.456,0.436,0,2098292,113695860
33132863488,100588924928,61489152,1004802048,6.307,1.035,92.187,0.471,0,2173688,114910760
33132339200,100589322240,61497344,1004920832,5.360,0.966,93.207,0.467,0,2097508,114382488
33141633024,100579934208,61497344,1005010944,6.186,1.250,92.190,0.375,0,2231602,115679678
33141284864,100580151296,61497344,1005142016,7.226,1.126,91.398,0.250,0,2249884,117460408
33141166080,100580163584,61505536,1005232128,5.637,0.814,93.235,0.313,0,2049922,106840282
33141522432,100579684352,61505536,1005350912,5.856,0.945,92.727,0.472,0,2145038,116945116
33141952512,100579131392,61505536,1005473792,6.117,1.129,92.440,0.314,0,2193852,121736078
33141878784,100579090432,61505536,1005584384,6.595,1.131,91.928,0.345,0,2135916,117050314
33142444032,100578422784,61513728,1005674496,6.013,1.378,92.045,0.564,0,2105966,115558514
33143382016,100577345536,61521920,1005801472,5.983,0.997,92.552,0.467,0,2226256,120995256
33142480896,100578119680,61521920,1005920256,7.983,0.998,90.677,0.343,0,2192102,119021858
33151811584,100568694784,61521920,1006014464,7.862,1.243,88.751,2.144,0,2305268,126554214
33153507328,100566867968,61521920,1006141440,5.934,1.036,92.590,0.440,0,2227502,121331894
33152782336,100567478272,61521920,1006252032,5.851,1.189,92.553,0.407,0,2307046,122447120
33153572864,100566568960,61530112,1006362624,4.626,0.787,93.896,0.692,0,1961058,106200360
33154854912,100565168128,61530112,1006481408,4.297,1.317,93.946,0.439,0,2244144,114771744
33154174976,100565733376,61538304,1006583808,6.822,1.054,90.946,1.178,0,2085630,114896854
33156673536,100563132416,61538304,1006686208,5.111,0.878,93.540,0.470,0,2220270,116191404
33156739072,100562919424,61538304,1006829568,6.646,1.317,91.661,0.376,0,2202016,119511624
33157615616,100561907712,61546496,1006952448,5.802,1.185,92.514,0.499,0,2127282,107693664
33158094848,100561321984,61546496,1007050752,5.904,0.812,92.971,0.312,0,2232082,114724286
33160167424,100559138816,61554688,1007153152,7.970,1.035,86.853,4.142,0,2308022,123138786
33160089600,100559081472,61554688,1007280128,7.934,1.151,90.604,0.311,0,2109918,114124848
33159860224,100559138816,61554688,1007452160,11.741,1.339,86.484,0.436,0,2222770,117524598
33164075008,100554776576,61562880,1007583232,6.559,1.167,91.580,0.694,0,2107084,117379990
33162805248,100555931648,61562880,1007697920,9.331,0.943,89.255,0.471,0,2274526,122768292
33166286848,100552331264,61571072,1007808512,7.534,0.969,91.091,0.406,0,2061098,114661984
33166946304,100551553024,61571072,1007923200,7.244,1.223,90.969,0.564,0,2072386,112851656
33168187392,100550209536,61571072,1008025600,8.312,1.156,90.219,0.312,0,2191570,119100820
33173774336,100544356352,61579264,1008271360,10.997,1.336,87.170,0.497,0,2198812,118304126
33175199744,100542799872,61579264,1008394240,5.495,0.942,93.187,0.377,0,2147590,117444250
33175871488,100542009344,61579264,1008513024,5.649,0.936,93.009,0.406,0,2153566,115247944
33177739264,100540030976,61587456,1008615424,5.514,1.190,91.009,2.287,0,2263440,122142898
33176997888,100540649472,61587456,1008738304,4.955,1.035,93.540,0.470,0,2194120,115830712
33176719360,100540657664,61595648,1008992256,5.860,1.091,92.550,0.499,0,2240506,117143300
33178390528,100538888192,61595648,1009086464,5.647,1.210,92.740,0.403,0,2239098,117908786
33177894912,100539256832,61595648,1009209344,4.105,1.034,94.516,0.345,0,2186202,117271798
33178169344,100538871808,61603840,1009311744,7.580,2.237,89.034,1.149,0,2137416,116545966
33181151232,100535734272,61603840,1009459200,4.920,1.222,93.513,0.345,0,2267580,120059054
33180614656,100536176640,61612032,1009545216,4.872,0.843,93.785,0.500,0,2044276,110645682
33181855744,100534820864,61612032,1009651712,5.172,1.097,93.417,0.313,0,2185880,113172078
33181188096,100535341056,61612032,1009790976,3.765,0.973,94.948,0.314,0,2220548,120997306
33184210944,100532215808,61612032,1009893376,4.178,0.911,92.680,2.231,0,2271362,119118130
33185542144,100530757632,61612032,1010020352,6.011,1.190,92.455,0.344,0,2124972,114672782
33186238464,100529950720,61616128,1010122752,5.263,1.034,92.982,0.721,0,2301114,119869778
33186529280,100529532928,61616128,1010237440,5.079,0.820,93.659,0.442,0,2312590,118768336
33186160640,100529770496,61616128,1010368512,4.886,1.221,93.392,0.501,0,2414072,120715188
33186586624,100529221632,61624320,1010479104,5.011,1.253,93.267,0.470,0,2417564,124701004
33187971072,100527730688,61624320,1010581504,4.523,0.879,93.876,0.722,0,2350812,123586282
33188864000,100526735360,61628416,1010679808,4.151,1.217,94.101,0.531,0,2118904,112211610
33188126720,100527325184,61628416,1010823168,4.589,1.280,93.600,0.531,0,2142588,113683282
33188962304,100526374912,61628416,1010937856,5.507,0.876,93.148,0.469,0,2071056,110777026
33189289984,100525928448,61628416,1011052544,5.161,1.314,93.087,0.438,0,2193924,118971216
33189421056,100525674496,61636608,1011167232,5.796,1.091,88.376,4.737,0,2204558,120561406
33189818368,100525150208,61644800,1011277824,4.795,1.121,93.431,0.654,0,2132600,115832156
33188450304,100526403584,61644800,1011392512,5.618,0.874,93.102,0.406,0,2162612,118020510
33190850560,100523872256,61644800,1011523584,5.025,1.124,93.414,0.437,0,2125818,117412650
33192218624,100522270720,61644800,1011757056,4.052,0.879,94.661,0.408,0,2132970,115071208
33191833600,100522541056,61652992,1011863552,5.140,1.028,92.773,1.059,0,2172952,116595500
33192157184,100522078208,61661184,1011990528,4.978,1.346,93.049,0.626,0,2241996,117029500
33190801408,100523331584,61661184,1012088832,4.732,0.909,93.983,0.376,0,2292074,122749210
33193730048,100520263680,61661184,1012219904,4.964,1.249,93.194,0.593,0,2208888,120331516
33191567360,100522323968,61661184,1012322304,3.700,0.822,95.066,0.411,0,2062592,115995472
33192468480,100521299968,61661184,1012436992,3.586,0.786,95.250,0.377,0,2128118,116463538
33192189952,100521443328,61677568,1012551680,2.954,0.880,95.757,0.409,0,2085780,114414802
33193062400,100520448000,61677568,1012670464,5.585,1.224,92.909,0.282,0,2098396,112124564
33192714240,100520665088,61677568,1012797440,4.530,0.912,94.181,0.377,0,2171762,112991112
33193775104,100519489536,61677568,1012903936,4.558,1.195,93.681,0.566,0,2056860,109809352
33194065920,100519079936,61677568,1013018624,4.574,1.159,91.729,2.538,0,2179122,120005462
33192620032,100520407040,61685760,1013129216,5.108,1.097,92.855,0.940,0,2135716,116188394
33194119168,100518785024,61685760,1013252096,3.999,0.850,94.742,0.409,0,2322520,119784104
33194700800,100518080512,61685760,1013374976,5.970,1.493,92.133,0.404,0,2243238,120677756
33196777472,100515889152,61693952,1013473280,3.977,1.034,94.551,0.438,0,2118854,109211562
33196634112,100515917824,61693952,1013587968,3.880,0.939,94.712,0.469,0,2172310,115771358
33195966464,100516462592,61706240,1013694464,3.935,0.724,94.271,1.070,0,2234392,118825508
33194745856,100517548032,61706240,1013825536,4.496,1.155,93.600,0.749,0,2216270,117554982
33195245568,100516966400,61706240,1013907456,4.884,0.877,93.676,0.564,0,2234134,117172382
33197740032,100514332672,61714432,1014038528,6.240,1.061,92.200,0.499,0,2097924,111538620
33198354432,100513460224,61714432,1014296576,5.048,1.091,93.456,0.405,0,2423270,122015958
33200873472,100510826496,61714432,1014407168,4.669,1.214,93.589,0.529,0,2288036,122439192
33199415296,100512165888,61714432,1014525952,4.519,1.028,94.017,0.436,0,2228792,116700714
33202470912,100508999680,61714432,1014632448,5.672,1.661,92.228,0.439,0,2247930,118397566
33202331648,100508999680,61714432,1014771712,3.608,0.879,95.105,0.408,0,2376270,120435248
33202057216,100509192192,61714432,1014853632,5.278,0.937,93.348,0.437,0,2153446,113309052
33202192384,100508917760,61730816,1014968320,5.255,1.157,88.802,4.786,0,2272884,112588516
33203392512,100507574272,61730816,1015111680,4.341,1.031,94.222,0.406,0,2429296,128948268
33202511872,100508332032,61730816,1015226368,5.022,0.936,93.637,0.405,0,2229548,118965340
33203077120,100507656192,61730816,1015336960,4.100,0.876,94.679,0.344,0,2239552,119238920
33202708480,100507914240,61730816,1015447552,3.885,0.940,94.831,0.345,0,2066430,108575534
33204199424,100506312704,61747200,1015533568,5.164,1.189,92.707,0.939,0,2521034,115944246
33205374976,100505006080,61747200,1015664640,5.280,1.250,92.971,0.500,0,2343020,122070008
33204256768,100505993216,61747200,1015787520,6.486,1.154,91.830,0.530,0,2190246,116172508
33203822592,100506304512,61747200,1015906304,4.103,1.127,94.300,0.470,0,2246878,120934212
33206747136,100503269376,61747200,1016016896,5.627,0.912,93.052,0.409,0,2219606,121232558
33207939072,100501823488,61755392,1016258560,4.096,1.094,94.184,0.625,0,2309080,121698758
33206030336,100503609344,61755392,1016381440,3.180,0.661,95.812,0.346,0,2266614,120704858
33205661696,100503859200,61763584,1016483840,4.906,0.875,93.594,0.625,0,2185722,113136582
33204682752,100504719360,61763584,1016602624,4.734,1.059,93.616,0.592,0,2376188,125107474
33206956032,100502319104,61763584,1016721408,3.859,1.004,94.666,0.471,0,2276634,121286884
33208922112,100500226048,61771776,1016836096,5.493,1.030,93.040,0.437,0,2186728,116247664
33209970688,100499058688,61771776,1016954880,4.524,1.186,92.418,1.872,0,2310660,120675110
33208844288,100500074496,61771776,1017065472,6.193,1.126,92.274,0.407,0,2189262,113932010
33211977728,100496818176,61771776,1017184256,5.686,1.031,92.815,0.469,0,2282710,115961178
33210867712,100497813504,61771776,1017298944,5.191,1.251,93.183,0.375,0,2207932,119147560
33210593280,100497969152,61779968,1017409536,4.216,0.874,94.285,0.625,0,2258804,119432018
33211092992,100497346560,61788160,1017524224,3.732,0.784,94.732,0.753,0,2237942,120445874
33210191872,100498120704,61788160,1017647104,4.005,0.907,94.743,0.344,0,2271424,116722800
33212588032,100495613952,61788160,1017753600,5.202,0.883,93.600,0.315,0,2197752,114674340
33212420096,100495634432,61788160,1017896960,3.712,1.029,94.916,0.343,0,2285698,115810640
33210699776,100497231872,61796352,1017999360,4.386,0.971,94.079,0.564,0,2238538,116104860
33213173760,100494655488,61796352,1018097664,6.450,1.240,89.891,2.419,0,2258738,118808268
33214074880,100493627392,61804544,1018212352,3.996,1.342,94.255,0.406,0,2122858,116384182
33212608512,100494974976,61804544,1018327040,4.112,1.193,94.288,0.408,0,2220618,116943600
33212014592,100495446016,61804544,1018445824,3.019,1.038,95.252,0.692,0,2174012,111180342
33211834368,100495376384,61812736,1018687488,4.474,0.970,94.024,0.532,0,2254724,115519540
33212993536,100494098432,61812736,1018806272,4.742,0.974,93.247,1.036,0,2211906,121971444
33213550592,100493430784,61812736,1018916864,5.724,1.189,92.743,0.344,0,2294892,121369770
33216684032,100490178560,61820928,1019023360,4.671,1.097,93.730,0.502,0,2288594,120524208
33214902272,100491808768,61820928,1019162624,4.393,1.059,94.050,0.498,0,2288590,119523926
33215524864,100491067392,61829120,1019269120,6.164,1.090,92.092,0.654,0,2198088,115583776
33216282624,100490194944,61829120,1019379712,4.919,1.183,93.306,0.592,0,2220264,116270596
33217163264,100489199616,61829120,1019494400,4.577,1.003,92.445,1.975,0,2349794,123677990
33216245760,100489990144,61829120,1019621376,3.385,1.065,95.080,0.470,0,2272732,121922450
33217204224,100488900608,61837312,1019731968,3.584,0.786,95.064,0.566,0,2214252,117582346
33218064384,100487921664,61845504,1019842560,4.903,1.062,93.473,0.562,0,2098976,114563220
33217740800,100488126464,61845504,1019961344,4.494,1.061,93.976,0.468,0,2265888,123766414
33216368640,100489379840,61845504,1020080128,4.984,0.878,93.166,0.972,0,2261144,121429104
29050232832,104655409152,61845504,1020182528,4.802,1.310,93.452,0.437,0,2056612,108935922
25858433024,107847970816,61845504,1019408384,4.740,1.029,93.920,0.312,0,1728228,95159262
21805285376,111902138368,61865984,1018368000,3.227,0.909,95.175,0.689,0,1572836,87092122
18665275392,115042942976,61865984,1017569280,3.620,0.811,95.162,0.406,0,1286462,72673242
15474982912,118234279936,61865984,1016524800,2.917,0.659,94.479,1.945,0,1076408,59656312
12285612032,121424281600,61865984,1015894016,1.978,0.502,96.797,0.722,0,822840,46137904
9090191360,124620414976,61865984,1015181312,1.406,0.500,97.750,0.344,0,649922,37067578
5905899520,127805771776,61878272,1014104064,0.628,0.282,98.902,0.188,0,422142,21806208
2688241664,131024072704,61886464,1013452800,0.469,0.219,99.218,0.094,0,202614,11388002
1086177280,132627238912,61886464,1012350976,0.188,0.094,99.531,0.188,0,111458,1497468
1068490752,132645367808,61886464,1011908608,0.031,0.031,99.937,0,0,67426,0
1068490752,132645367808,61886464,1011908608,0,0,100,0,0,95102,0
1067966464,132645892096,61886464,1011908608,0.031,0,99.969,0,0,98466,0
1067954176,132645892096,61906944,1011900416,0,0.031,99.688,0.281,0,67102,132
1067429888,132646408192,61906944,1011908608,0.031,0,99.969,0,0,32886,0
1067171840,132646666240,61906944,1011908608,0,0,100,0,0,66048,1508
1067171840,132646666240,61906944,1011908608,0.031,0,99.969,0,0,120886,0
1067171840,132646666240,61906944,1011908608,0,0,100,0,0,66760,0
1066913792,132646924288,61906944,1011908608,0,0.031,99.969,0,0,120044,168
1066647552,132647182336,61915136,1011908608,0.062,0,99.906,0.031,0,50984,0
1066131456,132647698432,61915136,1011908608,0,0,100,0,0,159218,0
1066131456,132647698432,61915136,1011908608,0,0,100,0,0,103162,1000
1065869312,132647956480,61915136,1011912704,0,0,100,0,0,101616,3310
1065869312,132647956480,61915136,1011912704,0.031,0.031,99.938,0,0,87230,0
1065611264,132648214528,61915136,1011912704,0,0,100,0,0,116926,0
1065291776,132648525824,61923328,1011912704,0,0.031,99.906,0.062,0,71300,0
1065033728,132648783872,61923328,1011912704,0.031,0,99.969,0,0,29624,0
1065033728,132648783872,61923328,1011912704,0,0,100,0,0,120374,84
1064517632,132649299968,61923328,1011912704,0,0,100,0,0,112020,84
1063743488,132650074112,61923328,1011912704,0.031,0.031,99.938,0,0,147670,0
1063735296,132650082304,61923328,1011912704,0,0,100,0,0,95178,0
1063211008,132650598400,61931520,1011912704,0.031,0,99.937,0.031,0,88498,0
1062948864,132650856448,61931520,1011916800,0.031,0,99.969,0,0,175994,220
1062948864,132650856448,61931520,1011916800,0.062,0.031,99.906,0,0,200362,1948
1062432768,132651372544,61931520,1011916800,0.031,0,99.969,0,0,136620,0
1079808000,132633485312,61935616,1012109312,1.282,0.313,97.624,0.781,0,566554,23244
1071878144,132639404032,61935616,1012301824,0.438,0.344,99.219,0,0,292012,37218
