"Dstat 0.7.3 CSV output"
"Author:","Dag Wieers <dag@wieers.com>",,,,"URL:","http://dag.wieers.com/home-made/dstat/"
"Host:","parasilo-16.rennes.grid5000.fr",,,,"User:","root"
"Cmdline:","dstat -m -c -n -o dstat.csv",,,,"Date:","23 Jun 2020 00:00:43 CEST"
"memory usage",,,,"total cpu usage",,,,,"net/total",
"used","free","buff","cach","usr","sys","idl","wai","stl","recv","send"
1557630976,129390878720,73003008,3671146496,0.244,0.090,99.495,0.171,0,0,0
1565970432,129382195200,73019392,3671498752,0.812,0.562,98.595,0.031,0,390236,20246
1602740224,129345396736,73019392,3671519232,0.843,0.437,98.720,0,0,388314,29406
1581170688,129366925312,73031680,3671498752,0.813,0.688,97.842,0.657,0,389436,25854
1567338496,129381126144,73043968,3671060480,0.468,0.437,99.032,0.062,0,5128,14076
1566908416,129381560320,73043968,3671056384,0,0.031,99.969,0,0,272,0
1566908416,129381560320,73043968,3671056384,0,0,100,0,0,416,0
1566908416,129381560320,73043968,3671056384,0,0.062,99.938,0,0,106,0
1566654464,129381814272,73043968,3671056384,0,0.031,99.969,0,0,234,0
1566625792,129381822464,73064448,3671056384,0,0,99.844,0.156,0,212,84
1566449664,129381998592,73064448,3671056384,0.063,0.063,99.875,0,0,3416,4872
1570291712,129378152448,73064448,3671056384,0.938,0.625,98.437,0,0,388878,25634
1568477184,129379966976,73064448,3671056384,0,0,100,0,0,0,0
1580855296,129367097344,73080832,3671531520,0.814,0.658,98.528,0,0,555618,28506
1573969920,129374416896,73093120,3671085056,0.438,0.469,99.031,0.062,0,3558,15072
1588183040,129359736832,73105408,3671531520,0.720,0.438,98.779,0.063,0,386142,14638
1587277824,129360629760,73105408,3671531520,0.936,0.811,98.252,0,0,387560,25874
1571094528,129377259520,73105408,3671085056,0.281,0.219,99.500,0,0,2254,14624
1575018496,129373249536,73105408,3671089152,1.812,0.125,98.062,0,0,223272,11748
1575591936,129372626944,73117696,3671089152,0.062,0.031,99.844,0.062,0,1962,2668
1576165376,129371942912,73129984,3671187456,0.469,0.156,99.312,0.062,0,343376,16208
1584431104,129363668992,73146368,3671183360,0.219,0.313,99.437,0.031,0,173342,15116
1583796224,129364201472,73146368,3671285760,0,0.031,99.969,0,0,4914,5488
1583538176,129364459520,73146368,3671285760,0,0.031,99.969,0,0,5202,5488
1583509504,129364475904,73158656,3671285760,0.062,0.031,99.844,0.062,0,5678,5668
1583505408,129364467712,73170944,3671285760,0.031,0.063,99.875,0.031,0,5386,5292
1584279552,129363693568,73170944,3671285760,0.156,0.031,99.812,0,0,8064,7840
1583763456,129364209664,73170944,3671285760,0,0.031,99.969,0,0,5020,5292
1583763456,129364209664,73170944,3671285760,0.031,0.031,99.938,0,0,5096,5488
1583497216,129364467712,73179136,3671285760,0.031,0,99.937,0.031,0,5202,5488
1583239168,129364725760,73179136,3671285760,0,0.031,99.969,0,0,5696,5656
1575825408,129372192768,73203712,3671207936,0.344,0.094,99.500,0.063,0,174402,17444
1574854656,129373257728,73203712,3671109632,0,0.031,99.969,0,0,288,0
1574592512,129373519872,73203712,3671109632,0,0.031,99.969,0,0,288,0
1574572032,129373528064,73216000,3671109632,0,0.062,98.875,1.062,0,234,0
1574023168,129374076928,73216000,3671109632,0,0,100,0,0,106,0
1573765120,129374334976,73228288,3671097344,0,0.031,99.938,0.031,0,106,84
1573236736,129374851072,73228288,3671109632,0,0.031,99.969,0,0,106,228
1573171200,129374908416,73228288,3671109632,0.500,0.125,99.375,0,0,17198,32768
1604431872,129342943232,73506816,3671363584,6.608,0.940,90.636,1.816,0,52664,74098
1605132288,129341222912,73969664,3671633920,2.195,0.408,95.328,2.070,0,7624,7520
1604657152,129341628416,73969664,3671699456,0.031,0,99.969,0,0,1398,1604
1603928064,129342349312,73977856,3671699456,0.063,0,99.875,0.063,0,1002,1604
1603903488,129342373888,73977856,3671699456,0,0,100,0,0,1100,1604
1603903488,129342373888,73986048,3671691264,0.188,0.031,99.719,0.063,0,1270,1814
1603633152,129342631936,73986048,3671703552,0.062,0.031,99.906,0,0,926,1604
1603629056,129342636032,73986048,3671703552,0,0.031,99.969,0,0,820,1604
1596870656,129349394432,73986048,3671703552,0.062,0,99.938,0,0,926,1604
1602826240,129342771200,74002432,3672301568,1.255,0.157,98.463,0.126,0,737490,709960
1604005888,129340448768,74027008,3673395200,1.283,0.282,98.185,0.250,0,1664910,1618138
1603194880,129340104704,74027008,3674492928,0.720,0.094,99.186,0,0,2668298,2311575
1603616768,129338081280,74027008,3676037120,0.781,0.219,99.000,0,0,3095102,3044576
1602252800,129337524224,74027008,3677835264,0.969,0.188,98.844,0,0,3744394,3753740
1622945792,129314230272,74027008,3680350208,3.188,0.313,96.499,0,0,5065034,4582156
1628143616,129306603520,74043392,3682701312,1.655,0.250,98.001,0.094,0,5191982,5196138
1628835840,129303240704,74043392,3685306368,1.468,0.250,97.845,0.437,0,5667936,5584987
1628839936,129299894272,74043392,3688566784,0.750,0.219,99.031,0,0,6345274,6490745
1627660288,129297764352,74043392,3691782144,1.062,0.156,98.782,0,0,6653268,6604024
1627533312,129294176256,74043392,3695407104,0.813,0.250,98.937,0,0,7404932,7564102
1625878528,129291853824,74051584,3699281920,0.877,0.157,98.904,0.063,0,8111626,8102870
1627070464,129286721536,74059776,3703111680,1.034,0.188,98.747,0.031,0,7931348,8007830
1626746880,129283661824,74059776,3706413056,0.843,0.219,98.938,0,0,7832728,7883838
1627586560,129278664704,74059776,3710447616,1.557,0.311,98.132,0,0,7562432,7606423
1626386432,129276325888,74059776,3713880064,0.751,0.188,99.062,0,0,7891350,7992668
1627680768,129270755328,74067968,3718045696,1.252,0.250,98.436,0.063,0,8394030,8427185
1627791360,129266618368,74080256,3721940992,1.471,0.250,97.591,0.688,0,7654202,7671715
1641111552,129249079296,74080256,3726053376,1.876,0.250,97.874,0,0,8504588,8688444
1635598336,129250611200,74080256,3729920000,1.125,0.156,98.718,0,0,8110282,8143553
1634201600,129248235520,74080256,3733581824,0.626,0.125,99.248,0,0,7572102,7651827
1641066496,129237123072,74088448,3737702400,2.249,0.406,97.251,0.094,0,8550556,8674349
1645674496,129229381632,74088448,3740758016,1.718,0.187,98.094,0,0,6330758,6432246
1649389568,129221332992,74096640,3744960512,1.876,0.219,97.749,0.156,0,8832764,8903361
1636519936,129229754368,74096640,3749285888,1.252,0.125,98.623,0,0,8895694,8992210
1652736000,129209110528,74096640,3753598976,1.750,0.344,97.906,0,0,9001498,9087553
1653927936,129204043776,74104832,3757432832,1.657,0.313,97.967,0.063,0,8541292,8646741
1653424128,129200336896,74104832,3761475584,1.596,0.156,98.247,0,0,7845770,7947258
1653227520,129196707840,74113024,3765202944,0.875,0.250,98.844,0.031,0,8505700,8471220
1647988736,129197735936,74113024,3769266176,0.783,0.157,99.060,0,0,7821378,7887589
1648304128,129193619456,74113024,3772973056,0.469,0.156,99.374,0,0,7665174,7738477
1647718400,129189748736,74121216,3777314816,0.438,0.188,99.281,0.094,0,8954696,9127779
1648173056,129185390592,74121216,3781103616,0.531,0.250,99.219,0,0,8855672,8845321
1647509504,129182035968,74121216,3785003008,0.469,0.156,99.375,0,0,7882146,8006530
1644957696,129180778496,74129408,3788726272,1.250,0.219,98.500,0.031,0,8710336,8792567
1651421184,129169448960,74129408,3793440768,0.688,0.188,99.124,0,0,8225490,8284455
1659416576,129157500928,74137600,3797266432,0.563,0.125,99.250,0.063,0,7929718,7963885
1672445952,129140563968,74137600,3801042944,2.248,0.468,97.284,0,0,9045046,16883352
1685458944,129122787328,74137600,3805528064,5.064,0.313,93.748,0.875,0,8303900,35733701
1687367680,129116602368,74137600,3809693696,2.972,0.188,96.841,0,0,8525180,35441773
1688555520,129111379968,74145792,3813715968,0.939,0.250,98.748,0.063,0,8463556,37780822
1688748032,129107255296,74153984,3817529344,0.531,0.188,99.219,0.063,0,8001068,37053786
1689894912,129102094336,74153984,3821441024,0.625,0.312,99.063,0,0,8262650,37357763
1692651520,129095004160,74153984,3825614848,0.470,0.125,98.653,0.752,0,8629184,36584988
1689108480,129095405568,74158080,3828682752,0.469,0.219,98.907,0.406,0,8228078,36492451
1704984576,129075318784,74158080,3832782848,3.374,0.312,96.314,0,0,8943672,38329319
1729957888,129045086208,74174464,3837857792,5.807,0.343,93.600,0.250,0,8545406,37552977
1746284544,129025155072,74174464,3841335296,6.309,0.344,93.348,0,0,8437462,38253350
1757675520,129008959488,74174464,3846041600,0.595,0.219,99.185,0,0,8333804,37738658
1741987840,129020829696,74174464,3849752576,0.375,0.188,99.438,0,0,8140246,35516916
1741332480,129017167872,74174464,3853918208,0.438,0.313,99.250,0,0,8682820,36509942
1741336576,129013112832,74182656,3857862656,0.624,0.312,99.033,0.031,0,8287878,16429141
1753702400,128996839424,74190848,3861651456,2.033,0.250,97.686,0.031,0,7995630,15874227
1752023040,128994054144,74190848,3865968640,0.470,0.125,99.405,0,0,9123176,17993114
1742577664,128999456768,74190848,3869917184,0.438,0.125,99.437,0,0,8226654,16600890
1742811136,128995241984,74190848,3873832960,0.375,0.250,99.374,0,0,8564740,16977088
1741692928,128992489472,74199040,3877564416,0.407,0.188,99.312,0.094,0,7343038,14682017
1740820480,128988696576,74199040,3882090496,0.749,0.343,98.908,0,0,9507080,18871678
1741111296,128984309760,74207232,3886084096,0.531,0.281,99.156,0.031,0,8533244,17006346
1744101376,128977096704,74207232,3890196480,0.376,0.188,99.436,0,0,8465584,16127773
1754415104,128962670592,74215424,3894165504,0.501,0.219,99.186,0.094,0,8326024,17315439
1763741696,128949252096,74223616,3898138624,0.345,0.376,99.217,0.063,0,8325102,16682732
1771683840,128937508864,74223616,3901845504,0.313,0.157,99.530,0,0,7710488,15353886
1783496704,128921968640,74223616,3905458176,0.531,0.281,99.187,0,0,9056530,18099005
1791815680,128908935168,74231808,3910041600,0.406,0.344,98.468,0.781,0,8124030,16076148
1808822272,128887783424,74231808,3914104832,1.061,0.343,98.472,0.125,0,8125602,16398253
1807839232,128884670464,74240000,3918065664,0.282,0.251,99.404,0.063,0,8759510,17366138
1807257600,128880939008,74240000,3922284544,0.594,0.344,99.062,0,0,8944148,17923828
1806491648,128877592576,74240000,3926278144,0.532,0.156,99.312,0,0,7690822,15343949
1807470592,128872398848,74240000,3930341376,0.376,0.313,99.311,0,0,9083442,17950116
1807364096,128868519936,74248192,3934199808,0.407,0.250,98.185,1.158,0,8076802,16096755
1806901248,128864694272,74256384,3938369536,0.469,0.313,99.156,0.063,0,8748994,17339701
1806274560,128861065216,74256384,3942506496,0.375,0.344,99.281,0,0,8569146,17260943
1806405632,128857452544,74256384,3945918464,0.438,0.250,99.312,0,0,8259158,16459625
1805885440,128853307392,74256384,3950440448,0.531,0.281,99.188,0,0,8376238,16573001
1805758464,128849436672,74264576,3954327552,1.032,0.281,98.655,0.031,0,8264188,16244709
1805127680,128845549568,74272768,3958747136,0.406,0.281,99.250,0.062,0,8572124,17290079
1806102528,128842182656,74272768,3961028608,0.500,0.281,99.219,0,0,8040228,16147472
1805176832,128838045696,74272768,3965939712,0.500,0.281,99.219,0,0,8544930,17026921
1804640256,128833871872,74272768,3970531328,0.501,0.219,99.280,0,0,8661534,17260654
1804890112,128829485056,74272768,3974569984,0.500,0.281,99.219,0,0,8431160,16919826
1805049856,128825339904,74289152,3978420224,0.469,0.313,99.125,0.094,0,8118110,16073397
1807323136,128818839552,74289152,3982524416,0.531,0.312,99.157,0,0,8597338,17139960
1817251840,128804749312,74289152,3986587648,0.313,0.282,99.405,0,0,8223550,15913421
1825525760,128792231936,74289152,3990728704,0.375,0.313,99.312,0,0,8756572,17923467
1836056576,128777773056,74289152,3994550272,0.344,0.282,99.374,0,0,8002936,15861512
1846284288,128763641856,74297344,3998322688,0.500,0.250,99.219,0.031,0,8183810,16388943
1856479232,128749010944,74305536,4002639872,0.500,0.313,99.155,0.031,0,9147708,18323266
1867153408,128734654464,74305536,4006215680,0.344,0.313,99.343,0,0,8248290,16336879
1877536768,128719507456,74305536,4010844160,0.500,0.406,99.095,0,0,8576992,17085352
1888419840,128704618496,74309632,4014727168,0.407,0.251,98.998,0.345,0,8290092,16491074
1898422272,128690266112,74317824,4018966528,0.470,0.250,98.685,0.595,0,8611370,17313446
1922408448,128662810624,74317824,4022337536,0.938,0.219,98.843,0,0,8391036,16666021
1921458176,128659197952,74326016,4026806272,0.438,0.188,99.187,0.188,0,8549104,16891433
1922736128,128654807040,74326016,4029804544,0.251,0.157,99.593,0,0,7457738,14871093
1921355776,128650940416,74326016,4034904064,0.406,0.250,99.344,0,0,9061594,16649560
1922015232,128646811648,74334208,4038303744,0.375,0.250,98.467,0.907,0,8469712,18311816
1923022848,128641359872,74334208,4042596352,0.781,0.250,98.968,0,0,8571940,17296542
1922973696,128636973056,74334208,4046905344,0.281,0.312,99.406,0,0,8272086,16311102
1922523136,128633102336,74342400,4051116032,0.406,0.188,99.375,0.031,0,8591800,17145037
1922203648,128629239808,74342400,4055187456,0.344,0.188,99.468,0,0,8589428,17144727
1922461696,128625057792,74350592,4059000832,0.282,0.219,99.437,0.063,0,7909046,15830475
1922846720,128620662784,74350592,4062912512,0.500,0.219,99.281,0,0,8547758,16945060
1922834432,128617050112,74350592,4066430976,0.313,0.282,99.406,0,0,8265762,16557569
1922068480,128612921344,74350592,4071206912,0.438,0.313,99.250,0,0,8746934,17486958
1921720320,128609550336,74358784,4074807296,0.624,0.250,99.095,0.031,0,7787302,14183015
1921781760,128604889088,74366976,4079267840,0.780,0.312,98.846,0.062,0,9210952,19676622
1921597440,128601518080,74366976,4082728960,0.407,0.281,99.312,0,0,8475408,16878123
1921822720,128596582400,74366976,4087271424,0.407,0.219,99.375,0,0,7942504,15662563
1921462272,128592711680,74366976,4091400192,0.345,0.219,99.436,0,0,8653420,17308466
1921900544,128588050432,74366976,4095504384,0.438,0.188,99.374,0,0,8569858,17059368
1926324224,128579534848,74383360,4099481600,0.720,0.219,98.966,0.094,0,8371454,16732440
1925652480,128576163840,74383360,4103401472,0.407,0.219,99.374,0,0,8197644,16374322
1925496832,128572534784,74383360,4107075584,0.500,0.312,99.188,0,0,8272908,16537342
1924300800,128569434112,74383360,4111249408,0.532,0.188,99.280,0,0,8311566,16390160
1923801088,128565563392,74383360,4115513344,0.532,0.188,99.281,0,0,8916978,17887407
1924251648,128560918528,74391552,4119597056,0.406,0.344,99.093,0.156,0,8550952,16983685
1924358144,128557047808,74407936,4123267072,0.469,0.344,98.123,1.063,0,8276278,16386848
1923923968,128553451520,74407936,4127170560,0.344,0.282,99.374,0,0,7560364,15114915
1924083712,128548790272,74407936,4131549184,0.469,0.281,99.250,0,0,9086748,18253069
1924390912,128544403456,74416128,4135518208,0.655,0.343,98.908,0.094,0,8283442,16450484
1928691712,128535789568,74424320,4139687936,0.500,0.406,99.031,0.062,0,8787940,17530261
1940127744,128520916992,74424320,4143034368,0.438,0.219,98.591,0.752,0,8236624,16400147
1950392320,128506122240,74432512,4147429376,0.376,0.250,99.343,0.031,0,8480898,16835561
1958105088,128493879296,74432512,4151816192,0.376,0.219,99.405,0,0,8712694,17519029
1968848896,128479653888,74432512,4155228160,0.438,0.282,99.281,0,0,8201538,16160334
1978605568,128465633280,74440704,4159361024,0.376,0.219,99.342,0.063,0,8005890,15845954
1988833280,128451018752,74440704,4163612672,0.625,0.250,99.126,0,0,8621032,17285391
1998811136,128436965376,74440704,4167589888,0.375,0.313,99.312,0,0,8269676,16464073
2009718784,128422092800,74448896,4171444224,0.532,0.219,99.187,0.063,0,8065520,16095580
2020368384,128406962176,74448896,4175818752,0.438,0.157,99.405,0,0,8962222,17726076
2030747648,128392359936,74457088,4179927040,0.438,0.250,99.249,0.063,0,8546202,17081279
2042179584,128377217024,74457088,4183531520,0.438,0.313,99.249,0,0,8694296,17536987
2052005888,128362586112,74457088,4188196864,0.532,0.188,99.281,0,0,8533196,16474625
2060898304,128350842880,74457088,4190982144,0.251,0.125,99.624,0,0,7250806,14931097
2070679552,128336228352,74465280,4195700736,0.656,0.281,99.032,0.031,0,9066892,18004948
2098466816,128303779840,74473472,4200189952,1.093,0.531,98.314,0.062,0,8876046,17690104
2097942528,128300175360,74473472,4204232704,0.500,0.312,99.188,0,0,8043866,16042250
2098216960,128296128512,74473472,4207882240,0.563,0.188,98.341,0.908,0,8279532,16425847
2097360896,128292515840,74473472,4212248576,0.500,0.188,99.312,0,0,8944922,17977493
2097401856,128288407552,74473472,4216197120,0.407,0.282,99.312,0,0,8367724,16511042
2097106944,128284205056,74489856,4220555264,0.469,0.281,99.156,0.094,0,8482420,17067583
2098610176,128279801856,74489856,4223385600,0.344,0.250,99.405,0,0,8318232,16498015
2097750016,128275935232,74489856,4227956736,0.407,0.250,98.811,0.532,0,8160272,16340273
2097266688,128272633856,74489856,4231639040,0.344,0.282,99.374,0,0,8027278,15805223
2097401856,128267390976,74489856,4236578816,0.376,0.282,99.342,0,0,9088374,18227622
2097393664,128263503872,74498048,4240388096,0.531,0.250,99.156,0.062,0,8591156,17130416
2097385472,128259100672,74506240,4244635648,0.282,0.188,99.498,0.031,0,8308140,16523590
2098139136,128255488000,74506240,4247416832,0.407,0.250,99.343,0,0,8402762,16739213
2096787456,128251351040,74506240,4252758016,0.534,0.220,99.246,0,0,8536724,17121545
2096619520,128247738368,74506240,4256440320,0.407,0.313,99.281,0,0,7795268,15391296
2097123328,128242823168,74530816,4260708352,0.594,0.313,98.812,0.281,0,8871502,17801936
2096828416,128239210496,74530816,4264509440,0.344,0.406,99.250,0,0,8372526,16547419
2107609088,128224497664,74530816,4268351488,0.938,0.250,98.811,0,0,8491658,17029469
2108313600,128219344896,74530816,4272668672,0.375,0.219,99.406,0,0,8644588,17323482
2101174272,128222154752,74530816,4276850688,0.344,0.156,99.499,0,0,8341092,16617037
2100441088,128219041792,74539008,4280578048,0.469,0.219,99.281,0.031,0,7849546,14253744
2099572736,128215945216,74547200,4284456960,0.438,0.157,99.374,0.031,0,8424564,18229550
2099281920,128211959808,74547200,4288602112,0.438,0.156,99.405,0,0,8400048,16691086
2099281920,128207572992,74547200,4292886528,0.469,0.375,99.156,0,0,8989476,17851915
2099085312,128203960320,74547200,4296597504,0.500,0.219,99.281,0,0,7780852,15414045
2099060736,128199888896,74555392,4300578816,0.438,0.281,99.187,0.094,0,8282634,16668369
2098978816,128195760128,74555392,4304703488,0.563,0.281,99.156,0,0,9121530,16688746
2099150848,128192147456,74563584,4308037632,0.438,0.188,99.343,0.031,0,7852830,17047352
2099130368,128187244544,74567680,4312829952,0.344,0.250,98.372,1.033,0,8898788,17847886
2099339264,128183656448,74567680,4316127232,0.344,0.219,99.437,0,0,8253460,14817307
2098892800,128179523584,74575872,4320579584,0.531,0.281,99.125,0.062,0,8513778,18567705
2099535872,128174862336,74575872,4324462592,0.344,0.313,99.343,0,0,8031438,16020473
2099503104,128170201088,74575872,4329037824,0.344,0.219,99.437,0,0,8377688,16651220
2099851264,128166039552,74584064,4332699648,0.438,0.282,98.435,0.845,0,8186412,15712912
2099437568,128162168832,74584064,4336861184,0.438,0.250,99.312,0,0,8679466,17976192
2100174848,128157233152,74592256,4340908032,0.375,0.313,99.249,0.063,0,8512412,16925451
2099531776,128154120192,74592256,4344573952,0.783,0.282,98.935,0,0,8509480,17061659
2100326400,128149164032,74592256,4348616704,0.562,0.281,99.157,0,0,7609352,15147247
2099941376,128145092608,74592256,4352942080,0.376,0.282,99.343,0,0,9155972,18180750
2099773440,128142254080,74600448,4355887104,0.438,0.219,99.312,0.031,0,8317988,16549206
2099134464,128137879552,74608640,4360744960,0.407,0.219,99.280,0.094,0,8659138,17343595
2098610176,128134524928,74608640,4364525568,0.468,0.343,99.189,0,0,8135546,16221849
2098450432,128130174976,74608640,4368920576,0.313,0.375,99.312,0,0,8362054,16564328
2098278400,128126038016,74608640,4373110784,0.438,0.250,99.312,0,0,8751546,17559011
2098413568,128121638912,74616832,4377251840,0.500,0.219,99.187,0.094,0,8355566,16550472
2097872896,128117964800,74633216,4381274112,0.500,0.219,99.188,0.094,0,8404828,16951218
2097864704,128113909760,74633216,4385234944,0.469,0.312,99.219,0,0,8333450,16486488
2097909760,128110338048,74633216,4388671488,0.407,0.219,99.374,0,0,7839222,15524108
2097844224,128106983424,74633216,4392046592,0.344,0.219,99.436,0,0,7910286,15376577
2097016832,128102887424,74637312,4396789760,0.250,0.344,98.498,0.908,0,8715302,17596542
2096820224,128099016704,74645504,4400787456,0.375,0.282,99.280,0.063,0,9367232,18666336
2096844800,128093859840,74653696,4405760000,0.250,0.282,99.405,0.063,0,8278006,16435042
2096758784,128089989120,74653696,4409614336,0.313,0.156,99.531,0,0,8187252,16336100
2096926720,128085602304,74653696,4413734912,0.250,0.250,99.500,0,0,8433228,16851292
2096676864,128081731584,74653696,4417744896,0.406,0.250,98.812,0.531,0,8538036,16918607
2096979968,128077086720,74661888,4421976064,0.501,0.188,99.249,0.063,0,8732276,17487064
2096484352,128073474048,74661888,4425977856,0.344,0.188,99.469,0,0,8451072,16744824
2096640000,128069070848,74670080,4430094336,0.313,0.156,99.468,0.063,0,8599910,17206191
2098511872,128064425984,74670080,4432818176,1.159,0.157,98.685,0,0,8216290,15873666
2097958912,128060022784,74670080,4437610496,0.313,0.219,99.469,0,0,8462082,17335849
2100973568,128052551680,74678272,4441952256,0.625,0.187,99.126,0.062,0,8108672,16199119
2100637696,128048758784,74678272,4445958144,0.468,0.187,99.344,0,0,8468134,16750860
2100252672,128045113344,74678272,4449857536,0.344,0.219,99.437,0,0,8334344,16665683
2099539968,128041263104,74686464,4454285312,0.375,0.219,99.375,0.031,0,9025434,18027008
2099380224,128037392384,74686464,4458213376,0.562,0.187,99.251,0,0,8242624,16468620
2100772864,128031956992,74694656,4462133248,0.312,0.343,99.282,0.062,0,8248844,16401798
2100756480,128028196864,74694656,4465815552,0.282,0.188,99.530,0,0,8732702,17460557
2101751808,128023535616,74694656,4469379072,0.313,0.219,99.468,0,0,8194868,16166629
2101104640,128019161088,74694656,4474269696,0.312,0.312,99.375,0,0,8468648,17059366
2101231616,128015810560,74702848,4477403136,0.438,0.219,99.281,0.063,0,8366894,16477397
2100183040,128012189696,74715136,4481966080,0.438,0.250,98.155,1.157,0,8026986,16168246
2100674560,128007286784,74715136,4486221824,0.500,0.250,99.250,0,0,8783564,17373141
2100666368,128003657728,74715136,4489760768,0.313,0.282,99.406,0,0,7421112,14827860
2100527104,127999254528,74715136,4494172160,0.594,0.187,99.219,0,0,9168738,18285249
2100727808,127994834944,74715136,4498255872,0.438,0.282,99.280,0,0,8506226,17012453
2101362688,127989932032,74747904,4502392832,0.344,0.188,98.591,0.877,0,8471182,16824219
2101637120,127985270784,74747904,4506652672,0.438,0.156,99.406,0,0,8920330,17833145
2103111680,127979962368,74747904,4510404608,0.564,0.188,99.249,0,0,8274394,16351921
2102366208,127976738816,74747904,4514258944,0.313,0.125,99.562,0,0,8289062,16615360
2102206464,127972163584,74747904,4518907904,0.251,0.188,99.561,0,0,8523916,16845977
2104766464,127966511104,74756096,4521877504,0.780,0.218,98.939,0.062,0,7844602,15664906
2103656448,127962656768,74764288,4526694400,0.438,0.281,99.250,0.031,0,9057438,18203046
2103275520,127958999040,74764288,4530634752,0.282,0.188,99.531,0,0,8305136,16400650
2103259136,127954857984,74764288,4534673408,0.406,0.281,99.312,0,0,8379174,16877197
2103250944,127950712832,74764288,4538707968,0.313,0.219,99.467,0,0,8462358,16839496
2104004608,127947087872,74772480,4541501440,0.469,0.219,99.218,0.094,0,8517576,16899634
2102865920,127943200768,74772480,4546367488,0.438,0.281,99.281,0,0,8480170,16956456
2103005184,127939375104,74780672,4549955584,0.375,0.219,99.343,0.063,0,8363424,16668973
2102034432,127935655936,74780672,4554510336,0.376,0.188,99.436,0,0,8363248,16497589
2101714944,127932428288,74780672,4557967360,0.406,0.343,99.251,0,0,8412604,16918693
2101518336,127927607296,74788864,4562837504,0.469,0.219,99.281,0.031,0,8470080,16742933
2101649408,127923539968,74788864,4566634496,0.313,0.219,99.468,0,0,8024712,15900460
2101788672,127919153152,74788864,4570783744,0.250,0.282,99.468,0,0,8698114,17324448
2101223424,127915782144,74797056,4574597120,0.438,0.219,99.280,0.063,0,7906140,15891082
2101190656,127911473152,74797056,4578824192,0.438,0.188,99.374,0,0,8836118,17682720
2102288384,127906054144,74805248,4583034880,1.156,0.281,98.532,0.031,0,8943244,17592461
2103943168,127901392896,74805248,4585947136,1.189,0.250,97.621,0.939,0,8298602,16675435
2102542336,127897862144,74805248,4590759936,0.407,0.250,99.343,0,0,7899738,15567159
2101895168,127894257664,74805248,4594896896,0.593,0.219,99.188,0,0,8593516,17225213
2102083584,127889768448,74813440,4599062528,0.344,0.282,99.343,0.031,0,8700722,17425787
2101563392,127886524416,74821632,4602732544,0.345,0.251,99.342,0.063,0,7725322,15423805
2102591488,127882911744,74821632,4605251584,0.532,0.094,98.749,0.626,0,7765946,15407364
2100948992,127878512640,74825728,4611121152,0.438,0.313,98.748,0.501,0,9715806,19417694
2100445184,127874781184,74825728,4615233536,0.499,0.406,99.095,0,0,8719048,17182122
2100293632,127870619648,74833920,4619399168,0.469,0.313,99.155,0.063,0,8676558,17452202
2100523008,127866748928,74850304,4622954496,0.313,0.282,99.312,0.094,0,8259988,16412107
2099527680,127863226368,74850304,4627337216,0.625,0.156,99.219,0,0,8348786,16533753
2099220480,127859412992,74850304,4631326720,0.562,0.219,99.219,0,0,8406556,16882540
2099585024,127855304704,74850304,4635029504,0.407,0.219,99.374,0,0,8548926,15832077
2099695616,127851180032,74850304,4638867456,0.251,0.219,99.530,0,0,7838490,16959771
2098860032,127847723008,74858496,4643045376,0.282,0.313,99.311,0.094,0,8628126,17278781
2098921472,127843397632,74866688,4647186432,0.313,0.188,99.436,0.063,0,8194530,16118140
2098475008,127839526912,74866688,4651397120,0.624,0.281,99.095,0,0,8804078,17727919
2099896320,127833849856,74866688,4655542272,0.313,0.250,99.436,0,0,8680116,11639667
2100056064,127829979136,74866688,4659159040,0.219,0.157,99.624,0,0,7491972,7551279
2100064256,127825432576,74874880,4663603200,0.438,0.188,99.312,0.063,0,9272994,9405136
2119409664,127802191872,74874880,4667363328,1.437,0.344,98.219,0,0,8154888,8247386
2118852608,127798304768,74883072,4671725568,0.344,0.156,99.469,0.031,0,8564262,8651002
2137976832,127774375936,74899456,4675874816,1.280,0.343,98.346,0.031,0,8643444,8386931
