"Dstat 0.7.3 CSV output"
"Author:","Dag Wieers <dag@wieers.com>",,,,"URL:","http://dag.wieers.com/home-made/dstat/"
"Host:","grisou-44.nancy.grid5000.fr",,,,"User:","root"
"Cmdline:","dstat -m -c -n -o dstat.csv",,,,"Date:","24 May 2020 18:42:50 CEST"
"memory usage",,,,"total cpu usage",,,,,"net/total",
"used","free","buff","cach","usr","sys","idl","wai","stl","recv","send"
1008832512,132900683776,53354496,854568960,1.133,0.368,98.321,0.178,0,0,0
1020551168,132888489984,53354496,854908928,0.624,0.187,99.188,0,0,386992,15102
1010544640,132898729984,53354496,854462464,0.500,0.375,99.126,0,0,4306,14912
1027104768,132881702912,53374976,854720512,0.375,0.094,99.406,0.125,0,382836,10624
1014534144,132894445568,53374976,854462464,0.593,0.531,98.876,0,0,12090,15046
1013985280,132894994432,53374976,854462464,0,0.031,99.625,0.344,0,2530,2568
1019539456,132889350144,53374976,854466560,0.970,0.500,98.530,0,0,385634,23218
1019514880,132889374720,53374976,854466560,0,0.031,99.969,0,0,874,84
1019506688,132889382912,53374976,854466560,0,0,100,0,0,1790,0
1019236352,132889640960,53387264,854466560,0,0,99.906,0.094,0,992,0
1018720256,132890157056,53387264,854466560,0,0,99.593,0.407,0,1174,2380
1018462208,132890415104,53387264,854466560,0,0.031,98.906,1.063,0,406,0
1018281984,132890595328,53387264,854466560,0,0,100,0,0,580,1508
1018281984,132890595328,53387264,854466560,0,0,100,0,0,466,0
1018023936,132890853376,53387264,854466560,0,0,100,0,0,754,0
1017757696,132891111424,53395456,854466560,0,0,99.938,0.062,0,346,0
1017233408,132891635712,53395456,854466560,0,0,100,0,0,5072,0
1017233408,132891635712,53395456,854466560,0,0,100,0,0,4898,0
1017225216,132891643904,53395456,854466560,0,0,100,0,0,6968,0
1017532416,132891336704,53395456,854466560,0.031,0.031,99.938,0,0,7992,2568
1020133376,132888727552,53395456,854466560,1.092,0.687,98.221,0,0,393674,27122
1020080128,132888768512,53407744,854466560,0,0.031,99.906,0.062,0,9938,0
1022902272,132885872640,53407744,854482944,0.344,0.219,99.438,0,0,171932,11956
1032396800,132875759616,53407744,855064576,0.845,0.500,98.655,0,0,389578,16530
1019576320,132889026560,53407744,854618112,0.125,0.063,99.812,0,0,4468,13724
1032998912,132875337728,53415936,854876160,0.624,0.250,99.064,0.062,0,382968,11142
1015287808,132893306880,53415936,854618112,0.406,0.406,99.188,0,0,3900,14512
1016840192,132891742208,53428224,854618112,1.124,0.531,98.283,0.062,0,386360,25802
1016283136,132892299264,53428224,854618112,0,0,100,0,0,866,84
1016283136,132892299264,53428224,854618112,0,0,100,0,0,918,0
1047502848,132860739584,53440512,854872064,1.752,0.219,97.936,0.094,0,221976,9832
1019219968,132889243648,53440512,854622208,0.062,0.031,99.906,0,0,16264,4252
1018679296,132889784320,53452800,854609920,0,0,99.969,0.031,0,4722,1228
1017892864,132890558464,53452800,854622208,0,0,100,0,0,1154,1008
1018556416,132889894912,53452800,854622208,0.438,0.188,99.375,0,0,342100,14964
1026109440,132882145280,53452800,854814720,0.188,0.063,99.750,0,0,180040,21504
1025458176,132882784256,53465088,854814720,0,0.031,99.875,0.094,0,13188,13328
1025449984,132882784256,53473280,854814720,0,0,99.875,0.125,0,13474,13328
1025179648,132883050496,53477376,854814720,0,0.031,99.938,0.031,0,12600,13132
1024921600,132883308544,53477376,854814720,0,0,100,0,0,12956,13328
1024647168,132883582976,53477376,854814720,0,0,100,0,0,20200,18872
1024389120,132883841024,53477376,854814720,0,0,100,0,0,13100,13496
1023873024,132884357120,53477376,854814720,0,0,100,0,0,12842,13328
1023606784,132884615168,53485568,854814720,0.031,0.031,99.906,0.031,0,13226,13132
1016291328,132892114944,53485568,854630400,0.031,0.031,99.937,0,0,14270,15564
1016274944,132892131328,53485568,854630400,0,0,100,0,0,1004,0
1014591488,132893806592,53485568,854634496,0.344,0.062,99.594,0,0,172448,14288
1014317056,132894081024,53485568,854634496,0,0,100,0,0,916,0
1014059008,132894339072,53485568,854634496,0,0,100,0,0,950,0
1014046720,132894339072,53497856,854634496,0,0,99.938,0.062,0,718,0
1013776384,132894597120,53510144,854634496,0,0,99.969,0.031,0,1220,1948
1013092352,132895281152,53510144,854634496,0,0,100,0,0,1038,0
1013088256,132895281152,53510144,854638592,0,0,100,0,0,6282,220
1012555776,132895813632,53510144,854638592,0,0,100,0,0,1596,1158
1012555776,132895813632,53510144,854638592,0,0,100,0,0,466,0
1012289536,132896071680,53518336,854638592,0,0,99.969,0.031,0,858,0
1012031488,132896329728,53518336,854638592,0,0,100,0,0,1038,0
1012031488,132896329728,53518336,854638592,0,0.031,99.844,0.125,0,1610,0
1010040832,132898222080,53518336,854642688,1.031,0.625,98.344,0,0,390484,30406
1009766400,132898496512,53518336,854642688,0,0,100,0,0,806,0
1008984064,132899278848,53518336,854642688,0,0,100,0,0,708,0
1008713728,132899536896,53530624,854642688,0,0,99.937,0.063,0,918,0
1008455680,132899794944,53530624,854642688,0,0,100,0,0,880,0
1008443392,132899794944,53542912,854642688,0,0,99.938,0.062,0,1040,168
1007833088,132900405248,53542912,854642688,0.031,0,99.969,0,0,882,1008
1007833088,132900405248,53542912,854642688,0,0,100,0,0,806,0
1007316992,132900921344,53542912,854642688,0,0.031,99.969,0,0,992,0
1006792704,132901437440,53551104,854642688,0,0,99.969,0.031,0,2676,0
1006784512,132901445632,53551104,854642688,0,0,100,0,0,3202,0
1006784512,132901445632,53551104,854642688,0,0,100,0,0,1624,0
1731497984,132177059840,53551104,854315008,6.864,2.309,90.827,0,0,1327528,54770
4843012096,129063690240,53555200,855932928,32.987,12.830,54.182,0,0,1324434,54992
7970385920,125934891008,53592064,857288704,35.491,13.634,50.469,0.407,0,1652768,68192
11107573760,122796060672,53604352,858841088,35.104,12.225,52.357,0.314,0,1324890,56804
14299877376,119601999872,53612544,860442624,35.227,12.532,52.178,0.063,0,1323774,55038
17553666048,116346671104,53624832,861925376,38.110,13.740,47.995,0.155,0,1325584,58212
20703825920,113195171840,53637120,863178752,37.500,13.065,49.278,0.157,0,1690910,5845076
23757205504,110139961344,53649408,864927744,39.906,13.564,46.405,0.126,0,1523038,26205286
27019218944,106876538880,53665792,866258944,46.979,14.884,37.665,0.472,0,1744712,47322924
30063251456,103831355392,53669888,867360768,49.026,13.424,37.427,0.124,0,1267792,68618315
30934261760,102960279552,53678080,867418112,21.276,4.738,73.521,0.465,0,719476,90235313
31090819072,102803660800,53678080,867479552,13.707,1.807,84.081,0.405,0,906008,112596057
31256096768,102638309376,53678080,867553280,18.084,1.827,79.710,0.378,0,1063640,134674592
31447588864,102446436352,53780480,867827712,18.351,2.021,71.004,8.623,0,1193916,153399677
31642681344,102251249664,53780480,867917824,21.308,2.566,71.120,5.006,0,1368566,174513565
31839309824,102054506496,53780480,868032512,25.372,2.512,71.712,0.403,0,1543552,196041184
31997648896,101895909376,53780480,868282368,22.117,2.237,75.362,0.284,0,1577630,202073948
32089284608,101804138496,53780480,868413440,19.860,2.542,76.740,0.858,0,1582470,202059681
32229957632,101663342592,53796864,868507648,18.791,3.007,77.325,0.877,0,1552510,201913704
32344166400,101549002752,53796864,868634624,19.957,3.445,75.667,0.931,0,1570292,201959929
32371539968,101521502208,53796864,868757504,17.300,2.961,79.084,0.655,0,1547222,202253610
32348155904,101544714240,53796864,868884480,12.500,2.594,83.969,0.938,0,1535462,201991557
32334213120,101558390784,53796864,869130240,10.009,2.014,87.410,0.567,0,1497444,202127659
32327860224,101564604416,53805056,869261312,10.892,2.347,86.103,0.657,0,1501638,201815430
32337715200,101554642944,53805056,869359616,8.483,2.081,88.836,0.599,0,1501592,202141037
32372744192,101519486976,53805056,869486592,8.959,2.201,88.243,0.597,0,1495220,202162373
32410271744,101481799680,53805056,869605376,8.445,2.627,88.333,0.594,0,1505796,202331174
32447647744,101444276224,53805056,869748736,8.705,2.633,88.073,0.589,0,1534336,202044750
32480776192,101411028992,53813248,869859328,7.705,1.712,90.076,0.507,0,1533572,202181890
32487890944,101403783168,53817344,869982208,7.545,2.160,89.198,1.096,0,1489652,202091346
32493547520,101398007808,53817344,870096896,6.989,1.934,90.702,0.374,0,1500216,201958172
32510304256,101381124096,53817344,870223872,7.923,2.215,89.364,0.499,0,1509296,202331653
32536793088,101354516480,53817344,870334464,7.022,2.194,90.031,0.752,0,1488966,202118928
32542744576,101348429824,53825536,870457344,7.861,2.940,88.425,0.774,0,1492724,202139122
32566607872,101324427264,53825536,870592512,7.161,2.242,90.193,0.405,0,1420918,202301265
32569413632,101321412608,53850112,870772736,6.372,2.040,85.938,5.650,0,1435588,202028999
32581844992,101308862464,53850112,870887424,6.581,2.027,91.079,0.312,0,1438656,201967649
32590254080,101300326400,53850112,871006208,7.384,2.566,89.643,0.407,0,1479666,202244654
32621867008,101268582400,53858304,871129088,7.743,2.581,88.993,0.684,0,1481730,202197451
32627834880,101262503936,53858304,871239680,8.675,2.581,87.842,0.902,0,1460920,202046612
32633921536,101256290304,53866496,871354368,7.383,2.617,88.629,1.371,0,1495746,202112064
32662503424,101227442176,53866496,871612416,7.993,2.498,89.135,0.375,0,1470338,202226930
32665624576,101224198144,53866496,871735296,7.282,2.166,90.113,0.439,0,1481488,202250086
32669601792,101220098048,53874688,871845888,7.507,2.283,89.521,0.688,0,1503380,202110526
32687611904,101201965056,53874688,871964672,5.971,1.917,91.326,0.786,0,1456984,201856118
32701845504,101187596288,53874688,872095744,6.584,2.143,90.559,0.714,0,1477766,202384483
32711163904,101178155008,53874688,872218624,6.975,2.685,89.660,0.679,0,1479164,202048810
32718352384,101170814976,53874688,872361984,6.816,2.552,90.289,0.342,0,1458888,202219019
32719478784,101169586176,53882880,872456192,5.642,1.964,91.926,0.468,0,1474736,202192892
32724369408,101164560384,53882880,872591360,5.440,1.761,92.013,0.786,0,1469264,202068166
32732229632,101156577280,53882880,872706048,6.011,2.429,90.969,0.592,0,1488042,201983705
32735346688,101153329152,53891072,872824832,6.549,2.193,90.670,0.587,0,1448274,202319018
32735662080,101152899072,53891072,872935424,5.240,1.945,92.093,0.722,0,1441066,202100425
32735936512,101152481280,53903360,873062400,5.571,2.272,91.690,0.467,0,1765510,202228931
32745271296,101143015424,53903360,873193472,5.771,2.172,91.623,0.434,0,1438822,202337388
32759992320,101128179712,53903360,873299968,8.200,2.497,88.903,0.401,0,1438538,202085405
32762585088,101125447680,53907456,873435136,5.566,2.146,86.847,5.442,0,1443850,201735663
32772972544,101114933248,53907456,873562112,5.643,1.923,92.024,0.410,0,1450440,202152973
32775077888,101112647680,53915648,873668608,6.545,2.512,90.478,0.465,0,1437174,202157569
32773693440,101113905152,53915648,873787392,5.559,2.136,91.489,0.817,0,1443632,202184707
32783163392,101104300032,53915648,873918464,6.453,2.151,90.960,0.436,0,1472356,202093518
32784035840,101103181824,53915648,874160128,7.411,2.326,89.674,0.589,0,1478334,202291881
32787582976,101099495424,53923840,874291200,9.165,1.746,88.061,1.029,0,1498374,202129344
32789741568,101097205760,53932032,874401792,8.432,2.862,88.021,0.685,0,1460170,202080735
32798019584,101088788480,53932032,874532864,8.382,1.770,89.320,0.528,0,1433598,202139725
32805003264,101081681920,53932032,874651648,8.419,2.050,89.065,0.466,0,1457188,202240321
32813608960,101072986112,53932032,874741760,8.806,2.577,87.143,1.473,0,1469984,202361963
32819302400,101067124736,53940224,874889216,9.147,2.209,87.679,0.965,0,1486564,202077886
32823697408,101062574080,53948416,875016192,8.158,2.202,89.051,0.589,0,1459348,202398163
32839081984,101047025664,53948416,875139072,9.161,2.352,87.744,0.743,0,1461360,202318737
32850280448,101035704320,53948416,875253760,8.704,2.704,88.094,0.497,0,1494822,202175617
32867950592,101017911296,53948416,875376640,10.034,2.601,86.250,1.115,0,1496420,202094090
32898363392,100987375616,53948416,875499520,12.071,2.290,83.720,1.919,0,1484372,202369826
32933261312,100952358912,53956608,875610112,13.610,2.474,83.050,0.866,0,1488500,202125881
32943742976,100941746176,53956608,875737088,10.188,2.346,87.095,0.370,0,1508524,202315476
32977752064,100907597824,53956608,875868160,12.122,2.150,85.385,0.343,0,1459238,202073789
32976748544,100908494848,53956608,875974656,10.184,2.024,87.045,0.747,0,1477680,202364973
32992546816,100892569600,53964800,876093440,10.820,2.528,85.974,0.678,0,1436278,202139727
33005490176,100879491072,53972992,876220416,9.762,1.940,87.922,0.375,0,1446578,201992664
33026945024,100857913344,53972992,876339200,10.292,2.456,86.474,0.777,0,1486188,202393868
33035116544,100849618944,53972992,876462080,7.231,2.225,90.111,0.433,0,1461992,202170342
33061769216,100822716416,53972992,876707840,11.166,2.636,85.794,0.403,0,1449662,202046091
33099837440,100784504832,53981184,876838912,9.307,1.849,87.371,1.473,0,1495060,202395743
33139986432,100744204288,53989376,876974080,9.853,2.027,87.621,0.499,0,1461962,202113773
33205874688,100678205440,53989376,877084672,9.894,2.185,87.328,0.593,0,1452494,202202494
33254350848,100629606400,53989376,877207552,11.768,2.179,85.585,0.467,0,1484898,202300926
33306812416,100577017856,53989376,877334528,10.898,2.415,86.285,0.402,0,1453486,202168036
33360158720,100523536384,53997568,877453312,10.325,2.535,85.595,1.546,0,1417732,201450541
33394094080,100489469952,54005760,877576192,9.527,2.615,87.298,0.560,0,1476128,202164566
33442029568,100441411584,54005760,877694976,9.688,2.125,87.719,0.469,0,1454156,202170199
33488797696,100394532864,54005760,877805568,8.535,1.986,89.075,0.403,0,1447248,202471316
33482805248,100400377856,54005760,877948928,5.234,2.292,92.072,0.403,0,1465918,201998927
33476775936,100406304768,54013952,878043136,5.037,2.301,91.822,0.840,0,1468016,202430210
33481805824,100401119232,54022144,878190592,6.658,2.559,88.379,2.404,0,1437300,201964051
33484894208,100397899776,54022144,878309376,6.932,2.249,90.111,0.709,0,1439720,202234033
33485717504,100396957696,54022144,878428160,5.157,1.988,92.358,0.497,0,1389520,202224775
33485279232,100397281280,54022144,878542848,6.366,2.565,90.389,0.680,0,1391612,202150831
33485631488,100396642304,54038528,878788608,5.881,2.371,87.531,4.218,0,1459388,202320650
33488879616,100393254912,54046720,878915584,5.912,1.867,90.448,1.773,0,1395354,202141145
33490665472,100391358464,54046720,879026176,6.233,2.746,90.497,0.525,0,1436336,202089864
33490554880,100391321600,54046720,879161344,4.916,2.022,92.377,0.685,0,1440650,202440187
33490493440,100391256064,54046720,879284224,4.122,1.811,93.660,0.406,0,1450556,202264871
33490350080,100391288832,54054912,879386624,4.284,1.907,93.246,0.563,0,1469474,202195057
33487949824,100393545728,54063104,879517696,4.591,1.999,91.661,1.749,0,1437616,202147311
33487851520,100393512960,54063104,879648768,4.728,2.256,92.522,0.494,0,1403302,202150945
33486393344,100394848256,54063104,879763456,4.564,1.894,92.766,0.776,0,1451234,202416842
33485668352,100395450368,54063104,879882240,4.370,2.247,93.071,0.312,0,1448110,202061017
33485914112,100394934272,54071296,880144384,5.420,2.341,91.099,1.140,0,1462692,202193348
33485578240,100395139072,54079488,880263168,5.125,2.439,90.738,1.698,0,1427554,202122085
33484677120,100395933696,54079488,880365568,5.102,2.191,92.175,0.532,0,1436902,202137844
33483239424,100397223936,54079488,880504832,4.644,2.229,92.786,0.341,0,1460026,202038677
33484398592,100395868160,54079488,880697344,4.842,2.031,92.346,0.781,0,1475842,202263468
33484902400,100395225088,54087680,880828416,4.290,2.145,92.819,0.746,0,1452748,202361252
33484943360,100395061248,54087680,880947200,4.912,2.224,91.659,1.205,0,1462360,202314636
33484791808,100395077632,54095872,881070080,5.244,2.468,90.962,1.326,0,1488850,202276177
33485303808,100394430464,54095872,881205248,4.653,2.419,92.463,0.465,0,1463012,202248321
33485201408,100394401792,54095872,881332224,4.954,2.136,92.322,0.588,0,1455308,202289288
33485041664,100394369024,54104064,881508352,4.831,2.075,91.917,1.177,0,1466056,202075393
33484398592,100394885120,54104064,881635328,4.702,2.196,92.484,0.619,0,1435026,202347276
33484804096,100394336256,54104064,881774592,4.601,2.269,90.706,2.425,0,1434384,201570496
33484914688,100394110976,54104064,881889280,4.471,2.049,92.952,0.528,0,1408086,201881005
33484152832,100394754048,54104064,882008064,4.741,2.200,92.594,0.465,0,1418078,202217283
33482522624,100396093440,54120448,882266112,4.472,1.957,92.826,0.745,0,1474664,202399506
33482833920,100395642880,54120448,882397184,5.309,2.346,92.037,0.309,0,1478868,202114555
33483808768,100394557440,54120448,882503680,5.480,2.012,91.393,1.115,0,1460154,202417126
33484673024,100393558016,54120448,882634752,4.689,1.988,93.012,0.311,0,1481134,202028786
33484865536,100393222144,54120448,882769920,4.777,2.342,92.070,0.812,0,1469330,202267422
33489334272,100388610048,54128640,882900992,5.330,1.797,91.881,0.992,0,1487820,202361805
33485737984,100391931904,54136832,883163136,4.986,2.323,92.258,0.434,0,1471696,202228930
33487646720,100389900288,54140928,883277824,4.638,2.006,92.322,1.034,0,1470770,201440717
33487388672,100390031360,54140928,883400704,5.170,1.931,92.152,0.747,0,1469384,202804215
33487843328,100389449728,54140928,883527680,4.913,2.287,92.367,0.433,0,1434446,202378636
33488449536,100388708352,54149120,883654656,4.482,2.148,92.250,1.120,0,1474614,202215396
33490083840,100386934784,54157312,883777536,5.496,1.976,91.818,0.710,0,1445634,202090880
33489969152,100386934784,54157312,883892224,4.379,1.689,92.774,1.157,0,1464668,202015862
33490309120,100386451456,54157312,884031488,4.526,2.325,92.684,0.465,0,1432304,202354764
33491988480,100384641024,54157312,884158464,5.633,2.136,91.891,0.340,0,1435144,202224749
33488420864,100388061184,54165504,884289536,4.759,2.053,92.442,0.747,0,1471310,202145685
33488318464,100388061184,54165504,884387840,4.700,1.774,92.686,0.840,0,1402808,202179623
33488392192,100387835904,54173696,884531200,4.024,1.572,93.964,0.440,0,1391736,202334920
33487790080,100388237312,54173696,884658176,4.691,2.144,91.861,1.305,0,1441948,202065010
33487941632,100387946496,54173696,884793344,4.468,2.203,92.709,0.621,0,1454774,202437048
33488764928,100387008512,54181888,884895744,4.229,2.208,92.662,0.902,0,1458470,202045582
33488424960,100387205120,54181888,885035008,4.618,1.997,92.917,0.468,0,1474656,202468565
33489551360,100385947648,54181888,885166080,4.567,2.019,92.606,0.808,0,1463700,202006588
33489883136,100385492992,54190080,885280768,4.735,2.118,91.963,1.184,0,1484046,202260519
33491058688,100384206848,54190080,885391360,4.044,1.850,93.260,0.846,0,1416776,202334823
33491120128,100383977472,54198272,885534720,5.405,2.749,91.229,0.618,0,1367408,202224974
33491222528,100383752192,54198272,885649408,5.338,2.191,91.638,0.833,0,1454498,202012944
33490771968,100384071680,54198272,885780480,4.877,2.500,92.284,0.340,0,1450058,202411186
33491144704,100383461376,54198272,886009856,4.895,1.952,91.914,1.239,0,1448194,202011669
33492185088,100382265344,54206464,886153216,4.653,2.047,92.897,0.403,0,1439020,202427156
33491275776,100383023104,54214656,886292480,4.992,2.326,92.124,0.558,0,1440426,201870667
33491677184,100382507008,54214656,886407168,5.154,1.975,92.500,0.370,0,1434564,202476275
33492840448,100381204480,54214656,886538240,4.223,1.595,93.556,0.626,0,1454368,202240276
33492041728,100381880320,54214656,886657024,4.641,2.104,92.234,1.021,0,1465750,202525516
33491501056,100382269440,54222848,886800384,5.471,1.886,91.994,0.649,0,1427966,201998088
33492140032,100381495296,54231040,886919168,4.094,2.031,93.094,0.781,0,1442802,202394330
33492103168,100381429760,54231040,887013376,4.375,2.265,93.081,0.279,0,1462036,202293761
33491566592,100381818880,54231040,887156736,4.265,1.819,93.227,0.690,0,1454414,202237851
33492213760,100381040640,54231040,887283712,5.487,2.294,91.538,0.682,0,1490910,202329281
33493397504,100379721728,54231040,887418880,4.842,2.173,92.117,0.869,0,1471956,202169587
33493659648,100379348992,54247424,887513088,4.319,2.206,92.418,1.057,0,1451482,202352456
33492856832,100379996160,54247424,887656448,4.367,1.747,93.387,0.499,0,1444800,202305986
33492529152,100380188672,54247424,887787520,4.253,2.235,92.797,0.714,0,1448888,202201514
33491841024,100380737536,54247424,887926784,4.271,1.933,93.049,0.748,0,1449038,202185584
33492303872,100380155904,54247424,888041472,4.885,1.805,92.035,1.276,0,1442956,202021536
33492144128,100380188672,54263808,888152064,4.550,1.839,92.583,1.028,0,1400158,202419778
33491734528,100380446720,54263808,888303616,5.088,2.128,92.260,0.524,0,1400610,202144367
33492234240,100379832320,54263808,888418304,4.415,1.691,93.049,0.845,0,1441162,202010660
33492992000,100378963968,54263808,888528896,5.419,2.309,91.810,0.462,0,1433382,202419095
33492951040,100378865664,54263808,888664064,4.584,1.840,92.329,1.247,0,1415846,202138119
33492643840,100378898432,54272000,888926208,4.417,1.991,92.784,0.809,0,1450608,202148309
33495126016,100376285184,54280192,889040896,4.449,1.960,92.626,0.965,0,1433916,202379246
33492893696,100378382336,54280192,889176064,4.272,1.964,93.046,0.717,0,1446548,202148978
33491517440,100379639808,54280192,889294848,4.019,2.212,93.302,0.467,0,1452792,202227973
33490063360,100380962816,54280192,889425920,3.770,1.822,93.245,1.162,0,1452860,202409801
33490776064,100380127232,54288384,889540608,4.688,2.204,92.052,1.056,0,1468490,202261367
33492131840,100378636288,54288384,889667584,4.746,2.078,92.773,0.403,0,1427122,202064854
33492070400,100378517504,54296576,889794560,4.099,1.690,93.492,0.720,0,1457766,202366107
33491378176,100379066368,54296576,889933824,3.998,1.968,93.535,0.500,0,1458436,202216362
33489448960,100380872704,54296576,890052608,4.059,1.904,93.693,0.343,0,1438128,202203232
33490329600,100379873280,54304768,890163200,4.516,1.900,92.308,1.277,0,1441420,202424105
33491189760,100378873856,54304768,890298368,4.462,1.654,93.510,0.374,0,1415874,201793773
33492533248,100377391104,54304768,890433536,4.411,2.144,93.103,0.342,0,1427984,202332036
33492434944,100377391104,54304768,890527744,4.338,1.685,93.539,0.437,0,1444800,202177727
33493315584,100376358912,54312960,890662912,4.669,2.272,92.499,0.560,0,1479760,202039591
33493913600,100375617536,54321152,890793984,4.544,1.836,92.001,1.618,0,1444684,202339996
33494331392,100375068672,54321152,890925056,4.245,1.779,93.383,0.593,0,1430390,202345243
33493680128,100375584768,54321152,891056128,4.514,1.775,93.213,0.498,0,1415440,201958051
33493405696,100375601152,54321152,891297792,4.712,2.495,92.424,0.370,0,1433552,202456408
33493843968,100375019520,54329344,891424768,4.495,2.201,92.405,0.899,0,1453584,202086209
33492758528,100375969792,54337536,891551744,4.435,2.202,87.717,5.645,0,1424528,202314164
33492557824,100376035328,54337536,891678720,4.167,1.723,93.609,0.501,0,1452614,202307030
33492692992,100375777280,54337536,891797504,4.148,1.996,93.387,0.468,0,1444902,201967464
33492287488,100376068096,54337536,891912192,4.003,1.970,93.371,0.657,0,1451972,202271534
33492938752,100375261184,54337536,892063744,4.750,2.498,92.289,0.463,0,1451634,202205021
33494192128,100373872640,54349824,892182528,4.732,2.505,91.463,1.299,0,1455424,202211525
33494085632,100373872640,54349824,892289024,4.443,1.658,93.429,0.469,0,1438734,202127601
33495502848,100372324352,54349824,892420096,4.272,1.840,93.483,0.405,0,1445106,202112331
33495965696,100371709952,54349824,892563456,4.090,2.029,93.069,0.812,0,1455064,201988086
33495445504,100372099072,54349824,892694528,4.280,1.624,93.689,0.406,0,1441142,202415623
33495543808,100371873792,54358016,892801024,4.216,1.811,93.067,0.906,0,1413420,201977135
33495990272,100371292160,54366208,892928000,4.431,1.872,92.418,1.279,0,1417730,202240935
33496514560,100370616320,54366208,893063168,4.066,1.877,93.494,0.563,0,1427010,202280893
33498259456,100368744448,54366208,893190144,4.280,1.937,93.346,0.437,0,1396776,202069773
33498632192,100368261120,54366208,893300736,4.390,1.930,92.902,0.778,0,1453008,202225300
33498820608,100367937536,54374400,893427712,4.091,1.936,93.254,0.718,0,1428190,202217933
33498423296,100368080896,54382592,893673472,4.809,2.312,90.475,2.404,0,1451488,202174429
33497223168,100369145856,54382592,893808640,4.242,1.965,93.325,0.468,0,1458398,202006900
33496276992,100369985536,54382592,893915136,4.492,2.107,93.030,0.372,0,1432252,202551291
33497276416,100368855040,54382592,894046208,4.265,2.117,93.275,0.342,0,1431182,202013128
33496301568,100369678336,54390784,894185472,4.275,1.778,93.167,0.780,0,1484268,202152018
33497255936,100368580608,54390784,894324736,5.564,2.507,90.645,1.284,0,1451036,202203488
33496166400,100369547264,54398976,894439424,4,1.844,93.812,0.344,0,1427454,202135713
33494872064,100370718720,54398976,894562304,4.765,2.104,92.481,0.650,0,1419186,202409278
33494970368,100370493440,54398976,894689280,4.718,2.266,92.644,0.372,0,1430684,202078217
33494622208,100370718720,54407168,894795776,4.171,2.085,92.779,0.965,0,1477010,202236148
33497272320,100367912960,54407168,894943232,4.413,2.144,92.418,1.025,0,1454460,202220787
33496563712,100368478208,54407168,895070208,4.271,2.026,93.204,0.499,0,1445672,202057623
33498456064,100366458880,54415360,895188992,4.530,2.110,92.740,0.621,0,1473808,202382147
33497067520,100367704064,54415360,895320064,4.415,2.021,93.159,0.404,0,1473534,202163730
33496748032,100367896576,54423552,895434752,4.321,2.114,92.291,1.274,0,1427394,202079894
33497874432,100366639104,54423552,895561728,4.926,2.045,92.534,0.496,0,1454890,202132708
33498542080,100365832192,54423552,895696896,4.124,1.812,92.627,1.437,0,1447932,202357334
31911825408,101952417792,54423552,895827968,4.193,1.658,93.586,0.563,0,1448718,199938320
27839492096,106025074688,54431744,895492096,4.606,2.071,92.828,0.495,0,1303198,178469918
24606416896,109259132928,54444032,894492672,3.832,1.651,93.458,1.059,0,1121922,156531060
21356892160,112509325312,54444032,893820928,3.444,1.862,94.384,0.310,0,1013248,135507618
17417080832,116449947648,54444032,893005824,3.592,1.703,93.063,1.641,0,843530,114126162
14245400576,119622455296,54444032,892170240,2.377,1.063,96.372,0.188,0,665096,91798945
10992689152,122876227584,54444032,891109376,1.873,0.968,96.815,0.343,0,494576,70104572
6798082048,127071662080,54464512,890261504,1.471,0.657,97.372,0.501,0,306120,47605218
3363532800,130507075584,54464512,889397248,0.938,0.531,98.375,0.156,0,152396,25867419
1071562752,132800151552,54464512,888291328,0.313,0.157,99.280,0.250,0,32254,6141056
1045008384,132827369472,54464512,887627776,0.094,0.031,99.875,0,0,1830,0
1044484096,132827893760,54464512,887627776,0,0,100,0,0,1380,1008
1044484096,132827893760,54464512,887627776,0,0,100,0,0,2388,0
1044463616,132827893760,54484992,887627776,0,0,99.812,0.188,0,886,0
1044205568,132828151808,54484992,887627776,0,0,100,0,0,1018,0
1044197376,132828160000,54484992,887627776,0,0,100,0,0,1924,588
1043673088,132828684288,54484992,887627776,0,0,100,0,0,1728,84
1043406848,132828950528,54484992,887627776,0,0,100,0,0,1658,1508
1043406848,132828950528,54484992,887627776,0,0,100,0,0,1410,0
1043398656,132828950528,54493184,887627776,0,0,99.937,0.063,0,1718,0
1043140608,132829208576,54493184,887627776,0,0,100,0,0,1628,84
1043140608,132829208576,54493184,887627776,0,0,100,0,0,950,84
1043140608,132829208576,54493184,887627776,0,0,100,0,0,1176,0
1043140608,132829208576,54493184,887627776,0,0,100,0,0,512,0
1042882560,132829466624,54493184,887627776,0,0,100,0,0,2080,0
1042616320,132829724672,54501376,887627776,0,0,99.969,0.031,0,588,0
1042616320,132829724672,54501376,887627776,0,0,100,0,0,574,0
1042616320,132829724672,54501376,887627776,0,0,100,0,0,692,0
1042100224,132830240768,54501376,887627776,0,0,100,0,0,1840,0
1042100224,132830240768,54501376,887627776,0,0,100,0,0,346,0
1042100224,132830240768,54501376,887627776,0,0,100,0,0,2140,0
1042092032,132830240768,54509568,887627776,0,0,99.938,0.062,0,858,0
1041833984,132830498816,54509568,887627776,0,0,100,0,0,1568,0
1041833984,132830498816,54509568,887627776,0,0,100,0,0,512,0
1041833984,132830498816,54509568,887627776,0,0,100,0,0,1674,0
1041833984,132830498816,54509568,887627776,0,0.031,99.531,0.438,0,988,2380
1041285120,132831047680,54509568,887627776,0,0,100,0,0,1856,0
1041276928,132831047680,54517760,887627776,0,0,99.906,0.094,0,858,1508
1041276928,132831047680,54517760,887627776,0,0,100,0,0,512,0
1041276928,132831047680,54517760,887627776,0,0,100,0,0,1092,0
1040760832,132831563776,54517760,887627776,0,0,100,0,0,2426,0
1040502784,132831821824,54517760,887627776,0,0,100,0,0,3686,0
1040388096,132831936512,54517760,887627776,0,0,100,0,0,1794,0
1040121856,132832194560,54525952,887627776,0,0,99.969,0.031,0,1384,0
1041104896,132831031296,54525952,887627776,0.156,0.125,99.719,0,0,407722,20028
1040367616,132829999104,54525952,887635968,1.281,0.594,98.001,0.125,0,15923,31054
1040359424,132830007296,54525952,887635968,0,0,100,0,0,3874,0
1039319040,132831047680,54525952,887635968,0,0,100,0,0,5250,0
1039319040,132831047680,54525952,887635968,0,0,100,0,0,2020,0
1038778368,132831571968,54538240,887640064,0.031,0,99.906,0.062,0,1218,168
1038508032,132831830016,54550528,887640064,0,0,99.969,0.031,0,918,0
1038499840,132831838208,54550528,887640064,0,0,100,0,0,580,0
1038499840,132831838208,54550528,887640064,0,0,100,0,0,2426,0
1038499840,132831838208,54550528,887640064,0,0,100,0,0,1052,0
