172.16.192.13 : 30.39 10.27 10.30 10.32 10.32 10.33 10.33 10.25 10.24 10.22
172.16.192.19 : 10.27 10.38 10.31 10.26 10.32 10.35 10.33 10.31 10.36 10.37
172.16.192.20 : 0.04 0.03 0.03 0.03 0.03 0.03 0.01 0.01 0.01 0.01
172.16.192.21 : 0.24 0.22 0.20 0.22 0.22 0.24 0.23 0.22 0.22 0.23
172.16.192.22 : 0.15 0.22 0.21 0.23 0.23 0.22 0.23 0.27 0.20 0.23
172.16.192.3  : 0.20 0.28 0.20 0.21 0.27 0.28 0.22 0.26 0.24 0.26
172.16.192.4  : 200.36 200.36 200.35 200.39 200.38 200.37 200.36 200.36 200.37 200.31
172.16.192.5  : 200.37 200.38 - 200.34 200.40 200.37 200.35 200.39 200.35 -
172.16.192.6  : 200.40 200.32 200.39 200.38 200.31 200.35 200.34 200.35 200.27 200.34
172.16.192.7  : 200.33 200.38 200.39 200.31 200.36 200.38 200.36 200.36 200.35 200.39
172.16.192.8  : 4.30 4.33 4.35 4.34 4.40 4.33 4.35 4.35 4.31 4.39

      11 targets
      11 alive
       0 unreachable
       0 unknown addresses

       1 timeouts (waiting for response)
     110 ICMP Echos sent
     108 ICMP Echo Replies received
       0 other ICMP received

 0.01 ms (min round trip time)
 73.0 ms (avg round trip time)
 200 ms (max round trip time)
       10.083 sec (elapsed real time)

