"Dstat 0.7.3 CSV output"
"Author:","Dag Wieers <dag@wieers.com>",,,,"URL:","http://dag.wieers.com/home-made/dstat/"
"Host:","parasilo-4.rennes.grid5000.fr",,,,"User:","root"
"Cmdline:","dstat -m -c -n -o dstat.csv",,,,"Date:","23 Jun 2020 00:00:43 CEST"
"memory usage",,,,"total cpu usage",,,,,"net/total",
"used","free","buff","cach","usr","sys","idl","wai","stl","recv","send"
861298688,133238366208,47661056,672792576,1.488,0.340,98.001,0.171,0,0,0
874561536,133224493056,47685632,673124352,0.843,0.624,98.408,0.125,0,390204,19400
899371008,133199785984,47685632,672972800,0.688,0.281,99.031,0,0,387554,27160
872833024,133226082304,47685632,673140736,0.968,0.437,98.594,0,0,389172,17180
862531584,133236830208,47685632,672694272,0.406,0.406,98.406,0.781,0,4778,6224
862273536,133237088256,47685632,672694272,0.031,0,99.969,0,0,454,0
862273536,133237088256,47685632,672694272,0,0,100,0,0,234,0
862248960,133237100544,47697920,672694272,0,0,99.969,0.031,0,106,0
861978624,133237358592,47710208,672694272,0,0.031,99.938,0.031,0,234,0
861720576,133237616640,47710208,672694272,0.031,0,99.969,0,0,106,0
863547392,133235757056,47710208,672694272,0.031,0.063,99.906,0,0,6542,7288
862085120,133237190656,47710208,672698368,0.812,0.719,98.469,0,0,386384,16400
860434432,133238841344,47710208,672698368,0,0,100,0,0,0,0
875769856,133223014400,47722496,673144832,0.750,0.375,98.812,0.062,0,557040,30308
863502336,133235695616,47722496,672698368,0.344,0.469,99.187,0,0,3558,14640
881303552,133217390592,47722496,673148928,0.532,0.188,99.281,0,0,384318,11452
883118080,133215526912,47734784,673148928,1,0.562,98.406,0.031,0,388942,20724
861327360,133237764096,47734784,672702464,0.344,0.375,99.281,0,0,2842,10696
862887936,133236064256,47747072,672710656,1.813,0.188,97.937,0.063,0,224618,13056
862679040,133236273152,47747072,672710656,0,0.062,99.938,0,0,1962,2668
861786112,133237161984,47747072,672714752,0.500,0.094,99.406,0,0,343520,16690
869253120,133229502464,47759360,672899072,0.188,0.031,99.750,0.031,0,172452,14060
868995072,133229760512,47759360,672899072,0.031,0,99.969,0,0,4914,5390
868220928,133230534656,47771648,672886784,0,0.031,99.938,0.031,0,5202,5488
868208640,133230534656,47771648,672899072,0,0,99.250,0.750,0,5330,5292
867950592,133230792704,47771648,672899072,0,0,99.656,0.344,0,5308,5572
867426304,133231316992,47771648,672899072,0.031,0.031,99.937,0,0,7700,7448
867160064,133231575040,47779840,672899072,0,0,99.969,0.031,0,5020,5390
866902016,133231833088,47779840,672899072,0,0.062,99.938,0,0,5096,5390
866893824,133231833088,47788032,672899072,0,0,99.938,0.062,0,5020,5488
866893824,133231833088,47788032,672899072,0.031,0,99.969,0,0,5302,5194
858750976,133240057856,47788032,672817152,0.250,0.125,99.625,0,0,174000,16932
857661440,133241241600,47788032,672718848,0,0,100,0,0,288,0
857653248,133241249792,47788032,672718848,0.031,0,99.969,0,0,288,0
857395200,133241507840,47788032,672718848,0.031,0,99.969,0,0,234,0
857059328,133241831424,47800320,672718848,0,0,99.812,0.188,0,106,0
857059328,133241831424,47800320,672718848,0,0,100,0,0,106,84
856993792,133241884672,47812608,672718848,0,0,99.969,0.031,0,106,0
856539136,133242339328,47812608,672718848,0.031,0.031,99.938,0,0,2090,2764
863338496,133235503104,47812608,672718848,0.875,0.750,98.375,0,0,389562,28560
887201792,133211623424,47824896,672722944,0.282,0.031,99.656,0.031,0,328696,13668
2875752448,131223023616,47837184,672710656,17.185,7.800,73.928,1.088,0,1458172,71596
5971218432,128125722624,47837184,674451456,29.056,11.829,59.115,0,0,1537812,77068
8925261824,125170008064,47849472,675917824,33.354,13.103,53.448,0.094,0,1333628,67307
11995754496,122098204672,47861760,677105664,31.477,13.499,54.899,0.124,0,1333130,65906
14979686400,119112585216,47869952,678694912,33.852,12.663,53.360,0.124,0,1333650,68106
17874952192,116215910400,47960064,679964672,32.438,12.520,54.043,0.999,0,1222688,100788
20633366528,113455837184,47964160,681525248,32.423,11.356,56.035,0.186,0,1460350,1414234
23627939840,110459768832,47972352,682856448,37.308,11.923,50.675,0.094,0,1275706,3137012
26392641536,107693469696,47988736,684261376,37.488,11.225,51.070,0.217,0,1373550,3811011
29455421440,104629174272,48005120,685625344,40.242,14.108,45.370,0.280,0,884672,3858641
30702166016,103382310912,48005120,685727744,24.511,5.521,69.274,0.694,0,99758,4714516
30913490944,103170932736,48005120,685776896,15.052,1.533,75.812,7.603,0,132226,6937172
31092387840,102991966208,48005120,685846528,14.118,1.548,84.056,0.279,0,138542,6817719
31268790272,102815477760,48005120,685932544,16.394,1.263,82.065,0.277,0,164066,8555017
31479394304,102604791808,48025600,685989888,16.785,1.236,81.298,0.680,0,166966,8373994
31664832512,102419243008,48025600,686096384,16.906,1.750,81.031,0.312,0,172054,8103649
31782825984,102301085696,48025600,686186496,15.867,1.185,82.481,0.468,0,154432,6903948
31957102592,102126694400,48025600,686297088,17.689,1.673,80.328,0.310,0,153116,7060060
32039317504,102044385280,48025600,686387200,14.189,1.600,83.749,0.462,0,150330,6705954
32105451520,101978107904,48033792,686481408,16.182,2.042,81.281,0.495,0,147110,6780266
32180068352,101903413248,48033792,686559232,13.803,2.109,83.561,0.527,0,149240,6753052
32140500992,101942665216,48103424,686800896,8.826,1.909,86.228,3.036,0,141782,6525388
32094339072,101988732928,48103424,686891008,7.632,2.025,89.128,1.215,0,140470,6265168
32050704384,102032269312,48103424,686989312,5.156,1.163,93.241,0.440,0,150608,6772800
32038924288,102043938816,48111616,687091712,7.975,2.087,89.315,0.623,0,147628,6509854
32032210944,102050435072,48111616,687308800,7.649,1.661,90.094,0.596,0,145062,6425170
32033341440,102049177600,48111616,687431680,7.805,1.586,90.205,0.404,0,149000,6712430
32030744576,102051676160,48119808,687521792,5.493,0.785,90.678,3.045,0,148094,6500516
32040185856,102042144768,48119808,687607808,7.264,1.267,91.097,0.371,0,131396,5918034
32046137344,102036074496,48128000,687710208,7.021,1.646,90.805,0.528,0,140834,6377182
32045400064,102036725760,48128000,687792128,6.781,1.182,91.664,0.373,0,144370,6516780
32049557504,102032457728,48128000,687898624,8.634,1.211,89.752,0.404,0,145730,6600786
32050593792,102031298560,48128000,688017408,5.727,0.778,93.246,0.249,0,153164,7021738
32052994048,102028808192,48128000,688107520,6.213,1.212,92.171,0.404,0,150464,6785074
32056229888,102025469952,48136192,688193536,6.526,1.299,91.710,0.464,0,143354,6369972
32057835520,102023753728,48136192,688295936,7.721,1.116,90.915,0.248,0,128750,5736726
32061730816,102019739648,48136192,688406528,7.664,0.931,91.064,0.341,0,141634,6340716
32058187776,102023204864,48136192,688484352,4.388,0.747,93.589,1.276,0,140838,6311168
32069447680,102011838464,48136192,688586752,6.193,1.001,92.493,0.313,0,138338,6346694
32074670080,102006513664,48144384,688680960,7.800,1.212,90.553,0.435,0,137552,6205548
32079015936,102002065408,48144384,688783360,6.125,1.188,92.188,0.500,0,131600,5892846
32086994944,101993967616,48144384,688893952,6.719,1.089,91.788,0.404,0,145022,6509474
32087396352,101993492480,48144384,688967680,4.176,1.130,94.317,0.377,0,157180,7229508
32089141248,101991620608,48152576,689086464,5.299,1.029,89.370,4.302,0,156258,7056536
32093822976,101986836480,48160768,689176576,6.679,1.149,91.550,0.621,0,148264,6770586
32098906112,101981646848,48160768,689283072,6.476,1.681,91.532,0.311,0,147026,6717710
32102006784,101978427392,48160768,689401856,5.473,1.213,93.066,0.249,0,153824,6952470
32109977600,101970231296,48160768,689627136,6.095,1.461,92.164,0.280,0,142696,6407944
32111546368,101968556032,48160768,689725440,6.658,0.809,92.159,0.373,0,143010,6318654
32112214016,101967802368,48168960,689803264,4.980,0.996,93.495,0.529,0,137290,6341842
32113524736,101966376960,48168960,689917952,5.811,0.812,93.065,0.312,0,141142,6238462
32118964224,101960859648,48168960,689991680,5.202,1.184,93.364,0.249,0,144122,6518310
32117968896,101961736192,48168960,690110464,5.248,0.906,93.565,0.281,0,154466,7132720
32121438208,101958148096,48168960,690225152,7.003,0.965,90.819,1.214,0,154770,6968026
32125263872,101954232320,48177152,690302976,5.613,0.842,93.202,0.343,0,149572,6750498
32128327680,101951057920,48177152,690409472,5.662,0.782,93.306,0.250,0,143094,6386090
32129134592,101950152704,48177152,690507776,4.877,0.688,94.123,0.313,0,141484,6491536
32129953792,101949222912,48177152,690610176,6.219,1.031,92.406,0.344,0,146722,6599102
32130244608,101948817408,48177152,690716672,6.089,1.212,92.327,0.373,0,137262,6207842
32132096000,101946859520,48193536,690802688,6.721,0.844,91.404,1.032,0,139074,6244276
32136384512,101942378496,48193536,690892800,7.562,0.844,91.250,0.344,0,148416,6692106
32139882496,101938757632,48193536,690999296,7.210,1.003,91.411,0.376,0,142876,6529676
32141811712,101936738304,48193536,691089408,7.822,1.064,90.864,0.250,0,144308,6504242
32142254080,101936197632,48193536,691187712,8.318,1.024,90.286,0.372,0,140038,6332734
32143204352,101935132672,48201728,691286016,6.731,0.935,91.898,0.436,0,143926,6433222
32143241216,101934952448,48201728,691429376,8.031,1.054,90.605,0.310,0,155486,7181992
32148660224,101929451520,48201728,691511296,8.467,1.514,89.710,0.309,0,147182,6633490
32149606400,101928235008,48201728,691765248,6.400,0.999,92.226,0.375,0,143390,6467570
32152301568,101925462016,48201728,691838976,7.724,1.438,90.432,0.407,0,141848,6479382
32153436160,101924175872,48209920,691941376,7.516,2.205,88.447,1.832,0,159564,7192236
32169746432,101907832832,48209920,692064256,6.692,1.563,91.432,0.313,0,140250,6336772
32199233536,101878259712,48209920,692146176,9.179,1.307,89.266,0.249,0,131590,5887558
32238551040,101838843904,48209920,692236288,7.803,1.404,90.418,0.375,0,133216,5980242
32288227328,101789065216,48209920,692334592,11.012,1.758,86.922,0.308,0,139178,6449536
32331898880,101745287168,48218112,692424704,9.057,1.027,89.418,0.498,0,150728,6763596
32400904192,101676183552,48226304,692510720,8.933,0.744,90.012,0.310,0,135764,6165448
32437837824,101639139328,48226304,692621312,9.286,1.028,89.342,0.343,0,135786,6256164
32489177088,101587673088,48226304,692748288,10.252,1.025,88.381,0.342,0,137712,6183572
32528465920,101548294144,48226304,692838400,8.315,1.192,90.179,0.314,0,138406,6408148
32581156864,101495517184,48234496,692916224,8.931,0.909,88.530,1.630,0,149234,6814384
32586801152,101489762304,48234496,693018624,6.903,0.902,91.791,0.404,0,143634,6567076
32577310720,101499154432,48234496,693112832,4.016,0.784,94.917,0.282,0,143782,6370636
32574009344,101502349312,48234496,693215232,5.478,0.934,93.215,0.373,0,145056,6625500
32570347520,101505933312,48234496,693288960,6.972,0.899,91.757,0.372,0,143866,6459930
32571142144,101504999424,48242688,693415936,5.056,1.124,93.383,0.437,0,140170,6303036
32565059584,101510975488,48250880,693514240,7.327,0.838,90.655,1.180,0,152422,6808596
32555876352,101520064512,48250880,693604352,5.868,0.780,93.040,0.312,0,156696,7128826
32556040192,101519802368,48250880,693702656,5.288,0.907,93.461,0.344,0,158744,7183850
32553193472,101522415616,48250880,693936128,4.390,0.909,94.324,0.376,0,152536,7082618
32555606016,101519892480,48259072,694038528,5.549,1.009,93.064,0.378,0,149282,6742986
32555278336,101520130048,48259072,694124544,6.333,1.211,92.052,0.404,0,142156,6584598
32555626496,101519675392,48259072,694226944,4.738,0.779,94.171,0.312,0,150796,6968038
32550940672,101524254720,48259072,694333440,4.148,0.849,94.657,0.346,0,146226,6722290
32546344960,101528768512,48259072,694415360,5.345,0.719,93.529,0.406,0,151168,6859036
32546852864,101528158208,48267264,694509568,4.361,0.816,94.352,0.471,0,145344,6528000
32546471936,101528449024,48267264,694599680,6.026,0.999,90.884,2.092,0,143392,6236246
32547225600,101527572480,48267264,694722560,5.061,0.750,93.846,0.344,0,423620,7093260
32548208640,101526515712,48267264,694796288,4.073,0.627,94.893,0.407,0,155882,7166248
32550948864,101523660800,48267264,694906880,5.712,0.879,93.001,0.408,0,159126,7285738
32550699008,101523791872,48275456,695017472,4.637,0.757,94.132,0.473,0,139682,6514482
32549498880,101524893696,48275456,695107584,4.601,0.870,93.752,0.777,0,155152,7214358
32550711296,101523562496,48283648,695214080,5.312,0.750,93.375,0.562,0,161024,7287794
32554098688,101520084992,48283648,695304192,5.278,1.124,93.192,0.406,0,149718,6754314
32554500096,101519581184,48283648,695398400,5.949,0.877,92.768,0.407,0,150200,6746640
32555012096,101518954496,48291840,695500800,5.403,0.937,93.254,0.406,0,142282,6386300
32555360256,101518503936,48291840,695603200,3.705,0.570,95.345,0.380,0,150734,7021834
32553955328,101519794176,48291840,695717888,5.791,0.991,92.846,0.372,0,151326,7004738
32554196992,101519474688,48291840,695791616,5.998,0.808,92.791,0.404,0,149320,7016006
32554795008,101518782464,48291840,695885824,5.634,0.970,93.114,0.282,0,146790,6569526
32555933696,101517520896,48300032,696000512,5.237,1.023,93.337,0.403,0,147620,6759344
32556097536,101517266944,48300032,696082432,5.286,1.051,93.323,0.340,0,141874,6395102
32556445696,101516808192,48300032,696193024,6.739,0.773,90.479,2.009,0,148408,6656962
32557113344,101516042240,48300032,696291328,5.556,1.086,92.893,0.466,0,150388,6890158
32556965888,101516087296,48300032,696389632,6.731,0.873,92.054,0.343,0,150660,6949036
32557662208,101515272192,48308224,696500224,3.479,1.160,94.923,0.439,0,147972,6542466
32558436352,101514403840,48308224,696590336,4.579,0.841,94.174,0.405,0,142712,6573010
32560254976,101512466432,48308224,696709120,4.928,0.847,93.691,0.534,0,144444,6615384
32561221632,101511397376,48316416,696803328,5.373,0.781,93.533,0.312,0,144610,6485816
32561827840,101510684672,48316416,696901632,5.941,0.876,92.902,0.281,0,144694,6631784
32563245056,101509074944,48324608,697077760,5.519,0.815,93.133,0.533,0,161128,7274702
32564281344,101507944448,48324608,697167872,5.184,0.750,93.754,0.312,0,156188,6998938
32565379072,101506744320,48324608,697270272,4.720,0.907,92.404,1.969,0,144608,6633296
32566075392,101505929216,48324608,697384960,5.455,1.029,93.111,0.405,0,150178,6855882
32568385536,101503520768,48324608,697479168,5.250,0.719,93.719,0.312,0,160506,7375254
32568016896,101503651840,48332800,697704448,5.910,0.928,92.698,0.464,0,156472,7110852
32571949056,101499617280,48332800,697806848,6.240,1.025,92.425,0.310,0,147288,6671066
32573542400,101497913344,48332800,697917440,3.705,0.848,95.039,0.408,0,146070,6649344
32577380352,101493977088,48340992,698007552,7.016,0.776,91.866,0.342,0,144724,6474846
32578633728,101492621312,48340992,698105856,3.617,0.873,95.073,0.437,0,148568,6883670
32580706304,101490290688,48349184,698355712,4.678,0.565,94.223,0.534,0,151526,6937374
32581632000,101489262592,48349184,698454016,6.236,1.148,92.274,0.341,0,147994,6786464
32582606848,101488193536,48349184,698548224,5.791,0.872,92.964,0.374,0,141908,6292396
32585392128,101485293568,48349184,698662912,6.351,1.059,91.002,1.588,0,140430,6506786
32585404416,101485199360,48349184,698744832,4.379,0.845,94.401,0.375,0,135216,6169722
32586596352,101483880448,48357376,698851328,5.128,0.813,93.715,0.344,0,142858,6495624
32586878976,101483491328,48357376,698957824,5.036,0.813,93.838,0.313,0,139504,6197814
32589037568,101481234432,48357376,699052032,6.130,1.207,92.322,0.341,0,136918,6316180
32589725696,101480431616,48365568,699158528,4.896,1.060,93.109,0.935,0,145478,6719794
32590581760,101479460864,48365568,699269120,4.953,0.966,93.769,0.312,0,151948,6923064
32591319040,101478621184,48373760,699363328,4.720,0.938,93.904,0.438,0,145678,6772082
32591622144,101478203392,48373760,699473920,4.227,0.814,94.584,0.376,0,141752,6454996
32593264640,101476458496,48373760,699576320,5.554,1.086,92.957,0.403,0,143490,6476382
32593424384,101476204544,48373760,699670528,4.211,1.029,92.545,2.215,0,141908,6274838
32593616896,101475917824,48373760,699764736,4.618,1.123,93.822,0.437,0,137560,6286702
32595783680,101473624064,48381952,699883520,5.400,1.248,92.915,0.437,0,136790,6114150
32595247104,101474058240,48381952,699981824,4.606,1.089,93.838,0.467,0,145184,6597234
32596103168,101473103872,48381952,700076032,5.114,0.842,93.608,0.437,0,139774,6278222
32595787776,101473304576,48381952,700186624,4.307,0.723,94.373,0.597,0,148062,6900568
32595615744,101473370112,48390144,700284928,5.820,1.022,92.755,0.402,0,160566,7210140
32595976192,101472886784,48398336,700391424,3.990,0.691,94.785,0.534,0,158110,7194680
32596787200,101471985664,48398336,700477440,4.107,0.784,94.577,0.533,0,147018,6557240
32598835200,101469818880,48398336,700592128,5.064,0.938,93.498,0.500,0,142102,6359088
32599056384,101469364224,48414720,700809216,4.906,0.969,89.188,4.938,0,142704,6511320
32599056384,101469237248,48414720,700932096,5.336,0.722,93.566,0.377,0,149776,6829612
32599818240,101468389376,48414720,701018112,4.173,0.841,94.581,0.405,0,150870,6725336
32600240128,101467852800,48414720,701128704,4.054,0.904,94.637,0.405,0,145832,6550626
32600600576,101467398144,48414720,701222912,6.058,1.025,92.482,0.435,0,149540,6911774
32602537984,101465329664,48422912,701337600,3.116,0.755,95.530,0.598,0,154280,7138540
32602259456,101465497600,48422912,701444096,5.307,0.993,92.396,1.304,0,160312,7130730
32603398144,101464264704,48422912,701534208,3.936,0.812,94.939,0.312,0,152428,6906058
32603922432,101463625728,48422912,701640704,5.224,0.845,93.619,0.313,0,146290,6676592
32604020736,101463433216,48422912,701734912,5.227,0.689,93.678,0.407,0,140588,6338750
32604737536,101462568960,48431104,701870080,3.608,0.879,95.011,0.502,0,136062,6204588
32604737536,101462495232,48443392,701927424,5.724,0.866,92.141,1.269,0,135000,6121126
32605360128,101461753856,48443392,702046208,4.690,0.844,94.121,0.344,0,138398,6375162
32605765632,101461233664,48443392,702156800,3.939,0.813,94.811,0.438,0,146788,6604488
32609538048,101457371136,48443392,702242816,4.242,1.029,94.323,0.405,0,140580,6506946
32610779136,101456015360,48451584,702349312,4.629,0.813,93.619,0.938,0,136598,6221206
32617451520,101449236480,48451584,702451712,4.777,0.874,94.006,0.343,0,150620,6866804
32618254336,101448335360,48451584,702545920,5.322,0.971,93.269,0.438,0,154152,7050398
32620027904,101446443008,48451584,702656512,4.188,0.844,94.594,0.375,0,143356,6448654
32620216320,101446164480,48451584,702742528,3.923,1.067,94.696,0.314,0,142842,6465928
32621129728,101445107712,48459776,702869504,4.713,0.911,93.874,0.503,0,137808,5979712
32620777472,101445398528,48459776,702926848,4.796,0.872,92.868,1.464,0,140392,6579940
32621170688,101444755456,48459776,703176704,3.267,0.597,95.822,0.314,0,147800,6688600
32622325760,101443493888,48459776,703279104,3.959,0.935,94.763,0.343,0,141742,6386924
32621957120,101443756032,48459776,703381504,5.640,1.215,92.801,0.343,0,140578,6282458
32623230976,101442334720,48467968,703508480,4.846,0.683,94.035,0.435,0,135416,6007056
32623247360,101442232320,48467968,703594496,3.947,0.689,94.862,0.501,0,136262,6163374
32623558656,101441814528,48476160,703692800,4.520,0.565,93.942,0.973,0,139610,6475626
32623407104,101441847296,48476160,703811584,5.647,0.900,92.957,0.496,0,148360,6896568
32624930816,101440229376,48476160,703901696,4.964,0.968,93.725,0.343,0,149520,6796832
32625963008,101439082496,48484352,704008192,5.665,0.751,93.114,0.469,0,137760,6107462
32626438144,101438492672,48484352,704118784,4.683,0.781,94.131,0.406,0,134404,6073302
32625836032,101439008768,48484352,704204800,3.858,0.659,93.726,1.757,0,138344,6338494
32625491968,101439229952,48484352,704327680,4.165,0.626,94.864,0.345,0,149202,6873666
32625401856,101439229952,48484352,704417792,5.323,0.867,93.470,0.340,0,150028,6893018
32628215808,101436329984,48492544,704495616,5.737,0.811,92.984,0.468,0,144716,6611646
32629444608,101434974208,48492544,704622592,4.266,0.753,94.605,0.376,0,135028,6090634
32631197696,101433131008,48492544,704712704,4.383,0.808,94.094,0.715,0,133416,6210760
32631885824,101432320000,48500736,704827392,4.772,0.816,93.972,0.440,0,140804,6507224
32632102912,101431885824,48500736,705044480,4.249,1.187,94.221,0.344,0,149986,6918294
32634023936,101429841920,48508928,705159168,5.758,1.089,92.593,0.560,0,152322,6988306
32635695104,101428072448,48508928,705257472,4.936,0.776,93.915,0.373,0,151186,7005464
32634421248,101429248000,48508928,705351680,3.844,0.719,93.562,1.875,0,154800,7204610
32637145088,101426401280,48508928,705474560,4.906,1.031,93.781,0.281,0,161158,7337746
32638091264,101425360896,48508928,705564672,3.075,1.004,95.576,0.345,0,153188,7015360
32638709760,101424623616,48517120,705675264,6.484,1.278,91.615,0.623,0,147042,6819768
32639799296,101423423488,48517120,705785856,4.670,0.965,94.022,0.342,0,160258,7438954
32640098304,101423067136,48517120,705839104,5.526,1.242,92.673,0.559,0,155198,7173146
32640901120,101422104576,48525312,705982464,4.737,0.784,93.632,0.847,0,152478,6909528
32640057344,101422845952,48525312,706076672,4.409,0.719,94.340,0.532,0,149074,6895794
32640532480,101422260224,48533504,706179072,4.168,0.846,94.453,0.533,0,156678,7578696
32647933952,101414719488,48533504,706306048,4.941,1.032,93.684,0.344,0,168436,7462100
32648986624,101413580800,48533504,706392064,6.846,1.000,91.591,0.563,0,147168,6603174
32649216000,101413253120,48533504,706482176,4.259,0.777,94.622,0.342,0,142902,6676664
32648925184,101413445632,48533504,706576384,4.295,0.658,94.702,0.345,0,143692,6510034
32649224192,101413027840,48541696,706682880,6.051,0.873,92.296,0.780,0,140288,6324170
32650145792,101411999744,48541696,706789376,4.304,1.061,94.323,0.312,0,150518,6592860
32650657792,101411385344,48541696,706891776,5.531,0.781,93.188,0.500,0,143530,6392476
32650592256,101411225600,48541696,707108864,4.054,1.029,92.766,2.152,0,146262,6757342
32653496320,101408186368,48541696,707239936,3.143,0.691,95.852,0.314,0,146078,6606092
32653221888,101408362496,48549888,707321856,5.369,0.628,93.626,0.377,0,139944,6565930
32653434880,101408030720,48549888,707432448,5.135,0.871,93.713,0.280,0,149126,6858622
32652763136,101408612352,48549888,707518464,5.033,0.881,93.835,0.252,0,138864,6322406
32653774848,101407481856,48549888,707637248,4.199,0.752,94.296,0.752,0,147600,6793178
32654585856,101406543872,48558080,707756032,4.562,0.776,94.289,0.372,0,155088,7070654
32655953920,101404893184,48566272,707842048,5.908,0.995,92.662,0.435,0,162686,6922406
32656707584,101404028928,48566272,707952640,4.089,0.975,94.464,0.472,0,149656,6611574
32657080320,101403566080,48566272,708042752,4.796,0.810,93.927,0.467,0,140772,6311462
32656248832,101404311552,48566272,708128768,4.624,0.962,93.203,1.210,0,126128,5606020
32656568320,101403885568,48566272,708231168,4.131,0.845,94.491,0.532,0,128826,5914782
32657620992,101402701824,48582656,708345856,5.175,0.717,93.703,0.405,0,134002,5948612
32657833984,101402378240,48582656,708456448,4.146,0.966,94.545,0.343,0,146250,6876146
32659283968,101400805376,48582656,708562944,3.917,1.254,94.516,0.313,0,151808,6801514
29496266752,104563728384,48582656,708653056,5.485,1.122,93.113,0.280,0,139748,6240720
26370842624,107689971712,48582656,707833856,3.836,1.038,94.497,0.629,0,122510,5489532
23139483648,110922100736,48594944,707047424,3.832,0.691,95.163,0.314,0,110272,5028234
19895517184,114166669312,48603136,706437120,2.657,0.719,96.436,0.188,0,95522,4179006
16749424640,117313679360,48603136,705519616,2.410,0.595,96.901,0.094,0,70984,3126788
13644709888,120419241984,48603136,704671744,3.348,0.594,95.964,0.094,0,62772,2867172
10495569920,123569012736,48603136,704040960,1.693,0.627,96.928,0.752,0,53098,2319692
7359365120,126706290688,48615424,702955520,1.224,0.377,98.273,0.126,0,35630,1579848
4105031680,129961480192,48615424,702095360,1.034,0.282,98.653,0.031,0,21544,941180
924872704,133142515712,48615424,701218816,0.344,0.250,99.374,0.031,0,10708,431810
890494976,133177556992,48615424,700555264,0.125,0.031,99.844,0,0,480,3352
890286080,133177987072,48615424,700334080,0,0.031,99.719,0.250,0,288,0
889790464,133178474496,48635904,700321792,0,0,99.937,0.063,0,0,1564
889262080,133178990592,48635904,700334080,0.031,0,99.969,0,0,106,0
889262080,133178990592,48635904,700334080,0.031,0,99.969,0,0,182,0
889004032,133179248640,48635904,700334080,0,0,100,0,0,106,0
888745984,133179506688,48635904,700334080,0,0,100,0,0,0,0
888737792,133179514880,48635904,700334080,0,0,100,0,0,106,0
888213504,133180030976,48644096,700334080,0.031,0,99.906,0.062,0,0,0
887955456,133180289024,48644096,700334080,0,0,100,0,0,288,0
887955456,133180289024,48644096,700334080,0,0,100,0,0,234,0
887697408,133180547072,48644096,700334080,0,0.031,99.969,0,0,106,0
887697408,133180547072,48644096,700334080,0.031,0,99.969,0,0,364,0
887697408,133180547072,48644096,700334080,0,0,100,0,0,404,264
887431168,133180805120,48652288,700334080,0,0,99.969,0.031,0,296,0
887173120,133181063168,48652288,700334080,0,0,100,0,0,574,0
887169024,133181063168,48652288,700338176,0.031,0,99.969,0,0,0,0
886992896,133181239296,48652288,700338176,0,0,100,0,0,106,0
886734848,133181497344,48652288,700338176,0.031,0,99.969,0,0,746,300
886734848,133181497344,48652288,700338176,0,0.031,99.969,0,0,340,0
886726656,133181497344,48660480,700338176,0,0,99.938,0.062,0,234,0
886468608,133181755392,48660480,700338176,0,0,100,0,0,106,2020
886210560,133182013440,48660480,700338176,0.031,0,99.969,0,0,0,1564
885952512,133182271488,48660480,700338176,0.031,0,99.969,0,0,318,168
885694464,133182529536,48660480,700338176,0,0.031,99.969,0,0,182,0
885436416,133182787584,48660480,700338176,0,0,100,0,0,106,0
903561216,133164457984,48668672,700342272,0.938,0.219,98.812,0.031,0,391228,19346
