172.16.72.14 : 10.20 10.26 10.25 10.25 10.22 10.24 10.28 10.26 10.27 10.28
172.16.72.23 : 10.27 10.28 10.27 10.28 10.29 10.28 10.26 10.28 10.25 10.26
172.16.72.25 : 0.16 0.20 0.19 0.20 0.21 0.18 0.19 0.21 0.22 0.22
172.16.72.26 : 0.15 0.19 0.19 0.18 0.17 0.17 0.19 0.22 0.17 0.17
172.16.72.27 : 0.21 0.21 0.17 0.19 0.20 0.17 0.21 0.22 0.20 0.20
172.16.72.28 : 0.16 0.20 0.18 0.21 0.19 0.17 0.17 0.18 0.19 0.19
172.16.72.29 : 0.15 0.18 0.19 0.18 0.16 0.22 0.22 0.17 0.18 0.20
172.16.72.3  : 0.22 0.23 0.22 0.20 0.20 0.20 0.19 0.17 0.19 0.20
172.16.72.30 : 0.20 0.19 0.18 0.19 0.21 0.21 0.21 0.17 0.21 0.20
172.16.72.31 : 0.17 0.17 0.19 0.21 0.21 0.21 0.20 0.20 0.21 0.19
172.16.72.32 : 0.20 0.21 0.20 0.17 0.18 0.18 0.21 0.15 0.19 0.20
172.16.72.33 : 0.22 0.20 0.20 0.19 0.21 0.21 0.21 0.20 0.20 0.20
172.16.72.34 : 0.21 0.20 0.18 0.20 0.19 0.20 0.22 0.19 0.21 0.20
172.16.72.35 : 0.14 0.17 0.22 0.15 0.21 0.20 0.19 0.20 0.19 0.19
172.16.72.36 : 0.18 0.15 0.21 0.20 0.11 0.14 0.19 0.18 0.16 0.16
172.16.72.37 : 0.20 0.17 0.20 0.19 0.21 0.16 0.20 0.19 0.19 0.20
172.16.72.38 : 0.18 0.17 0.19 0.17 0.18 0.21 0.19 0.18 0.20 0.18
172.16.72.39 : 0.04 0.03 0.04 0.03 0.03 0.03 0.03 0.03 0.03 0.01
172.16.72.4  : 200.22 - - 200.31 200.29 200.29 200.32 200.32 200.31 200.26
172.16.72.40 : 200.29 200.31 200.29 200.33 200.29 200.32 200.30 200.31 200.28 -
172.16.72.41 : - 200.32 200.32 200.29 200.29 200.32 200.31 - - 200.32
172.16.72.42 : - 200.31 200.29 200.23 200.26 200.24 200.28 200.30 200.29 200.27
172.16.72.43 : 200.31 200.31 200.34 - 200.32 200.30 200.20 200.26 200.30 200.30
172.16.72.44 : 200.27 200.23 200.31 200.32 200.29 200.28 200.28 200.27 200.29 200.27
172.16.72.46 : 200.29 - 200.27 200.32 200.25 200.28 200.28 - - 200.27
172.16.72.47 : 200.29 - 200.33 200.33 200.33 200.30 200.32 200.31 200.33 -
172.16.72.48 : 200.33 200.31 200.30 200.30 200.28 200.31 200.25 200.22 200.26 200.30
172.16.72.49 : 200.21 200.30 200.31 200.28 200.28 200.25 200.29 200.28 200.30 200.32
172.16.72.5  : 200.27 - 200.25 200.26 200.20 200.31 200.25 200.24 200.20 200.25
172.16.72.50 : - 200.29 200.26 200.30 200.29 200.30 200.29 200.28 200.28 200.27
172.16.72.51 : 200.28 200.32 200.29 200.31 - 200.34 200.32 200.25 - 200.29
172.16.72.6  : 200.24 - 200.31 200.32 - 200.30 200.31 200.34 200.31 200.28
172.16.72.7  : 200.25 200.29 200.29 200.31 200.29 200.30 200.28 200.27 200.30 200.31
172.16.72.8  : 200.28 200.30 200.29 200.30 200.31 200.32 200.31 200.31 200.31 200.29
172.16.72.9  : 4.27 4.24 4.32 4.29 4.31 4.31 4.30 4.30 4.31 4.32

      35 targets
      35 alive
       0 unreachable
       0 unknown addresses

      11 timeouts (waiting for response)
     350 ICMP Echos sent
     331 ICMP Echo Replies received
       0 other ICMP received

 0.01 ms (min round trip time)
 86.1 ms (avg round trip time)
 200 ms (max round trip time)
       10.326 sec (elapsed real time)

