"Dstat 0.7.3 CSV output"
"Author:","Dag Wieers <dag@wieers.com>",,,,"URL:","http://dag.wieers.com/home-made/dstat/"
"Host:","grisou-23.nancy.grid5000.fr",,,,"User:","root"
"Cmdline:","dstat -m -c -n -o dstat.csv",,,,"Date:","27 May 2020 10:04:35 CEST"
"memory usage",,,,"total cpu usage",,,,,"net/total",
"used","free","buff","cach","usr","sys","idl","wai","stl","recv","send"
1709522944,124346007552,76324864,8430317568,0.141,0.068,99.721,0.070,0,0,0
1719754752,124335443968,76341248,8430665728,0.531,0.156,99.282,0.031,0,395002,14616
1718898688,124336558080,76353536,8430395392,0.874,0.624,98.470,0.031,0,390872,27778
1717964800,124337426432,76353536,8430411776,1.031,0.718,97.845,0.406,0,6248,16476
1716760576,124338819072,76353536,8430223360,0.031,0,99.969,0,0,7560,0
1718108160,124337246208,76382208,8430419968,1.032,0.781,98.093,0.094,0,392830,26570
1716228096,124339314688,76382208,8430231552,0,0.031,99.969,0,0,5684,132
1715879936,124339662848,76382208,8430231552,0,0.031,99.969,0,0,11850,84
1715134464,124340396032,76394496,8430231552,0.063,0.031,99.875,0.031,0,16010,264
1714860032,124340670464,76394496,8430231552,0,0.031,99.969,0,0,6938,0
1714585600,124340895744,76406784,8430231552,0,0.063,99.875,0.063,0,4760,2560
1714327552,124341153792,76406784,8430231552,0.063,0,99.937,0,0,3124,1008
1714327552,124341153792,76406784,8430231552,0.031,0.031,99.937,0,0,2658,1508
1713029120,124342452224,76406784,8430231552,0.062,0,99.938,0,0,1232,84
1712562176,124342910976,76414976,8430231552,0.031,0.031,99.906,0.031,0,586,0
1712549888,124342870016,76423168,8430231552,0,0,99.937,0.063,0,1158,0
1712291840,124343128064,76423168,8430231552,0,0,100,0,0,932,0
1712033792,124343386112,76423168,8430231552,0.031,0.031,99.938,0,0,4584,0
1734111232,124321308672,76427264,8430227456,0.781,0.563,98.156,0.500,0,389306,17234
1719197696,124336156672,76439552,8430239744,0.344,0.344,99.063,0.250,0,8268,13660
1721417728,124333879296,76476416,8430252032,0.407,0.438,98.905,0.250,0,350106,19588
1722204160,124333006848,76476416,8430284800,0.406,0.125,99.469,0,0,410752,18080
1717366784,124337836032,76476416,8430288896,1.125,0.562,98.313,0,0,31806,17686
1719857152,124335312896,76492800,8430297088,1.093,0.687,98.188,0.031,0,405712,26586
1718595584,124336574464,76492800,8430297088,0,0.063,99.531,0.407,0,22932,0
1731883008,124323270656,76517376,8430284800,0.937,0.531,98.407,0.125,0,388970,12910
1723867136,124331220992,76517376,8430297088,0.188,0.219,99.593,0,0,17040,13660
1723412480,124331577344,76517376,8430297088,0,0.031,99.969,0,0,48786,0
1724821504,124329832448,76517376,8430551040,1.625,0.250,98.125,0,0,224180,10816
1722847232,124332036096,76517376,8430301184,0.031,0.031,99.500,0.438,0,3916,2800
1721909248,124332924928,76529664,8430301184,0.062,0.031,99.844,0.062,0,1098,0
1721851904,124332969984,76541952,8430301184,0,0,99.937,0.063,0,752,0
1722368000,124332220416,76558336,8430518272,0.438,0.156,99.375,0.031,0,342746,15256
1728794624,124325810176,76558336,8430505984,0.312,0.125,99.563,0,0,179878,22166
1728458752,124326133760,76562432,8430514176,0,0.063,99.656,0.281,0,12720,13230
1728696320,124325883904,76574720,8430514176,0.031,0,99.875,0.094,0,13006,13132
1728696320,124325883904,76574720,8430514176,0,0.063,99.937,0,0,13068,13230
1728675840,124325892096,76587008,8430514176,0.031,0.031,99.906,0.031,0,13128,13328
1728159744,124326408192,76587008,8430514176,0.031,0.031,99.937,0,0,19914,19026
1728159744,124326408192,76587008,8430514176,0,0,100,0,0,13188,13328
1728159744,124326408192,76595200,8430505984,0,0.063,99.625,0.313,0,13352,13328
1727893504,124326666240,76595200,8430514176,0,0.031,99.969,0,0,12782,13230
1727893504,124326666240,76595200,8430514176,0.031,0.031,99.937,0,0,12176,12838
1720193024,124334358528,76603392,8430514176,0.062,0.031,99.844,0.062,0,1892,2236
1719177216,124335415296,76619776,8430452736,0.250,0.156,99.562,0.031,0,173236,14316
1719255040,124335435776,76632064,8430342144,0.094,0.063,99.469,0.375,0,63900,1008
1719250944,124335435776,76632064,8430346240,0.031,0.031,99.937,0,0,8648,2016
1718992896,124335693824,76632064,8430346240,0.062,0,99.938,0,0,928,1008
1718726656,124335955968,76632064,8430350336,0,0.031,99.969,0,0,346,0
1718714368,124335955968,76644352,8430350336,0.031,0,99.937,0.031,0,828,0
1718706176,124335955968,76652544,8430350336,0.031,0.062,99.531,0.375,0,932,1948
1718706176,124335955968,76652544,8430350336,0.031,0,99.969,0,0,406,0
1718190080,124336472064,76652544,8430350336,0,0,100,0,0,812,220
1717932032,124336730112,76652544,8430350336,0,0,100,0,0,692,0
1742970880,124311638016,76705792,8430309376,5.754,0.840,92.442,0.964,0,67928,103524
1748783104,124304605184,77221888,8430768128,4.133,0.438,93.049,2.379,0,7798,6744
1747804160,124305207296,77406208,8430854144,1.190,0.157,97.871,0.783,0,4818,5022
1747460096,124305465344,77406208,8430940160,0.031,0.031,99.937,0,0,3242,1604
1740005376,124312920064,77406208,8430940160,0,0.031,99.969,0,0,2670,1604
1739558912,124313366528,77406208,8430940160,0.188,0,99.812,0,0,4004,1814
1739030528,124313882624,77422592,8430936064,0.125,0.062,99.407,0.406,0,4092,1604
1738248192,124314656768,77422592,8430944256,0.031,0,99.969,0,0,4178,1604
1738248192,124314656768,77422592,8430944256,0,0,100,0,0,3898,1604
1737990144,124314914816,77422592,8430944256,0.094,0,99.906,0,0,2282,1604
1738248192,124314656768,77422592,8430944256,0.188,0.031,99.781,0,0,1918,1814
1737981952,124314914816,77430784,8430944256,0.031,0.031,99.812,0.125,0,2550,1604
1737715712,124315172864,77438976,8430944256,0.031,0.031,99.875,0.062,0,1512,1604
1737175040,124315688960,77438976,8430968832,0.595,0.156,99.249,0,0,796782,782415
1739296768,124310110208,77438976,8434282496,2.530,0.500,96.970,0,0,5881668,5896362
1758687232,124285149184,77438976,8439676928,3.729,0.470,95.801,0,0,10755368,10836093
1761923072,124276420608,77447168,8444981248,3.218,0.469,96.032,0.281,0,12319186,12440696
1758887936,124271984640,77447168,8452214784,1.438,0.250,98.311,0,0,13786368,11776235
1758126080,124264460288,77471744,8460263424,1.532,0.469,97.781,0.219,0,16238520,18429234
1760628736,124255887360,77471744,8466149376,2.435,0.406,97.159,0,0,13440000,13437518
1780375552,124229816320,77471744,8472276992,2.434,0.499,97.066,0,0,12880046,12927143
1785966592,124217688064,77479936,8478646272,2.413,0.251,97.242,0.094,0,12631614,12795719
1785253888,124211978240,77479936,8484864000,0.719,0.282,98.999,0,0,12607116,12759182
1785049088,124203978752,77479936,8492916736,1.409,0.282,98.309,0,0,17075438,17036218
1792659456,124184399872,77488128,8504508416,4.808,0.687,94.474,0.031,0,24340494,24482811
1842176000,124122066944,77496320,8516984832,7.094,0.594,92.188,0.125,0,27771496,28015179
1841332224,124107845632,77504512,8531574784,2.846,0.500,96.559,0.094,0,29544551,29824625
1843085312,124091523072,77508608,8545763328,1.782,0.375,96.685,1.157,0,28904591,29095876
1873670144,124047343616,77508608,8559034368,1.658,0.532,97.810,0,0,29488170,29815515
1904234496,124002160640,77508608,8573235200,7.704,0.780,91.516,0,0,27924522,27943107
1928253440,123966140416,77516800,8584884224,5.191,0.563,94.215,0.031,0,25300105,25532871
1932214272,123949846528,77524992,8596918272,5.651,0.593,93.693,0.062,0,26412161,26657025
1935216640,123933319168,77529088,8610058240,2.874,0.750,95.251,1.125,0,27601890,27975685
1931595776,123918409728,77529088,8628117504,5.229,0.564,93.738,0.470,0,36034758,36263306
1954402304,123875024896,77529088,8648134656,2.058,1.123,96.819,0,0,41261582,41805345
1998299136,123809988608,77529088,8668700672,1.191,0.721,98.088,0,0,43742244,44158687
2041061376,123745804288,77545472,8689467392,1.034,0.878,97.994,0.094,0,42517148,43038227
2056232960,123710124032,77545472,8709488640,1.281,1.031,97.688,0,0,42880208,43371247
2054963200,123691511808,77545472,8728821760,1.223,0.690,98.088,0,0,40592898,41145975
2046377984,123679203328,77545472,8749084672,1.250,0.813,97.937,0,0,42506146,43059433
2044198912,123660189696,77545472,8769712128,1.127,0.782,98.091,0,0,41708648,42241312
2044624896,123637465088,77553664,8791445504,1.097,0.752,98.088,0.063,0,45840814,46298849
2042527744,123616182272,77561856,8814116864,1.192,0.627,98.118,0.063,0,46167296,46712019
2086526976,123550109696,77561856,8835620864,1.161,0.721,98.118,0,0,45198998,45725288
2125991936,123489820672,77561856,8855932928,1.034,0.784,98.182,0,0,41893942,42311386
2167054336,123427217408,77561856,8876994560,1.567,0.784,97.649,0,0,45154378,45668729
2166431744,123403927552,77570048,8900116480,1.347,0.689,97.902,0.063,0,47761506,48250619
2165661696,123381194752,77570048,8923054080,1.160,0.878,97.962,0,0,47381452,47795694
2167762944,123357388800,77578240,8944128000,1.317,0.721,97.930,0.031,0,46263178,46905806
2166059008,123336200192,77578240,8966471680,1.189,0.907,97.904,0,0,44070014,44642401
2164649984,123315990528,77578240,8987430912,1.159,0.814,98.027,0,0,43473774,43880514
2164985856,123294031872,77586432,9008455680,1.560,0.811,97.567,0.062,0,45196926,45851640
2164449280,123268902912,77586432,9033388032,1.316,0.940,97.744,0,0,51847575,52391353
2190241792,123217371136,77590528,9058476032,1.684,1.092,96.132,1.092,0,51104723,51564939
2239139840,123145781248,77598720,9080504320,1.407,0.813,97.592,0.188,0,46393516,46971224
2285928448,123076145152,77598720,9102774272,1.591,0.998,97.411,0,0,47460408,47967567
2331127808,123005288448,77606912,9127759872,1.688,1.000,97.218,0.094,0,50561890,51032164
2332205056,122981695488,77606912,9149554688,1.282,0.907,97.812,0,0,46275322,46991791
2331951104,122958413824,77606912,9172418560,1.439,0.751,97.810,0,0,48176536,48554285
2330832896,122935156736,77611008,9196167168,1.531,0.875,95.376,2.218,0,49115154,49679581
2331824128,122911354880,77623296,9218355200,1.753,0.814,91.453,5.980,0,46838662,47372225
2331017216,122890924032,77639680,9238941696,1.066,0.846,91.567,6.520,0,42261432,42636528
2329911296,122867376128,77643776,9262948352,1.469,0.844,97.250,0.438,0,50318284,50967852
2330038272,122844102656,77643776,9285562368,1.035,0.878,98.087,0,0,46830542,47364981
2328588288,122821087232,77643776,9309270016,1.284,0.846,97.870,0,0,49839194,50559481
2328137728,122797785088,77643776,9332441088,1.129,0.815,98.056,0,0,48967122,49365609
2328731648,122774839296,77660160,9354194944,1.439,0.907,97.497,0.156,0,45490088,45957178
2338328576,122743177216,77660160,9375588352,1.406,0.875,97.719,0,0,44033034,44689621
2385764352,122674515968,77660160,9396232192,1.438,0.688,97.874,0,0,43180260,43698573
2425597952,122608877568,77660160,9421303808,3.149,0.967,95.884,0,0,51362780,59656260
2425925632,122585088000,77660160,9444143104,3.238,1.059,95.704,0,0,48443678,76992148
2425692160,122562314240,77668352,9466560512,1.317,0.690,97.930,0.063,0,46521362,76295545
2424852480,122539798528,77676544,9489346560,2.064,1.032,96.842,0.063,0,47976300,77970435
2425004032,122516443136,77676544,9511817216,1.825,0.661,96.665,0.850,0,48991528,79006115
2426408960,122491121664,77692928,9535021056,2.319,0.783,93.889,3.008,0,46377558,76543585
2432114688,122462330880,77709312,9557467136,3.096,0.813,95.935,0.156,0,46868360,76834067
2431860736,122440089600,77717504,9579347968,2.339,0.905,96.694,0.062,0,46183031,75865188
2433384448,122417324032,77717504,9600176128,1.690,0.876,97.433,0,0,47319282,76456624
2433183744,122392502272,77725696,9624379392,1.189,1.002,97.778,0.031,0,47255882,77426531
2429898752,122373390336,77725696,9646206976,1.562,1.062,97.376,0,0,45660854,75062456
2429554688,122350362624,77725696,9668931584,1.190,0.908,97.902,0,0,46999820,76376767
2429894656,122325938176,77733888,9692332032,1.876,0.813,97.249,0.063,0,48102182,78068741
2429399040,122305744896,77733888,9712447488,1.035,0.565,98.400,0,0,42554388,72691412
2429444096,122282016768,77733888,9735577600,1.500,0.907,97.593,0,0,48471916,78153071
2429898752,122257195008,77742080,9759301632,1.746,1.060,97.163,0.031,0,51288367,81253236
2430083072,122232414208,77750272,9783140352,1.504,0.940,97.462,0.094,0,47523753,77102351
2429984768,122208661504,77758464,9806348288,1.254,0.815,97.869,0.063,0,49724430,79705639
2429251584,122184761344,77758464,9830301696,1.378,0.783,97.840,0,0,48523256,78947968
2428891136,122161790976,77758464,9852997632,1.348,0.658,97.994,0,0,49285354,78720742
2428784640,122138210304,77758464,9876090880,1.408,0.845,97.748,0,0,47685051,75779705
2426482688,122114957312,77766656,9900900352,1.408,0.782,97.779,0.031,0,50614773,81119574
2427678720,122089975808,77774848,9924050944,1.438,0.875,97.624,0.063,0,49324816,79638722
2427138048,122066718720,77774848,9947222016,1.378,0.657,97.777,0.188,0,47645008,77800918
2426531840,122047057920,77774848,9966915584,1.003,0.752,98.246,0,0,42235774,72428027
2426404864,122023276544,77774848,9990246400,1.751,0.782,97.467,0,0,48839240,79339602
2426015744,121999228928,77774848,10013880320,1.622,0.967,97.411,0,0,48525972,78305342
2425262080,121978589184,77791232,10034733056,1.313,0.719,97.874,0.094,0,43350774,73688851
2425909248,121956929536,77791232,10055163904,1.097,0.815,98.088,0,0,43735354,73308406
2424983552,121935155200,77791232,10077294592,1.281,0.844,97.875,0,0,46239139,76229806
2424860672,121911881728,77791232,10100125696,1.621,0.935,97.444,0,0,48913715,78197754
2424131584,121890607104,77791232,10121478144,1.219,0.719,98.062,0,0,41495578,70285939
2423930880,121868623872,77799424,10143072256,1.651,0.779,97.508,0.062,0,46044860,74760198
2423681024,121846108160,77807616,10165104640,1.347,0.689,97.901,0.063,0,47034982,77510139
2423222272,121822601216,77811712,10188398592,1.375,0.719,96.780,1.125,0,47468596,75411710
2422173696,121798815744,77811712,10212552704,1.346,0.876,97.778,0,0,50488562,77122696
2423046144,121774219264,77811712,10235637760,1.222,0.877,97.901,0,0,48957274,77439180
2422661120,121750413312,77819904,10259132416,1.346,0.782,97.809,0.063,0,48389332,78670132
2420457472,121730854912,77819904,10280312832,1.440,0.783,97.777,0,0,44259818,74011146
2421383168,121705775104,77832192,10303811584,1.251,0.938,96.716,1.095,0,48606840,77695413
2419744768,121683275776,77836288,10327355392,1.160,0.909,95.016,2.915,0,49219996,79488740
2420670464,121660239872,77848576,10348793856,1.065,0.940,95.020,2.975,0,44386566,74981278
2420150272,121639821312,77860864,10369204224,1.313,0.813,93.934,3.940,0,43035914,72779553
2418393088,121619599360,77864960,10390605824,1.251,0.813,92.993,4.942,0,44673847,74717459
2418708480,121594847232,77864960,10414280704,1.190,0.814,97.996,0,0,49319136,79645858
2419261440,121571090432,77873152,10437062656,1.437,0.906,97.595,0.062,0,48265897,78780929
2418950144,121547313152,77873152,10460364800,1.563,0.844,97.593,0,0,49734061,79501856
2418941952,121523281920,77881344,10483847168,1.437,0.781,97.719,0.062,0,47384894,77623449
2419048448,121501007872,77881344,10505248768,1.340,0.904,97.756,0,0,45042798,74903340
2418475008,121479028736,77881344,10527281152,1.494,0.996,97.509,0,0,44909526,74661280
2418601984,121456287744,77881344,10549284864,1.343,0.937,97.719,0,0,46957270,77268919
2421055488,121431560192,77889536,10570866688,1.440,0.845,97.652,0.063,0,44824987,74478587
2421497856,121410576384,77901824,10590855168,1.904,0.905,95.256,1.935,0,42118525,69904729
2421166080,121388138496,77930496,10612973568,1.438,0.844,96.124,1.594,0,45815448,74787825
2421198848,121366454272,77930496,10633981952,1.468,0.625,97.907,0,0,43875608,72854761
2421542912,121342701568,77930496,10656833536,1.564,0.657,97.779,0,0,48018258,77521608
2421338112,121320640512,77930496,10678472704,1.190,0.845,97.965,0,0,46494050,75935378
2420588544,121296691200,77946880,10702458880,1.373,0.998,97.504,0.125,0,48913686,78631890
2420477952,121273675776,77946880,10724966400,1.158,0.814,98.028,0,0,46339442,76309721
2420768768,121250402304,77946880,10747305984,1.250,0.969,97.781,0,0,47329833,77001301
2420797440,121229471744,77955072,10767683584,1.250,0.843,97.782,0.125,0,43009093,69968296
2420502528,121206718464,77955072,10790080512,1.063,0.907,98.029,0,0,46776934,74676575
2418642944,121185443840,77963264,10812628992,1.404,0.843,97.659,0.094,0,45774654,71260472
2420613120,121161170944,77963264,10834268160,1.466,0.936,97.598,0,0,47855044,77136129
2421080064,121136058368,77963264,10858246144,1.873,0.843,97.285,0,0,48988204,78720154
2420989952,121111502848,77963264,10882195456,1.531,0.843,97.626,0,0,49737974,79641664
2420895744,121089138688,77971456,10904145920,1.314,0.751,97.904,0.031,0,45825596,76308439
2420625408,121065095168,77979648,10927738880,1.158,0.907,97.904,0.031,0,48861538,78326957
2421833728,121041051648,77979648,10950008832,1.345,0.751,97.904,0,0,47262960,77369207
2421506048,121017765888,77979648,10972897280,1.282,0.844,97.874,0,0,47266260,76766697
2420776960,120995528704,77979648,10995216384,0.971,0.909,98.120,0,0,46258204,76300227
2422054912,120971464704,77979648,11017404416,1.716,0.749,97.536,0,0,47257400,76644595
2421940224,120948215808,77996032,11040202752,1.065,0.846,97.995,0.094,0,46766674,76361564
2420744192,120926494720,77996032,11062476800,1.187,1.031,97.783,0,0,45426952,75334922
2421284864,120905801728,77996032,11082055680,1.095,0.782,97.934,0.188,0,43808290,73779110
2420920320,120882511872,77996032,11105017856,1.191,0.658,98.150,0,0,46180176,75604446
2421501952,120858480640,78004224,11127934976,1.724,0.627,97.524,0.125,0,48464444,77334495
2422321152,120831995904,78012416,11152822272,1.314,0.814,97.810,0.063,0,51650894,80468274
2422325248,120809693184,78020608,11174502400,1.128,0.783,98.026,0.063,0,45337588,74687750
2421796864,120786202624,78020608,11197886464,1.223,0.721,96.834,1.223,0,48039314,76999194
2422534144,120761716736,78020608,11220992000,1.437,0.937,97.595,0.031,0,50207037,79116353
2422198272,120737964032,78020608,11244433408,1.345,0.782,97.873,0,0,48211541,77758854
2421452800,120714678272,78028800,11267756032,1.281,0.968,97.688,0.062,0,48400070,77742374
2421022720,120691503104,78028800,11290726400,1.065,0.909,98.026,0,0,48284654,78074505
2421395456,120668524544,78036992,11312803840,1.344,0.781,97.843,0.031,0,45638092,75627874
2420801536,120645349376,78045184,11335847936,1.098,0.784,95.797,2.321,0,48140176,75226480
2421334016,120621096960,78049280,11358941184,1.408,0.970,94.683,2.940,0,49164662,77125263
2420695040,120597782528,78069760,11382177792,1.222,0.815,93.732,4.231,0,47097540,76368731
2419376128,120577302528,78073856,11403419648,1.064,0.939,92.553,5.444,0,43787954,73278071
2420690944,120552230912,78073856,11426537472,1.840,0.967,97.193,0,0,49326394,78376147
2419933184,120531050496,78082048,11447857152,1.004,0.785,98.180,0.031,0,44298282,72780372
2421903360,120506544128,78082048,11469713408,1.254,0.564,98.181,0,0,46432768,76049000
2420264960,120484220928,78090240,11493048320,1.220,0.876,97.811,0.094,0,47027668,77185384
2420621312,120459915264,78090240,11516338176,1.342,1.062,97.596,0,0,50154250,80098655
2419539968,120437723136,78090240,11539042304,1.373,0.936,97.691,0,0,46020896,75464539
2418790400,120415227904,78090240,11561623552,1.314,0.845,97.842,0,0,48353096,78525405
2418081792,120392761344,78098432,11584217088,1.375,0.812,97.781,0.031,0,45486226,74498571
2418659328,120372785152,78106624,11603038208,1.188,0.719,98.061,0.031,0,40485500,66873515
2419081216,120350269440,78106624,11624566784,1.252,0.751,97.996,0,0,45492818,75506099
2418679808,120326582272,78106624,11647950848,1.250,0.875,97.875,0,0,49413479,78077367
2419601408,120303325184,78110720,11669696512,1.652,0.997,95.263,2.088,0,45298891,74730836
2420518912,120278691840,78139392,11692736512,1.473,0.815,95.832,1.880,0,48471723,77936700
2424434688,120253898752,78155776,11713019904,2.127,0.719,97.060,0.094,0,42004059,71112146
2424815616,120229130240,78155776,11736698880,1.189,0.845,97.966,0,0,49458754,79370162
2424672256,120205926400,78155776,11759484928,1.252,0.814,97.934,0,0,48167326,76776860
2424430592,120184512512,78155776,11780493312,1.312,0.843,97.844,0,0,44352815,73998085
2423898112,120162291712,78155776,11802607616,1.189,0.876,97.934,0,0,45801705,75787406
2424188928,120139534336,78163968,11824500736,1.216,1.154,97.568,0.062,0,45821944,75019202
2424438784,120115269632,78172160,11847839744,1.255,0.596,98.087,0.063,0,48785672,79087835
2424451072,120095211520,78172160,11867348992,1.433,0.810,97.758,0,0,40944690,70277635
2423345152,120072679424,78172160,11890360320,1.099,0.785,98.117,0,0,49516462,79236200
2421878784,120049922048,78172160,11913904128,1.683,0.904,97.413,0,0,48506208,77812300
2421239808,120026537984,78180352,11937288192,1.223,0.784,97.930,0.063,0,48002524,77084291
2421186560,120003772416,78180352,11959488512,1.346,0.782,97.872,0,0,46296062,75746682
2421297152,119978958848,78188544,11983572992,1.319,0.879,97.770,0.031,0,51463074,81291336
2422460416,119955763200,78188544,12004970496,1.506,0.847,97.647,0,0,45111824,74717539
2421256192,119933542400,78188544,12027674624,1.222,0.752,98.026,0,0,45899248,75503391
2421473280,119909801984,78196736,12050608128,1.284,0.814,97.871,0.031,0,47890232,77624203
2420871168,119887585280,78196736,12072808448,1.223,0.690,98.088,0,0,47210375,76394107
2420076544,119864156160,78196736,12096434176,1.218,1.031,97.595,0.156,0,48522595,77901537
2419478528,119840903168,78204928,12119650304,1.282,0.876,97.780,0.063,0,49272792,79202559
2420158464,119817338880,78204928,12141805568,1.220,0.657,98.123,0,0,45322652,75064080
2420338688,119796944896,78213120,12161511424,1.250,0.812,97.906,0.031,0,42675620,71077567
2420715520,119772864512,78213120,12184576000,1.436,0.999,97.566,0,0,47554142,76245785
2420707328,119751671808,78213120,12205264896,1.466,0.748,97.786,0,0,44023036,72746198
2420178944,119729229824,78213120,12227616768,1.406,0.750,97.844,0,0,45842686,75399191
2420531200,119704633344,78221312,12251131904,1.469,0.812,97.656,0.062,0,48694404,78331643
2419920896,119684714496,78229504,12271083520,0.912,0.503,98.522,0.063,0,42785506,72264858
2422943744,119660134400,78229504,12292055040,1.567,0.658,97.774,0,0,44538826,74180344
2422984704,119637860352,78229504,12313743360,1.160,0.783,97.368,0.689,0,42746968,72589579
2422857728,119614636032,78241792,12336349184,1.470,0.751,96.559,1.220,0,47964490,77463505
2422685696,119592931328,78241792,12357746688,1.345,0.813,97.842,0,0,45613996,75748149
2422468608,119571738624,78249984,12378509312,1.251,0.688,97.967,0.094,0,43949776,73841451
2421940224,119548694528,78249984,12401369088,1.343,0.781,97.876,0,0,45926110,75885684
2423414784,119524679680,78249984,12423368704,1.466,1.029,97.505,0,0,50146974,79378834
2421645312,119500374016,78258176,12448743424,1.438,0.938,95.656,1.969,0,50427382,80357760
2421747712,119477051392,78262272,12471255040,1.161,0.816,92.404,5.618,0,45863176,76061265
2421075968,119454691328,78278656,12493639680,1.190,1.003,90.257,7.550,0,45783360,74502981
2421030912,119431188480,78286848,12516589568,1.250,1.219,94.625,2.906,0,48110434,78343337
2421415936,119408553984,78290944,12538318848,1.281,0.938,96.625,1.156,0,45909010,75788069
2420891648,119385808896,78290944,12560875520,1.065,0.909,98.026,0,0,47126602,77167238
2422972416,119360106496,78299136,12583829504,1.567,0.846,97.555,0.031,0,47174474,76410888
2425630720,119333605376,78307328,12607070208,1.724,0.721,97.493,0.063,0,48573046,76937392
2425024512,119312211968,78307328,12628430848,1.222,0.564,98.214,0,0,45571146,75989356
2426003456,119287197696,78307328,12651765760,1.160,0.815,98.026,0,0,48172554,78437497
2426122240,119263584256,78307328,12674449408,1.284,0.814,97.902,0,0,49541594,78903388
2426056704,119239860224,78307328,12697579520,1.530,0.750,97.720,0,0,47320774,76847098
2426834944,119214522368,78323712,12721467392,0.912,0.755,98.238,0.094,0,49173272,79657710
2425737216,119193571328,78331904,12742926336,1.064,0.939,96.275,1.721,0,45136078,75332241
2426052608,119168188416,78356480,12767244288,1.254,0.846,96.396,1.504,0,50146754,79033045
2431954944,119139577856,78376960,12789280768,1.561,0.937,97.471,0.031,0,47033118,77292260
2427330560,119118401536,78376960,12814229504,1.130,0.847,98.023,0,0,49949060,79833075
2426785792,119093854208,78389248,12838817792,1.098,0.847,97.992,0.063,0,50668358,80686249
2429825024,119066386432,78401536,12862447616,2.061,0.812,97.064,0.062,0,50953782,79659490
2429009920,119043555328,78401536,12885413888,1.345,0.907,97.748,0,0,47815136,76801145
2428293120,119021039616,78401536,12908027904,1.068,0.691,98.242,0,0,46699656,74868866
2428342272,118997008384,78401536,12931366912,1.501,0.750,97.749,0,0,49054876,78102133
2428542976,118975782912,78409728,12951920640,1.622,0.749,97.567,0.062,0,43598114,73600460
2430201856,118948605952,78409728,12976771072,1.620,1.060,97.320,0,0,52768384,82726640
2430607360,118926663680,78417920,12997709824,1.158,0.814,97.996,0.031,0,44707274,73889177
2429173760,118904938496,78417920,13020078080,1.437,0.750,97.813,0,0,43590464,73535763
2429042688,118882631680,78417920,13041905664,1.315,0.657,98.028,0,0,45740717,75776621
2430738432,118856798208,78426112,13065461760,1.219,1,97.688,0.094,0,49551145,78912503
2429972480,118833741824,78426112,13088567296,1.222,0.658,98.120,0,0,48062668,77961395
2428899328,118811017216,78426112,13111721984,1.407,0.781,97.812,0,0,48734568,78781317
2432876544,118784913408,78434304,13133242368,1.497,0.780,97.443,0.281,0,45200732,74064486
2436284416,118759510016,78434304,13154643968,1.721,0.689,97.590,0,0,46142634,75902711
2435940352,118734487552,78442496,13179305984,1.408,0.845,97.685,0.063,0,50074348,79813803
2433830912,118712733696,78442496,13202501632,1.221,0.752,98.027,0,0,48354802,78272306
2434662400,118689251328,78442496,13224595456,1.281,0.906,97.812,0,0,47759430,77719459
2434007040,118666764288,78450688,13247090688,1.002,1.002,97.559,0.438,0,44866200,75338823
2433662976,118645039104,78450688,13268594688,1.345,0.813,97.842,0,0,46100422,75539443
2435440640,118617911296,78458880,13293187072,1.281,1.000,97.657,0.062,0,49701326,79828245
2435661824,118594428928,78458880,13315923968,1.468,0.719,97.813,0,0,47762078,77740941
2435338240,118572138496,78458880,13337886720,1.284,0.846,97.870,0,0,46422516,75490727
2433937408,118549090304,78471168,13361623040,1.466,0.998,96.006,1.529,0,48805304,78902537
2435002368,118526144512,78471168,13382955008,1.158,0.689,98.153,0,0,45049398,75282786
2435555328,118502563840,78479360,13405241344,1.345,0.688,97.904,0.063,0,46839243,77268256
2434904064,118480023552,78479360,13427900416,1.466,0.873,97.661,0,0,46356009,76392661
2437410816,118455603200,78479360,13449220096,1.564,0.970,97.466,0,0,46232243,76269213
2436243456,118433357824,78479360,13471969280,1.312,0.906,97.688,0.094,0,46305380,76361210
2435702784,118412070912,78495744,13493182464,1.407,0.875,94.686,3.032,0,43599869,73052859
2434375680,118389587968,78508032,13516353536,1.436,0.968,94.538,3.059,0,47336251,77536437
2434797568,118367588352,78520320,13537275904,1.250,1.032,94.780,2.938,0,46132322,75215782
2434093056,118342164480,78524416,13562716160,1.224,0.659,96.264,1.852,0,51157188,81101775
2434981888,118318407680,78524416,13584949248,1.283,0.688,98.029,0,0,46428326,76799487
2437500928,118293630976,78524416,13606662144,1.130,0.691,98.180,0,0,47054216,76553148
2436317184,118270939136,78540800,13629861888,1.438,0.812,97.656,0.094,0,47833072,78035455
2436595712,118246629376,78540800,13653192704,1.433,1.060,97.507,0,0,47942661,78137989
2435067904,118224150528,78540800,13676552192,1.282,0.876,97.842,0,0,49348873,79759707
2436009984,118199869440,78540800,13699276800,1.250,0.968,97.782,0,0,47388826,77855710
2439479296,118172680192,78540800,13722431488,1.876,0.813,97.312,0,0,48517096,78639574
2439708672,118149423104,78548992,13744779264,1.407,0.688,97.811,0.094,0,47098110,76752733
2437640192,118128115712,78557184,13767507968,1.036,0.722,98.210,0.031,0,46986832,77111696
2437742592,118104158208,78557184,13790670848,1.410,0.783,97.807,0,0,48700598,78896442
2437488640,118082121728,78557184,13812285440,1.590,1.060,96.322,1.029,0,45783808,76075650
2437595136,118058631168,78585856,13835026432,1.317,0.847,92.911,4.925,0,47653510,77368740
2436861952,118034083840,78594048,13859598336,1.624,0.781,97.502,0.094,0,50362818,80490116
2437185536,118011006976,78602240,13881831424,1.498,0.936,97.503,0.062,0,46829028,76753497
2438496256,117997830144,78602240,13893271552,0.814,0.501,98.685,0,0,24098850,53249099
2438545408,117997363200,78602240,13893677056,0.125,0.062,99.812,0,0,55794,28850168
2438483968,117997424640,78602240,13893677056,0.094,0.063,99.844,0,0,42814,28323788
2438316032,117997592576,78610432,13893668864,0.063,0.031,99.843,0.063,0,42440,28090770
2457661440,117978238976,78610432,13893677056,1.375,0.063,98.562,0,0,76814,29133326
2457653248,117978238976,78618624,13893677056,0.094,0.031,99.844,0.031,0,45782,28299020
2457645056,117978247168,78618624,13893677056,0.125,0.062,99.812,0,0,68724,24886446
2452467712,117983424512,78618624,13893677056,0.094,0.031,99.875,0,0,47432,28751256
2452467712,117983424512,78626816,13893668864,0.063,0.094,99.781,0.063,0,46964,27065334
2452713472,117983170560,78626816,13893677056,0.125,0.031,99.844,0,0,43602,27911806
2452709376,117983170560,78626816,13893681152,0.063,0.063,99.875,0,0,73856,28782574
2452271104,117983600640,78635008,13893681152,0.063,0.063,99.812,0.063,0,44208,27144645
2452271104,117983600640,78635008,13893681152,0.125,0.031,99.844,0,0,68218,28363574
2452271104,117983600640,78643200,13893672960,0.031,0.031,99.906,0.031,0,27864,11215696
2452062208,117983797248,78643200,13893681152,0,0.031,99.969,0,0,41706,1916
2451853312,117984006144,78643200,13893681152,0,0.031,99.969,0,0,10734,2572
2451845120,117984010240,78647296,13893681152,0,0.031,99.625,0.344,0,38562,2650
2451681280,117984165888,78655488,13893681152,0.031,0,99.906,0.062,0,43678,2782
2469232640,117966131200,78663680,13893808128,0.719,0.219,99.000,0.063,0,439986,19862
2493374464,117940072448,78663680,13893804032,0.938,0.657,98.405,0,0,229083,39942
