172.16.66.10  : 4.30 4.30 4.34 4.30 4.22 4.24 4.31 4.30 4.22 4.35
172.16.66.106 : 4.34 4.38 4.41 4.36 4.30 4.34 4.40 4.40 4.25 4.37
172.16.66.109 : 0.24 0.22 0.23 0.16 0.16 0.17 0.15 0.14 0.14 0.16
172.16.66.110 : 0.04 0.03 0.01 0.03 0.03 0.03 0.03 0.03 0.03 0.03
172.16.66.113 : 0.20 0.22 0.22 0.22 0.23 0.22 0.23 0.22 0.22 0.21
172.16.66.114 : 0.19 0.22 0.23 0.22 0.22 0.22 0.22 0.22 0.23 0.22
172.16.66.49  : 4.30 4.42 4.33 4.39 4.39 4.38 4.38 4.40 4.32 4.40
172.16.66.5   : 4.34 4.41 4.38 4.38 4.34 4.33 4.32 4.34 4.32 4.33
172.16.66.50  : 4.27 4.32 4.38 4.38 4.38 4.38 4.38 4.38 4.39 4.40
172.16.66.51  : 4.27 4.41 4.32 4.31 4.30 4.34 4.32 4.32 4.38 4.40
172.16.66.52  : 4.26 4.29 4.38 4.40 4.29 4.39 4.32 4.31 4.40 4.39

      11 targets
      11 alive
       0 unreachable
       0 unknown addresses

       0 timeouts (waiting for response)
     110 ICMP Echos sent
     110 ICMP Echo Replies received
       0 other ICMP received

 0.01 ms (min round trip time)
 2.82 ms (avg round trip time)
 4.42 ms (max round trip time)
        9.109 sec (elapsed real time)

