172.16.72.14 : 0.20 0.12 0.13 0.15 0.19 0.18 0.18 0.18 0.14 0.19
172.16.72.23 : 0.04 0.03 0.03 0.03 0.03 0.01 0.03 0.03 0.01 0.03
172.16.72.25 : 10.31 10.29 10.27 10.27 10.30 10.33 10.31 10.34 10.31 10.32
172.16.72.26 : 10.32 10.25 10.30 10.31 10.28 - 10.27 - 10.18 10.16
172.16.72.27 : 10.25 10.33 10.29 - 10.29 10.25 10.31 10.29 10.27 10.30
172.16.72.28 : 10.17 10.23 10.19 10.19 10.15 10.22 - 10.24 10.25 10.26
172.16.72.29 : 10.21 10.29 10.30 10.30 10.27 10.31 10.28 10.30 10.27 -
172.16.72.3  : 10.27 10.29 10.28 10.30 10.29 10.30 10.28 10.29 10.26 10.29
172.16.72.30 : 10.18 10.30 10.30 10.28 10.26 10.25 10.19 10.19 10.24 -
172.16.72.31 : 10.24 10.29 10.28 10.30 10.29 10.33 10.28 10.32 10.32 10.30
172.16.72.32 : 10.18 10.26 10.28 10.26 10.23 10.22 10.29 10.23 10.23 10.24
172.16.72.33 : 10.17 10.31 10.30 10.30 10.29 10.30 10.30 10.30 10.31 10.29
172.16.72.34 : 10.18 10.28 10.31 10.27 10.26 10.29 10.24 10.31 10.27 10.28
172.16.72.35 : 10.27 10.29 10.29 10.31 10.32 10.29 10.31 10.31 10.28 10.29
172.16.72.36 : 10.28 10.31 10.27 10.29 10.19 10.31 10.30 10.28 10.23 10.30
172.16.72.37 : 10.23 - 10.24 10.24 10.27 10.23 10.23 10.20 10.32 10.27
172.16.72.38 : - 10.26 10.25 10.25 10.28 10.29 10.28 10.28 10.33 10.27
172.16.72.39 : 10.30 10.29 10.29 10.31 10.28 10.29 10.31 10.30 10.30 10.34
172.16.72.4  : 4.27 4.27 4.31 4.30 4.28 4.29 4.31 4.34 4.30 4.31
172.16.72.40 : 4.28 4.25 4.24 4.27 4.24 4.26 4.30 4.25 4.31 4.28
172.16.72.41 : 4.26 4.25 4.31 4.32 4.28 4.31 4.30 4.31 4.27 4.29
172.16.72.42 : 4.25 4.31 4.32 4.29 4.30 4.33 4.29 4.28 4.31 4.30
172.16.72.43 : 4.32 4.33 4.33 4.28 4.27 4.28 4.28 4.32 4.29 4.29
172.16.72.44 : 4.25 4.29 4.25 4.28 4.25 4.26 4.30 4.31 4.29 4.27
172.16.72.46 : 4.29 4.29 4.26 4.29 4.30 4.32 4.30 4.27 4.30 4.26
172.16.72.47 : 4.29 4.24 4.30 4.30 4.32 4.28 4.32 4.26 4.30 4.32
172.16.72.48 : 4.30 4.31 4.28 4.31 4.31 4.31 4.30 4.32 4.24 4.32
172.16.72.49 : 4.26 4.27 4.28 4.30 4.32 4.26 4.25 4.27 4.28 4.30
172.16.72.5  : 4.27 4.30 4.27 4.30 4.31 4.30 4.29 4.32 4.32 4.28
172.16.72.50 : 4.31 4.33 4.27 4.27 4.29 4.31 4.31 4.31 4.31 4.29
172.16.72.51 : 4.30 4.29 4.27 4.33 4.33 4.32 4.31 4.32 4.32 4.31
172.16.72.6  : 4.30 4.29 4.28 4.29 4.31 4.28 4.30 4.31 4.31 4.28
172.16.72.7  : 4.28 4.29 4.24 4.26 4.28 4.29 4.30 4.26 4.29 4.31
172.16.72.8  : 4.28 4.29 4.30 4.29 4.31 4.30 4.29 4.28 4.31 4.32
172.16.72.9  : 4.26 4.29 4.31 4.30 4.33 4.29 4.31 4.32 4.30 4.23

      35 targets
      35 alive
       0 unreachable
       0 unknown addresses

       7 timeouts (waiting for response)
     350 ICMP Echos sent
     342 ICMP Echo Replies received
       0 other ICMP received

 0.01 ms (min round trip time)
 6.70 ms (avg round trip time)
 10.3 ms (max round trip time)
       10.173 sec (elapsed real time)

