"Dstat 0.7.3 CSV output"
"Author:","Dag Wieers <dag@wieers.com>",,,,"URL:","http://dag.wieers.com/home-made/dstat/"
"Host:","grisou-42.nancy.grid5000.fr",,,,"User:","root"
"Cmdline:","dstat -m -c -n -o dstat.csv",,,,"Date:","27 May 2020 10:27:27 CEST"
"memory usage",,,,"total cpu usage",,,,,"net/total",
"used","free","buff","cach","usr","sys","idl","wai","stl","recv","send"
1031413760,132934004736,54284288,795451392,1.495,0.325,97.987,0.193,0,0,0
1043062784,132921856000,54296576,795906048,0.562,0.125,98.657,0.656,0,387016,15086
1034948608,132930154496,54296576,795717632,0.593,0.562,98.845,0,0,385696,26596
1033519104,132931833856,54300672,795463680,0.720,0.594,98.686,0,0,4848,15200
1045340160,132920000512,54312960,795463680,0.344,0.125,99.469,0.062,0,383478,10756
1036001280,132929339392,54312960,795463680,0.625,0.531,98.844,0,0,5976,15514
1035714560,132929613824,54325248,795463680,0,0,99.969,0.031,0,5436,0
1035149312,132930179072,54325248,795463680,0,0,98.655,1.345,0,2086,662
1034891264,132930437120,54325248,795463680,0,0,100,0,0,5756,0
1034375168,132930953216,54325248,795463680,0,0,100,0,0,772,220
1033846784,132931469312,54337536,795463680,0,0,99.937,0.063,0,1338,0
1033588736,132931727360,54337536,795463680,0,0.031,99.969,0,0,1098,0
1033580544,132931727360,54345728,795463680,0,0,99.969,0.031,0,406,0
1033572352,132931735552,54345728,795463680,0,0,100,0,0,2196,0
1033572352,132931735552,54345728,795463680,0,0,100,0,0,812,0
1033572352,132931735552,54345728,795463680,0,0,100,0,0,936,496
1033572352,132931735552,54345728,795463680,0,0,100,0,0,7336,0
1033314304,132931993600,54345728,795463680,0,0,100,0,0,1972,0
1036472320,132928376832,54353920,795910144,1.125,0.594,98.219,0.062,0,398748,33548
1035395072,132929900544,54353920,795463680,0.031,0,99.969,0,0,988,132
1036328960,132928909312,54353920,795488256,0.281,0.250,99.469,0,0,170110,12136
1047605248,132917157888,54353920,795955200,0.563,0.250,99.187,0,0,386726,15034
1032810496,132932419584,54353920,795488256,0.406,0.406,99.188,0,0,4086,15556
1045139456,132919615488,54378496,795934720,0.531,0.281,99.000,0.187,0,384068,11410
1034579968,132930621440,54378496,795488256,0.469,0.406,99.125,0,0,5242,14880
1045921792,132919279616,54378496,795488256,0.281,0.094,99.625,0,0,382550,10888
1032876032,132932308992,54378496,795492352,0.719,0.500,98.781,0,0,4854,15546
1032867840,132932317184,54378496,795492352,0,0,100,0,0,934,0
1033805824,132931244032,54403072,795500544,1.686,0.219,97.220,0.874,0,222782,13084
1033916416,132931133440,54403072,795500544,0,0.031,99.969,0,0,3674,4176
1033400320,132931649536,54403072,795500544,0,0,100,0,0,2086,0
1033134080,132931915776,54403072,795500544,0,0,100,0,0,2718,84
1032744960,132932300800,54403072,795500544,0.499,0.218,99.282,0,0,344564,15004
1040576512,132924256256,54419456,795697152,0.219,0.094,99.093,0.594,0,179390,21006
1039773696,132925046784,54431744,795697152,0,0,99.969,0.031,0,12618,13328
1039704064,132925116416,54431744,795697152,0,0.031,99.969,0,0,13290,13230
1039187968,132925632512,54431744,795697152,0,0.031,99.969,0,0,13420,13132
1039187968,132925632512,54431744,795697152,0,0,100,0,0,21818,13230
1038413824,132926406656,54431744,795697152,0,0,99.750,0.250,0,19670,18632
1038413824,132926406656,54431744,795697152,0,0,100,0,0,13338,13760
1038147584,132926664704,54439936,795697152,0,0,99.937,0.063,0,18724,13328
1037631488,132927180800,54439936,795697152,0.031,0,99.969,0,0,40402,13190
1037115392,132927696896,54439936,795697152,0.031,0.031,99.937,0,0,15386,13328
1029775360,132935188480,54439936,795512832,0.031,0.031,99.938,0,0,3668,2320
1029836800,132935122944,54439936,795516928,0.250,0.125,99.625,0,0,174160,14368
1029562368,132935397376,54439936,795516928,0,0,100,0,0,1038,84
1029025792,132935921664,54452224,795516928,0,0,99.969,0.031,0,1444,0
1029025792,132935921664,54452224,795516928,0,0,100,0,0,926,172
1028489216,132936445952,54464512,795516928,0,0,99.969,0.031,0,2136,0
1028263936,132936671232,54464512,795516928,0,0,99.812,0.188,0,2948,220
1027747840,132937187328,54464512,795516928,0,0,100,0,0,2318,0
1027747840,132937187328,54464512,795516928,0,0,100,0,0,752,0
1027477504,132937428992,54472704,795521024,0,0,99.938,0.062,0,466,0
1027477504,132937428992,54472704,795521024,0,0,100,0,0,586,0
1039122432,132925329408,54472704,795971584,0.469,0.188,99.344,0,0,389436,15166
1025146880,132939743232,54472704,795525120,0.687,0.406,98.907,0,0,5578,15588
1025138688,132939751424,54472704,795525120,0,0,100,0,0,2716,0
1024622592,132940267520,54472704,795525120,0,0,100,0,0,1392,0
2230521856,131734470656,54484992,795451392,10.212,4.279,85.478,0.031,0,1324590,51672
5210296320,128753303552,54501376,796807168,31.729,11.472,56.705,0.094,0,1649720,64934
8196993024,125764915200,54538240,798404608,35.265,12.454,50.986,1.295,0,1328322,58530
11349778432,122610454528,54546432,800026624,36.770,11.903,51.140,0.187,0,1324646,55036
14368804864,119589965824,54550528,801415168,35.728,12.785,51.329,0.158,0,1332830,59026
17528827904,116428562432,54562816,802656256,36.084,13.838,49.953,0.124,0,1648258,63284
20728127488,113227735040,54583296,804106240,38.357,12.807,48.647,0.189,0,1387684,4552680
23692984320,110261276672,54587392,805576704,36.994,13.147,49.733,0.126,0,1600226,17936910
26700697600,107252154368,54595584,806887424,40.692,13.522,44.780,1.006,0,1775736,27575917
29689131008,104262373376,54616064,808153088,42.212,12.638,44.961,0.190,0,1393108,42039840
30785654784,103165759488,54624256,808230912,22.724,4.426,72.413,0.436,0,892872,51150312
30984155136,102967156736,54624256,808300544,17.164,1.057,81.468,0.311,0,1180410,64711150
31164653568,102786580480,54636544,808357888,20.205,1.831,77.343,0.621,0,1424316,79322334
31373475840,102577455104,54722560,808566784,19.027,1.747,73.331,5.895,0,1636228,89092304
31586816000,102363967488,54722560,808714240,24.703,2.030,65.397,7.870,0,1912606,104733834
31753056256,102197633024,54730752,808800256,21.144,2.208,76.244,0.404,0,2119968,116616434
31869435904,102081138688,54730752,808914944,25.764,2.776,70.774,0.686,0,2134892,115299390
31988604928,101961867264,54730752,809017344,18.994,1.749,78.944,0.312,0,2077354,115369938
32143446016,101806792704,54738944,809242624,22.219,2.288,74.835,0.658,0,2118484,116969512
32251854848,101698256896,54738944,809369600,22.264,2.987,73.994,0.755,0,2106692,117801046
32281571328,101668413440,54747136,809484288,16.036,2.094,81.494,0.375,0,2175892,121643364
32269967360,101679935488,54747136,809566208,11.914,1.706,85.728,0.652,0,2186786,119048676
32231501824,101718269952,54747136,809697280,10.829,1.909,86.854,0.407,0,2117532,116964708
32233742336,101715902464,54747136,809824256,10.227,3.272,85.777,0.724,0,2167214,117075186
32203784192,101745778688,54747136,809906176,11.504,1.876,86.089,0.531,0,2209026,120607962
32217915392,101731500032,54755328,810041344,9.384,1.720,87.957,0.938,0,2117360,119053496
32220286976,101729005568,54755328,810160128,10.288,1.751,87.617,0.344,0,2070014,112127364
32221835264,101727371264,54755328,810242048,8.539,1.282,89.803,0.375,0,2112684,118048242
32227254272,101721817088,54755328,810377216,8.902,1.290,89.210,0.598,0,2105008,116067946
32223604736,101725372416,54755328,810467328,7.752,1.302,87.256,3.690,0,2227256,121092702
32220884992,101727969280,54763520,810569728,8.997,1.031,89.535,0.437,0,2161112,115892260
32231079936,101717635072,54763520,810708992,8.625,1.531,89.469,0.375,0,2129542,120986020
32245694464,101702922240,54763520,810807296,8.745,1.218,89.475,0.562,0,2131790,121082900
32248119296,101700415488,54763520,810889216,9.014,1.189,89.421,0.376,0,2128680,117596400
32251023360,101697363968,54763520,811032576,6.967,1.343,91.159,0.531,0,2041522,116763934
32255303680,101692960768,54771712,811143168,6.899,1.461,87.259,4.382,0,2014582,110479032
32259072000,101689085952,54771712,811245568,7.750,1.600,90.053,0.596,0,1993370,108266822
32258371584,101689663488,54771712,811364352,7.049,1.092,91.142,0.717,0,2059808,112721802
32263176192,101684727808,54788096,811474944,7.642,1.716,90.050,0.593,0,2116512,114596706
32262365184,101685284864,54788096,811683840,6.149,1.198,92.400,0.252,0,2107238,113918828
32272371712,101675122688,54796288,811823104,8.393,1.747,87.270,2.590,0,2533880,122091510
32283193344,101664186368,54796288,811937792,7.125,1.812,90.781,0.281,0,2233432,113506448
32285335552,101661949952,54796288,812032000,5.997,0.884,92.487,0.631,0,2278078,116874700
32293539840,101653594112,54804480,812171264,7.940,1.250,90.341,0.469,0,2235286,117945098
32294432768,101652598784,54804480,812269568,7.042,0.908,91.768,0.282,0,2191662,117809984
32310259712,101636681728,54804480,812359680,6.860,1.762,90.340,1.038,0,2274830,124320974
32315400192,101631393792,54804480,812507136,7.885,1.283,88.736,2.096,0,2153624,115747242
32328749056,101617938432,54804480,812613632,6.729,1.565,91.017,0.689,0,2211690,116629124
32336408576,101610172416,54812672,812699648,6.281,1.256,91.928,0.534,0,2222982,120643860
32335564800,101610885120,54812672,812830720,5.864,1.286,92.505,0.345,0,2142566,112999472
32352473088,101593870336,54812672,812933120,7.165,1.414,91.075,0.346,0,2380760,124314546
32358776832,101587456000,54820864,813031424,5.910,0.885,91.498,1.707,0,2173018,115811010
32364646400,101581455360,54820864,813162496,4.959,0.916,93.651,0.474,0,2248812,117201140
32364060672,101581918208,54829056,813273088,5.547,0.851,92.972,0.630,0,2239340,117406346
32370118656,101575770112,54829056,813363200,7.819,1.433,90.436,0.312,0,2157292,115493560
32376082432,101569654784,54829056,813502464,7.042,1.283,91.080,0.595,0,2122558,112379790
32376528896,101569114112,54829056,813596672,6.364,0.846,89.655,3.135,0,2113680,115224418
32376778752,101568749568,54829056,813694976,6.340,0.968,92.224,0.468,0,2216030,120281752
32380071936,101565300736,54837248,813834240,6.677,1.223,91.442,0.658,0,2245502,121742504
32390111232,101555027968,54837248,814063616,5.608,1.134,92.911,0.347,0,2040444,113496234
32415510528,101529526272,54837248,814166016,8.046,0.908,90.482,0.564,0,2121912,115407848
32415657984,101529350144,54837248,814284800,7.639,0.880,90.946,0.534,0,2159152,119613766
32427954176,101516947456,54845440,814379008,10.153,1.999,86.254,1.593,0,2083890,111269136
32428326912,101516455936,54853632,814489600,8.702,1.310,89.457,0.530,0,2274144,121156080
32454475776,101490180096,54853632,814616576,9.307,1.562,88.788,0.344,0,2197546,118192238
32456642560,101487824896,54861824,814718976,8.608,1.243,89.590,0.559,0,2219668,114662618
32468684800,101475688448,54861824,814813184,9.059,1.478,88.896,0.566,0,2126860,116328788
32490164224,101454061568,54861824,814960640,9.648,1.743,87.644,0.965,0,2101174,111851920
32501800960,101442342912,54861824,815042560,7.003,1.167,91.483,0.347,0,2186340,117271920
32502562816,101441454080,54861824,815161344,7.743,1.097,90.815,0.345,0,2338416,114880936
32517398528,101426483200,54870016,815284224,9.046,1.560,88.865,0.530,0,2232970,116253662
32558829568,101384957952,54870016,815374336,9.108,1.555,88.829,0.508,0,2244602,116182728
32601047040,101342621696,54870016,815493120,10.315,1.184,86.663,1.839,0,2133028,113200290
32663629824,101279920128,54878208,815603712,9.228,1.287,88.795,0.691,0,2119594,113525394
32699813888,101243633664,54878208,815702016,9.357,1.372,88.896,0.374,0,2080276,114522462
32738156544,101205164032,54886400,815816704,9.054,1.320,89.123,0.503,0,2373584,125773774
32763932672,101179260928,54886400,815943680,8.170,1.341,89.897,0.592,0,2203226,119256700
32813154304,101129949184,54886400,816033792,9.314,1.762,87.476,1.447,0,2270054,115325782
32890368000,101052624896,54886400,816140288,12.261,1.474,83.663,2.603,0,2231392,120006576
32960200704,100982505472,54886400,816418816,11.789,1.257,86.671,0.283,0,2296114,114912650
32972566528,100970053632,54894592,816492544,5.678,1.035,92.817,0.471,0,2051352,116443210
32973737984,100968755200,54894592,816611328,5.301,1.098,92.942,0.659,0,2252438,118179766
32960000000,100982358016,54894592,816742400,6.316,1.151,92.190,0.342,0,2306370,121436888
32949477376,100992798720,54902784,816816128,6.842,1.000,90.659,1.500,0,2293412,115056300
32950906880,100991238144,54902784,816939008,5.636,0.939,93.143,0.282,0,2226290,118159054
32951279616,100990722048,54910976,817074176,4.780,1.038,93.616,0.566,0,2288002,121148404
32957018112,100984905728,54910976,817147904,4.325,1.285,94.077,0.313,0,2151506,117316324
32972431360,100969365504,54910976,817274880,5.349,1.164,92.920,0.566,0,2127968,112612158
32962580480,100979068928,54919168,817410048,5.798,0.877,84.174,9.151,0,2043184,111195942
32964079616,100977479680,54919168,817496064,6.343,1.073,92.111,0.473,0,2266812,122049654
32974802944,100966658048,54927360,817586176,6.062,1.125,92.281,0.531,0,2072734,113875808
32979251200,100962066432,54927360,817725440,5.159,1.001,93.496,0.344,0,2037016,114212030
32973008896,100968202240,54927360,817827840,6.370,1.035,92.281,0.314,0,2060336,112779142
32968384512,100972716032,54927360,817938432,4.456,0.885,94.311,0.348,0,2176132,118178126
32968740864,100972212224,54935552,818077696,5.345,0.938,93.060,0.656,0,2252064,122915968
32968544256,100972318720,54943744,818155520,5.140,1.028,93.427,0.405,0,2165014,114713962
32978194432,100962557952,54943744,818266112,4.808,1.006,93.809,0.377,0,2241672,120785818
32978513920,100962095104,54943744,818405376,5.969,1.068,92.523,0.440,0,2202730,117885878
32977444864,100963061760,54943744,818495488,6.644,1.254,91.413,0.689,0,2157060,115627754
32977473536,100962914304,54943744,818610176,5.934,1.062,90.568,2.436,0,2111934,110772538
32980705280,100959539200,54951936,818733056,4.690,1.032,93.809,0.469,0,2394200,127395126
32978980864,100961177600,54951936,818814976,7.435,1.468,90.753,0.344,0,2143940,116112478
32979615744,100960407552,54951936,818946048,6.348,1.383,91.546,0.723,0,2193936,114861836
32980451328,100959440896,54951936,819077120,6.252,0.691,92.743,0.314,0,2234144,116140454
32980164608,100959657984,54951936,819146752,8.855,1.064,86.264,3.817,0,2081418,110420190
32985079808,100954599424,54960128,819277824,5.639,1.284,92.607,0.470,0,2087158,113487846
32985018368,100954542080,54960128,819396608,6.321,1.069,92.107,0.503,0,2212348,117759050
32990867456,100948606976,54960128,819482624,6.971,1.313,91.372,0.344,0,2260842,122146136
32988160000,100951113728,54960128,819666944,6.984,0.940,91.450,0.626,0,2210578,114636546
32989618176,100949520384,54960128,819802112,5.182,0.879,93.028,0.911,0,2334444,122741740
32991199232,100947836928,54976512,819888128,5.681,1.036,91.400,1.883,0,2227960,116790990
32991748096,100947173376,54976512,820002816,5.135,0.908,93.363,0.595,0,2048176,110439744
32992129024,100946649088,54976512,820129792,6.999,1.193,91.431,0.377,0,2024004,109068762
32992317440,100946350080,54976512,820232192,5.613,0.941,92.882,0.564,0,2137086,114980552
32994775040,100943642624,54976512,820477952,5.640,1.402,92.708,0.249,0,2189052,115560932
33009496064,100928778240,54984704,820609024,7.436,1.224,86.978,4.361,0,2181998,117237766
33017155584,100921032704,54984704,820695040,5.121,0.691,93.779,0.408,0,2164526,116635316
33017135104,100920934400,54984704,820813824,3.778,0.976,94.679,0.567,0,2208210,119993062
33016713216,100921208832,54984704,820957184,5.910,1.220,92.495,0.375,0,2080602,113665292
33017610240,100920094720,54984704,821170176,5.871,1.093,92.411,0.625,0,2177276,115830448
33019404288,100918169600,55001088,821280768,7.265,1.684,90.427,0.624,0,2362694,115813872
33020186624,100917231616,55001088,821432320,8.787,1.220,89.619,0.375,0,2349206,123518304
33025859584,100911443968,55001088,821538816,11.167,0.936,87.555,0.343,0,2060736,113069596
33030438912,100906786816,55001088,821612544,9.487,1.033,88.917,0.564,0,2116392,111847082
33029369856,100907708416,55001088,821751808,5.559,0.817,93.216,0.408,0,2114550,114167258
33028169728,100908756992,55009280,821895168,6.824,1.038,90.220,1.918,0,2244708,117917958
33033297920,100903534592,55017472,821977088,12.114,1.592,85.670,0.624,0,2365126,126544312
33033728000,100902969344,55017472,822112256,8.062,1.531,89.844,0.562,0,2273126,119912708
33036271616,100900302848,55017472,822235136,6.675,0.998,92.015,0.312,0,2216722,116846028
33039171584,100897304576,55017472,822325248,8.016,1.591,90.050,0.343,0,2113618,115111472
33038110720,100898230272,55025664,822452224,4.920,1.097,93.325,0.658,0,2122852,117393406
33038127104,100898099200,55025664,822562816,5.701,1.433,89.315,3.551,0,2275104,122539232
33038475264,100897644544,55025664,822665216,3.594,1.166,94.893,0.347,0,2308738,120772236
33039933440,100896059392,55025664,822788096,5.641,1.285,92.416,0.658,0,2090486,113199464
33037467648,100898402304,55025664,822906880,4.267,0.784,94.666,0.282,0,2149350,117017152
33039261696,100896477184,55033856,823029760,4.584,1.256,93.752,0.408,0,2234822,118101386
33039540224,100896083968,55046144,823123968,3.884,0.916,91.632,3.568,0,2333626,126153654
33039548416,100895940608,55046144,823255040,5.224,0.876,93.463,0.438,0,2237550,118666168
33042010112,100893368320,55046144,823365632,5.455,1.097,93.103,0.345,0,2220000,116701464
33040785408,100894482432,55046144,823472128,5.077,1.135,93.472,0.315,0,2212976,117267606
33042677760,100892438528,55054336,823611392,5.452,1.277,92.804,0.467,0,2158672,113097418
33042866176,100892143616,55054336,823717888,5.283,1.219,93.123,0.375,0,2158196,120736098
33042460672,100891914240,55062528,824344576,5.323,1.386,92.598,0.693,0,2107118,113975406
33042956288,100891295744,55062528,824463360,4.062,0.882,94.647,0.409,0,2090810,116028394
33043677184,100890435584,55062528,824598528,4.668,1.190,93.797,0.345,0,2240116,120976400
33043390464,100890619904,55070720,824684544,4.707,1.004,93.756,0.533,0,2208518,116790038
33044246528,100889640960,55070720,824807424,5.172,1.129,93.103,0.596,0,2333224,120044542
33043005440,100890763264,55070720,824926208,4.293,0.726,93.371,1.610,0,2235260,119549852
33045106688,100888408064,55078912,825163776,3.938,1.040,93.069,1.953,0,2378128,124943040
33045278720,100888117248,55078912,825278464,4.665,1.221,93.863,0.250,0,2149874,115041630
33046765568,100886499328,55078912,825405440,5.253,0.944,93.520,0.283,0,2300364,118095514
33046056960,100887105536,55078912,825507840,5.327,1.065,93.137,0.470,0,2225930,118952974
33046360064,100886679552,55078912,825630720,3.753,0.757,92.431,3.059,0,2302992,122049046
33048915968,100883861504,55087104,825880576,5.171,1.160,92.667,1.003,0,2132142,115791702
33049481216,100883177472,55087104,825999360,4.311,0.755,94.588,0.346,0,2088712,115927800
33049235456,100883329024,55087104,826093568,4.321,0.751,94.396,0.532,0,2103726,114187372
33048383488,100884062208,55087104,826212352,4.379,0.970,94.245,0.407,0,2217930,116164152
33048322048,100884004864,55087104,826327040,4.345,0.969,94.123,0.563,0,2267202,121726296
33050349568,100881825792,55103488,826458112,4.921,0.820,91.356,2.902,0,2218334,113483096
33048891392,100883173376,55103488,826568704,4.696,1.127,93.832,0.344,0,2141546,116464530
33050177536,100881772544,55103488,826679296,4.723,1.095,93.807,0.375,0,2311132,120972922
33050439680,100881408000,55103488,826781696,4.581,0.973,93.881,0.565,0,2284280,123892122
33050181632,100881547264,55103488,826896384,4.650,0.974,94.094,0.283,0,2406298,125084260
33052131328,100879441920,55119872,827031552,5.053,1.092,92.327,1.528,0,2266480,120421688
33053491200,100877955072,55119872,827154432,5.344,0.943,93.430,0.283,0,2262538,122328734
33053769728,100877582336,55119872,827248640,4.591,0.881,93.868,0.660,0,2088668,114645662
33053847552,100877340672,55119872,827379712,4.925,0.847,93.946,0.282,0,2215212,120130598
33054425088,100876652544,55119872,827490304,5.286,0.938,93.212,0.563,0,2326774,127856886
33053646848,100877303808,55128064,827600896,4.713,0.968,93.508,0.811,0,2255032,119524508
33053847552,100876984320,55136256,827707392,5.171,0.815,93.576,0.439,0,2207024,117161428
33053249536,100877438976,55136256,827846656,3.811,0.819,94.772,0.598,0,2209488,117511368
33052794880,100877721600,55136256,827940864,4.032,0.762,94.794,0.413,0,2269846,122476086
33055113216,100875268096,55136256,828067840,4.338,1.069,94.090,0.503,0,2253094,120074520
33054253056,100875997184,55144448,828186624,4.704,1.003,93.039,1.254,0,2165234,117069290
33058045952,100872085504,55152640,828289024,4.231,0.940,92.761,2.068,0,2352794,124468072
33056428032,100873588736,55152640,828399616,3.845,0.781,94.655,0.719,0,2089332,112193344
33053020160,100876746752,55152640,828645376,4.822,0.845,93.989,0.344,0,2170538,118126404
33055420416,100874227712,55152640,828764160,6.908,1.063,91.747,0.281,0,2068114,110944134
33055617024,100873912320,55160832,828874752,3.623,0.788,94.833,0.756,0,2325978,123223806
33056751616,100872646656,55160832,829005824,4.430,0.911,90.229,4.430,0,2275832,120255734
33056169984,100873117696,55160832,829104128,3.282,0.947,95.393,0.379,0,2268652,119597878
33059958784,100869197824,55160832,829227008,5.486,1.465,92.456,0.592,0,2238600,115344348
33059459072,100869562368,55160832,829353984,5.002,0.969,93.529,0.500,0,2208102,112476792
33060438016,100868456448,55169024,829468672,3.927,1.257,94.188,0.628,0,2168926,116910772
33058979840,100869812224,55177216,829562880,4.233,0.815,91.878,3.073,0,2208788,118417102
33058648064,100869996544,55177216,829702144,5.427,1.310,92.639,0.624,0,2198172,121585006
33060990976,100867559424,55177216,829792256,4.581,1.122,93.892,0.405,0,2146740,117070828
33061613568,100866805760,55177216,829923328,5.608,0.914,92.785,0.693,0,2136640,113995562
33062121472,100866166784,55185408,830042112,4.288,1.127,94.147,0.438,0,2243660,119991932
33060945920,100867227648,55185408,830156800,3.697,0.916,94.660,0.727,0,2239796,120282644
33061752832,100866314240,55193600,830255104,4.922,0.878,86.019,8.182,0,2143340,117946606
33063829504,100864110592,55193600,830377984,4.718,0.786,93.709,0.786,0,2054960,115003300
33061883904,100865798144,55193600,830636032,3.466,0.851,95.274,0.410,0,2270712,119026262
33061216256,100866351104,55201792,830734336,5.303,1.255,92.720,0.722,0,2342656,121514688
33062785024,100864655360,55201792,830857216,4.433,0.937,94.255,0.375,0,2347250,116725118
33063571456,100863750144,55209984,830967808,4.270,0.785,93.155,1.790,0,2136020,113495834
33064878080,100862332928,55209984,831078400,5.285,1.070,93.268,0.377,0,2111988,108295122
33067110400,100859998208,55209984,831180800,4.698,1.002,93.611,0.689,0,2200554,121046048
33067843584,100859125760,55218176,831311872,4.934,0.974,93.149,0.943,0,2231940,116019492
33066766336,100860088320,55218176,831426560,4.193,0.851,94.578,0.378,0,2105278,114466334
33068253184,100858515456,55226368,831504384,4.142,0.659,90.116,5.083,0,2179490,112710436
33068969984,100857655296,55226368,831647744,5.111,0.997,93.487,0.405,0,2184696,125092708
33069666304,100856844288,55226368,831754240,4.138,0.878,94.577,0.408,0,2300846,128953332
33070260224,100856123392,55234560,831873024,3.992,0.786,94.719,0.503,0,2206524,119757956
33069879296,100856381440,55234560,831995904,4.458,0.691,94.317,0.534,0,2119292,114286620
33068412928,100857716736,55234560,832126976,4.263,1.034,93.950,0.752,0,2063684,111541254
33070350336,100855656448,55242752,832241664,5.172,0.815,92.633,1.379,0,2181066,116942450
33068896256,100857012224,55242752,832339968,5.031,0.906,93.719,0.344,0,2026136,110390842
33069465600,100856303616,55250944,832462848,5.803,0.972,92.785,0.439,0,2270982,118065916
33072250880,100853407744,55250944,832565248,4.581,0.784,94.352,0.282,0,2181756,119206720
33069834240,100855705600,55250944,832679936,4.925,1.066,93.476,0.533,0,2132002,111433882
33071874048,100853514240,55259136,832815104,3.603,0.877,86.184,9.336,0,2022782,110923478
33073418240,100851720192,55259136,833056768,4.311,1.007,94.399,0.283,0,2094270,117728122
33072357376,100852682752,55267328,833142784,4.474,0.907,93.586,1.033,0,2193656,119334560
33073381376,100851523584,55267328,833277952,3.991,1.123,94.606,0.281,0,2212272,121613644
33072558080,100852224000,55267328,833400832,3.981,0.627,94.639,0.752,0,2313720,126843758
33071419392,100853268480,55275520,833486848,4.138,0.846,92.759,2.257,0,2179164,119854856
33073348608,100851187712,55275520,833634304,4.470,0.850,94.429,0.252,0,2110452,116574108
33072209920,100852207616,55283712,833740800,4.454,1.066,93.758,0.721,0,2122464,117580256
33072877568,100851437568,55283712,833839104,5.265,1.254,93.200,0.282,0,2069546,112007038
33073577984,100850622464,55283712,833949696,3.960,0.691,94.909,0.440,0,2189862,118444392
33074393088,100849659904,55283712,834093056,5.456,1.160,93.101,0.282,0,2085786,115311060
33076838400,100847087616,55291904,834199552,4.193,0.694,84.615,10.498,0,2206246,120322644
33077096448,100846714880,55300096,834301952,4.374,0.881,93.833,0.913,0,2095978,115789060
33076903936,100846772224,55300096,834433024,3.815,0.757,95.082,0.347,0,2132668,116456940
30644482048,103279079424,55300096,834547712,4.019,0.848,94.600,0.534,0,2133178,116058890
27406487552,106517655552,55300096,833961984,4.039,1.064,94.584,0.313,0,1882098,104273618
23534120960,110390779904,55308288,833191936,3.705,0.785,93.940,1.570,0,1584936,90884010
20184399872,113741299712,55320576,832380928,2.860,0.786,95.726,0.629,0,1493270,82766550
17029890048,116896845824,55320576,831344640,2.874,0.843,96.126,0.156,0,1301706,67877308
13841555456,120086011904,55320576,830513152,1.752,0.876,97.247,0.125,0,951968,55490172
10648887296,123279155200,55320576,830033920,1.691,0.532,97.651,0.125,0,785432,41921614
6697054208,127232069632,55324672,828948480,1.510,0.503,97.137,0.849,0,452870,29071932
4223901696,129706078208,55336960,828080128,0.906,0.312,98.595,0.187,0,294882,16061742
1102217216,132828643328,55336960,827199488,0.375,0.188,99.344,0.094,0,82952,5356880
1067360256,132864385024,55336960,826314752,0.125,0.031,99.844,0,0,62002,0
1066835968,132864909312,55336960,826314752,0,0,100,0,0,5166,0
1066835968,132864909312,55336960,826314752,0,0,100,0,0,3492,0
1066819584,132864909312,55353344,826314752,0,0,99.812,0.188,0,1734,0
1066561536,132865167360,55353344,826314752,0,0,100,0,0,1706,0
1066553344,132865175552,55353344,826314752,0,0,100,0,0,3182,0
1065771008,132865957888,55353344,826314752,0.031,0.031,99.937,0,0,6476,0
1065762816,132865966080,55353344,826314752,0,0,100,0,0,16088,1288
1065504768,132866224128,55353344,826314752,0,0,100,0,0,7544,0
1064980480,132866740224,55361536,826314752,0,0,99.969,0.031,0,34266,0
1064980480,132866740224,55361536,826314752,0,0,100,0,0,15184,0
1064980480,132866740224,55361536,826314752,0,0,100,0,0,25308,132
1064464384,132867256320,55361536,826314752,0,0,100,0,0,28948,0
1064464384,132867256320,55361536,826314752,0,0.031,99.281,0.688,0,26698,0
1064198144,132867522560,55361536,826314752,0,0,100,0,0,23760,0
1064189952,132867522560,55369728,826314752,0,0,99.969,0.031,0,26076,2560
1063931904,132867780608,55369728,826314752,0,0.031,99.969,0,0,24284,516
1062899712,132868812800,55369728,826314752,0,0,100,0,0,20306,2244
1062850560,132868861952,55369728,826314752,0,0,100,0,0,45600,0
1062850560,132868861952,55369728,826314752,0,0,100,0,0,8914,0
1062850560,132868861952,55369728,826314752,0,0,100,0,0,47126,0
1062584320,132869120000,55377920,826314752,0,0,99.937,0.063,0,5560,84
1062326272,132869378048,55377920,826314752,0,0,100,0,0,42702,84
1061810176,132869894144,55377920,826314752,0.031,0,99.969,0,0,37034,0
1061036032,132870668288,55377920,826314752,0,0,100,0,0,77218,0
1061036032,132870668288,55377920,826314752,0,0,100,0,0,42282,0
1061036032,132870668288,55377920,826314752,0,0,100,0,0,49590,0
1061027840,132870668288,55386112,826314752,0,0,99.969,0.031,0,45950,0
1061027840,132870668288,55386112,826314752,0,0,100,0,0,7198,0
1061027840,132870668288,55386112,826314752,0,0.031,99.625,0.344,0,6538,0
1060511744,132871184384,55386112,826314752,0.031,0,99.969,0,0,6472,0
1060511744,132871184384,55386112,826314752,0,0,100,0,0,3302,0
1060511744,132871184384,55386112,826314752,0,0,100,0,0,2006,0
1060503552,132871184384,55394304,826314752,0,0,99.969,0.031,0,11534,0
1060241408,132871442432,55398400,826314752,0,0,99.969,0.031,0,9840,0
1059983360,132871700480,55398400,826314752,0,0,100,0,0,6916,0
1059983360,132871700480,55398400,826314752,0,0,100,0,0,3270,0
1059467264,132872216576,55398400,826314752,0,0,100,0,0,31640,220
1059463168,132872216576,55398400,826318848,0,0,100,0,0,1666,1008
1058938880,132872732672,55406592,826318848,0,0,99.938,0.062,0,23372,234
1058680832,132872990720,55406592,826318848,0,0,100,0,0,5644,234
1058422784,132873248768,55406592,826318848,0,0,100,0,0,42676,234
1058164736,132873506816,55406592,826318848,0,0,100,0,0,27792,234
1058164736,132873506816,55406592,826318848,0,0,100,0,0,72510,312
1058164736,132873506816,55406592,826318848,0.094,0.031,99.875,0,0,29580,4852
1063215104,132866543616,55414784,826327040,1.437,0.625,97.876,0.062,0,481829,46998
