"Dstat 0.7.3 CSV output"
"Author:","Dag Wieers <dag@wieers.com>",,,,"URL:","http://dag.wieers.com/home-made/dstat/"
"Host:","parasilo-8.rennes.grid5000.fr",,,,"User:","root"
"Cmdline:","dstat -m -c -n -o dstat.csv",,,,"Date:","15 Jun 2020 01:04:48 CEST"
"memory usage",,,,"total cpu usage",,,,,"net/total",
"used","free","buff","cach","usr","sys","idl","wai","stl","recv","send"
848609280,133205798912,50716672,718884864,1.016,0.260,98.486,0.238,0,0,0
851058688,133203107840,50716672,719155200,0.937,0.593,97.439,1.031,0,391544,31712
848125952,133206487040,50716672,718708736,0,0,100,0,0,106,132
845254656,133208911872,50728960,719142912,0.875,0.594,98.469,0.062,0,387934,18644
844693504,133209903104,50728960,718708736,0,0,100,0,0,220,132
844386304,133209710592,50741248,719155200,0.845,0.563,98.561,0.031,0,389976,21788
843276288,133211267072,50741248,718708736,0,0,99.844,0.156,0,106,0
843259904,133211283456,50741248,718708736,0.031,0.031,99.438,0.500,0,332,0
843001856,133211541504,50741248,718708736,0,0,100,0,0,288,0
842723328,133211807744,50753536,718708736,0.031,0,99.906,0.062,0,0,0
842457088,133212073984,50753536,718708736,0,0,100,0,0,288,0
842186752,133212332032,50765824,718708736,0,0,99.969,0.031,0,0,0
854368256,133200150528,50765824,718708736,0.406,0.125,99.469,0,0,387508,15888
842043392,133212475392,50765824,718708736,0.594,0.500,98.906,0,0,4372,6608
851427328,133202751488,50778112,718897152,0.219,0.188,99.562,0.031,0,171480,8532
860520448,133193375744,50778112,719159296,0.751,0.563,98.685,0,0,391058,22568
853983232,133199904768,50778112,719163392,0.844,0.625,98.531,0,0,387418,26416
842858496,133211475968,50778112,718716928,0.219,0.125,99.656,0,0,2212,3988
856285184,133197586432,50790400,719163392,0.813,0.375,98.749,0.063,0,386472,14736
848224256,133206093824,50790400,718716928,0.125,0.187,99.688,0,0,2196,4428
851935232,133202370560,50802688,718716928,0.094,0.062,99.781,0.062,0,222356,9764
848490496,133205782528,50802688,718716928,1.623,0.187,98.189,0,0,3296,4756
847941632,133206331392,50802688,718716928,0,0,100,0,0,106,132
848257024,133206003712,50814976,718716928,0.500,0.156,99.312,0.031,0,371992,20780
854941696,133199130624,50814976,718909440,0.250,0.188,99.562,0,0,145884,11616
854941696,133199130624,50814976,718909440,0.031,0.063,99.906,0,0,5262,5390
854708224,133199351808,50827264,718909440,0.031,0,99.938,0.031,0,5384,5488
854708224,133199351808,50827264,718909440,0,0,99.531,0.469,0,5000,5566
853921792,133200125952,50839552,718909440,0.031,0,99.938,0.031,0,5126,5572
853663744,133200384000,50839552,718909440,0,0,100,0,0,7412,7364
853663744,133200384000,50839552,718909440,0.031,0,99.969,0,0,5384,5390
853663744,133200384000,50839552,718909440,0,0,100,0,0,5210,5488
853655552,133200384000,50847744,718909440,0.031,0,99.937,0.031,0,5288,5574
853643264,133200384000,50851840,718917632,0,0,99.500,0.500,0,4716,5096
846753792,133207453696,50851840,718737408,0.281,0.125,99.594,0,0,174276,17296
846737408,133207470080,50851840,718737408,0.031,0,99.969,0,0,182,0
846479360,133207728128,50851840,718737408,0,0,100,0,0,106,0
846479360,133207728128,50851840,718737408,0.031,0,99.969,0,0,0,0
846467072,133207728128,50864128,718737408,0,0,99.937,0.063,0,106,0
846454784,133207728128,50876416,718737408,0,0.031,99.938,0.031,0,106,2552
846196736,133207986176,50876416,718737408,0.031,0,99.969,0,0,288,228
845938688,133208244224,50876416,718737408,0.031,0,99.969,0,0,166,0
857423872,133196759040,50876416,718737408,0.406,0.156,99.438,0,0,386946,15276
844505088,133209677824,50876416,718737408,0.562,0.531,98.907,0,0,4040,15584
843198464,133210972160,50888704,718737408,0,0,99.937,0.063,0,654,0
843198464,133210972160,50888704,718737408,0,0,100,0,0,0,0
843186176,133210984448,50888704,718737408,0.031,0,99.969,0,0,272,0
843186176,133210984448,50888704,718737408,0.031,0,99.969,0,0,0,0
842915840,133211242496,50900992,718737408,0,0,99.969,0.031,0,530,336
842915840,133211242496,50900992,718737408,0,0.031,99.969,0,0,166,0
842907648,133211242496,50909184,718737408,0,0,99.969,0.031,0,454,0
842641408,133211508736,50909184,718737408,0.031,0,99.969,0,0,166,0
842641408,133211508736,50909184,718737408,0,0,100,0,0,106,0
863211520,133191921664,50909184,717754368,0.469,0.188,99.344,0,0,334840,18052
3076907008,130976657408,50909184,718852096,20.296,9.192,70.296,0.216,0,1660410,77416
6004248576,128046858240,50909184,720486400,32.718,13.745,53.538,0,0,1335364,66519
8983298048,125066141696,50917376,722010112,34.256,13.223,52.427,0.093,0,1331920,67728
11956137984,122091732992,50917376,723480576,38.466,11.706,49.765,0.063,0,1334226,69004
14896771072,119149924352,50929664,724553728,37.769,12.714,49.330,0.187,0,1003774,55348
17748430848,116296859648,50946048,725868544,34.991,12.399,51.181,1.429,0,1664904,135170
20744568832,113298948096,50950144,727470080,37.500,12.905,48.286,1.309,0,1375050,3083870
23568121856,110473949184,50962432,728748032,36.957,12.371,50.297,0.375,0,1082344,5385096
26454081536,107586461696,50966528,730116096,38.308,12.516,48.954,0.222,0,1447824,7579455
29265068032,104774045696,50978816,731414528,42.265,12.686,44.864,0.186,0,1119446,6839721
30807937024,103231066112,50991104,731467776,28.612,7.396,63.773,0.219,0,111996,5366976
31011590144,103027093504,51077120,731688960,13.419,1.032,83.453,2.096,0,117216,6243865
31202250752,102836355072,51085312,731758592,14.091,1.707,83.675,0.528,0,157930,9072993
31396139008,102642388992,51085312,731836416,15.657,1.553,82.293,0.497,0,161674,7968458
31604752384,102433701888,51085312,731910144,16.917,1.595,81.051,0.438,0,157868,7520257
31759155200,102279208960,51085312,732000256,17.193,1.657,80.681,0.469,0,180472,8815734
31979319296,102058950656,51085312,732094464,18.190,2.262,79.021,0.527,0,191434,9330728
32113590272,101924556800,51101696,732200960,16.493,2.058,80.651,0.799,0,171514,7746722
32221745152,101816164352,51101696,732434432,14.733,2.096,82.515,0.657,0,158490,7165926
32298119168,101739696128,51101696,732524544,14.711,1.552,83.116,0.621,0,161354,7411754
32346087424,101691617280,51101696,732631040,14.134,2.246,82.715,0.905,0,161376,7344900
32323870720,101713764352,51101696,732696576,8.015,1.190,89.449,1.346,0,159274,7181148
32293986304,101743529984,51109888,732803072,7.196,1.526,89.408,1.869,0,148640,6757056
32249950208,101787463680,51109888,732901376,6.772,1.243,91.364,0.621,0,151710,6966890
32238174208,101799133184,51109888,732999680,8.325,1.571,89.475,0.628,0,144608,6571812
32255295488,101781909504,51109888,733102080,6.989,1.217,91.295,0.499,0,143220,6401782
32267337728,101769768960,51109888,733200384,7.388,1.122,90.960,0.530,0,132630,6008454
32270983168,101765812224,51179520,733425664,6.268,0.967,82.788,9.978,0,137122,6176478
32272617472,101764050944,51179520,733548544,6.600,0.934,91.999,0.467,0,145136,6543658
32281501696,101755068416,51179520,733646848,7.392,1.154,90.892,0.561,0,144264,6495224
32285569024,101750906880,51179520,733741056,6.822,0.997,91.682,0.498,0,141744,6271030
32287866880,101748510720,51179520,733831168,6.513,0.997,91.960,0.530,0,130078,5796326
32287666176,101748580352,51212288,733925376,4.892,0.659,89.652,4.798,0,133032,5869062
32290893824,101745242112,51212288,734035968,7.606,1.304,90.686,0.404,0,144434,6477382
32293195776,101742841856,51212288,734134272,6.178,1.708,91.555,0.559,0,139454,6232232
32292503552,101743423488,51212288,734236672,5.599,1.126,92.712,0.563,0,134248,5977026
32300093440,101735731200,51212288,734339072,6.390,1.153,91.864,0.592,0,142604,6511690
32305381376,101730328576,51220480,734445568,4.958,1.154,93.171,0.717,0,152276,6969198
32307474432,101728169984,51220480,734511104,6.748,1.067,90.898,1.287,0,141198,6426088
32314490880,101720932352,51220480,734732288,5.833,1.035,92.694,0.439,0,148910,6745788
32313892864,101721407488,51220480,734855168,7.420,1.293,90.733,0.554,0,153484,6972062
32319393792,101715824640,51220480,734932992,4.898,1.302,93.335,0.465,0,143360,6443316
32322134016,101712953344,51228672,735051776,4.534,1.063,93.652,0.750,0,143334,6505938
32325234688,101709746176,51228672,735158272,6.631,1.157,89.834,2.377,0,149566,6747972
32330887168,101704003584,51228672,735248384,6.182,1.093,92.288,0.437,0,158312,7399008
32332025856,101702774784,51228672,735334400,5.319,0.995,93.188,0.498,0,153658,6854966
32335167488,101699518464,51228672,735444992,4.981,0.846,93.734,0.439,0,142234,6271956
32339243008,101695324160,51236864,735547392,4.944,0.845,92.741,1.471,0,134890,6045412
32343465984,101690994688,51245056,735641600,5.836,0.847,92.752,0.565,0,139414,6395818
32347258880,101687091200,51245056,735748096,4.587,1.154,93.760,0.499,0,140630,6317340
32349327360,101684928512,51245056,735838208,5.956,0.935,92.548,0.561,0,139240,6262804
32350396416,101683765248,51245056,735924224,5.721,0.622,93.190,0.466,0,152808,6920692
32350130176,101683933184,51253248,736010240,5.728,0.845,92.520,0.908,0,164510,7653612
32352698368,101681229824,51253248,736133120,5.535,1.213,92.009,1.244,0,160146,6944012
32356179968,101677666304,51253248,736210944,5.420,0.721,93.484,0.376,0,148542,6629526
32356495360,101677219840,51253248,736337920,5.365,0.905,93.294,0.437,0,152218,6955940
32359522304,101674074112,51253248,736423936,4.016,0.879,94.572,0.533,0,149328,6539012
32359755776,101673840640,51261440,736497664,6.652,0.750,91.849,0.750,0,146906,6666740
32364154880,101669335040,51261440,736604160,5.990,0.931,92.427,0.652,0,145994,6597960
32366899200,101666340864,51261440,736849920,6.737,1.092,90.799,1.372,0,151202,6667276
32368361472,101664792576,51261440,736935936,8.215,1.266,90.056,0.463,0,156944,7188126
32369319936,101663703040,51261440,737067008,8.222,1.086,90.289,0.403,0,162048,7354850
32370311168,101662601216,51269632,737161216,7.572,1.345,90.426,0.657,0,154418,6972020
32371904512,101660901376,51269632,737267712,6.472,0.809,92.377,0.342,0,146624,6801312
32373653504,101659037696,51277824,737366016,7.796,1.440,89.042,1.722,0,148872,6736654
32377180160,101655412736,51277824,737464320,6.248,1.187,92.065,0.500,0,142380,6467640
32383344640,101649145856,51277824,737562624,8.602,1.939,89.052,0.407,0,142400,6551194
32386879488,101645504512,51286016,737660928,8.156,1.416,89.874,0.554,0,152350,6815750
32389730304,101642547200,51286016,737767424,6.435,1.250,91.815,0.500,0,141730,6394554
32389611520,101642530816,51286016,737861632,7.121,2.061,89.007,1.811,0,143890,6551262
32410701824,101621358592,51286016,737943552,7.979,0.745,90.748,0.528,0,139600,6324574
32446959616,101584986112,51286016,738058240,8.949,1.123,89.616,0.312,0,146656,6597448
32483303424,101548552192,51294208,738136064,7.639,0.939,90.858,0.564,0,154142,7190998
32519417856,101512310784,51294208,738263040,8.847,1.558,89.097,0.498,0,160780,7403004
32586645504,101445005312,51294208,738340864,9.907,0.872,87.788,1.433,0,147958,6631448
32631668736,101399863296,51302400,738443264,8.728,1.122,89.620,0.530,0,139756,6243796
32670044160,101361381376,51302400,738545664,9.673,1.586,88.305,0.435,0,139110,6284434
32688578560,101342744576,51310592,738639872,7.060,1.031,91.284,0.625,0,136098,6103342
32723075072,101308149760,51310592,738734080,9.130,0.994,89.441,0.435,0,137226,6159606
32753127424,101277855744,51310592,738967552,7.219,0.719,91.062,1,0,148072,6707796
32759218176,101271674880,51310592,739057664,6.956,0.724,88.700,3.620,0,149948,6728078
32761671680,101269118976,51310592,739151872,4.671,1.034,93.856,0.439,0,147222,6588728
32761786368,101268893696,51318784,739250176,4.079,0.690,94.321,0.910,0,137784,6249864
32744513536,101286051840,51318784,739364864,5.606,1.127,92.765,0.501,0,137458,6227626
32745127936,101285347328,51318784,739454976,4.930,0.874,93.729,0.468,0,148618,6760100
32740782080,101289570304,51326976,739569664,5.904,0.963,92.231,0.901,0,146006,6506116
32742092800,101288161280,51326976,739635200,7.664,0.869,91.095,0.372,0,139608,6479486
32742387712,101287735296,51335168,739753984,4.422,0.841,94.207,0.529,0,145696,6641388
32736600064,101293453312,51335168,739819520,4.174,0.935,94.237,0.654,0,138954,6339880
32737468416,101292453888,51335168,739950592,5.955,0.851,92.754,0.441,0,142664,6493818
32740577280,101289259008,51335168,740032512,5.761,0.747,91.809,1.682,0,142314,6440866
32742166528,101287559168,51335168,740143104,5.294,1.003,93.170,0.533,0,138518,6250292
32743133184,101286494208,51343360,740233216,4.635,0.971,93.705,0.689,0,146454,6590974
32743010304,101286510592,51343360,740331520,4.319,0.689,94.523,0.469,0,144526,6643696
32743231488,101286182912,51343360,740429824,5.438,0.963,92.977,0.622,0,154114,7015564
32745377792,101283930112,51351552,740528128,4.975,0.819,92.601,1.606,0,141250,6349122
32746917888,101282283520,51351552,740634624,4.854,0.658,93.956,0.532,0,137556,6124972
32747495424,101281595392,51359744,740732928,3.840,0.968,94.630,0.562,0,132070,6049992
32747032576,101281959936,51359744,740827136,6.361,0.900,92.243,0.496,0,145148,6559020
32748388352,101280505856,51359744,740921344,5.196,0.970,93.490,0.344,0,140384,6393134
32749236224,101279567872,51359744,741003264,4.565,0.625,94.371,0.438,0,147508,6744210
32749379584,101279309824,51359744,741117952,4.952,0.841,89.162,5.045,0,142166,6582426
32750186496,101278388224,51367936,741224448,4.975,0.907,93.648,0.469,0,145142,6697794
32751214592,101277261824,51367936,741318656,5.476,1.058,92.875,0.591,0,144638,6415428
32752529408,101275840512,51367936,741421056,4.540,0.883,94.010,0.567,0,135976,6182302
32752562176,101275717632,51367936,741507072,4.389,1.034,93.950,0.627,0,154914,7182418
32753975296,101274198016,51367936,741609472,4.634,0.814,93.143,1.409,0,157208,7052278
32753606656,101274456064,51384320,741699584,4.742,0.660,93.970,0.628,0,145980,6626124
32755916800,101272035328,51384320,741810176,6.633,0.841,92.027,0.498,0,147498,6813634
32755785728,101272006656,51384320,741965824,3.541,0.752,95.205,0.501,0,161964,7601594
32755548160,101272129536,51384320,742080512,6.492,1.030,91.979,0.499,0,149088,6806244
32755822592,101271777280,51384320,742158336,4.879,0.932,93.381,0.808,0,154246,6961408
32756903936,101270552576,51392512,742289408,5.355,1.253,92.327,1.065,0,161062,7413492
32758009856,101269356544,51392512,742375424,4.407,0.944,94.271,0.378,0,154816,6935770
32757014528,101270130688,51392512,742596608,4.173,1.028,94.363,0.436,0,143308,6691256
32757706752,101269327872,51392512,742707200,6.135,1.215,92.277,0.374,0,147078,6614734
32757776384,101269168128,51392512,742793216,4.180,0.691,94.783,0.346,0,137754,6269190
32758591488,101268226048,51408896,742899712,5.643,1.003,92.884,0.470,0,132724,5967312
32759128064,101267582976,51408896,743002112,5.126,0.901,93.632,0.342,0,140898,6451734
32760430592,101266165760,51408896,743112704,3.652,0.661,95.246,0.441,0,159348,7383768
32761970688,101264519168,51408896,743215104,5.731,0.658,93.173,0.438,0,149340,6774376
32762654720,101263745024,51408896,743305216,4.787,0.845,93.805,0.563,0,148908,6583992
32763445248,101262839808,51417088,743407616,6.264,1.085,90.388,2.264,0,152536,6869196
32765206528,101260955648,51417088,743530496,5.076,0.747,93.740,0.436,0,140172,6336222
32764547072,101261516800,51417088,743628800,4.944,0.840,93.626,0.591,0,142526,6375738
32767680512,101258219520,51417088,743788544,4.986,0.935,93.612,0.467,0,135296,6074756
32769044480,101256769536,51417088,743874560,5.056,1.124,93.321,0.499,0,136490,6335448
32770363392,101255323648,51425280,743989248,5.873,0.875,88.629,4.624,0,157794,7406010
32772702208,101252870144,51425280,744103936,6.345,0.867,92.386,0.402,0,162148,7396956
32774152192,101251325952,51425280,744198144,5.234,0.929,93.373,0.465,0,162660,7474000
32775897088,101249318912,51425280,744435712,5.331,0.878,93.384,0.408,0,167822,7700200
32776658944,101248454656,51425280,744534016,4.978,1.027,93.622,0.373,0,155276,7019094
32778182656,101246812160,51441664,744628224,5.319,0.876,93.054,0.751,0,157780,7298878
32782524416,101242359808,51441664,744738816,5.564,0.964,93.161,0.311,0,151966,6824546
32783536128,101241257984,51441664,744828928,4.929,0.722,93.846,0.502,0,149468,6673232
32784015360,101240664064,51441664,744939520,4.234,0.778,94.521,0.467,0,139362,6415548
32784617472,101239828480,51441664,745172992,4.802,0.847,93.974,0.377,0,144908,6582548
32786157568,101238181888,51449856,745271296,4.872,0.937,92.817,1.374,0,151576,6872602
32787288064,101236948992,51449856,745373696,5.703,1.060,92.801,0.436,0,154884,7113048
32787374080,101236760576,51449856,745472000,3.736,0.911,94.851,0.502,0,161160,7230528
32788910080,101235113984,51449856,745582592,2.866,1.039,95.654,0.441,0,151342,6788002
32789401600,101234483200,51449856,745680896,5.651,0.749,93.225,0.375,0,152052,6924082
32789327872,101234450432,51458048,745779200,4.202,0.659,94.606,0.533,0,152724,6738182
32792875008,101230772224,51462144,745893888,5.540,0.685,92.375,1.401,0,140620,6312474
32793165824,101230391296,51462144,745984000,5.397,0.753,93.379,0.471,0,143446,6535596
32793845760,101229551616,51462144,746094592,4.867,0.780,94.009,0.343,0,148034,6797244
32794693632,101228609536,51462144,746188800,3.330,0.848,95.445,0.377,0,148006,6712106
32794755072,101228425216,51470336,746295296,3.582,0.817,95.162,0.440,0,143490,6555040
32794890240,101228191744,51470336,746389504,4.958,0.624,93.888,0.530,0,146300,6650052
32794218496,101228740608,51478528,746500096,4.598,0.693,94.205,0.504,0,151642,7055024
32794787840,101228064768,51478528,746606592,4.014,0.878,94.732,0.376,0,156450,7033978
32795275264,101227483136,51478528,746700800,3.358,0.910,95.386,0.345,0,152332,6895246
32798613504,101224034304,51486720,746799104,5.468,1.305,92.544,0.683,0,150188,6787234
32800178176,101222371328,51486720,746897408,4.866,0.967,92.389,1.778,0,143084,6489590
32807751680,101214642176,51486720,747016192,3.874,0.850,94.677,0.598,0,134748,5940782
32807919616,101214384128,51486720,747106304,4.218,0.661,94.618,0.504,0,128308,5681264
32809320448,101212868608,51486720,747216896,3.407,0.688,95.561,0.344,0,143260,6504612
32810184704,101211901952,51494912,747307008,5.682,0.874,92.850,0.593,0,150718,6704716
32810778624,101211066368,51494912,747548672,3.599,0.814,94.147,1.440,0,141098,6448110
32808636416,101213097984,51494912,747655168,5.939,0.907,92.591,0.563,0,147124,6744540
32810082304,101211545600,51494912,747753472,4.368,0.967,94.165,0.499,0,150254,6786050
32809652224,101211881472,51511296,747823104,4.849,0.964,92.882,1.306,0,151708,6821032
32811200512,101210193920,51511296,747958272,4.304,0.597,94.753,0.346,0,153166,6900268
32811220992,101210062848,51511296,748068864,4.500,1.094,93.625,0.781,0,148958,6735986
32813658112,101207543808,51519488,748142592,4.469,1.125,93.562,0.844,0,141988,6338266
32813568000,101207519232,51519488,748257280,3.714,0.874,94.975,0.437,0,139064,6534394
32815591424,101205348352,51527680,748359680,5.353,0.809,92.624,1.214,0,154172,7124238
32818245632,101202612224,51527680,748441600,4.666,1.065,93.862,0.407,0,152714,6992950
32819388416,101201346560,51527680,748564480,4.244,1.022,94.238,0.496,0,149876,6878016
32819048448,101201575936,51527680,748675072,4.458,0.879,93.093,1.570,0,150784,6860052
32819560448,101200965632,51527680,748773376,5.213,1.055,93.298,0.434,0,155940,7046202
32819331072,101201092608,51535872,748867584,4.545,0.809,93.742,0.903,0,155626,7181006
32819179520,101201129472,51535872,748978176,5.844,0.870,92.882,0.404,0,150850,6910970
32819453952,101200773120,51535872,749060096,4.201,0.533,94.953,0.313,0,157794,7116726
32819994624,101200101376,51535872,749187072,5.029,0.962,92.549,1.459,0,146248,6679328
32821297152,101198708736,51544064,749268992,4.261,0.658,94.643,0.439,0,154466,7142374
32822370304,101197512704,51552256,749383680,5.440,1.274,92.882,0.404,0,149870,6654484
32824680448,101195096064,51552256,749490176,4.503,0.844,94.090,0.563,0,150194,6696758
32825102336,101194575872,51552256,749584384,4.732,0.909,93.952,0.407,0,125614,5622192
32826187776,101193252864,51552256,749813760,3.920,0.716,93.311,2.054,0,127218,5805008
32826671104,101192663040,51552256,749920256,4.224,0.876,94.618,0.282,0,141602,6479080
32828964864,101190258688,51560448,750014464,4.775,1.131,93.465,0.628,0,153310,6763546
32827953152,101191155712,51560448,750125056,3.823,0.783,95.017,0.376,0,147688,6702182
32833478656,101185515520,51560448,750235648,4.941,1.119,93.505,0.435,0,150920,6815856
32837070848,101181833216,51568640,750309376,5.734,0.873,92.926,0.467,0,147458,6551476
32837656576,101181128704,51568640,750424064,3.672,0.847,94.947,0.534,0,142432,6644298
32838897664,101179772928,51576832,750526464,4.699,0.658,94.173,0.470,0,157222,7168760
32839438336,101179080704,51576832,750632960,4.558,1.054,94.016,0.372,0,147022,6837586
32840769536,101177593856,51585024,750739456,5.078,0.752,93.793,0.376,0,139266,6150898
32839839744,101178437632,51585024,750825472,4.407,0.869,94.258,0.466,0,140650,6357358
32838717440,101179457536,51585024,750927872,5.628,0.871,92.289,1.213,0,143984,6585292
32839700480,101178335232,51585024,751063040,3.849,0.782,94.994,0.375,0,154858,7068738
32840994816,101176946688,51585024,751153152,5.483,0.966,93.209,0.343,0,144120,6630832
32843472896,101174362112,51593216,751247360,4.573,0.814,94.049,0.564,0,151386,6727892
32851189760,101166559232,51593216,751329280,4.939,1.125,93.592,0.344,0,136320,6034970
32853696512,101163778048,51593216,751599616,5.247,1.304,92.145,1.304,0,425265,5825168
32853606400,101163778048,51593216,751681536,4.726,0.777,94.154,0.342,0,134786,6109532
32853458944,101163814912,51593216,751788032,4.345,1.250,93.998,0.406,0,152340,6968260
32857112576,101160067072,51601408,751874048,5.097,0.844,93.527,0.532,0,149086,6855994
32857772032,101159186432,51601408,752013312,5.172,0.846,93.699,0.282,0,151538,6722280
32859860992,101156282368,51613696,752091136,3.926,1.028,93.020,2.026,0,153732,6745330
32858374144,101157666816,51613696,752193536,4.907,0.932,93.820,0.342,0,147608,6757520
32859430912,101156507648,51613696,752291840,4.337,0.874,94.446,0.343,0,139092,6375850
32859275264,101156564992,51625984,752373760,4.713,0.593,94.288,0.406,0,145860,6504566
32859652096,101156069376,51625984,752488448,4.877,0.994,93.787,0.342,0,135218,5923768
32860409856,101155196928,51634176,752594944,4.905,0.838,92.984,1.273,0,137552,6371738
32860413952,101155074048,51634176,752709632,4.652,0.874,93.662,0.812,0,147572,6549118
32866476032,101148909568,51634176,752812032,6.127,0.907,92.498,0.469,0,143968,6556844
32868245504,101147037696,51642368,752906240,5.076,1.028,93.367,0.529,0,140906,6463306
32875311104,101139877888,51642368,753000448,4.772,0.749,94.074,0.405,0,147384,6763164
32875143168,101139927040,51642368,753115136,3.581,0.716,95.266,0.436,0,154588,7081780
32875778048,101139193856,51642368,753213440,5.521,1.004,92.064,1.412,0,153146,6945590
32875675648,101139189760,51650560,753311744,4.444,0.876,94.272,0.407,0,150414,6881014
32876011520,101138735104,51658752,753422336,3.911,0.745,94.910,0.435,0,154070,7066276
32882823168,101131833344,51658752,753504256,4.718,1.148,93.793,0.341,0,141256,6297524
32884273152,101130252288,51658752,753631232,4.584,0.873,94.138,0.405,0,148480,6693762
32883826688,101130481664,51658752,753844224,3.323,0.696,91.899,4.082,0,149284,6792282
32883773440,101130416128,51658752,753963008,3.879,0.813,94.964,0.344,0,149768,6816114
32885174272,101128900608,51666944,754065408,5.257,1.244,92.659,0.840,0,156162,7042412
32885702656,101128286208,51666944,754151424,4.195,0.963,94.469,0.373,0,148172,6689084
32886566912,101127299072,51666944,754257920,6.108,0.873,92.646,0.374,0,135036,6110208
32886812672,101126946816,51666944,754364416,4.605,0.909,93.484,1.003,0,143972,6527078
32887685120,101125951488,51675136,754470912,3.236,0.817,95.350,0.597,0,138880,6164830
32889606144,101123915776,51683328,754573312,4.980,1.065,93.423,0.532,0,140794,6542338
32889802752,101123624960,51683328,754663424,4.299,1.090,94.050,0.561,0,144786,6583316
28956921856,105056407552,51683328,754761728,3.392,0.942,95.226,0.440,0,142544,6572436
26509541376,107504590848,51683328,753958912,3.949,0.871,94.776,0.404,0,135148,6089590
23269634048,110745333760,51683328,753164288,3.274,0.655,94.699,1.372,0,116822,5390722
19987652608,114028175360,51695616,752328704,4.073,0.909,94.643,0.376,0,100960,4501658
16783593472,117233115136,51695616,751489024,2.629,0.595,96.526,0.250,0,77602,3503508
13538533376,120479027200,51695616,750637056,2.438,0.531,96.874,0.156,0,69732,3097614
10416181248,123602300928,51695616,749793280,2.255,0.532,97.119,0.094,0,55860,2483954
7222837248,126796529664,51703808,748941312,1.938,0.344,97.030,0.688,0,36328,1577068
4003688448,130016145408,51716096,748511232,0.658,0.282,98.903,0.157,0,22586,1028364
921280512,133099552768,51716096,747536384,0.314,0.157,99.530,0,0,13796,548624
886566912,133134970880,51716096,746872832,0.125,0.062,99.813,0,0,504,12436
886521856,133135458304,51716096,746430464,0,0,100,0,0,620,0
886005760,133135974400,51716096,746430464,0,0,99.625,0.375,0,280,0
886001664,133135974400,51716096,746434560,0.031,0,99.906,0.062,0,106,0
885981184,133135982592,51728384,746434560,0,0,99.938,0.062,0,0,0
885465088,133136498688,51728384,746434560,0.031,0,99.969,0,0,224,132
885465088,133136498688,51728384,746434560,0,0,100,0,0,3112,0
885465088,133136498688,51728384,746434560,0,0,100,0,0,106,0
885207040,133136756736,51728384,746434560,0.031,0,99.969,0,0,298,264
885202944,133136756736,51732480,746434560,0,0,99.969,0.031,0,106,0
885194752,133136756736,51740672,746434560,0.031,0,99.938,0.031,0,212,168
884678656,133137272832,51740672,746434560,0,0,100,0,0,288,2240
884678656,133137272832,51740672,746434560,0.031,0,99.969,0,0,0,0
884420608,133137530880,51740672,746434560,0,0,100,0,0,106,0
884420608,133137530880,51740672,746434560,0,0.031,99.969,0,0,0,0
884162560,133137788928,51740672,746434560,0.031,0,99.969,0,0,288,0
899641344,133122301952,51748864,746434560,0.970,0.375,98.624,0.031,0,392662,19890
