"Dstat 0.7.3 CSV output"
"Author:","Dag Wieers <dag@wieers.com>",,,,"URL:","http://dag.wieers.com/home-made/dstat/"
"Host:","gros-114.nancy.grid5000.fr",,,,"User:","root"
"Cmdline:","dstat -m -c -n -o dstat.csv",,,,"Date:","24 May 2020 19:51:20 CEST"
"memory usage",,,,"total cpu usage",,,,,"net/total",
"used","free","buff","cach","usr","sys","idl","wai","stl","recv","send"
1503559680,96819118080,48967680,1210351616,0.782,0.107,99.109,0.002,0,0,0
1505394688,96817360896,48979968,1210253312,0.723,0.362,98.915,0,0,777239,43324
1493921792,96828829696,48979968,1210253312,0.583,0.361,99.056,0,0,10101,6262
1507450880,96814817280,48992256,1210720256,0.445,0.306,98.943,0.306,0,390746,13700
1490272256,96832462848,48992256,1210253312,0.222,0.139,99.639,0,0,13962,4008
1490272256,96832462848,48992256,1210253312,0,0,100,0,0,5477,220
1502654464,96819613696,49004544,1210699776,0.555,0.194,99.251,0,0,393732,15506
1490546688,96832118784,49004544,1210253312,0.333,0.250,99.417,0,0,10750,5660
1503428608,96818827264,49016832,1210646528,0.803,0.277,98.892,0.028,0,563108,25280
1514102784,96807956480,49016832,1210834944,0.777,0.777,98.446,0,0,390628,27068
1494220800,96828284928,49016832,1210388480,0.139,0.167,99.694,0,0,5668,3992
1494695936,96827793408,49029120,1210392576,0.584,0.445,98.971,0,0,387678,17416
1495703552,96826691584,49029120,1210396672,1.223,0.139,98.639,0,0,226612,13764
1501970432,96820224000,49041408,1210589184,0.528,0.167,99.306,0,0,511978,26732
1501954048,96820240384,49041408,1210589184,0,0.028,99.972,0,0,5555,3920
1501696000,96820580352,49041408,1210589184,0,0,100,0,0,7318,3920
1501696000,96820580352,49041408,1210589184,0,0.028,99.972,0,0,10360,3920
1501683712,96820580352,49053696,1210589184,0,0,100,0,0,9342,3920
1501675520,96820588544,49053696,1210589184,0,0.028,99.972,0,0,6946,3920
1501655040,96820596736,49065984,1210589184,0.111,0.028,99.861,0,0,9606,5960
1501638656,96820613120,49065984,1210589184,0,0,100,0,0,5296,3920
1501638656,96820613120,49065984,1210589184,0,0.056,99.944,0,0,9316,3920
1501638656,96820613120,49065984,1210589184,0.028,0.028,99.944,0,0,10158,3920
1494888448,96827547648,49065984,1210404864,0.028,0,99.972,0,0,12470,7314
1494515712,96827920384,49065984,1210404864,0.139,0.056,99.805,0,0,181778,16770
1494503424,96827920384,49078272,1210404864,0,0,100,0,0,4536,220
1494503424,96827920384,49078272,1210404864,0,0,100,0,0,12854,0
1494503424,96827920384,49078272,1210404864,0,0,100,0,0,7320,0
1507454976,96814505984,49090560,1210851328,0.528,0.083,99.389,0,0,401207,16274
1643737088,96678420480,49090560,1210707968,2.277,0.472,97.252,0,0,348088,28736
1646161920,96676323328,49090560,1210388480,0,0.028,99.972,0,0,15203,0
1646395392,96676073472,49102848,1210388480,0.028,0.028,99.944,0,0,14100,2100
1646411776,96676057088,49102848,1210388480,0,0.028,99.972,0,0,12564,2100
1646395392,96676048896,49115136,1210392576,0,0,100,0,0,7742,2100
1646391296,96676032512,49119232,1210400768,0.250,0.028,99.722,0,0,4908,2100
1646387200,96676032512,49119232,1210404864,2.778,0.028,97.194,0,0,6614,2100
1743093760,96579272704,49127424,1210408960,5.787,0.473,93.740,0,0,10981310,10942288
1892073472,96430178304,49127424,1210408960,9.526,0.390,90.084,0,0,36391414,35483086
1941684224,96380567552,49127424,1210408960,5.297,0.251,94.452,0,0,61559996,45618418
2091872256,96230322176,49135616,1210413056,6.147,0.894,92.959,0,0,87711847,45602080
2224443392,96097751040,49135616,1210413056,6.630,0.223,93.148,0,0,113141076,44652510
2381455360,95940730880,49143808,1210413056,5.298,1.060,93.642,0,0,138656638,42336556
2450071552,95872110592,49143808,1210417152,6.669,0.391,92.941,0,0,163827461,48579810
2633428992,95688753152,49143808,1210417152,8.345,1.228,90.427,0,0,188771738,49562068
2724966400,95597215744,49143808,1210417152,5.408,0.530,94.062,0,0,201596143,44568390
2814218240,95507959808,49143808,1210421248,4.603,0.446,94.951,0,0,201527141,48614736
2902253568,95419916288,49152000,1210421248,4.677,0.473,94.850,0,0,201457454,49427224
2990944256,95331225600,49152000,1210421248,4.108,0.419,95.472,0,0,201539349,47724362
3080290304,95241875456,49152000,1210425344,4.384,0.447,95.169,0,0,201508700,49348996
3153350656,95168806912,49152000,1210429440,4.324,0.335,95.342,0,0,201519900,47474902
3241824256,95080333312,49152000,1210429440,4.578,0.530,94.891,0,0,201497160,49000562
3330400256,94991749120,49160192,1210429440,4.028,0.392,95.580,0,0,201401700,48114388
3416322048,94905823232,49160192,1210433536,4.459,0.502,95.039,0,0,201333280,48879798
3504676864,94817468416,49160192,1210433536,4.240,0.474,95.286,0,0,201771414,50449888
3593469952,94728675328,49160192,1210433536,6.321,0.557,93.122,0,0,201340380,49597026
3680030720,94642110464,49160192,1210437632,4.694,0.391,94.915,0,0,201512242,50297744
3769958400,94552174592,49168384,1210437632,4.214,0.419,95.339,0.028,0,201378451,45754040
3863543808,94458589184,49168384,1210437632,4.420,0.392,95.189,0,0,201723725,48494906
3954536448,94367596544,49168384,1210437632,4.134,0.419,95.447,0,0,201459574,45064350
4041183232,94280945664,49168384,1210441728,4.140,0.503,95.357,0,0,201641561,48105502
4130246656,94191882240,49168384,1210441728,4.001,0.392,95.607,0,0,201648659,44173424
4216037376,94106083328,49176576,1210441728,4.433,0.418,95.149,0,0,201470048,49562850
4303761408,94018355200,49176576,1210445824,4.159,0.502,95.339,0,0,201378372,49846818
4391051264,93931065344,49176576,1210445824,4.106,0.587,95.307,0,0,201601212,50421390
4479483904,93842632704,49176576,1210445824,3.979,0.392,95.629,0,0,201525264,49458228
4569198592,93752918016,49176576,1210445824,4.108,0.391,95.500,0,0,201452404,45043272
4658315264,93663789056,49184768,1210449920,4.217,0.419,95.364,0,0,201475924,49394858
4745621504,93576482816,49184768,1210449920,4.326,0.419,95.255,0,0,201710170,50461646
4833390592,93488713728,49184768,1210449920,4.186,0.447,95.367,0,0,201496774,48035958
4924862464,93397237760,49184768,1210454016,4.076,0.558,95.366,0,0,201518114,44823114
5014355968,93307736064,49192960,1210454016,4.107,0.391,95.502,0,0,201723876,46151592
5103628288,93218455552,49201152,1210454016,4.192,0.419,95.388,0,0,201452728,48592245
5192327168,93129756672,49201152,1210454016,4.076,0.558,95.366,0,0,201481731,46016506
5282078720,93040001024,49201152,1210458112,4.192,0.475,95.333,0,0,201558119,49149848
5371502592,92950573056,49201152,1210462208,4.331,0.419,95.250,0,0,201485449,45907220
5461221376,92860854272,49201152,1210462208,4.029,0.392,95.579,0,0,201617852,46566140
5549314048,92772749312,49209344,1210466304,4.188,0.475,95.338,0,0,201580010,47574692
5634985984,92687077376,49209344,1210466304,4.221,0.335,95.443,0,0,201396010,49527206
5724225536,92597837824,49209344,1210466304,4.221,0.335,95.443,0,0,201834330,48405724
5814919168,92507144192,49209344,1210466304,4.269,0.307,95.424,0,0,201173848,44630228
5902143488,92419915776,49209344,1210470400,4.636,0.694,94.670,0,0,201827426,49777776
5990785024,92331266048,49217536,1210470400,4.240,0.446,95.314,0,0,201435836,47907994
6079066112,92242984960,49217536,1210470400,4.195,0.447,95.358,0,0,201291620,49727648
6167699456,92154351616,49217536,1210470400,4.320,0.530,95.151,0,0,201602222,49779658
6256447488,92065599488,49217536,1210474496,4.154,0.753,95.093,0,0,201664598,49793964
6345719808,91976327168,49217536,1210474496,4.107,0.531,95.362,0,0,201466246,48968372
6434332672,91887706112,49225728,1210474496,4.328,0.363,95.309,0,0,201711770,49280372
6526083072,91795951616,49225728,1210478592,3.889,0.448,95.663,0,0,201547867,41556306
6614605824,91707428864,49225728,1210478592,4.156,0.502,95.342,0,0,201318730,47710044
6701486080,91620548608,49225728,1210478592,4.167,0.475,95.358,0,0,201693616,50104544
6792212480,91529916416,49225728,1210474496,4.296,0.502,95.202,0,0,201473878,48788020
6876778496,91445338112,49233920,1210478592,4.190,0.475,95.335,0,0,201460910,49901954
6968111104,91354005504,49233920,1210478592,4.160,0.447,95.394,0,0,201799406,46915640
7057416192,91264700416,49233920,1210478592,4.486,0.390,95.124,0,0,201190936,47337104
7148449792,91173662720,49233920,1210482688,4.157,0.502,95.340,0,0,201757952,46631418
7236747264,91085365248,49233920,1210482688,4.032,0.364,95.603,0,0,201454662,48442476
7322947584,90999156736,49242112,1210482688,4.025,0.475,95.500,0,0,201507332,47656052
7413760000,90908340224,49242112,1210486784,4.134,0.419,95.447,0,0,201635428,44943332
7501467648,90820628480,49242112,1210490880,4.294,0.446,95.259,0,0,201612509,48606390
7588483072,90733613056,49242112,1210490880,4.196,0.392,95.413,0,0,201445518,50026806
7678287872,90643800064,49250304,1210490880,4.027,0.419,95.554,0,0,201547592,48087224
7768399872,90553675776,49258496,1210494976,4.371,0.557,95.072,0,0,201697570,46431256
7857737728,90464337920,49258496,1210494976,4.251,0.419,95.330,0,0,201473130,46754286
7949529088,90372546560,49258496,1210494976,3.915,0.364,95.721,0,0,201522282,42042600
8037801984,90284273664,49258496,1210494976,4.218,0.475,95.307,0,0,201810079,48812972
8128561152,90193510400,49258496,1210499072,4.155,0.502,95.343,0,0,201472806,44026941
8220278784,90101784576,49266688,1210499072,4.162,0.363,95.475,0,0,201690030,44369930
8313692160,90008371200,49266688,1210499072,4.071,0.530,95.399,0,0,201515460,41062306
8406736896,89915326464,49266688,1210499072,3.943,0.419,95.638,0,0,201673603,38821632
8497311744,89824747520,49266688,1210503168,4.161,0.447,95.392,0,0,201317577,44062040
8588132352,89733926912,49266688,1210503168,4.085,0.308,95.607,0,0,201505178,45867252
8679088128,89642962944,49274880,1210503168,4.164,0.419,95.416,0,0,201706108,46662890
8768622592,89553428480,49274880,1210503168,4.020,0.586,95.394,0,0,201266644,46986092
8857595904,89464451072,49274880,1210507264,4.160,0.503,95.338,0,0,201434916,47146628
8946544640,89375502336,49274880,1210507264,4.046,0.558,95.396,0,0,201683300,44701380
9034027008,89288019968,49274880,1210507264,4.079,0.503,95.418,0,0,201099226,48966994
9120841728,89201197056,49283072,1210507264,4.248,0.335,95.416,0,0,202023094,49399982
9207496704,89114537984,49283072,1210511360,4.296,0.446,95.258,0,0,201246520,50409168
9295052800,89026981888,49283072,1210511360,4.217,0.419,95.364,0,0,201437248,48792792
9383239680,88938795008,49283072,1210511360,4.299,0.391,95.310,0,0,201961570,49763330
9473708032,88848322560,49283072,1210515456,4.217,0.391,95.392,0,0,201380060,47142964
9564528640,88757493760,49291264,1210515456,4.214,0.447,95.339,0,0,201389508,47237966
9649709056,88672313344,49291264,1210515456,4.400,0.529,95.071,0,0,201717706,49417074
9743155200,88578867200,49291264,1210515456,3.945,0.392,95.663,0,0,201444960,39256126
9832394752,88489623552,49291264,1210519552,4.406,0.418,95.176,0,0,201642302,46793188
9921163264,88400855040,49291264,1210519552,4.216,0.447,95.338,0,0,201401069,50002048
10010095616,88311914496,49299456,1210519552,4.186,0.614,95.200,0,0,201599494,48933412
10096668672,88225341440,49299456,1210519552,4.251,0.336,95.414,0,0,201596667,50008246
10186489856,88135516160,49299456,1210523648,4.245,0.475,95.281,0,0,201528186,48921096
10272460800,88049545216,49299456,1210523648,4.353,0.474,95.173,0,0,201668916,50250520
10362822656,87959183360,49299456,1210523648,4.157,0.530,95.312,0,0,201465858,48006956
10451152896,87870832640,49315840,1210527744,4.407,0.363,95.230,0,0,201545314,47347872
10540122112,87781863424,49315840,1210527744,4.269,0.474,95.257,0,0,201394987,50101554
10627670016,87694315520,49315840,1210527744,4.299,0.475,95.226,0,0,201801689,50565914
10717224960,87604719616,49315840,1210527744,4.161,0.447,95.392,0,0,201428319,44186162
10807201792,87514738688,49315840,1210531840,4.139,0.308,95.554,0,0,201590266,46115676
10895777792,87426154496,49324032,1210531840,4.216,0.447,95.338,0,0,201526502,48823932
10985930752,87336001536,49324032,1210531840,4.080,0.475,95.444,0,0,201384160,46384552
11073835008,87248093184,49324032,1210535936,4.214,0.419,95.367,0,0,201812636,48625230
11161280512,87160647680,49324032,1210535936,4.195,0.475,95.330,0,0,201386878,50071226
11250753536,87071174656,49324032,1210535936,4.049,0.559,95.392,0,0,201664566,48923134
11340828672,86981091328,49332224,1210535936,3.996,0.503,95.502,0,0,201460244,45147724
11428196352,86893723648,49332224,1210535936,4.518,0.502,94.980,0,0,201621892,50576840
11514064896,86807851008,49332224,1210540032,4.056,0.448,95.497,0,0,201503656,49510462
11601788928,86720126976,49332224,1210540032,4.082,0.531,95.387,0,0,201534061,48437446
11689828352,86632079360,49332224,1210548224,4.506,0.473,95.021,0,0,201875664,49051624
11779919872,86541979648,49340416,1210548224,4.454,0.501,95.045,0,0,201479036,45053180
11866464256,86455435264,49340416,1210548224,4.330,0.363,95.307,0,0,201569768,48634536
11954315264,86367584256,49340416,1210548224,4.291,0.641,95.068,0,0,201443670,50144580
12043010048,86278885376,49340416,1210552320,4.135,0.503,95.362,0,0,201792660,49981590
12133113856,86188781568,49340416,1210552320,4.216,0.447,95.338,0,0,201503792,46377172
12219514880,86102380544,49348608,1210544128,4.084,0.364,95.552,0,0,201476130,47989212
12308664320,86013218816,49348608,1210556416,4.458,0.390,95.152,0,0,201585962,45837494
12396851200,85925031936,49348608,1210556416,4.269,0.446,95.285,0,0,201384656,47115552
12486238208,85835636736,49348608,1210560512,4.322,0.474,95.204,0,0,201717846,48554762
12576415744,85745459200,49348608,1210560512,4.562,0.445,94.993,0,0,201455108,46596548
12665958400,85655904256,49356800,1210564608,4.163,0.363,95.474,0,0,201323058,46832688
12757286912,85564575744,49356800,1210564608,4.106,0.531,95.363,0,0,201236002,42854504
12843462656,85478400000,49356800,1210564608,4.265,0.474,95.261,0,0,201955614,50235404
12936720384,85385142272,49356800,1210564608,4.191,0.391,95.418,0,0,201225562,43148496
13027049472,85294809088,49356800,1210568704,4.084,0.336,95.580,0,0,201644341,44254132
13115822080,85206028288,49364992,1210568704,4.050,0.475,95.475,0,0,201584217,44284478
13203238912,85118603264,49373184,1210568704,4.243,0.475,95.282,0,0,201364972,50579420
13291171840,85030666240,49373184,1210572800,4.596,0.362,95.042,0,0,201698194,50728996
13379764224,84942073856,49373184,1210572800,4.239,0.502,95.259,0,0,201266179,46867684
13467635712,84854202368,49373184,1210572800,4.618,0.362,95.021,0,0,201575086,47394290
13557362688,84764467200,49381376,1210572800,4.264,0.530,95.206,0,0,201504776,47640502
13647704064,84674121728,49381376,1210576896,4.135,0.559,95.278,0.028,0,201710028,48178432
13734776832,84587048960,49381376,1210576896,4.218,0.447,95.335,0,0,201478304,50301100
13823201280,84498624512,49381376,1210576896,4.160,0.530,95.310,0,0,201632362,48644194
13912616960,84409208832,49381376,1210576896,4.184,0.474,95.342,0,0,201644946,46917570
14002761728,84319051776,49389568,1210580992,4.189,0.475,95.336,0,0,200315678,45954960
14091419648,84230393856,49389568,1210580992,4.051,0.475,95.474,0,0,202463568,47549590
14177558528,84144254976,49389568,1210580992,4.002,0.448,95.550,0,0,201523894,46449704
14265339904,84056465408,49389568,1210585088,4.324,0.474,95.202,0,0,201576058,49951602
14352764928,83969040384,49389568,1210585088,4.219,0.419,95.362,0,0,201519246,50748236
14442840064,83878957056,49397760,1210585088,4.220,0.335,95.444,0,0,201593642,46680138
14530932736,83790860288,49397760,1210589184,4.183,0.502,95.315,0,0,201547197,47512148
14618505216,83703287808,49397760,1210589184,4.085,0.448,95.467,0,0,201604535,50014948
14706642944,83615150080,49397760,1210589184,4.294,0.418,95.287,0,0,201572062,48851600
14796279808,83525509120,49397760,1210593280,4.268,0.502,95.230,0,0,201510430,46411558
14884868096,83436912640,49405952,1210593280,4.217,0.391,95.392,0,0,201575194,48850354
14976282624,83345498112,49405952,1210593280,4.023,0.475,95.502,0,0,201464656,45643948
15063863296,83257913344,49405952,1210597376,4.047,0.614,95.339,0,0,201660958,48585702
15148519424,83173257216,49405952,1210597376,4.355,0.419,95.226,0,0,201337548,50452436
15236280320,83085496320,49405952,1210597376,4.246,0.587,95.168,0,0,201608472,50000992
15328456704,82993307648,49414144,1210601472,4.104,0.475,95.422,0,0,201456026,44969112
15418105856,82903658496,49414144,1210601472,4.084,0.448,95.469,0,0,201906672,46233086
15507980288,82813784064,49414144,1210601472,4.073,0.558,95.370,0,0,201187923,47760212
15597219840,82724544512,49414144,1210601472,4.191,0.447,95.362,0,0,201839983,49483408
15685697536,82636062720,49414144,1210605568,4.051,0.503,95.446,0,0,201173764,48413780
15773528064,82548224000,49422336,1210605568,4.408,0.335,95.257,0,0,201588682,48322824
15860998144,82460753920,49422336,1210605568,4.321,0.446,95.233,0,0,201571650,48831888
15951720448,82370023424,49430528,1210605568,4.128,0.530,95.342,0,0,201491560,46051086
16040255488,82281480192,49430528,1210613760,4.185,0.530,95.285,0,0,201466395,46207980
16132284416,82189451264,49430528,1210613760,4.078,0.503,95.419,0,0,201441008,45363638
16220696576,82101026816,49438720,1210617856,5.022,0.446,94.531,0,0,201477772,49032424
16308092928,82013630464,49438720,1210617856,4.328,0.531,95.141,0,0,201744316,49612068
16396619776,81925103616,49438720,1210617856,4.216,0.447,95.338,0,0,201718106,48480054
16486400000,81835319296,49438720,1210621952,4.112,0.420,95.469,0,0,201492008,46882746
16575823872,81745895424,49438720,1210621952,4.073,0.586,95.342,0,0,201386237,43378598
16671440896,81650270208,49446912,1210621952,4.368,0.529,95.103,0,0,201784383,40140890
16763658240,81558052864,49446912,1210621952,3.970,0.391,95.639,0,0,201226500,41323236
16856764416,81464942592,49446912,1210626048,3.937,0.698,95.364,0,0,201537336,43613482
16947212288,81374494720,49446912,1210626048,4.124,0.557,95.319,0,0,201457239,44728864
17036525568,81285181440,49446912,1210626048,4.142,0.364,95.494,0,0,201781941,49586262
17126879232,81194815488,49455104,1210630144,4.074,0.502,95.424,0,0,201455438,43722130
17218162688,81103532032,49455104,1210630144,4.051,0.531,95.418,0,0,201554468,44466248
17309171712,81012523008,49455104,1210630144,4.051,0.419,95.529,0,0,201646681,46592888
17395400704,80926294016,49455104,1210630144,4.251,0.364,95.386,0,0,201497761,50479046
17485955072,80835735552,49455104,1210634240,4.217,0.391,95.392,0,0,201605886,45380724
17574756352,80746926080,49463296,1210634240,4.382,0.447,95.172,0,0,201623490,48627184
17661165568,80660516864,49463296,1210634240,4.464,0.363,95.173,0,0,201477663,48281206
17750892544,80570761216,49487872,1210638336,4.056,0.476,95.469,0,0,201452151,47929424
17836806144,80484831232,49496064,1210638336,4.276,0.447,95.277,0,0,201630784,50800692
17924190208,80397447168,49496064,1210638336,4.439,0.391,95.170,0,0,201835798,50392184
18014834688,80306798592,49496064,1210642432,4.271,0.475,95.254,0,0,201471964,46452892
18106261504,80215371776,49496064,1210642432,4.055,0.308,95.638,0,0,201507381,43101874
18194337792,80127295488,49496064,1210642432,4.378,0.446,95.176,0,0,201380153,46406080
18283790336,80037838848,49496064,1210646528,4.245,0.391,95.364,0,0,201830106,48481796
18370891776,79950729216,49504256,1210646528,4.431,0.502,95.067,0,0,201444183,50383234
18459824128,79861792768,49504256,1210650624,4.188,0.503,95.310,0,0,201598794,46813646
18551468032,79770144768,49504256,1210654720,4.053,0.475,95.472,0,0,201555506,43871292
18638188544,79683416064,49512448,1210654720,4.268,0.418,95.314,0,0,201494578,49402116
18727411712,79594192896,49512448,1210654720,4.491,0.502,95.007,0,0,201626097,48184956
18816192512,79505399808,49520640,1210654720,4.243,0.503,95.254,0,0,201407414,50215182
18903818240,79417769984,49520640,1210658816,4.184,0.530,95.286,0,0,201711800,47224308
18994401280,79327186944,49520640,1210658816,4.082,0.503,95.415,0,0,201726884,46906734
19086430208,79235158016,49520640,1210658816,4.025,0.503,95.472,0,0,201561460,44044548
19175505920,79146070016,49528832,1210662912,4.132,0.530,95.338,0,0,201502042,48112324
19265163264,79056404480,49537024,1210662912,4.246,0.391,95.363,0,0,201834534,47167846
19352174592,78969393152,49537024,1210662912,4.457,0.557,94.986,0,0,201319785,50813674
19443253248,78878310400,49537024,1210667008,4.076,0.447,95.477,0,0,201519875,43744188
19534422016,78787141632,49537024,1210667008,4.276,0.335,95.388,0,0,201724160,46732216
19621855232,78699708416,49537024,1210667008,4.454,0.473,95.072,0,0,202026388,46581902
19709308928,78612242432,49545216,1210671104,4.224,0.420,95.357,0,0,201444296,48944080
19797356544,78524194816,49545216,1210671104,4.111,0.447,95.442,0,0,201395708,50291650
19888291840,78433259520,49545216,1210671104,4.330,0.391,95.279,0,0,201813006,46422730
19974184960,78347362304,49545216,1210675200,4.379,0.502,95.119,0,0,201510012,49891394
20061876224,78259671040,49545216,1210675200,4.135,0.419,95.446,0,0,201604002,48275900
20149043200,78172491776,49553408,1210679296,4.220,0.447,95.333,0,0,201766142,50227130
20235333632,78086201344,49553408,1210679296,4.166,0.335,95.499,0,0,201506792,48640958
20323196928,77998333952,49553408,1210683392,4.082,0.587,95.331,0,0,201417842,48889198
20414976000,77906554880,49553408,1210683392,4.106,0.447,95.447,0,0,201964634,44950260
20505268224,77816262656,49553408,1210683392,4.218,0.447,95.335,0,0,201267680,47275018
20597071872,77724446720,49561600,1210687488,4.108,0.363,95.528,0,0,201930652,45719280
20684513280,77637005312,49561600,1210687488,3.983,0.393,95.624,0,0,201386306,50396276
20771012608,77550505984,49561600,1210687488,4.239,0.502,95.259,0,0,201535124,50071692
20858793984,77462720512,49561600,1210691584,4.170,0.364,95.466,0,0,201661342,49718282
20946702336,77374812160,49561600,1210691584,4.355,0.419,95.226,0,0,201316044,48562820
21033263104,77288243200,49569792,1210691584,4.110,0.419,95.471,0,0,201540536,49118414
21124349952,77197152256,49569792,1210695680,4.190,0.419,95.391,0,0,201717270,46350440
21215068160,77106434048,49569792,1210695680,4.212,0.530,95.258,0,0,201697034,48900682
21302378496,77019123712,49569792,1210695680,4.054,0.475,95.471,0,0,201506704,48463604
21389180928,76932313088,49573888,1210699776,4.189,0.475,95.336,0,0,201528917,50286380
21477949440,76843532288,49582080,1210699776,4.159,0.530,95.311,0,0,199938256,45188056
21554057216,76767424512,49582080,1210699776,3.915,0.364,95.721,0,0,178306562,48752806
21614301184,76707180544,49582080,1210699776,4.204,0.362,95.434,0,0,152778615,47523202
21660397568,76661080064,49582080,1210703872,3.959,0.251,95.790,0,0,126887691,47665054
21690007552,76631461888,49590272,1210703872,4.201,0.250,95.548,0,0,101129305,49563632
21705871360,76615581696,49598464,1210707968,3.874,0.139,95.987,0,0,75553681,48010616
21710356480,76611092480,49598464,1210712064,3.734,0.084,96.183,0,0,49739794,45564700
21708808192,76612640768,49598464,1210712064,3.953,0.084,95.963,0,0,24767308,47716518
21705515008,76615933952,49598464,1210712064,3.670,0.028,96.302,0,0,2761288,44302632
21698166784,76623278080,49598464,1210716160,3.481,0.028,96.491,0,0,143176,43907748
21685800960,76635627520,49614848,1210716160,3.561,0.056,96.384,0,0,175924,47253088
21681496064,76639932416,49614848,1210716160,3.589,0.056,96.355,0,0,168720,45964804
21674569728,76646854656,49614848,1210720256,3.694,0.028,96.278,0,0,168394,46277370
21668450304,76652974080,49614848,1210720256,3.509,0.028,96.463,0,0,162476,44090230
21661655040,76659769344,49614848,1210720256,3.641,0.056,96.304,0,0,219256,46548610
21650767872,76670644224,49623040,1210724352,3.720,0.056,96.197,0.028,0,174830,44777492
21637156864,76684255232,49623040,1210724352,3.693,0.083,96.223,0,0,163096,45860322
21625180160,76696231936,49623040,1210724352,3.669,0.056,96.276,0,0,143516,45865532
21616766976,76704641024,49623040,1210728448,3.613,0.056,96.331,0,0,171802,45341296
21609586688,76711821312,49623040,1210728448,3.561,0.028,96.411,0,0,147054,45027250
21598396416,76723003392,49631232,1210728448,3.640,0.083,96.277,0,0,203196,45639166
21590523904,76730871808,49631232,1210732544,3.666,0.056,96.279,0,0,165266,46907190
21581168640,76740227072,49631232,1210732544,3.510,0.056,96.435,0,0,195948,46565298
21577404416,76743991296,49631232,1210732544,3.612,0.028,96.360,0,0,156078,43992318
21615833088,76703784960,49635328,1211244544,4.716,0.416,94.868,0,0,605802,47001638
21598547968,76720488448,49643520,1211203584,3.799,0.083,96.118,0,0,149864,44512866
