"Dstat 0.7.3 CSV output"
"Author:","Dag Wieers <dag@wieers.com>",,,,"URL:","http://dag.wieers.com/home-made/dstat/"
"Host:","grisou-7.nancy.grid5000.fr",,,,"User:","root"
"Cmdline:","dstat -m -c -n -o dstat.csv",,,,"Date:","24 May 2020 18:42:50 CEST"
"memory usage",,,,"total cpu usage",,,,,"net/total",
"used","free","buff","cach","usr","sys","idl","wai","stl","recv","send"
1010384896,132906418176,52686848,850763776,1.468,0.452,97.898,0.182,0,0,0
1028284416,132888141824,52686848,851103744,0.687,0.375,98.938,0,0,387934,16656
1008877568,132907995136,52686848,850657280,0.250,0.250,99.031,0.469,0,3582,13932
1019568128,132896829440,52711424,851103744,0.406,0.156,99.312,0.125,0,383136,10624
1012068352,132904775680,52711424,850657280,0.625,0.469,98.906,0,0,11624,14976
1012781056,132904062976,52711424,850657280,0,0.062,99.938,0,0,242562,6544
1025146880,132891230208,52711424,851103744,0.469,0.250,99.281,0,0,142610,4724
1014456320,132902367232,52711424,850657280,0.344,0.469,97.999,1.188,0,5060,14448
1014439936,132902383616,52711424,850657280,0,0,99.406,0.594,0,932,0
1014149120,132902649856,52736000,850657280,0,0,99.906,0.094,0,646,0
1014149120,132902649856,52736000,850657280,0,0,100,0,0,874,148
1013882880,132902916096,52736000,850657280,0,0,100,0,0,406,0
1013436416,132903362560,52736000,850657280,0,0.031,99.969,0,0,998,676
1013178368,132903620608,52736000,850657280,0,0,100,0,0,346,0
1013178368,132903620608,52736000,850657280,0,0,100,0,0,754,220
1013170176,132903620608,52744192,850657280,0,0,99.969,0.031,0,842,0
1013428224,132903362560,52744192,850657280,0,0,100,0,0,7434,0
1013411840,132903378944,52744192,850657280,0,0,100,0,0,2040,0
1012895744,132903895040,52744192,850657280,0,0,100,0,0,10654,0
1012473856,132904316928,52744192,850657280,0.094,0.063,99.844,0,0,385718,12828
1010294784,132906483712,52744192,850661376,0.938,0.531,98.531,0,0,14972,16676
1010266112,132906500096,52756480,850661376,0,0,99.937,0.063,0,7286,0
1013522432,132903198720,52756480,850681856,0.281,0.312,99.406,0,0,172314,11956
1025912832,132890337280,52756480,851128320,0.594,0.219,99.187,0,0,388902,15276
1015361536,132900888576,52756480,851128320,0.500,0.531,98.969,0,0,5290,14892
1027334144,132888858624,52768768,851128320,0.469,0.219,99.281,0.031,0,383068,11616
1014923264,132901650432,52768768,850681856,0.406,0.500,99.094,0,0,3900,14448
1016242176,132900261888,52781056,850681856,0.968,0.656,98.314,0.062,0,386664,26104
1015709696,132900794368,52781056,850681856,0,0,99.468,0.532,0,972,168
1015709696,132900794368,52781056,850681856,0,0,100,0,0,978,0
1017012224,132899115008,52789248,850927616,2.118,0.187,97.633,0.062,0,222714,11268
1017069568,132899299328,52789248,850685952,0.031,0.031,99.938,0,0,16098,2800
1016758272,132899598336,52801536,850685952,0,0,99.969,0.031,0,3672,630
1016750080,132899606528,52801536,850685952,0,0,100,0,0,1036,2926
1019609088,132896706560,52801536,850694144,0.438,0.188,99.031,0.344,0,342498,16528
1027944448,132888002560,52801536,851009536,0.188,0.094,99.719,0,0,180220,21488
1027407872,132888526848,52813824,851009536,0,0,99.937,0.063,0,12902,13328
1027125248,132888797184,52826112,851009536,0,0,99.969,0.031,0,13414,13328
1027117056,132888805376,52826112,851009536,0,0.031,99.969,0,0,12782,13328
1026842624,132889067520,52830208,851017728,0,0,99.469,0.531,0,12956,13328
1026842624,132889067520,52830208,851017728,0,0,100,0,0,20006,18956
1026842624,132889067520,52830208,851017728,0,0,100,0,0,13054,13314
1026842624,132889067520,52830208,851017728,0,0,100,0,0,13194,13328
1026834432,132889067520,52838400,851017728,0.031,0,99.906,0.062,0,13294,13328
1019174912,132896792576,52846592,850944000,0.031,0,99.906,0.063,0,14416,15564
1018253312,132897824768,52846592,850833408,0,0,100,0,0,948,432
1016967168,132899078144,52846592,850833408,0.281,0.156,99.563,0,0,172328,14000
1016152064,132899893248,52846592,850833408,0,0.031,99.969,0,0,830,0
1015894016,132900151296,52846592,850833408,0,0,100,0,0,950,0
1015881728,132900151296,52858880,850833408,0,0,99.937,0.063,0,718,0
1015771136,132900249600,52871168,850833408,0,0,99.938,0.062,0,2018,84
1015480320,132900540416,52871168,850833408,0.031,0,99.781,0.188,0,346,0
1015476224,132900540416,52871168,850837504,0,0,100,0,0,6282,0
1015476224,132900540416,52871168,850837504,0,0,100,0,0,1246,662
1015476224,132900540416,52871168,850837504,0,0,100,0,0,812,220
1015209984,132900798464,52879360,850837504,0,0,99.969,0.031,0,512,0
1015209984,132900798464,52879360,850837504,0,0,100,0,0,1536,476
1014435840,132901572608,52879360,850837504,0,0,100,0,0,1610,148
1014435840,132901572608,52879360,850837504,0,0,100,0,0,1024,168
1027264512,132888268800,52879360,851304448,0.688,0.219,99.094,0,0,387004,15160
1015250944,132900749312,52879360,850837504,0.406,0.375,99.219,0,0,3856,15056
1015230464,132900757504,52891648,850837504,0,0,99.938,0.062,0,1084,84
1014956032,132901031936,52891648,850837504,0.031,0.031,99.938,0,0,866,84
1014956032,132901031936,52891648,850837504,0,0,99.812,0.188,0,828,148
1014956032,132901031936,52891648,850837504,0,0,100,0,0,824,1198
1014673408,132901302272,52903936,850837504,0,0,99.969,0.031,0,1304,168
1014673408,132901302272,52903936,850837504,0,0,100,0,0,1112,0
1014407168,132901560320,52912128,850837504,0,0,99.938,0.062,0,3940,0
1013891072,132902076416,52912128,850837504,0,0,100,0,0,2224,0
1013891072,132902076416,52912128,850837504,0,0,99.844,0.156,0,1278,0
1013616640,132902350848,52912128,850837504,0,0,100,0,0,1580,0
1013399552,132902567936,52912128,850837504,0,0,100,0,0,2490,148
1013141504,132902825984,52912128,850837504,0,0.031,99.969,0,0,2044,0
1013141504,132902825984,52920320,850829312,0.031,0,99.906,0.062,0,166,1948
1013125120,132902834176,52920320,850837504,0,0,100,0,0,406,220
1013125120,132902834176,52920320,850837504,0,0,100,0,0,1038,0
1012867072,132903092224,52920320,850837504,0,0,100,0,0,752,0
1012092928,132903866368,52920320,850837504,0,0,100,0,0,786,0
1012092928,132903866368,52920320,850837504,0,0,100,0,0,1098,0
1011826688,132904124416,52928512,850837504,0,0,99.969,0.031,0,1212,0
1011560448,132904390656,52928512,850837504,0,0,100,0,0,874,0
1011560448,132904390656,52928512,850837504,0,0,100,0,0,4552,0
1011044352,132904906752,52928512,850837504,0,0,100,0,0,1220,0
1010786304,132905164800,52928512,850837504,0,0,100,0,0,572,0
1010786304,132905164800,52928512,850837504,0,0,100,0,0,346,0
1010520064,132905422848,52936704,850837504,0,0,99.938,0.062,0,512,0
1010520064,132905422848,52936704,850837504,0,0,100,0,0,812,0
1009344512,132906598400,52936704,850837504,0,0,100,0,0,752,0
1154772992,132761960448,52936704,850022400,2.122,0.624,97.253,0,0,834676,37374
4061069312,129853726720,52940800,851726336,28.455,12.477,59.068,0,0,1484688,57406
7189733376,126723510272,52957184,853147648,35.896,12.269,51.836,0,0,1324432,57202
10297159680,123614613504,52965376,854482944,32.335,14.088,53.483,0.095,0,1488426,61270
13532155904,120378081280,52969472,855863296,33.978,14.353,51.232,0.437,0,1487574,61688
16787107840,117121085440,53059584,857726976,34.665,13.853,50.827,0.655,0,1326476,55450
19753517056,114153168896,53063680,859148288,33.166,12.323,54.385,0.126,0,1340086,2259055
22658732032,111246856192,53075968,860147712,37.641,13.079,48.999,0.282,0,1482064,20503027
25650544640,108253245440,53092352,861790208,43.154,12.968,43.752,0.126,0,1673988,42143355
28648579072,105253715968,53092352,863191040,43.886,12.606,43.414,0.094,0,1860140,63393481
30948749312,102953172992,53092352,863543296,37.970,10.150,51.692,0.188,0,735252,84936299
31117873152,102783959040,53104640,863617024,13.581,1.918,84.124,0.377,0,870246,107400170
31260971008,102640803840,53104640,863674368,19.352,2.099,78.179,0.370,0,980370,126635672
31401496576,102500036608,53112832,863887360,19.881,2.289,77.297,0.533,0,1174960,145722087
31576760320,102324666368,53112832,863981568,24.551,2.910,72.229,0.310,0,1334532,166385417
31763996672,102137077760,53198848,864243712,27.122,2.934,67.135,2.809,0,1507154,185338529
31875993600,102024974336,53198848,864350208,25.165,3.044,71.509,0.282,0,1569510,202050594
31944364032,101956481024,53198848,864473088,21.601,2.688,75.117,0.594,0,1548672,201973716
32056229888,101844463616,53207040,864612352,24.705,4.438,69.522,1.335,0,1578682,201933333
32152064000,101748482048,53207040,864759808,19.064,3.276,77.036,0.624,0,1560920,202133383
32261255168,101639159808,53215232,864874496,21.681,4.249,72.602,1.468,0,1533876,202001426
32264495104,101635784704,53215232,865005568,14.969,3,68.594,13.438,0,1538872,202113805
32265752576,101634424832,53215232,865107968,12.686,3.319,83.096,0.900,0,1542050,202014479
32231702528,101668323328,53223424,865251328,10.451,2.706,86.190,0.653,0,1510034,202166820
32244400128,101655511040,53223424,865361920,8.980,2.378,88.392,0.250,0,1509450,202189842
32288481280,101611225088,53223424,865492992,8.163,1.758,89.765,0.314,0,1492354,202121715
32302247936,101597343744,53223424,865599488,9.742,2.606,87.310,0.341,0,1534556,202153381
32293318656,101606141952,53223424,865722368,7.468,2.278,89.715,0.538,0,1497632,202324867
32292241408,101607088128,53231616,865841152,7.780,1.890,89.701,0.630,0,1471218,201860508
32280977408,101618229248,53231616,865964032,8.766,2.549,88.343,0.342,0,1489124,202023844
32281989120,101616967680,53231616,866213888,5.769,1.743,92.203,0.285,0,1467448,202047270
32292118528,101606707200,53231616,866340864,6.344,2.531,90.812,0.312,0,1469976,202149579
32297635840,101601058816,53231616,866471936,6.889,1.793,91.003,0.315,0,1487756,201903904
32309870592,101588713472,53239808,866574336,5.582,1.881,91.941,0.596,0,1525880,202218978
32340844544,101557604352,53239808,866693120,7.640,2.526,89.523,0.312,0,1487296,202411369
32381108224,101517201408,53239808,866828288,7.935,2.749,89.066,0.250,0,1507732,201885704
32392708096,101505486848,53239808,866942976,7.552,2.664,88.436,1.348,0,1476364,202493546
32395108352,101502980096,53239808,867049472,6.103,2.045,90.752,1.101,0,1491564,201981086
32396279808,101501648896,53248000,867192832,6.477,2.128,90.864,0.532,0,1478500,202138439
32406077440,101491744768,53248000,867299328,6.817,1.822,91.015,0.346,0,1433884,201755814
32435802112,101461889024,53248000,867426304,8.380,2.825,88.449,0.345,0,1510848,202250850
32454463488,101443100672,53248000,867549184,7.224,2.073,90.421,0.283,0,1469880,201924896
32479600640,101417848832,53252096,867659776,6.585,2.383,90.248,0.784,0,1444352,202043806
32485122048,101412048896,53264384,867786752,7.093,2.049,89.502,1.356,0,1500728,202005219
32488861696,101408112640,53264384,867905536,6.334,2.153,91.201,0.312,0,1470550,202127841
32494374912,101402468352,53264384,868032512,6.037,2.252,91.429,0.282,0,1435570,201826945
32515313664,101381398528,53264384,868159488,6.521,2.184,90.889,0.406,0,1446058,202103040
32528334848,101368246272,53264384,868282368,6.091,2.166,89.827,1.915,0,1474998,201978787
32551411712,101345054720,53280768,868376576,7.016,2.370,90.178,0.437,0,1483606,202254508
32562364416,101333950464,53280768,868524032,5.902,2.268,91.519,0.311,0,1485296,202080869
32564731904,101331337216,53280768,868769792,6.232,2.192,91.168,0.407,0,1488466,202072114
32575979520,101319958528,53280768,868896768,4.621,1.823,93.304,0.251,0,1472170,201964198
32578228224,101317582848,53280768,869019648,5.585,2.165,91.246,1.004,0,1459166,202032047
32580550656,101315133440,53288960,869134336,5.486,2.226,91.818,0.470,0,1804938,201985856
32589254656,101306302464,53288960,869257216,5.164,2.236,92.160,0.441,0,1452610,202073443
32606449664,101288984576,53297152,869367808,5.379,2.328,91.884,0.409,0,1459662,202044579
32619040768,101276266496,53297152,869494784,5.726,2.159,91.834,0.282,0,1477146,202084881
32618344448,101276835840,53297152,869621760,5.322,1.847,91.484,1.346,0,1487480,201852147
32629157888,101265899520,53305344,869732352,4.793,1.577,92.715,0.915,0,1468164,202284958
32645128192,101249798144,53305344,869859328,5.113,1.662,92.911,0.314,0,1482592,202246795
32650924032,101243863040,53305344,869994496,6.240,2.017,91.428,0.315,0,1466014,202071054
32650985472,101243711488,53305344,870084608,6.495,1.726,91.528,0.251,0,1470904,201936825
32669167616,101225381888,53305344,870227968,8.410,1.676,89.662,0.253,0,1498076,202248470
32672526336,101221896192,53317632,870334464,9.663,1.857,87.567,0.913,0,1483446,201946841
32673697792,101220605952,53317632,870453248,8.297,2.011,89.346,0.346,0,1464176,202202183
32688373760,101205807104,53317632,870576128,9.567,2.244,87.878,0.312,0,1467146,202118235
32695169024,101198876672,53317632,870703104,7.936,1.976,89.711,0.376,0,1476682,201925683
32696594432,101197316096,53317632,870838272,8.788,2.026,88.875,0.312,0,1461370,202223245
32698601472,101195177984,53325824,870952960,8.784,2.063,88.246,0.907,0,1490938,202056400
32698720256,101194928128,53325824,871075840,8.444,1.953,89.382,0.221,0,1482830,202041885
32698785792,101194571776,53325824,871321600,6.917,1.847,91.080,0.156,0,1415806,201819206
32750538752,101142700032,53325824,871432192,10.177,2.116,87.519,0.187,0,1444066,202496815
32786677760,101106421760,53325824,871567360,12.180,2.498,85.072,0.250,0,1467878,201941905
32808124416,101084844032,53334016,871690240,10.216,2.031,85.036,2.718,0,1478630,201957328
32827469824,101065392128,53334016,871796736,9.051,1.608,89.089,0.252,0,1450534,202090544
32836214784,101056499712,53334016,871940096,9.715,2.256,87.684,0.345,0,1484392,202223794
32841486336,101051125760,53334016,872042496,9.085,1.686,89.042,0.187,0,1443430,201959304
32859287552,101033201664,53334016,872161280,9.338,1.874,88.570,0.219,0,1453118,201949635
32877924352,101014401024,53350400,872304640,11.517,2.122,85.393,0.968,0,1477750,202258205
32884449280,101007765504,53350400,872411136,9.125,2.156,88.406,0.312,0,1436594,202142274
32901611520,100990476288,53350400,872529920,9.238,2.029,88.514,0.218,0,1437788,201873106
32938102784,100953866240,53350400,872640512,9.554,2.217,87.918,0.312,0,1462310,202050895
32988794880,100903030784,53350400,872779776,10.050,1.935,87.703,0.312,0,1461310,202255155
33038835712,100852862976,53358592,872890368,11.910,2.094,85.402,0.594,0,1476118,201957465
33110884352,100780683264,53358592,873021440,11.669,2.184,85.928,0.218,0,1476826,202126591
33184935936,100706508800,53358592,873140224,12.640,2.060,85.112,0.187,0,1473254,202230258
33264947200,100626382848,53358592,873254912,11.691,2.043,86.047,0.220,0,1448700,202010833
33327173632,100564029440,53358592,873381888,11.007,2.146,86.536,0.311,0,1465780,202155843
33390686208,100500389888,53366784,873500672,10.362,1.810,87.422,0.406,0,1495286,202061050
33459642368,100431298560,53366784,873631744,11.583,2.310,84.515,1.592,0,1474740,202141795
33506668544,100384137216,53366784,873754624,9.239,1.948,88.498,0.314,0,1474616,202225748
33506717696,100383813632,53366784,874029056,4.780,1.937,92.908,0.375,0,1445986,202021769
33507414016,100383006720,53366784,874135552,4.565,1.689,93.402,0.344,0,1434898,202159076
33502289920,100388007936,53374976,874250240,4.621,1.717,92.944,0.718,0,1469938,202052911
33504014336,100386136064,53383168,874385408,4.463,1.477,92.992,1.069,0,1465422,202202431
33505370112,100384653312,53383168,874508288,5.344,1.875,92.406,0.375,0,1447626,202180619
33507344384,100382556160,53383168,874627072,5.339,1.842,92.320,0.500,0,1458618,202156369
33508155392,100381618176,53383168,874749952,4.253,1.670,93.730,0.347,0,1433112,201974037
33507688448,100381941760,53391360,874885120,4.536,2.081,92.544,0.839,0,1418088,202261965
33508118528,100381392896,53399552,874995712,4.009,1.785,91.732,2.474,0,1437708,200746563
33509130240,100380266496,53399552,875106304,4.533,2.126,93.060,0.281,0,1449130,201938275
33508798464,100380463104,53399552,875229184,5.440,2.083,92.073,0.404,0,1463506,201991020
33510801408,100378329088,53399552,875352064,6.050,2.761,90.816,0.372,0,1452352,202292408
33511030784,100377976832,53407744,875466752,4.877,2.112,92.482,0.528,0,1469692,201879816
33510387712,100378488832,53415936,875589632,4.591,1.562,93.317,0.531,0,1418192,202023654
33510973440,100377772032,53415936,875720704,4.645,1.995,93.111,0.249,0,1455860,202164635
33511329792,100377296896,53415936,875835392,4.463,1.998,93.321,0.218,0,1461950,202101517
33511768064,100376748032,53415936,875945984,4.156,1.750,93.875,0.219,0,1458378,201972187
33512001536,100376363008,53424128,876085248,3.858,1.631,94.072,0.439,0,1448660,202420404
33513046016,100375199744,53424128,876199936,4.554,1.871,93.387,0.187,0,1440552,201934208
33511993344,100376137728,53432320,876306432,3.995,1.623,76.966,17.416,0,1248712,179555689
33528221696,100359782400,53432320,876433408,6.103,1.793,91.853,0.252,0,1491016,201756021
33528381440,100359503872,53432320,876548096,5.091,1.905,92.661,0.344,0,1461822,202114685
33514409984,100373336064,53440512,876679168,3.976,1.816,93.488,0.720,0,1438322,201840031
33514115072,100373491712,53440512,876814336,4.536,1.939,93.150,0.375,0,1458116,202261207
33514803200,100372684800,53448704,876920832,4.148,1.634,93.495,0.723,0,1478346,202038961
33515016192,100372328448,53448704,877060096,4.319,1.753,93.521,0.407,0,1474038,202201648
33514565632,100372631552,53448704,877195264,4.897,1.996,92.701,0.405,0,1439186,202065148
33515909120,100371169280,53456896,877305856,4.659,1.876,92.527,0.938,0,1432828,201938064
33517109248,100369846272,53456896,877420544,4.379,2.422,92.764,0.435,0,1401946,202335508
33519271936,100367556608,53456896,877547520,4.975,1.815,91.552,1.658,0,1453206,202118268
33519935488,100366684160,53456896,877756416,4.591,2.030,92.942,0.437,0,1408690,202121849
33519747072,100366749696,53456896,877867008,4.621,1.717,93.256,0.406,0,1448352,201956481
33520185344,100366135296,53473280,878018560,4.644,1.820,92.564,0.973,0,1449604,202372532
33519939584,100366233600,53473280,878161920,4.504,1.595,93.556,0.344,0,1441932,202026368
33517035520,100369006592,53473280,878288896,4.337,2.090,92.949,0.624,0,1455680,202078650
33516896256,100369039360,53473280,878395392,3.944,1.690,93.772,0.595,0,1443234,202081228
33516498944,100369166336,53473280,878665728,4.737,1.901,92.988,0.374,0,1451874,202229873
33517076480,100368457728,53489664,878776320,3.933,1.605,93.518,0.944,0,1440776,202073516
33518739456,100366651392,53489664,878919680,4.626,1.844,93.154,0.375,0,1453112,201989656
33519644672,100365619200,53489664,879038464,4.768,1.631,93.099,0.502,0,1451834,201984341
33520578560,100364562432,53489664,879161344,4.322,1.691,93.611,0.376,0,1434768,202087379
33519828992,100365045760,53489664,879423488,4.449,1.880,93.327,0.345,0,1481788,202373056
33519935488,100364787712,53506048,879554560,5.421,1.713,92.274,0.592,0,1455586,202043865
33519493120,100365111296,53506048,879669248,4.852,1.928,92.877,0.342,0,1442496,201976941
33520939008,100363530240,53506048,879800320,4.628,1.876,93.152,0.344,0,1430166,202291099
33522343936,100362014720,53506048,879910912,4.545,1.661,91.881,1.912,0,1433480,201931549
33522724864,100361494528,53506048,880050176,4.845,2.032,92.779,0.344,0,1440568,202305635
33523634176,100360433664,53522432,880185344,3.995,1.762,93.489,0.755,0,1404808,202158445
33522966528,100360982528,53522432,880291840,3.651,1.605,94.397,0.346,0,1441430,201940215
33522384896,100361433088,53522432,880422912,3.869,1.510,94.275,0.346,0,1454950,201923612
33523527680,100360175616,53522432,880537600,4.432,1.779,93.134,0.655,0,1465788,202343747
33523060736,100360499200,53522432,880672768,4.500,1.844,93.344,0.312,0,1452112,201989608
33523830784,100359593984,53538816,880791552,4.112,1.758,93.001,1.130,0,1458654,202318498
33523310592,100359983104,53538816,880922624,3.949,1.359,94.344,0.348,0,1454578,201918772
33523503104,100359659520,53538816,881053696,3.772,1.509,94.310,0.409,0,1440396,202019058
33522442240,100360593408,53547008,881172480,4.319,1.847,91.362,2.473,0,1437958,202047816
33522962432,100359819264,53547008,881426432,4.428,1.933,93.358,0.281,0,1425504,202035317
33523724288,100358918144,53547008,881561600,4.216,2.030,93.379,0.375,0,1435808,202330943
33523736576,100358770688,53555200,881684480,4.598,2.175,92.637,0.590,0,1446540,202042774
33523400704,100358995968,53555200,881795072,4.219,2.031,93.500,0.250,0,1438546,202144950
33522737152,100359528448,53563392,881917952,4.259,1.754,93.611,0.376,0,1442040,201718577
33523089408,100359045120,53563392,882049024,4.275,1.966,93.167,0.593,0,1456802,202435774
33523548160,100358303744,53563392,882315264,4.432,1.685,93.633,0.250,0,1461340,202047862
33523187712,100358529024,53571584,882442240,4.913,2.052,92.755,0.280,0,1465752,202073246
33523834880,100357754880,53571584,882565120,4.164,1.816,93.801,0.219,0,1446936,202168185
33524994048,100356464640,53579776,882679808,4.300,1.994,93.300,0.405,0,1463804,201981366
33525555200,100355756032,53579776,882814976,3.694,1.705,94.285,0.316,0,1451940,202075510
33526165504,100354883584,53579776,883077120,4.565,1.988,93.106,0.342,0,1429840,202369524
33525788672,100355141632,53579776,883191808,4.113,1.758,93.721,0.408,0,1445124,202068965
33524834304,100355948544,53587968,883322880,4.849,1.710,93.037,0.404,0,1448234,202048815
33525784576,100354883584,53596160,883429376,5.531,1.958,91.983,0.528,0,1435716,201940709
33525084160,100355432448,53596160,883576832,3.865,1.823,93.023,1.288,0,1422928,202098825
33525506048,100354883584,53596160,883699712,4.312,1.688,93.688,0.312,0,1419360,202366221
33524482048,100355768320,53596160,883830784,3.790,1.879,93.987,0.345,0,1422538,201825390
33523888128,100356222976,53604352,883929088,4.451,1.992,93.215,0.342,0,1419490,202174652
33524809728,100355158016,53612544,884064256,3.951,1.787,93.666,0.596,0,1436746,202200339
33524613120,100355223552,53616640,884191232,4.090,1.936,93.444,0.531,0,1433342,202081452
33524862976,100354850816,53616640,884314112,4.564,1.969,93.123,0.344,0,1474542,202120663
33526435840,100353142784,53616640,884441088,4.126,1.876,93.686,0.313,0,1446772,201995045
33526169600,100353236992,53624832,884604928,4.055,2.121,93.356,0.468,0,1420650,201826186
33526644736,100352655360,53633024,884690944,4.536,1.988,92.793,0.683,0,1427560,202550178
33526120448,100353011712,53633024,884850688,3.735,1.726,94.225,0.314,0,1452162,201966576
33526743040,100352270336,53633024,884969472,4.561,1.781,93.252,0.406,0,1429458,202143926
33528422400,100350464000,53633024,885096448,4.506,1.752,93.429,0.313,0,1429400,201857168
33527291904,100351496192,53633024,885194752,4.116,1.964,93.577,0.343,0,1449650,202205152
33527185408,100351463424,53641216,885321728,3.999,1.480,93.860,0.661,0,1459756,201725133
33527783424,100350722048,53641216,885465088,4.429,1.684,93.200,0.686,0,1449672,202425939
33528745984,100349624320,53641216,885592064,4.110,1.506,93.128,1.255,0,1454914,201880252
33529741312,100348366848,53649408,885841920,3.912,1.972,93.803,0.313,0,1449400,202152379
33528184832,100349788160,53649408,885964800,4.475,1.989,93.257,0.280,0,1410238,202163474
33527566336,100350271488,53657600,886091776,3.896,1.477,93.968,0.660,0,1433812,201908991
33526476800,100351238144,53657600,886214656,4.184,1.748,93.787,0.281,0,1394412,201932150
33525858304,100351721472,53657600,886349824,4.082,2.119,93.238,0.561,0,1424086,202193242
33526726656,100350722048,53665792,886468608,3.982,1.693,93.854,0.470,0,1451774,202217277
33527468032,100349849600,53665792,886595584,4.345,1.688,93.654,0.313,0,1474196,202242306
33528262656,100348915712,53673984,886722560,3.804,1.509,94.279,0.409,0,1450726,202061468
33528467456,100348592128,53673984,886841344,4.871,1.986,92.895,0.248,0,1438360,202181445
33529298944,100347625472,53673984,886976512,3.892,1.726,92.467,1.915,0,1422432,201779716
33529655296,100347142144,53673984,887099392,4.008,1.659,93.926,0.407,0,1454560,202274869
33528901632,100347756544,53682176,887226368,4.213,1.841,93.571,0.375,0,1467656,202024326
33528303616,100348239872,53690368,887332864,4.284,1.907,93.246,0.563,0,1435178,202155011
33528995840,100347400192,53690368,887472128,4.216,1.874,93.473,0.437,0,1447890,202017220
33528631296,100347625472,53690368,887603200,4.049,1.569,93.220,1.161,0,1429688,202252149
33528119296,100348010496,53690368,887730176,4.538,1.989,93.130,0.342,0,1474506,201153105
33528598528,100347416576,53690368,887840768,3.708,1.760,94.186,0.346,0,1467476,203069479
33531224064,100344512512,53706752,888098816,4.506,1.909,93.054,0.532,0,1421624,202113181
33530101760,100345511936,53706752,888221696,3.956,1.727,94.003,0.314,0,1431994,202264307
33530449920,100345028608,53706752,888356864,3.765,1.757,93.725,0.753,0,1410082,202098503
33531068416,100344287232,53706752,888475648,4.321,2.098,92.361,1.221,0,1434564,202052501
33531940864,100343287808,53706752,888602624,4.410,1.689,93.619,0.282,0,1479586,202073265
33531899904,100343201792,53723136,888713216,4.246,1.842,93.444,0.468,0,1426676,201943579
33531457536,100343492608,53723136,888852480,4.040,1.754,93.956,0.251,0,1438852,202112871
33530916864,100343922688,53723136,888963072,3.827,1.757,94.166,0.251,0,1434720,201998768
33531179008,100343504896,53723136,889110528,3.997,1.322,94.082,0.598,0,1448686,202219206
33530986496,100343570432,53723136,889233408,4.322,1.503,93.893,0.282,0,1458266,202253703
33530527744,100343894016,53731328,889360384,4.250,1.688,93.469,0.594,0,1444744,202041683
33531236352,100343054336,53739520,889475072,3.888,1.662,94.073,0.376,0,1446894,202169361
33531047936,100343087104,53739520,889630720,3.810,1.574,94.364,0.252,0,1407908,201850447
33530920960,100343087104,53739520,889753600,3.989,2.181,93.549,0.280,0,1458068,202084708
33531793408,100342087680,53739520,889876480,3.968,1.812,93.877,0.344,0,1449740,202085427
33531531264,100342255616,53747712,889962496,4.403,1.655,93.254,0.687,0,1474228,202038119
33532231680,100341383168,53747712,890130432,4.194,1.565,93.865,0.376,0,1457598,202181197
33532891136,100340580352,53755904,890257408,3.772,1.603,93.933,0.692,0,1464948,201916659
33531629568,100341710848,53755904,890388480,3.912,1.847,92.363,1.878,0,1454764,202305895
33532608512,100340613120,53755904,890499072,3.798,1.726,94.068,0.408,0,1440594,201894556
33531109376,100341870592,53764096,890732544,4.194,1.753,93.646,0.407,0,1474064,201860546
33530974208,100341837824,53764096,890892288,4.514,1.837,93.337,0.311,0,1466700,202493197
33531052032,100341645312,53764096,891002880,3.734,1.820,94.227,0.220,0,1455458,202155743
33531211776,100341354496,53772288,891117568,4.605,1.680,92.626,1.089,0,1479340,202009114
33530552320,100341870592,53772288,891256832,3.856,1.755,94.044,0.345,0,1484008,202030797
33531924480,100340355072,53780480,891387904,4.275,1.778,93.448,0.499,0,1484244,202151539
33532207104,100339937280,53780480,891523072,3.980,1.598,94.108,0.313,0,1470576,202109162
33532293120,100339740672,53780480,891629568,4.219,1.719,93.750,0.312,0,1451396,201920157
33532928000,100338999296,53780480,891736064,4.193,1.783,93.680,0.344,0,1479146,202449036
32659386368,101212393472,53788672,891867136,3.241,1.385,76.337,19.037,0,1236120,176210265
28687134720,105184522240,53800960,891977728,4.019,1.633,94.003,0.345,0,1327814,184535864
25489305600,108383338496,53800960,890990592,3.395,1.226,95.190,0.189,0,1244090,162474648
22167920640,111705751552,53800960,889962496,3.679,1.559,94.481,0.281,0,1065572,141399786
18945798144,114928664576,53800960,889163776,2.759,1.317,95.735,0.188,0,922118,120005670
14953136128,118922141696,53805056,888344576,2.164,1.255,96.236,0.345,0,778850,98007853
11801284608,122074812416,53817344,887508992,1.821,0.816,96.923,0.440,0,593418,76671883
8409669632,125467275264,53817344,886661120,1.256,0.785,97.676,0.283,0,417840,55857401
5117493248,128760311808,53817344,885800960,0.755,0.377,98.648,0.220,0,235404,36073402
1844441088,132034113536,53817344,885051392,0.626,0.282,98.874,0.219,0,61674,11654166
1056821248,132822835200,53817344,883949568,0.094,0.125,99.781,0,0,8532,2297226
1048236032,132831641600,53817344,883728384,0.031,0,99.969,0,0,844,0
1047703552,132832157696,53833728,883728384,0,0,99.750,0.250,0,2154,0
1047703552,132832157696,53833728,883728384,0,0,100,0,0,844,0
1047678976,132832182272,53833728,883728384,0,0.031,99.969,0,0,1236,0
1047420928,132832440320,53833728,883728384,0,0,100,0,0,844,0
1047162880,132832698368,53833728,883728384,0,0,100,0,0,944,0
1046929408,132832931840,53833728,883728384,0,0,100,0,0,1372,0
1046663168,132833189888,53841920,883728384,0,0,99.938,0.062,0,1524,0
1046663168,132833189888,53841920,883728384,0,0,100,0,0,692,0
1046147072,132833705984,53841920,883728384,0,0,100,0,0,678,0
1045889024,132833964032,53841920,883728384,0,0,100,0,0,1424,1508
1045880832,132833972224,53841920,883728384,0,0,100,0,0,2094,0
1045622784,132834230272,53841920,883728384,0,0,100,0,0,4018,0
1045356544,132834488320,53850112,883728384,0,0,99.969,0.031,0,1462,0
1045098496,132834746368,53850112,883728384,0,0,100,0,0,1716,0
1056227328,132823322624,53850112,883736576,0.281,0.094,99.625,0,0,409715,21492
1044910080,132832829440,53850112,883736576,1.216,0.624,98.160,0,0,14734,29410
1044910080,132832829440,53850112,883736576,0,0,100,0,0,4506,0
1044901888,132832837632,53850112,883736576,0,0,100,0,0,4676,0
1044885504,132832837632,53862400,883740672,0,0,99.906,0.094,0,1854,0
1045143552,132832579584,53862400,883740672,0,0.031,99.187,0.781,0,1112,84
1044885504,132832837632,53862400,883740672,0,0,100,0,0,1364,168
1044873216,132832837632,53874688,883740672,0,0,99.969,0.031,0,406,0
1044865024,132832845824,53874688,883740672,0,0,100,0,0,2366,0
1044598784,132833112064,53874688,883740672,0,0,100,0,0,1354,0
