172.16.72.21 : 4.28 4.33 4.32 4.26 4.28 4.27 4.31 4.29 4.31 4.31
172.16.72.22 : 4.24 4.27 4.29 4.32 4.29 4.32 4.29 4.26 4.31 4.25
172.16.72.23 : 4.29 4.32 4.30 4.29 4.30 4.30 4.30 4.28 4.29 4.31
172.16.72.24 : 4.30 4.30 4.26 4.32 4.35 4.32 4.33 4.33 4.27 4.31
172.16.72.25 : 4.32 4.31 4.29 4.28 4.31 4.31 4.33 4.32 4.33 4.27
172.16.72.26 : 4.30 4.32 4.33 4.28 4.31 4.29 4.31 4.30 4.33 4.28
172.16.72.27 : 4.33 4.30 4.33 4.32 4.31 4.31 4.33 4.30 4.28 4.29
172.16.72.28 : 4.32 4.31 4.30 4.29 4.30 4.33 4.32 4.30 4.29 4.32
172.16.72.29 : 4.31 4.30 4.32 4.30 4.34 4.31 4.29 4.26 4.30 4.24
172.16.72.3  : 4.26 4.29 4.26 4.27 4.28 4.27 4.30 4.28 4.28 4.28
172.16.72.30 : 4.28 - 4.29 4.28 4.28 4.33 4.31 4.30 4.29 4.29
172.16.72.31 : 4.27 4.32 4.32 4.29 4.30 4.31 4.31 4.29 4.31 4.27
172.16.72.32 : 4.29 4.26 4.29 4.31 4.27 4.29 4.32 4.29 4.31 4.30
172.16.72.33 : 4.29 4.31 4.33 4.32 4.31 4.29 4.30 4.31 4.30 4.30
172.16.72.34 : 4.26 4.30 4.26 4.31 4.31 4.27 4.31 4.30 4.31 4.28
172.16.72.35 : 4.26 4.31 4.31 4.29 4.29 4.31 4.30 4.29 4.30 4.31
172.16.72.36 : 4.27 4.29 4.29 4.30 4.31 4.29 4.30 4.30 4.28 4.30
172.16.72.37 : 4.29 4.30 4.29 4.31 4.28 4.32 4.27 4.30 4.31 4.27
172.16.72.38 : 0.17 0.13 0.11 0.14 0.15 0.14 0.17 0.15 0.17 0.18
172.16.72.39 : 0.16 0.16 0.15 0.11 0.13 0.14 0.17 0.16 0.17 0.18
172.16.72.4  : 0.13 0.21 0.19 0.19 0.19 0.18 0.20 0.21 0.21 0.20
172.16.72.40 : 0.18 0.17 0.20 0.17 0.19 0.21 0.16 0.20 0.14 0.19
172.16.72.41 : 0.14 0.19 0.18 0.17 0.21 0.19 0.19 0.20 0.19 0.16
172.16.72.43 : 0.14 0.16 0.22 0.17 0.16 0.16 0.21 0.19 0.16 0.19
172.16.72.44 : 0.13 0.20 0.17 0.19 0.22 0.17 0.19 0.19 0.19 0.20
172.16.72.45 : 0.03 0.03 0.03 0.03 0.01 0.03 0.01 0.03 0.03 0.02
172.16.72.46 : 0.20 0.17 0.18 0.19 0.18 0.20 0.19 0.20 0.17 0.19
172.16.72.47 : 0.21 0.21 0.20 0.16 0.18 0.19 0.20 0.21 0.19 0.21
172.16.72.49 : 0.20 0.16 0.18 0.17 0.19 0.19 0.18 0.19 0.18 0.21
172.16.72.5  : 0.15 0.18 0.19 0.21 0.19 0.17 0.21 0.18 0.20 0.19
172.16.72.50 : 0.19 0.19 0.17 0.18 0.17 0.16 0.16 0.15 0.12 0.14
172.16.72.51 : 0.16 0.18 0.18 0.17 0.20 0.13 0.18 0.15 0.19 0.20
172.16.72.6  : 0.20 0.20 0.19 0.14 0.16 0.15 0.19 0.13 0.18 0.15
172.16.72.7  : 0.15 0.18 0.14 0.17 0.15 0.18 0.14 0.14 0.14 0.14
172.16.72.8  : 4.27 4.24 4.32 4.28 4.28 4.23 4.28 4.26 4.27 4.29

      35 targets
      35 alive
       0 unreachable
       0 unknown addresses

       1 timeouts (waiting for response)
     350 ICMP Echos sent
     349 ICMP Echo Replies received
       0 other ICMP received

 0.01 ms (min round trip time)
 2.40 ms (avg round trip time)
 4.35 ms (max round trip time)
       10.113 sec (elapsed real time)

