"Dstat 0.7.3 CSV output"
"Author:","Dag Wieers <dag@wieers.com>",,,,"URL:","http://dag.wieers.com/home-made/dstat/"
"Host:","gros-71.nancy.grid5000.fr",,,,"User:","root"
"Cmdline:","dstat -m -c -n -o dstat.csv",,,,"Date:","23 May 2020 20:22:09 CEST"
"memory usage",,,,"total cpu usage",,,,,"net/total",
"used","free","buff","cach","usr","sys","idl","wai","stl","recv","send"
1336410112,97223585792,58228736,939499520,1.566,0.418,97.993,0.023,0,0,0
1326419968,97233121280,58228736,939950080,0.858,0.388,98.449,0.305,0,392716,29638
1327333376,97232654336,58228736,939503616,0,0,100,0,0,824,132
1329762304,97229770752,58228736,939954176,0.556,0.334,99.110,0,0,386748,16370
1329127424,97230852096,58228736,939507712,0,0,100,0,0,332,0
1332162560,97227788288,58253312,939507712,0.528,0.361,99.110,0,0,386392,16782
1332162560,97227788288,58253312,939507712,0,0,100,0,0,1384,102
1332154368,97227796480,58253312,939507712,0,0,100,0,0,9318,1288
1332154368,97227796480,58253312,939507712,0,0.028,99.972,0,0,6340,0
1332154368,97227796480,58253312,939507712,0,0,100,0,0,10244,0
1331347456,97228578816,58277888,939507712,0.056,0,99.944,0,0,14452,2536
1328316416,97231605760,58277888,939507712,0.668,0.278,99.054,0,0,400604,18298
1339088896,97220780032,58277888,939528192,0.389,0.556,99.055,0,0,559822,27560
1329483776,97230381056,58277888,939528192,0.583,0.389,99.028,0,0,388130,23354
1327239168,97232609280,58277888,939532288,0.556,0.306,99.138,0,0,9412,7762
1338998784,97220399104,58277888,939978752,0.333,0.167,99.500,0,0,389066,11934
1329676288,97230143488,58302464,939532288,0.250,0.250,99.500,0,0,23228,7500
1329668096,97230151680,58302464,939532288,0,0.028,99.972,0,0,3752,220
1329160192,97230585856,58302464,939540480,1.166,0.167,98.667,0,0,226136,10864
1328693248,97231052800,58302464,939540480,0,0.028,99.972,0,0,3054,2668
1328275456,97231339520,58302464,939671552,0.278,0.139,99.583,0,0,344352,15400
1335554048,97223852032,58327040,939855872,0.195,0.223,99.582,0,0,176590,18368
1335554048,97223852032,58327040,939855872,0,0.028,99.972,0,0,10100,10192
1335554048,97223852032,58327040,939855872,0,0,100,0,0,11180,10192
1335545856,97223860224,58327040,939855872,0,0.028,99.972,0,0,9592,9996
1335545856,97223860224,58327040,939855872,0,0.028,99.972,0,0,10418,10192
1335529472,97223868416,58335232,939855872,0.028,0,99.972,0,0,15634,15496
1335529472,97223868416,58335232,939855872,0,0.028,99.972,0,0,11056,10456
1335529472,97223868416,58335232,939855872,0.028,0.028,99.944,0,0,10641,10094
1335529472,97223868416,58335232,939855872,0.028,0,99.972,0,0,10906,10192
1335529472,97223868416,58335232,939855872,0,0.028,99.972,0,0,10566,10094
1336168448,97223413760,58335232,939671552,0.111,0.056,99.805,0.028,0,169694,10940
1328476160,97231089664,58347520,939675648,0.083,0.056,99.861,0,0,9652,6082
1328476160,97231089664,58347520,939675648,0,0,100,0,0,5018,0
1328476160,97231089664,58347520,939675648,0,0,100,0,0,2766,0
1328476160,97231089664,58347520,939675648,0,0,100,0,0,5036,456
1328455680,97231097856,58359808,939675648,0,0.028,99.972,0,0,6068,0
1328455680,97231097856,58368000,939667456,0.028,0,99.972,0,0,8474,872
1328447488,97231097856,58368000,939675648,0,0.028,99.972,0,0,7434,0
1327063040,97232478208,58368000,939675648,0.666,0.389,98.945,0,0,392162,29622
1327054848,97232486400,58368000,939675648,0,0,100,0,0,2182,0
2874617856,95684976640,58372096,939376640,10.008,3.642,86.350,0,0,1323304,58246
6305361920,92252237824,58376192,940969984,24.834,8.749,66.417,0,0,1653652,72618
9891024896,88664379392,58400768,942940160,26.111,9.058,64.831,0,0,1656818,73352
13507735552,85046026240,58417152,944480256,26.295,8.149,65.556,0,0,1655920,74042
17164075008,81387560960,58421248,946548736,26.580,9.881,63.539,0,0,1656070,75200
20772839424,77777416192,58437632,947871744,26.253,9.660,64.087,0,0,1661960,278722
24332554240,74215686144,58449920,949772288,27.467,10.120,62.330,0.083,0,1817256,9843854
28006850560,70539874304,58482688,951193600,31.623,9.958,58.419,0,0,2027748,23583360
30761299968,67784282112,58503168,952287232,25.313,7.169,67.519,0,0,966742,36724906
30862422016,67683098624,58503168,952344576,5.202,0.584,94.214,0,0,921950,53020773
31029915648,67515564032,58503168,952381440,8.447,1.000,90.553,0,0,1230302,71156472
31261233152,67284033536,58503168,952590336,13.786,0.832,85.381,0,0,1440682,79514314
31491334144,67053850624,58511360,952664064,15.385,1.143,83.473,0,0,2071680,96527959
31730204672,66814869504,58511360,952766464,16.462,0.836,82.702,0,0,1940280,106193476
31942643712,66602328064,58523648,952856576,15.038,0.752,84.211,0,0,2134966,118722510
32101748736,66443108352,58523648,952971264,13.831,1.313,84.856,0,0,2211796,120610124
32195088384,66349662208,58523648,953077760,14.771,0.975,84.253,0,0,2075152,115510822
32304140288,66240438272,58531840,953237504,15.502,1.141,83.357,0,0,2038811,115105512
32410112000,66134335488,58531840,953368576,12.745,1.216,86.038,0,0,2143050,119918890
32392155136,66152194048,58531840,953462784,8.810,0.829,90.362,0,0,2159714,119177532
32323891200,66220322816,58531840,953589760,6.797,0.559,92.643,0,0,2196126,121095292
32274423808,66269675520,58531840,953696256,7.276,0.750,91.919,0.056,0,2256622,123821000
32224956416,66318893056,58540032,953937920,7.041,0.559,92.400,0,0,2163664,120366056
32173301760,66370441216,58540032,954044416,7.024,0.833,92.143,0,0,2088472,116441640
32143282176,66400342016,58540032,954163200,6.318,0.531,93.151,0,0,2176170,121067114
32150573056,66392920064,58540032,954294272,6.153,0.529,93.318,0,0,2045806,113430618
32128512000,66414886912,58540032,954388480,6.240,0.616,93.145,0,0,2251784,123848058
32121868288,66421293056,58556416,954609664,5.181,0.504,94.315,0,0,2260506,121904006
32108093440,66434961408,58556416,954712064,4.743,0.642,94.615,0,0,2279640,125675086
32113594368,66429329408,58556416,954839040,5.381,0.804,93.814,0,0,2205274,121362890
32107589632,66435211264,58556416,954957824,4.366,0.584,95.050,0,0,2085736,116074698
32112582656,66430107648,58556416,955068416,5.779,0.639,93.582,0,0,2148196,120089152
32116105216,66426470400,58564608,955174912,5.180,0.997,93.823,0,0,2176636,120266412
32113885184,66428440576,58564608,955420672,5.374,0.776,93.850,0,0,2159828,118534576
32115482624,66426716160,58564608,955547648,4.653,0.557,94.790,0,0,2160900,117380396
32119013376,66423078912,58564608,955654144,4.552,0.611,94.838,0,0,2015920,112811824
32121266176,66420727808,58564608,955748352,5.072,0.831,94.096,0,0,2138058,115882434
32130670592,66411192320,58572800,955871232,4.480,0.612,94.880,0.028,0,2209712,121913232
32133226496,66408386560,58572800,956108800,5.833,0.556,93.611,0,0,2126836,117731482
32133795840,66407706624,58572800,956211200,4.143,0.695,95.161,0,0,2042278,114957884
32134676480,66406690816,58572800,956346368,4.084,0.587,95.329,0,0,2190440,123583366
32136204288,66405052416,58572800,956456960,4.624,0.669,94.708,0,0,2069056,114725888
32144084992,66397069312,58589184,956534784,4.383,0.832,94.785,0,0,2138732,118020256
32144539648,66396467200,58589184,956669952,4.835,0.639,94.526,0,0,2133872,116086400
32146997248,66393915392,58589184,956764160,4.139,0.643,95.218,0,0,2074062,114084602
32148574208,66392064000,58589184,957030400,3.685,0.698,95.617,0,0,2067446,116243986
32161857536,66378682368,58589184,957128704,3.632,0.726,95.641,0,0,1977398,111525318
32168030208,66372395008,58597376,957235200,3.774,0.531,95.667,0.028,0,1953869,111089818
32170541056,66369781760,58597376,957333504,3.760,0.474,95.766,0,0,2222440,121616864
32174759936,66365427712,58597376,957468672,4.430,0.641,94.929,0,0,2111600,117968024
32183705600,66356375552,58597376,957566976,4.079,0.860,95.061,0,0,2182700,120651486
32190357504,66349604864,58597376,957685760,3.536,0.807,95.657,0,0,2117208,115788900
32190398464,66349445120,58613760,957788160,3.301,0.559,96.140,0,0,2209230,120837314
32191176704,66348548096,58613760,957902848,4.040,0.636,95.324,0,0,2064658,116047616
32192688128,66346913792,58613760,958025728,4.961,0.610,94.429,0,0,2152120,119607324
32195735552,66343698432,58613760,958119936,3.548,0.531,95.921,0,0,2126436,117550928
32197484544,66341818368,58613760,958246912,4.001,0.611,95.388,0,0,2239284,123722320
32200380416,66338803712,58621952,958353408,4.384,0.866,94.722,0.028,0,2097774,115040340
32201576448,66337480704,58621952,958476288,4.115,0.751,95.135,0,0,2124676,114989384
32205459456,66333487104,58621952,958574592,3.681,0.753,95.566,0,0,2132234,119228596
32210796544,66327969792,58621952,958685184,5.500,0.639,93.861,0,0,2174462,117316806
32221847552,66316795904,58621952,958808064,6.257,0.667,93.076,0,0,1999156,112853680
32235278336,66303250432,58630144,958906368,7.548,0.553,91.899,0,0,2077630,116398660
32243761152,66294640640,58638336,959021056,5.900,0.668,93.432,0,0,2102914,116492508
32273100800,66265063424,58638336,959254528,6.434,0.721,92.845,0,0,2160818,120020310
32283213824,66254843904,58638336,959356928,5.593,0.584,93.823,0,0,1988742,110929396
32288198656,66249732096,58638336,959471616,5.487,0.474,94.039,0,0,2176250,121237864
32295108608,66242797568,58646528,959578112,6.362,0.670,92.941,0.028,0,2037934,113191910
32298430464,66239373312,58646528,959680512,3.842,0.729,95.429,0,0,2019492,112366660
32304427008,66233249792,58646528,959807488,4.490,0.781,94.730,0,0,2127062,117973442
32356253696,66181308416,58646528,959913984,6.948,0.584,92.468,0,0,2126712,116881004
32382541824,66154901504,58646528,960032768,5.787,0.615,93.598,0,0,2012200,113303686
32428142592,66109059072,58654720,960262144,7.046,0.718,92.235,0,0,2177932,120610746
32530305024,66006790144,58662912,960360448,9.622,0.834,89.544,0,0,2243508,124023696
32624619520,65912352768,58662912,960483328,7.759,0.616,91.625,0,0,2127154,117860246
32732000256,65804845056,58662912,960610304,10.363,0.838,88.799,0,0,2044010,112207022
32784510976,65752244224,58662912,960700416,7.069,0.587,92.344,0,0,2311082,127056464
32875081728,65661550592,58671104,960811008,7.868,0.642,91.490,0,0,2187135,119972828
32891211776,65645297664,58687488,960913408,5.766,0.585,93.621,0.028,0,2155092,119173276
32871571456,65664798720,58687488,961052672,4.359,0.750,94.892,0,0,2112998,119832782
32839761920,65696493568,58687488,961159168,3.310,0.584,96.106,0,0,2019664,110184290
32842334208,65693806592,58687488,961269760,3.039,0.585,96.376,0,0,2252392,123068240
32820670464,65715335168,58695680,961396736,3.591,0.640,95.768,0,0,2237710,123614636
32821010432,65714884608,58703872,961495040,4.001,0.448,95.551,0,0,2134928,119244892
32822632448,65713156096,58703872,961597440,3.820,0.641,95.538,0,0,2112774,118760648
32815767552,65719771136,58703872,961843200,3.613,0.448,95.938,0,0,2019620,113404438
32817164288,65718259712,58703872,961957888,2.789,0.697,96.513,0,0,1997142,111894982
32814616576,65720684544,58712064,962072576,3.401,0.641,95.958,0,0,2069542,114356342
32802496512,65732689920,58712064,962183168,3.253,0.639,96.080,0.028,0,2147340,119475950
32798228480,65736880128,58712064,962260992,3.672,0.584,95.744,0,0,2111870,119207270
32783368192,65751592960,58712064,962404352,3.656,0.558,95.786,0,0,2099118,117311826
32783671296,65751175168,58712064,962514944,3.478,0.501,96.021,0,0,2049082,114355026
32792817664,65741938688,58720256,962596864,2.933,0.698,96.369,0,0,2010760,114102122
32789176320,65745424384,58728448,962736128,3.606,0.693,95.700,0,0,2075844,115948902
32786894848,65747611648,58728448,962830336,3.095,0.474,96.432,0,0,2087456,114835214
32786726912,65747582976,58728448,962949120,3.345,0.558,96.097,0,0,2085196,115329732
32786333696,65747853312,58728448,963067904,2.374,0.531,97.095,0,0,2136470,119930866
32788590592,65745473536,58732544,963170304,3.981,0.585,95.434,0,0,2124664,117404392
32785252352,65748684800,58740736,963284992,4.044,0.502,95.455,0,0,2023924,114248094
32785637376,65748058112,58740736,963522560,4.203,0.612,95.185,0,0,2182026,123382694
32786845696,65746669568,58740736,963702784,3.060,0.612,96.328,0,0,2125398,119008996
32785776640,65747623936,58740736,963817472,3.133,0.559,96.308,0,0,2103568,117941842
32786702336,65746440192,58744832,964071424,4.139,0.528,95.333,0,0,2111860,118088394
32785739776,65747296256,58753024,964169728,4.226,0.473,95.274,0.028,0,1988598,111209364
32786587648,65746354176,58753024,964259840,4.867,0.417,94.716,0,0,2009994,113056026
32787070976,65745731584,58753024,964399104,5.877,0.499,93.624,0,0,2110824,116869100
32786173952,65746538496,58753024,964489216,5.252,0.691,94.057,0,0,2185058,120397020
32788733952,65743831040,58761216,964620288,5.082,0.666,94.252,0,0,2138301,117624296
32788004864,65744322560,58761216,964857856,3.237,0.502,96.261,0,0,2129674,118622428
32789274624,65742921728,58769408,964972544,3.622,0.613,95.765,0,0,2060308,117130606
32789258240,65742827520,58769408,965083136,2.752,0.473,96.775,0,0,2100190,117282468
32791228416,65740746752,58769408,965193728,3.157,0.559,96.284,0,0,2149846,119586154
32790876160,65740947456,58773504,965328896,3.286,0.613,96.101,0,0,2059324,114929694
32790953984,65740754944,58773504,965439488,2.537,0.446,96.989,0.028,0,2072908,114636364
32791445504,65740173312,58773504,965529600,3.851,0.748,95.400,0,0,2194774,121447558
32792502272,65738973184,58773504,965664768,3.225,0.639,96.136,0,0,2066884,115769620
32793051136,65738317824,58773504,965767168,5.323,0.725,93.952,0,0,2201866,121195256
32796426240,65734815744,58777600,965885952,4.152,0.585,95.263,0,0,2210244,122424438
32797212672,65733906432,58785792,965996544,3.350,0.475,96.175,0,0,2166856,117783536
32798838784,65732136960,58785792,966131712,6.391,0.667,92.942,0,0,2224032,123168756
32798932992,65731952640,58785792,966221824,5.605,0.527,93.868,0,0,2138016,118483418
32799375360,65731399680,58785792,966332416,6.090,0.473,93.437,0,0,2074240,115571942
32802246656,65728401408,58793984,966451200,7.457,0.612,91.931,0,0,2126340,121344648
32805003264,65725530112,58793984,966561792,6.897,0.505,92.599,0,0,2136074,118659478
32807010304,65723375616,58802176,966696960,8.112,0.643,91.217,0.028,0,2113198,116902320
32808161280,65722109952,58802176,966807552,4.572,0.720,94.708,0,0,2142016,120917748
32810004480,65720147968,58802176,966914048,2.619,0.557,96.824,0,0,2165242,119827560
32809623552,65720389632,58810368,967041024,4.193,0.528,95.279,0,0,2184598,119479980
32809971712,65719914496,58810368,967168000,4.045,0.499,95.456,0,0,2059326,115077922
32809111552,65720668160,58818560,967266304,2.568,0.502,96.930,0,0,2022744,112543848
32810020864,65719623680,58818560,967397376,2.540,0.670,96.790,0,0,2053668,113621402
32811069440,65718353920,58818560,967618560,3.043,0.586,96.371,0,0,2189284,117889612
32812613632,65716674560,58826752,967741440,3.276,0.555,96.169,0,0,2125680,118555834
32810344448,65718837248,58826752,967847936,3.143,0.640,96.217,0,0,2076762,114427818
32811483136,65717567488,58826752,967974912,3.370,0.613,95.990,0.028,0,1999030,111759952
32812658688,65716264960,58826752,968097792,2.977,0.640,96.383,0,0,2192738,118336514
32810618880,65718202368,58834944,968187904,2.616,0.501,96.883,0,0,2147356,119729388
32812716032,65715953664,58843136,968327168,3.855,0.721,95.424,0,0,2161597,119320860
32812142592,65716158464,58843136,968691712,2.794,0.503,96.703,0,0,2145936,117910236
32813604864,65714561024,58843136,968822784,3.202,0.640,96.129,0.028,0,2371648,131207202
32813883392,65714176000,58843136,968929280,3.389,0.644,95.966,0,0,2161312,119151594
32814399488,65713557504,58843136,969031680,2.492,0.504,97.004,0,0,2184864,120695678
32813105152,65714708480,58859520,969150464,3.612,0.389,95.999,0,0,2092492,116015974
32813764608,65713803264,58859520,969396224,2.604,0.532,96.865,0,0,2187262,120841258
32815501312,65711947776,58859520,969510912,2.533,0.557,96.910,0,0,2138740,119302654
32814526464,65712807936,58859520,969621504,2.758,0.641,96.602,0,0,2051840,110931270
32815398912,65711828992,58859520,969728000,2.922,0.640,96.438,0,0,2141708,118815906
32815226880,65711845376,58875904,969867264,3.315,0.501,96.184,0,0,2137868,119216332
32817037312,65709924352,58875904,969969664,3.013,0.502,96.485,0,0,1996364,110295258
32818802688,65707905024,58875904,970215424,3.087,0.584,96.301,0.028,0,2098442,114467890
32817369088,65709215744,58875904,970334208,2.148,0.642,97.210,0,0,2111480,117171336
32819150848,65707315200,58875904,970448896,2.753,0.667,96.580,0,0,2082758,117078882
32816357376,65709973504,58884096,970567680,2.561,0.640,96.798,0,0,2225398,125347272
32818831360,65707356160,58884096,970702848,2.802,0.693,96.505,0,0,2192712,119542700
32820322304,65705762816,58892288,970792960,3.983,0.613,95.404,0,0,2175018,120881966
32819261440,65706721280,58892288,970895360,2.751,0.750,96.499,0,0,1983572,111522334
32817737728,65708101632,58892288,971034624,2.457,0.475,97.068,0,0,2098122,116663392
32818999296,65706696704,58900480,971161600,3.560,0.417,96.023,0,0,2125166,118785944
32819761152,65705852928,58900480,971243520,2.615,0.556,96.829,0,0,2085570,115017366
32818597888,65706901504,58912768,971345920,2.319,0.503,97.150,0.028,0,1989286,111406040
32819089408,65706262528,58912768,971493376,3.450,0.501,96.049,0,0,1977818,110960266
32821342208,65703907328,58912768,971595776,2.534,0.529,96.937,0,0,2066790,118151284
32820535296,65704603648,58920960,971698176,2.563,0.529,96.907,0,0,2063998,118649984
32821305344,65703677952,58920960,971845632,2.848,0.475,96.677,0,0,2082464,117039882
32821497856,65703387136,58920960,971943936,2.462,0.364,97.174,0,0,1980804,113148516
32823427072,65701322752,58929152,972062720,3.207,0.418,96.375,0,0,2040880,117282128
32825536512,65699090432,58929152,972181504,2.682,0.559,96.760,0,0,2076924,115468536
32825782272,65698705408,58937344,972312576,3.216,0.527,96.257,0,0,2018369,113445190
32825122816,65699270656,58937344,972402688,2.560,0.556,96.884,0,0,2140982,120422528
32824811520,65699446784,58937344,972529664,2.397,0.585,97.018,0,0,2067564,117142014
32825360384,65698783232,58945536,972636160,2.655,0.587,96.730,0.028,0,2099414,115312786
32827060224,65696980992,58945536,972738560,2.671,0.584,96.745,0,0,2165320,118902312
32827867136,65695907840,58953728,972992512,2.261,0.558,97.180,0,0,2083650,115822954
32828669952,65694969856,58953728,973115392,3.068,0.446,96.485,0,0,2048192,114217380
32828350464,65695141888,58953728,973230080,2.875,0.670,96.455,0,0,2231758,123650202
32830562304,65692807168,58961920,973340672,2.427,0.753,96.820,0,0,2039312,116301052
32831774720,65691471872,58961920,973459456,2.398,0.669,96.933,0,0,2198380,123288214
32829059072,65694064640,58970112,973574144,3.114,0.723,96.163,0,0,2013842,111566958
32830554112,65692450816,58970112,973692928,3.670,0.473,95.858,0,0,2062160,115386500
32831963136,65690939392,58970112,973787136,2.807,0.584,96.609,0,0,2153158,123000018
32832258048,65690521600,58978304,973901824,2.420,0.668,96.885,0.028,0,2081682,118571090
32831303680,65691348992,58978304,974024704,3.180,0.691,96.128,0,0,2087778,115489878
32832319488,65690202112,58986496,974147584,2.760,0.474,96.766,0,0,2106418,117538806
32831836160,65690583040,58986496,974249984,2.513,0.475,97.013,0,0,2007984,114401824
32832933888,65689341952,59002880,974368768,2.815,0.474,96.711,0,0,2124212,120262152
32833683456,65688465408,59002880,974495744,3.175,0.724,96.101,0,0,2207646,127396454
32832462848,65689550848,59011072,974622720,3.555,0.500,95.946,0,0,2079964,118029834
32834695168,65687216128,59011072,974721024,3.419,0.639,95.942,0,0,2001524,112739652
32836440064,65685360640,59011072,974831616,2.936,0.748,96.316,0,0,2107960,117257598
32836976640,65684578304,59019264,975065088,2.365,0.612,97.023,0,0,2089514,116879126
32836509696,65684922368,59019264,975187968,2.679,0.446,96.847,0.028,0,2197190,123718402
32837492736,65683816448,59023360,975306752,2.612,0.639,96.749,0,0,2010212,111842412
32837398528,65683787776,59023360,975421440,2.907,0.587,96.506,0,0,2119090,120890506
32837042176,65684033536,59023360,975532032,2.840,0.473,96.686,0,0,2002756,112979878
32838242304,65682579456,59031552,975654912,2.464,0.504,97.032,0,0,2120434,117554250
32840196096,65680490496,59031552,975781888,2.731,0.557,96.711,0,0,2158464,122191574
32839979008,65680601088,59031552,975888384,2.917,0.639,96.444,0,0,2137672,118753166
32840261632,65680179200,59039744,975982592,2.737,0.559,96.705,0,0,2022757,112337606
32839553024,65680670720,59039744,976113664,3.017,0.447,96.536,0,0,2123156,118116840
32839733248,65680347136,59047936,976240640,2.974,0.556,96.470,0,0,1987502,111151790
32839376896,65680609280,59047936,976334848,1.931,0.588,97.453,0.028,0,2019646,114170478
32841658368,65678176256,59047936,976445440,3.082,0.694,96.223,0,0,2057232,119198312
32841039872,65678643200,59056128,976588800,3.062,0.584,96.354,0,0,2135998,119864462
32842452992,65677131776,59064320,976678912,2.458,0.642,96.899,0,0,2186730,123219970
32841842688,65677619200,59064320,976801792,3.194,0.389,96.418,0,0,2143686,118623004
32844025856,65675325440,59064320,976912384,2.557,0.584,96.859,0,0,2113068,121188130
32844042240,65675194368,59064320,977027072,2.319,0.559,97.122,0,0,2053650,117120406
32845172736,65673809920,59072512,977268736,3.232,0.697,96.071,0,0,2081836,116631206
32843923456,65674928128,59080704,977387520,2.561,0.501,96.938,0,0,2142484,117728064
32844226560,65674473472,59080704,977534976,2.561,0.557,96.882,0,0,2135286,115999360
32843718656,65674878976,59080704,977620992,2.960,0.503,96.537,0,0,2080834,113708410
32845250560,65673216000,59080704,977747968,3.204,0.557,96.211,0.028,0,2167540,119375280
32846868480,65671487488,59088896,977846272,2.432,0.503,97.065,0,0,2168786,119467952
32846958592,65671278592,59097088,977948672,2.879,0.503,96.618,0,0,2183364,121473094
32846286848,65671811072,59097088,978083840,2.448,0.668,96.885,0,0,2122876,118654276
32847110144,65670864896,59097088,978206720,2.863,0.695,96.441,0,0,2138662,116670814
32845414400,65672339456,59097088,978427904,1.953,0.558,97.489,0,0,2133800,120354250
32847081472,65670549504,59097088,978546688,2.897,0.529,96.574,0,0,2071392,115248170
32847228928,65670246400,59109376,978685952,2.708,0.503,96.790,0,0,2157884,119965200
32847851520,65669513216,59109376,978796544,3.142,0.500,96.358,0,0,2065742,115623264
32849530880,65667719168,59109376,978911232,2.262,0.586,97.152,0,0,2086468,117038068
32849018880,65668124672,59109376,979013632,2.543,0.419,97.010,0.028,0,2136508,116847766
32849473536,65667547136,59109376,979136512,2.755,0.557,96.688,0,0,2065250,114269584
32850173952,65666703360,59117568,979255296,2.963,0.587,96.451,0,0,2074172,117763262
32851189760,65665564672,59125760,979365888,2.760,0.474,96.766,0,0,2043758,114905222
30564798464,67951857664,59125760,979464192,3.178,0.530,96.292,0,0,2073800,114855060
26713526272,71803437056,59125760,979148800,2.848,0.530,96.622,0,0,1701080,100096240
22793031680,75724951552,59125760,978128896,1.790,0.559,97.651,0,0,1542493,90101474
18879582208,79639285760,59138048,977227776,2.113,0.501,97.386,0,0,1261348,77041836
14946938880,83572961280,59146240,976179200,1.949,0.501,97.550,0,0,1014100,63102782
10892115968,87628845056,59146240,975118336,0.949,0.335,98.716,0,0,736724,49146344
7704965120,90817011712,59158528,974053376,0.781,0.279,98.912,0.028,0,482246,32927368
3754905600,94767943680,59158528,973180928,0.445,0.195,99.361,0,0,239366,18164462
1382072320,97142095872,59158528,971862016,0.111,0.056,99.833,0,0,37068,2498978
1356242944,97168580608,59166720,971198464,0.056,0.028,99.917,0,0,496,0
1356226560,97168596992,59166720,971198464,0,0,100,0,0,4774,0
1356214272,97168596992,59179008,971198464,0,0,100,0,0,7748,220
1356214272,97168596992,59179008,971198464,0,0,100,0,0,4392,0
1356214272,97168596992,59179008,971198464,0,0,100,0,0,4052,0
1356214272,97168596992,59179008,971198464,0,0,100,0,0,1102,0
1356214272,97168596992,59179008,971198464,0,0,100,0,0,1916,0
1356214272,97168596992,59179008,971198464,0,0,100,0,0,658,0
1356206080,97168596992,59187200,971198464,0,0,100,0,0,1356,0
1356206080,97168596992,59187200,971198464,0,0,100,0,0,166,0
1356206080,97168596992,59187200,971198464,0,0,100,0,0,838,0
1356206080,97168596992,59187200,971198464,0,0,100,0,0,1866,0
1356206080,97168596992,59187200,971198464,0,0,100,0,0,9252,1288
1356206080,97168596992,59187200,971198464,0,0,100,0,0,5180,0
1356197888,97168596992,59195392,971198464,0,0,100,0,0,10586,0
1356197888,97168596992,59195392,971198464,0,0,100,0,0,14266,0
1356197888,97168596992,59195392,971198464,0,0,100,0,0,12900,132
1356185600,97168605184,59195392,971202560,0.028,0.056,99.917,0,0,6656,1014
1356185600,97168605184,59195392,971202560,0,0,100,0,0,6996,0
1356185600,97168605184,59195392,971202560,0,0,100,0,0,6594,0
1356177408,97168605184,59203584,971202560,0,0,100,0,0,6078,0
1356177408,97168605184,59203584,971202560,0,0,100,0,0,28760,2584
1356177408,97168605184,59203584,971202560,0,0,100,0,0,17732,1610
1356177408,97168605184,59203584,971202560,0,0,100,0,0,5741,0
1356177408,97168605184,59203584,971202560,0,0,100,0,0,2042,0
1356173312,97168605184,59203584,971206656,0,0,100,0,0,9286,1014
1356169216,97168605184,59207680,971206656,0,0.028,99.972,0,0,9048,1014
1356169216,97168605184,59207680,971206656,0,0,100,0,0,5090,0
1356169216,97168605184,59207680,971206656,0,0.028,99.972,0,0,718,0
1356169216,97168605184,59207680,971206656,0,0,100,0,0,1164,342
1356169216,97168605184,59207680,971206656,0,0,100,0,0,1704,0
1372893184,97151774720,59215872,971194368,0.750,0.111,99.139,0,0,400669,23262
