"Dstat 0.7.3 CSV output"
"Author:","Dag Wieers <dag@wieers.com>",,,,"URL:","http://dag.wieers.com/home-made/dstat/"
"Host:","grisou-48.nancy.grid5000.fr",,,,"User:","root"
"Cmdline:","dstat -m -c -n -o dstat.csv",,,,"Date:","27 May 2020 10:27:27 CEST"
"memory usage",,,,"total cpu usage",,,,,"net/total",
"used","free","buff","cach","usr","sys","idl","wai","stl","recv","send"
1013616640,132956491776,53755904,792928256,1.505,0.331,97.988,0.176,0,0,0
1030365184,132939481088,53755904,793190400,0.842,0.343,98.814,0,0,388180,16738
1018535936,132951756800,53755904,792743936,0.562,0.281,99.157,0,0,384408,24828
1009475584,132960784384,53768192,792743936,0.937,0.500,98.532,0.031,0,5894,15494
1021698048,132948287488,53776384,793006080,0.437,0.062,99.438,0.062,0,383098,10708
1008377856,132961820672,53776384,792748032,0.748,0.655,97.755,0.842,0,6096,15610
1008074752,132962123776,53776384,792748032,0,0.031,99.969,0,0,5270,0
1008058368,132962140160,53776384,792748032,0.031,0,99.969,0,0,2224,1544
1007788032,132962410496,53788672,792735744,0,0,99.969,0.031,0,5756,0
1007775744,132962410496,53788672,792748032,0,0,100,0,0,1430,78
1007251456,132962926592,53796864,792748032,0.031,0,99.938,0.031,0,992,0
1007054848,132963123200,53796864,792748032,0.125,0,99.875,0,0,752,0
1007054848,132963123200,53796864,792748032,0,0.031,99.969,0,0,466,0
1007054848,132963123200,53796864,792748032,0,0,100,0,0,2136,0
1007001600,132963168256,53805056,792748032,0,0,99.938,0.062,0,1056,242
1006985216,132963184640,53805056,792748032,0.031,0,99.969,0,0,932,0
1006985216,132963184640,53805056,792748032,0,0,100,0,0,6990,0
1006727168,132963442688,53805056,792748032,0.031,0,99.969,0,0,2322,496
1007849472,132962217984,53805056,792748032,0.938,0.657,98.405,0,0,398886,33924
1008041984,132962025472,53805056,792748032,0.031,0,99.969,0,0,1206,172
1013596160,132956405760,53817344,792768512,0.312,0.312,98.782,0.593,0,169864,11800
1029640192,132939878400,53817344,793214976,0.781,0.375,98.844,0,0,387962,16538
1010798592,132959166464,53817344,792768512,0.219,0.281,99.500,0,0,2732,13900
1023102976,132946366464,53829632,793214976,0.594,0.156,99.188,0.062,0,384296,11394
1033568256,132935901184,53829632,793214976,0.094,0.250,99.656,0,0,2630,1504
1025515520,132944138240,53841920,793014272,0.594,0.281,99.062,0.062,0,384764,24096
1012027392,132957868032,53841920,792772608,0.563,0.594,98.718,0.125,0,4854,17574
1011994624,132957900800,53841920,792772608,0,0.031,99.969,0,0,934,220
1015869440,132953980928,53854208,792772608,1.656,0.219,98.063,0.062,0,222976,11484
1015111680,132954738688,53854208,792772608,0,0.031,99.969,0,0,3674,2668
1015095296,132954755072,53854208,792772608,0,0,100,0,0,2086,0
1014792192,132955045888,53866496,792772608,0.031,0,99.656,0.312,0,2612,0
1015357440,132954480640,53866496,792772608,0.468,0.187,99.344,0,0,344682,15020
1024045056,132945584128,53878784,792969216,0.219,0.094,99.625,0.062,0,180012,21636
1023762432,132945866752,53878784,792969216,0.062,0,99.938,0,0,12946,13230
1023754240,132945874944,53878784,792969216,0.031,0.031,99.937,0,0,13368,13230
1023741952,132945874944,53891072,792969216,0.063,0,99.906,0.031,0,14084,13328
1023463424,132946141184,53895168,792977408,0.031,0,99.531,0.438,0,21458,13328
1023205376,132946399232,53895168,792977408,0,0.031,99.969,0,0,19704,19040
1023197184,132946407424,53895168,792977408,0.031,0.031,99.938,0,0,14432,12936
1023016960,132946587648,53895168,792977408,0,0,100,0,0,16812,13328
1023016960,132946587648,53895168,792977408,0.031,0.031,99.938,0,0,40790,13034
1022877696,132946710528,53911552,792977408,0.031,0,99.875,0.094,0,15204,13328
1015492608,132954091520,53911552,792981504,0.031,0.031,99.938,0,0,3682,2236
1014370304,132955398144,53911552,792797184,0.437,0.094,99.470,0,0,174048,14268
1014370304,132955398144,53911552,792797184,0.031,0,99.969,0,0,1278,0
1013854208,132955914240,53911552,792797184,0,0,100,0,0,1098,0
1013841920,132955926528,53911552,792797184,0,0,100,0,0,768,1508
1013817344,132955926528,53936128,792797184,0,0,99.719,0.281,0,2136,0
1013817344,132955926528,53936128,792797184,0.031,0,99.969,0,0,2948,0
1013817344,132955926528,53936128,792797184,0,0,100,0,0,2378,0
1013813248,132955926528,53936128,792801280,0.031,0,99.969,0,0,692,0
1013813248,132955926528,53936128,792801280,0,0,100,0,0,466,0
1013813248,132955926528,53944320,792793088,0.031,0.031,99.906,0.031,0,586,0
1013547008,132956184576,53944320,792801280,0.031,0,99.969,0,0,3126,264
1030201344,132939079680,53944320,793247744,0.874,0.406,98.720,0,0,389674,16654
1012469760,132957257728,53944320,792801280,0.344,0.156,99.500,0,0,5328,13948
1012453376,132957274112,53944320,792801280,0.031,0,99.969,0,0,1046,0
1012187136,132957540352,53944320,792801280,0,0.063,99.937,0,0,5942,0
1011851264,132957863936,53956608,792801280,0.031,0,99.687,0.281,0,1214,84
1011462144,132958253056,53968896,792788992,0,0.031,99.938,0.031,0,2648,168
1011191808,132958511104,53968896,792801280,0,0.031,99.969,0,0,2670,84
1011191808,132958511104,53968896,792801280,0,0,100,0,0,7852,0
1011154944,132958547968,53968896,792801280,0,0,100,0,0,812,0
1011126272,132958568448,53977088,792801280,0.031,0,99.938,0.031,0,7040,0
1010868224,132958826496,53977088,792801280,0,0.031,99.969,0,0,1850,2484
1010601984,132959092736,53977088,792801280,0,0,100,0,0,6694,3016
1061126144,132909121536,53977088,792195072,1.187,0.312,98.500,0,0,668300,25388
3586998272,130381762560,53981184,793620480,22.233,10.633,67.134,0,0,1656824,64746
6686584832,127280783360,53981184,794943488,35.385,13.163,51.452,0,0,1333796,55846
9767751680,124198109184,53997568,796336128,35.223,12.639,52.076,0.062,0,1327314,55902
12696969216,121267281920,54059008,797802496,35.069,12.721,51.136,1.073,0,1330104,55962
15718387712,118244208640,54075392,799363072,33.427,13.923,52.430,0.220,0,1325174,55208
18888679424,115072253952,54087680,800915456,37.363,13.780,48.763,0.094,0,1334994,725900
22120816640,111838806016,54091776,802168832,40.344,11.594,47.938,0.125,0,1645906,10258419
25099743232,108858568704,54104064,803360768,41.874,12.920,45.019,0.187,0,1860662,23669948
28050722816,105906024448,54112256,804786176,44.090,12.070,43.652,0.188,0,1779498,36167544
30634156032,103321788416,54116352,805548032,38.605,12.279,48.899,0.217,0,1069194,52120493
31015243776,102940626944,54128640,805597184,14.970,2.067,82.493,0.470,0,1089916,61387409
31189176320,102766628864,54128640,805662720,18.562,1.921,78.928,0.589,0,1305392,74767139
31308206080,102647521280,54136832,805724160,17.046,1.433,80.991,0.530,0,1473078,82288266
31488225280,102467403776,54136832,805822464,20.318,2.400,75.288,1.994,0,1706440,94303292
31703302144,102252244992,54136832,805904384,19.756,2.505,77.332,0.407,0,1913158,107891914
31914237952,102041186304,54136832,806023168,22.027,2.008,75.557,0.408,0,2088344,114823726
32065802240,101889511424,54136832,806125568,19.987,1.848,77.788,0.376,0,2117768,114556498
32225026048,101730185216,54145024,806219776,20.487,2.655,76.046,0.812,0,2236352,124334558
32394788864,101560291328,54145024,806346752,21.887,4.214,72.421,1.478,0,2174246,119370764
32495280128,101459431424,54214656,806608896,18.279,2.136,63.788,15.798,0,2109342,116752980
32504303616,101450178560,54214656,806838272,12.245,1.507,85.808,0.440,0,1998224,112290380
32524746752,101429624832,54214656,806948864,9.652,1.536,88.280,0.533,0,2097030,114959268
32562786304,101391466496,54222848,807055360,10.857,1.851,86.602,0.690,0,2104094,114664102
32566394880,101387763712,54222848,807149568,10.796,2.621,85.741,0.842,0,2212036,123688106
32571301888,101382717440,54231040,807276544,10.156,1.688,87.531,0.625,0,2136460,116254796
32592818176,101361070080,54247424,807378944,10.709,2.435,86.138,0.718,0,2249820,122105970
32566140928,101387640832,54247424,807485440,8.657,1.129,89.806,0.408,0,2166136,121220276
32546070528,101407584256,54247424,807612416,9.739,1.431,88.395,0.436,0,2150168,117061648
32554446848,101399101440,54247424,807718912,9.332,1.873,88.483,0.312,0,2179202,117443574
32556060672,101397381120,54247424,807825408,9.325,0.964,89.214,0.497,0,2151936,116421496
32558051328,101395279872,54255616,807927808,7.384,1.800,88.210,2.606,0,2505060,116693542
32561000448,101392076800,54255616,808181760,7.946,1.091,90.464,0.499,0,2323562,117097782
32571301888,101381681152,54255616,808275968,9.609,1.736,88.252,0.403,0,2334694,118253916
32577019904,101375832064,54255616,808407040,7.784,1.375,90.560,0.281,0,2104278,119624568
32577318912,101375418368,54255616,808521728,7.244,1.071,91.496,0.189,0,2219434,118586194
32588095488,101364535296,54263808,808615936,7.590,1.456,85.967,4.988,0,2123566,111274740
32593072128,101359435776,54263808,808738816,7.789,1.189,90.178,0.845,0,2177804,115873096
32597286912,101355110400,54263808,808849408,8.688,1.625,89.469,0.219,0,2355062,125343676
32602419200,101349863424,54263808,808955904,7.143,1.253,91.291,0.313,0,2235104,118929812
32600944640,101351223296,54263808,809070592,7.332,1.310,91.170,0.187,0,2127902,117022176
32612532224,101339500544,54272000,809193472,7.747,1.425,90.456,0.372,0,2178312,113320190
32619872256,101332062208,54280192,809283584,8.510,1.683,89.401,0.405,0,2354590,123308626
32633614336,101318193152,54280192,809406464,8.065,1.532,90.153,0.250,0,2211884,117884864
32636203008,101315477504,54280192,809525248,6.803,1.317,91.630,0.251,0,2256232,117989818
32639307776,101312282624,54280192,809615360,8.024,1.186,90.322,0.468,0,2230281,120381636
32638775296,101312692224,54288384,809725952,7.251,1.425,90.951,0.372,0,2253543,122203766
32641982464,101309353984,54288384,809857024,7.143,1.716,89.114,2.027,0,2235120,119527378
32646447104,101304786944,54288384,809959424,6.363,0.905,92.576,0.156,0,2007004,113571362
32653598720,101297516544,54288384,810078208,6.402,1.374,91.911,0.312,0,2221132,120548320
32658157568,101292838912,54288384,810196992,7.055,1.417,91.244,0.283,0,2241168,123353928
32660672512,101290229760,54296576,810283008,6.817,1.001,91.807,0.375,0,2146726,121664692
32677130240,101273649152,54296576,810405888,6.197,1.384,90.626,1.793,0,2244434,120818514
32683360256,101267292160,54296576,810528768,5.192,0.823,93.542,0.443,0,2140738,114903536
32686501888,101263925248,54296576,810741760,6.340,1.280,92.130,0.250,0,2195878,115774510
32696057856,101254168576,54296576,810872832,5.716,1.633,92.242,0.408,0,2060646,112808836
32697233408,101252866048,54312960,810979328,6.188,0.995,92.133,0.684,0,2330088,119920754
32702746624,101247254528,54312960,811073536,6.270,1.442,91.191,1.097,0,2113706,114536758
32712286208,101237583872,54321152,811192320,6.611,1.216,90.988,1.185,0,2192854,115169444
32710914048,101238820864,54321152,811323392,6.865,1.348,91.505,0.282,0,2153098,116207524
32716992512,101232652288,54321152,811413504,7.835,1.447,90.403,0.315,0,2369054,118760174
32722915328,101226680320,54329344,811536384,7.380,0.938,91.307,0.375,0,2094078,111162338
32729403392,101220077568,54329344,811638784,7.994,1.411,90.094,0.502,0,2332024,122973976
32744677376,101204692992,54329344,811741184,10.053,1.681,86.897,1.369,0,2209194,119419234
32744906752,101204344832,54329344,811859968,8.762,1.154,89.710,0.374,0,2186758,117843048
32757592064,101191540736,54329344,811978752,8.938,1.682,89.069,0.311,0,2197158,122805176
32768684032,101180346368,54337536,812064768,8.627,1.059,89.879,0.436,0,2233190,116895296
32767967232,101180932096,54337536,812191744,9.823,1.735,88.007,0.434,0,2119478,120198686
32769949696,101178826752,54345728,812306432,8.326,0.998,88.244,2.432,0,2277406,114824746
32771235840,101177442304,54345728,812404736,9.430,1.712,88.515,0.342,0,2083788,111887962
32784912384,101163651072,54345728,812519424,8.041,1.377,89.862,0.720,0,2355406,122671870
32813604864,101134823424,54353920,812642304,8.791,1.746,89.027,0.436,0,2209842,122977102
32847642624,101100679168,54353920,812744704,8.260,1.256,90.170,0.314,0,2131172,114843666
32874078208,101074059264,54353920,812929024,7.525,1.213,90.920,0.342,0,2224214,117201514
32927657984,101020372992,54353920,813027328,10.085,1.723,81.240,6.953,0,2347758,122233958
32962174976,100985753600,54353920,813129728,8.681,1.661,89.314,0.345,0,2049194,109950978
33013026816,100934770688,54362112,813252608,9.539,1.527,88.310,0.623,0,2244220,119524938
33075580928,100872105984,54362112,813359104,10.320,1.412,87.923,0.345,0,2028748,112673946
33133989888,100813582336,54362112,813469696,10.923,1.255,87.382,0.439,0,2129062,113178678
33176571904,100770877440,54370304,813576192,9.011,1.314,87.703,1.971,0,2149710,117036784
33224232960,100723081216,54370304,813707264,8.626,1.192,89.806,0.376,0,2006188,111468736
33221591040,100725600256,54378496,813817856,6.213,1.124,92.101,0.562,0,2263594,122618850
33215393792,100731695104,54378496,813920256,5.644,1.066,92.944,0.345,0,2215120,119681106
33217089536,100729876480,54378496,814039040,5.375,1.250,92.781,0.594,0,2085650,114419370
33203396608,100743471104,54378496,814137344,5.301,0.847,92.785,1.066,0,2103882,112371606
33204842496,100741910528,54378496,814252032,5.524,1.036,93.158,0.282,0,2167196,116886212
33228886016,100717727744,54386688,814374912,8.944,1.925,88.385,0.745,0,2240332,116976570
33229156352,100717355008,54386688,814469120,5.354,1.033,93.300,0.313,0,2065852,108948150
33231675392,100714708992,54386688,814587904,5.941,1.126,92.683,0.250,0,2164466,115548190
33230811136,100715470848,54394880,814682112,5.385,0.908,92.361,1.346,0,2175522,118617700
33231470592,100714692608,54394880,814800896,5.739,1.123,92.826,0.312,0,2295086,121102296
33223409664,100722630656,54403072,814907392,4.270,0.816,94.192,0.722,0,2147468,116753164
33214947328,100730970112,54403072,815030272,7.428,1.186,91.105,0.281,0,2147366,113194224
33213726720,100732084224,54403072,815132672,5.311,1.062,93.315,0.312,0,2150810,116694074
33205600256,100740091904,54403072,815247360,4.808,1.257,93.589,0.346,0,2172464,118837750
33207410688,100738170880,54403072,815357952,4.474,0.977,90.202,4.348,0,2157510,117506246
33208905728,100736540672,54419456,815468544,5.990,1.261,92.182,0.567,0,2175342,120054978
33211338752,100734001152,54419456,815575040,5.340,1.211,93.201,0.248,0,2095118,114995036
33207865344,100737368064,54419456,815677440,5.013,1.065,93.703,0.219,0,2223868,116536386
33208893440,100736221184,54419456,815796224,6.604,1.127,91.831,0.438,0,2216068,116373776
33209864192,100735123456,54419456,815923200,5.309,0.937,93.473,0.281,0,2253928,119834986
33208811520,100735848448,54435840,816234496,6.385,1.252,91.674,0.689,0,1988000,109818832
33217994752,100726554624,54435840,816336896,6.244,1.062,92.351,0.343,0,2047740,111334492
33217298432,100727021568,54435840,816566272,5.971,1.603,92.018,0.409,0,2206072,116856036
33220071424,100724125696,54435840,816689152,6.673,1.222,91.886,0.219,0,2143160,111319210
33220149248,100723937280,54435840,816799744,6.833,1.747,89.485,1.934,0,2221178,119113968
33222090752,100721868800,54444032,816914432,7.143,1.128,90.883,0.846,0,2134140,116035872
33219915776,100723945472,54444032,817008640,5.633,1.183,92.904,0.280,0,2141070,116537414
33221201920,100722524160,54444032,817143808,5.648,1.035,92.940,0.377,0,2180092,119336682
33223720960,100719902720,54444032,817242112,7.882,1.220,90.460,0.438,0,2194106,120675902
33223651328,100719869952,54444032,817344512,7.939,1.214,90.037,0.809,0,2185142,117725002
33229627392,100713758720,54452224,817463296,6.373,1.375,91.909,0.344,0,2356856,117249388
33231323136,100711940096,54452224,817582080,4.457,1.224,93.974,0.345,0,2235814,119427092
33232142336,100710998016,54452224,817696768,6.242,1.255,91.939,0.565,0,2252246,122658274
33232474112,100710543360,54452224,817811456,4.415,1.158,94.083,0.344,0,2118780,120192196
33233526784,100709380096,54460416,817913856,5.552,1.185,92.826,0.437,0,2141828,120709028
33234321408,100708458496,54468608,818032640,7.601,1.838,89.626,0.935,0,2109942,112843622
33234698240,100707975168,54468608,818139136,5.398,1.342,92.761,0.499,0,2040040,112966742
33235636224,100706926592,54468608,818249728,8.325,1.225,90.041,0.408,0,2286838,122651956
33236996096,100705423360,54468608,818388992,5.245,0.974,93.436,0.345,0,2044742,117393006
33238773760,100703547392,54468608,818483200,9.034,1.000,88.872,1.094,0,2158700,119422348
33241780224,100700405760,54476800,818610176,5.325,0.914,92.281,1.481,0,2131586,116581824
33246732288,100695326720,54484992,818724864,7.877,1.219,90.497,0.406,0,2054480,113676264
33248481280,100693450752,54484992,818843648,6.877,0.978,91.703,0.442,0,2284124,123599290
33250902016,100690935808,54484992,818937856,10.469,1.094,88.062,0.375,0,2163836,114739242
33254084608,100687216640,54484992,819462144,9.793,1.220,88.486,0.501,0,2132616,115523650
33255211008,100685971456,54497280,819568640,8.229,0.998,88.529,2.244,0,2117328,112582874
33255219200,100685832192,54497280,819691520,7.393,0.940,91.103,0.564,0,2128608,118125630
33256943616,100683988992,54497280,819802112,6.817,1.001,91.807,0.375,0,2135584,116812540
33260670976,100680126464,54497280,819933184,6.640,0.935,91.958,0.468,0,2181794,116009266
33255755776,100684800000,54497280,820170752,5.620,1.311,92.757,0.312,0,2106350,113147044
33255952384,100684476416,54513664,820281344,6.519,0.936,91.953,0.593,0,2111952,116438942
33255849984,100684451840,54513664,820408320,6.135,1.127,92.457,0.282,0,2078040,115299816
33253683200,100686381056,54513664,820641792,4.975,1.026,93.563,0.435,0,2037382,114638406
33254789120,100685156352,54513664,820756480,5.248,0.937,93.440,0.375,0,2125816,114920936
33258659840,100681158656,54513664,820875264,5.187,1.037,93.524,0.251,0,2195174,119755704
33260318720,100679249920,54521856,821112832,5.178,0.998,91.984,1.840,0,2082194,109955050
33261219840,100678217728,54530048,821235712,5.743,1.186,92.353,0.718,0,2198758,114649544
33260191744,100679127040,54530048,821354496,5.913,1.245,92.406,0.436,0,2126084,114992892
33262813184,100676390912,54530048,821465088,3.184,0.883,95.523,0.410,0,2178908,118653542
33262710784,100676399104,54530048,821559296,5.673,0.935,93.080,0.312,0,2234822,117389320
33262919680,100676038656,54538240,821698560,5.092,1.156,93.346,0.406,0,2230002,118033060
33262112768,100676722688,54538240,821813248,5.212,1.280,92.291,1.217,0,2113542,118007932
33263202304,100675538944,54538240,821907456,6.806,1.342,91.570,0.281,0,2141226,116170554
33264734208,100673880064,54538240,822030336,5.526,1.124,92.882,0.468,0,2150792,116961022
33265811456,100672671744,54538240,822161408,4.854,1.065,93.768,0.313,0,2044300,114230370
33266053120,100672319488,54546432,822259712,4.048,0.784,94.729,0.439,0,2077662,111540830
33265270784,100672966656,54554624,822382592,4.262,1.065,92.824,1.849,0,2117304,115356134
33267392512,100670726144,54554624,822497280,5.002,0.844,93.842,0.313,0,2295256,121775216
33266626560,100671393792,54558720,822591488,4.484,0.909,94.073,0.533,0,2352656,120463430
33265594368,100672270336,54571008,822722560,4.860,1.066,86.359,7.714,0,2094024,119139330
33266483200,100671254528,54571008,822849536,5.575,1.034,92.922,0.470,0,2134912,110171252
33267642368,100669980672,54575104,822956032,4.991,0.905,90.331,3.774,0,2266424,119802650
33268215808,100669300736,54579200,823054336,4.877,1.344,88.309,5.470,0,2229866,118884376
33269522432,100667850752,54579200,823193600,4.895,1.255,93.442,0.408,0,2126744,112204628
33268371456,100668891136,54587392,823291904,4.126,0.969,94.029,0.875,0,2257898,116863880
33269018624,100668133376,54587392,823402496,3.876,0.938,94.748,0.438,0,1987380,112336512
33269202944,100667817984,54591488,823525376,4.224,1.033,94.118,0.626,0,2039126,114694846
33269858304,100666908672,54591488,823779328,5.354,0.814,93.519,0.313,0,2154220,117197804
33269497856,100667162624,54591488,823881728,4.165,1.253,94.300,0.282,0,2206744,122817450
33271427072,100665114624,54599680,823992320,5.230,0.846,93.486,0.438,0,2123330,115766794
33271672832,100664737792,54599680,824123392,5.433,1.263,92.830,0.474,0,2206048,115786814
33270607872,100665696256,54599680,824221696,4.134,1.002,94.457,0.407,0,2234086,124666944
33270706176,100665470976,54607872,824340480,4.665,0.845,92.392,2.098,0,2221278,119830032
33271562240,100664492032,54607872,824455168,3.817,0.814,94.962,0.407,0,2217414,125590564
33272262656,100663660544,54616064,824578048,4.681,1.257,93.434,0.628,0,2211348,117252546
33272807424,100662992896,54616064,824696832,5.697,1.152,92.808,0.342,0,2132474,115872102
33274912768,100660776960,54616064,824807424,4.333,1.193,94.003,0.471,0,2110694,117859828
33273966592,100661600256,54616064,824930304,4.457,0.910,93.001,1.632,0,2096280,114638844
33276239872,100659220480,54616064,825032704,4.705,0.878,94.134,0.282,0,2261170,121039044
33275322368,100660002816,54624256,825159680,4.683,1.249,93.412,0.656,0,2271836,119714326
33272676352,100662550528,54624256,825257984,5.115,0.973,93.630,0.282,0,2282596,115734614
33274531840,100660563968,54624256,825376768,4.223,1.126,94.182,0.469,0,2156398,112839222
33276334080,100658618368,54632448,825511936,4.573,0.846,93.173,1.409,0,2163414,113164888
33278087168,100656762880,54632448,825614336,5.227,0.876,93.114,0.782,0,2083838,112256232
33276403712,100658339840,54640640,825708544,4.351,1.033,94.147,0.469,0,2111576,118464866
33278148608,100656447488,54640640,825847808,5.244,1.055,93.515,0.186,0,2193088,122731064
33277931520,100656537600,54640640,825970688,5.019,1.153,93.641,0.187,0,2139110,115999394
33276874752,100657500160,54640640,826064896,5.741,1.154,92.699,0.406,0,2115560,118453428
33278857216,100655255552,54648832,826310656,4.988,1.029,84.289,9.695,0,2145500,119384348
33278701568,100655271936,54657024,826437632,4.255,0.970,94.274,0.501,0,2052954,116642530
33279414272,100654440448,54657024,826556416,3.604,0.940,95.174,0.282,0,2069750,117334504
33278607360,100655153152,54657024,826650624,3.996,0.818,94.902,0.283,0,2270070,125167334
33279770624,100653850624,54657024,826785792,4.832,1.130,93.568,0.471,0,2205318,118873126
33280950272,100652556288,54665216,826892288,4.565,1.063,92.495,1.876,0,2234460,116746474
33280589824,100652806144,54673408,826994688,5.097,0.907,93.590,0.407,0,2306094,116722220
33281757184,100651499520,54673408,827121664,3.951,0.965,94.648,0.436,0,2227192,119465678
33283653632,100649472000,54673408,827248640,5.023,0.967,93.791,0.218,0,2272008,118396278
33283170304,100649857024,54673408,827346944,3.850,1.095,94.773,0.282,0,2165666,117937658
33280172032,100652720128,54681600,827469824,5.884,1.377,90.110,2.629,0,2147724,113626054
33283268608,100649496576,54689792,827580416,4.753,1.001,93.840,0.407,0,2193520,118251668
33282052096,100650590208,54689792,827699200,4.772,1.216,93.731,0.281,0,2316882,120582612
33281253376,100651274240,54689792,827813888,3.135,0.972,95.517,0.376,0,2064456,115615492
33282215936,100650192896,54689792,827928576,4.428,1.288,94.127,0.157,0,2159898,117861486
33283706880,100648570880,54689792,828051456,4.261,1.128,94.392,0.219,0,2112136,118958680
33286639616,100645519360,54706176,828149760,5.006,1.033,93.367,0.594,0,2123102,117340188
33284993024,100646907904,54706176,828403712,4.415,0.820,94.387,0.378,0,2055982,116808002
33285660672,100646125568,54706176,828510208,5.838,1.374,92.164,0.624,0,2313178,123170226
33286881280,100644794368,54706176,828620800,5.334,1.035,93.348,0.282,0,2066322,114058822
33285894144,100645646336,54706176,828751872,3.739,0.723,95.193,0.346,0,2144954,114684994
33287180288,100644225024,54722560,828866560,3.763,0.815,93.289,2.132,0,2230262,120119568
33289109504,100642189312,54722560,828964864,4.531,1.007,94.021,0.441,0,2143492,111109960
33289912320,100641251328,54722560,829100032,4.625,0.844,94.281,0.250,0,2164084,119191934
33287888896,100643160064,54722560,829210624,5.923,1.536,92.322,0.219,0,2108232,115556166
33290604544,100640337920,54722560,829313024,4.069,0.720,94.961,0.250,0,2164940,118192304
33289195520,100641615872,54730752,829431808,3.990,0.904,89.246,5.860,0,2187006,117885358
33287802880,100642897920,54730752,829542400,3.691,0.813,95.214,0.282,0,2184088,121482044
33287565312,100643020800,54730752,829652992,4.854,0.908,93.799,0.438,0,2018256,109204844
33288515584,100641951744,54730752,829767680,5.873,1.093,92.784,0.250,0,2174244,117782428
33292001280,100638322688,54730752,829906944,5.478,1.120,93.091,0.311,0,2032394,114677860
33290805248,100639395840,54747136,830009344,6.283,1.026,90.607,2.084,0,2028380,110511498
33290858496,100639227904,54747136,830119936,3.715,0.999,94.942,0.343,0,2139158,116565328
33291493376,100638482432,54747136,830226432,4.506,0.907,94.243,0.344,0,2136098,119913304
33289433088,100640415744,54747136,830353408,3.741,0.873,94.950,0.436,0,2092442,114260188
33290334208,100639404032,54747136,830455808,4.642,1.066,93.977,0.314,0,2101832,112279974
33291247616,100638351360,54763520,830574592,5.152,1.428,92.768,0.652,0,2111456,117708618
33289838592,100639502336,54763520,830832640,5.252,0.938,92.248,1.563,0,2082726,114887198
33292091392,100637151232,54763520,830926848,4.087,1.217,94.384,0.312,0,2195110,119953078
33290055680,100639039488,54763520,831066112,4.953,1.184,93.396,0.467,0,1920782,108724354
33292591104,100636397568,54763520,831172608,5.083,1.029,93.608,0.281,0,2105292,117289148
33292222464,100636631040,54771712,831291392,4.065,0.938,94.403,0.594,0,2230328,117653868
33294499840,100634243072,54779904,831393792,4.334,1.372,93.639,0.655,0,2094378,117508010
33293602816,100635017216,54779904,831516672,5.100,0.845,93.554,0.501,0,2265234,119942842
33293389824,100635119616,54779904,831619072,5.036,1.189,93.431,0.344,0,2166118,118957792
33294888960,100633493504,54779904,831746048,4.666,1.284,93.611,0.438,0,2198720,115893534
33296297984,100631957504,54788096,831864832,4.255,1.220,94.149,0.375,0,2118554,115607948
29224112128,104704032768,54788096,831975424,4.469,0.938,93.250,1.344,0,2071956,109268290
25901154304,108027994112,54796288,830963712,4.374,1.156,94.002,0.469,0,1745932,95161750
22003314688,111926628352,54796288,830160896,3.438,0.938,95.438,0.188,0,1493628,81373478
18753372160,115177373696,54796288,829358080,2.695,0.815,96.177,0.313,0,1347334,75517202
15485739008,118445817856,54808576,828530688,2.999,0.656,95.908,0.437,0,1017194,56957700
12195831808,121736560640,54808576,827695104,1.944,0.596,97.210,0.251,0,818406,46716728
8946335744,124987125760,54808576,826626048,1.346,0.501,97.495,0.657,0,556360,33830690
5792509952,128141586432,54816768,825982976,0.939,0.375,98.404,0.282,0,384136,22864268
2633613312,131301580800,54816768,824885248,0.469,0.282,98.999,0.250,0,210494,13447242
1068388352,132867325952,54829056,824352768,0.125,0.094,99.562,0.219,0,38564,1036022
1051234304,132885143552,54829056,823689216,0.094,0.031,99.875,0,0,22086,0
1051226112,132885151744,54829056,823689216,0,0,100,0,0,17400,0
1051226112,132885151744,54829056,823689216,0,0,100,0,0,28884,0
1050968064,132885409792,54829056,823689216,0.031,0,99.969,0,0,28130,432
1050955776,132885409792,54841344,823689216,0,0,99.875,0.125,0,27746,1948
1050697728,132885667840,54841344,823689216,0,0.031,99.969,0,0,21430,1508
1050423296,132885942272,54841344,823689216,0.031,0,99.969,0,0,27862,0
1050423296,132885942272,54841344,823689216,0,0,100,0,0,15236,0
1050423296,132885942272,54841344,823689216,0.031,0,99.969,0,0,45434,0
1050423296,132885942272,54841344,823689216,0,0.031,99.969,0,0,13178,0
1050157056,132886200320,54849536,823689216,0,0,99.969,0.031,0,43858,132
1049640960,132886716416,54849536,823689216,0.062,0,99.938,0,0,5494,0
1049382912,132886974464,54849536,823689216,0,0,100,0,0,43060,0
1049382912,132886974464,54849536,823689216,0.031,0,99.969,0,0,36554,0
1049382912,132886974464,54849536,823689216,0,0,100,0,0,78084,0
1049124864,132887232512,54849536,823689216,0.063,0.031,99.906,0,0,50346,168
1048600576,132887748608,54857728,823689216,0.031,0,99.906,0.063,0,48024,0
1048342528,132888006656,54857728,823689216,0,0,100,0,0,41680,0
1048342528,132888006656,54857728,823689216,0.031,0,99.969,0,0,6574,0
1048342528,132888006656,54857728,823689216,0,0,100,0,0,4102,0
1048342528,132888006656,54857728,823689216,0.031,0,99.969,0,0,6970,0
1048342528,132888006656,54857728,823689216,0,0,99.250,0.750,0,3302,0
1047818240,132888522752,54865920,823689216,0.031,0.031,99.875,0.062,0,5098,0
1047818240,132888522752,54865920,823689216,0,0,100,0,0,15276,0
1047560192,132888780800,54865920,823689216,0,0.031,99.969,0,0,5276,0
1047302144,132889038848,54865920,823689216,0.031,0,99.969,0,0,5038,1508
1047302144,132889038848,54865920,823689216,0,0,99.937,0.063,0,11282,1008
1047302144,132889038848,54865920,823689216,0,0,99.844,0.156,0,22868,0
1046777856,132889554944,54874112,823689216,0,0,99.969,0.031,0,6800,0
1046261760,132890071040,54874112,823689216,0.031,0.031,99.938,0,0,20530,234
1046003712,132890329088,54874112,823689216,0.031,0,99.969,0,0,5300,336
1046003712,132890329088,54874112,823689216,0.031,0,99.969,0,0,42858,396
1046003712,132890329088,54878208,823685120,0.031,0,99.875,0.094,0,25652,234
1045741568,132890587136,54878208,823689216,0,0,100,0,0,73486,390
1045569536,132890750976,54886400,823689216,0.094,0.063,99.781,0.063,0,40796,11468
1045037056,132889313280,54886400,823701504,1.096,0.657,98.247,0,0,469905,40410
