"Dstat 0.7.3 CSV output"
"Author:","Dag Wieers <dag@wieers.com>",,,,"URL:","http://dag.wieers.com/home-made/dstat/"
"Host:","grisou-27.nancy.grid5000.fr",,,,"User:","root"
"Cmdline:","dstat -m -c -n -o dstat.csv",,,,"Date:","27 May 2020 10:04:35 CEST"
"memory usage",,,,"total cpu usage",,,,,"net/total",
"used","free","buff","cach","usr","sys","idl","wai","stl","recv","send"
1174867968,132398202880,50507776,1189879808,0.524,0.038,99.326,0.112,0,0,0
1185304576,132387721216,50507776,1189953536,0.562,0.187,99.250,0,0,392932,18410
1176756224,132396523520,50507776,1189695488,0.500,0.625,98.874,0,0,389760,27148
1180278784,132392976384,50520064,1189699584,0.938,0.625,98.374,0.063,0,6294,17438
1179836416,132393406464,50532352,1189699584,0,0,98.905,1.095,0,7766,0
1184944128,132388110336,50532352,1189888000,0.938,0.750,98.311,0,0,392154,26554
1183080448,132390158336,50532352,1189699584,0,0,100,0,0,5684,0
1182814208,132390424576,50532352,1189699584,0.031,0,99.969,0,0,14200,84
1182814208,132390424576,50532352,1189699584,0,0,100,0,0,13362,0
1182031872,132391206912,50544640,1189687296,0,0.031,99.906,0.062,0,6938,0
1182011392,132391215104,50544640,1189699584,0.031,0.031,99.938,0,0,4594,0
1182003200,132391223296,50556928,1189687296,0,0,99.969,0.031,0,3534,662
1180426240,132392787968,50556928,1189699584,0,0,100,0,0,2548,1008
1179906048,132393308160,50556928,1189699584,0,0,100,0,0,1126,0
1179389952,132393824256,50556928,1189699584,0,0.031,99.969,0,0,586,0
1178865664,132394340352,50565120,1189699584,0,0,99.938,0.062,0,1158,0
1178865664,132394340352,50565120,1189699584,0,0,100,0,0,1098,84
1178865664,132394340352,50565120,1189699584,0,0,100,0,0,4822,264
1194852352,132377878528,50581504,1190154240,0.782,0.438,98.779,0,0,389580,17350
1176326144,132396847104,50581504,1189711872,0.281,0.219,99.500,0,0,7968,13644
1178603520,132394668032,50581504,1189613568,0.375,0.250,99.375,0,0,187780,12068
1180905472,132392235008,50593792,1189732352,0.125,0.094,99.687,0.094,0,406710,14368
1178705920,132394401792,50610176,1189744640,0.875,0.750,98.344,0.031,0,29272,16410
1179467776,132393529344,50622464,1189732352,1.216,0.749,98.004,0.031,0,405592,26774
1178140672,132394844160,50622464,1189744640,0,0,99.719,0.281,0,24136,0
1189691392,132382789632,50638848,1190199296,0.782,0.469,98.529,0.219,0,389158,13042
1177432064,132395483136,50651136,1189752832,0.281,0.187,99.469,0.062,0,17566,13628
1176383488,132396531712,50651136,1189752832,0,0,100,0,0,47056,0
1178947584,132393742336,50663424,1189965824,1.811,0.187,97.971,0.031,0,224282,11004
1177419776,132395397120,50663424,1189756928,0,0,100,0,0,3916,2800
1177128960,132395687936,50663424,1189756928,0,0,99.687,0.313,0,1398,0
1176870912,132395945984,50663424,1189756928,0.031,0,99.969,0,0,752,0
1177088000,132395573248,50675712,1189900288,0.407,0.125,99.406,0.063,0,342628,14832
1184952320,132387487744,50692096,1190088704,0.219,0.094,99.656,0.031,0,179318,20508
1184403456,132388036608,50704384,1190076416,0.031,0,99.937,0.031,0,12902,13328
1184133120,132388294656,50704384,1190088704,0,0.031,99.969,0,0,12642,13034
1184112640,132388302848,50708480,1190096896,0,0.031,99.500,0.469,0,12522,12936
1183854592,132388560896,50708480,1190096896,0.031,0.031,99.938,0,0,12764,13230
1183842304,132388560896,50720768,1190096896,0,0,99.969,0.031,0,18868,18578
1183576064,132388827136,50720768,1190096896,0,0.062,99.938,0,0,13218,13006
1183576064,132388827136,50720768,1190096896,0.031,0,99.969,0,0,13352,13132
1183576064,132388827136,50720768,1190096896,0,0.031,99.969,0,0,12054,13734
1182777344,132389617664,50728960,1190096896,0,0.031,99.812,0.156,0,12294,13304
1174691840,132397883392,50728960,1189912576,0.031,0.062,99.906,0,0,2256,3338
1174622208,132397826048,50741248,1189994496,0.219,0.094,99.656,0.031,0,173236,14300
1174319104,132398211072,50741248,1189912576,0,0,100,0,0,64176,0
1173794816,132398735360,50741248,1189912576,0.031,0.031,99.938,0,0,8246,1008
1173393408,132399132672,50741248,1189916672,0,0,99.750,0.250,0,794,1176
1173209088,132399316992,50753536,1189904384,0,0,99.969,0.031,0,346,0
1173184512,132399316992,50765824,1189916672,0,0,99.969,0.031,0,528,0
1172656128,132399841280,50765824,1189920768,0.343,0,99.657,0,0,992,0
1172365312,132400132096,50765824,1189920768,0,0,100,0,0,346,0
1172365312,132400132096,50765824,1189920768,0,0,99.906,0.094,0,812,0
1180045312,132392001536,50765824,1190367232,0.939,0.657,98.404,0,0,388250,16802
1170313216,132402171904,50765824,1189920768,0.094,0,99.906,0,0,3140,14140
1170300928,132402171904,50778112,1189920768,0,0.031,99.906,0.063,0,1038,0
1185849344,132386619392,50778112,1189924864,0.344,0.125,99.531,0,0,329722,12952
1321996288,132250214400,50778112,1190236160,2.720,0.281,96.999,0,0,3804,828
1323704320,132248616960,50819072,1190100992,0,0,99.500,0.500,0,1822,252
1323270144,132249038848,50819072,1190113280,0,0,100,0,0,2734,0
1323012096,132249296896,50819072,1190113280,0,0,100,0,0,3572,0
1322754048,132249554944,50827264,1190105088,0.031,0.031,99.906,0.031,0,3358,0
1322520576,132249780224,50827264,1190113280,1.844,0,98.156,0,0,4184,708
1322233856,132250066944,50827264,1190113280,3.126,0,96.686,0.188,0,4182,2460
1321811968,132250484736,50827264,1190117376,3.125,0,96.875,0,0,2892,1680
1321811968,132250484736,50827264,1190117376,3.156,0,96.844,0,0,3850,1606
1321725952,132250562560,50827264,1190117376,3.156,0,96.844,0,0,2854,1696
1333751808,132238528512,50843648,1190109184,3.751,0,96.155,0.094,0,298068,10009
1340452864,132231811072,50843648,1190125568,3.751,0.063,96.124,0.063,0,1158002,1152715
1359417344,132212846592,50843648,1190125568,4.624,0.125,95.251,0,0,2654220,2257916
1358786560,132213436416,50843648,1190125568,3.911,0,96.089,0,0,3421672,2540870
1392619520,132179599360,50843648,1190129664,5.623,0.125,94.252,0,0,4258912,1882058
1401974784,132170235904,50851840,1190129664,4.346,0.094,95.497,0.063,0,5181992,2935666
1414762496,132157440000,50860032,1190129664,5.095,0.094,94.717,0.094,0,5290172,3414490
1432031232,132140171264,50860032,1190129664,4.917,0.063,95.020,0,0,5046618,2960052
1432051712,132140150784,50860032,1190129664,3.784,0.094,96.123,0,0,5322614,3107270
1450909696,132121292800,50860032,1190129664,3.777,0.062,96.161,0,0,5417208,1741746
1455673344,132116516864,50868224,1190133760,3.684,0.312,95.973,0.031,0,5582434,2293520
1455656960,132116525056,50876416,1190133760,3.505,0.125,95.962,0.407,0,4779054,3197896
1456492544,132115689472,50876416,1190133760,3.260,0.031,96.708,0,0,4375224,3802092
1462693888,132109488128,50876416,1190133760,3.472,0.094,96.434,0,0,4163646,2837570
1500258304,132071923712,50876416,1190133760,4.413,0.156,95.430,0,0,4213892,2397082
1518125056,132054048768,50884608,1190133760,3.439,0.063,96.436,0.063,0,3773522,3259916
1543221248,132028944384,50892800,1190133760,3.535,0.063,95.996,0.407,0,3896574,3540182
1563795456,132008366080,50892800,1190137856,3.565,0.094,96.341,0,0,3534940,2504890
1590898688,131981262848,50892800,1190137856,3.320,0.063,96.618,0,0,3541760,3104856
1611902976,131960258560,50892800,1190137856,3.284,0.094,96.622,0,0,3391500,2743342
1638998016,131933155328,50900992,1190137856,3.503,0.063,96.340,0.094,0,3724704,3737790
1664155648,131907989504,50909184,1190137856,3.412,0.063,96.369,0.156,0,3555472,2913144
1689292800,131882852352,50909184,1190137856,3.441,0.063,96.497,0,0,3567746,2233786
1714167808,131857977344,50909184,1190137856,3.349,0.063,96.588,0,0,3655854,3159030
1739300864,131832844288,50909184,1190137856,3.479,0,96.521,0,0,3846416,3018370
1764519936,131807612928,50917376,1190141952,3.318,0.094,96.526,0.063,0,3792444,2180584
1792266240,131779866624,50917376,1190141952,3.378,0.063,96.559,0,0,3546960,2352538
1815326720,131756797952,50925568,1190141952,3.256,0.094,96.243,0.407,0,3569452,3268996
1850552320,131721572352,50925568,1190141952,4.193,0.063,95.745,0,0,3567936,3412192
1876369408,131695755264,50925568,1190141952,3.721,0.125,96.154,0,0,3769194,3873770
1888071680,131684044800,50933760,1190141952,3.654,0.125,96.127,0.094,0,3869736,3159046
1934655488,131637460992,50933760,1190141952,6.346,0.125,93.529,0,0,3726890,3058132
1959907328,131612196864,50941952,1190146048,3.348,0.125,96.026,0.501,0,3825344,3667988
1983717376,131588386816,50941952,1190146048,3.343,0.187,96.470,0,0,3560606,3076564
2006196224,131565903872,50941952,1190150144,3.751,0.344,95.905,0,0,3463240,3354378
1993351168,131578740736,50950144,1190150144,3.288,0.031,96.555,0.125,0,3686530,3482358
2009088000,131563003904,50950144,1190150144,6.627,0.156,93.217,0,0,3751218,3481878
2008182784,131563900928,50958336,1190150144,3.470,0.031,96.280,0.219,0,3826300,2746146
2010021888,131562061824,50958336,1190150144,3.408,0.063,96.529,0,0,3936598,2785184
2009440256,131562643456,50958336,1190150144,3.471,0.031,96.498,0,0,3598870,4202994
2009808896,131562258432,50966528,1190154240,3.285,0.094,96.558,0.063,0,3493788,2950902
2009194496,131562872832,50966528,1190154240,4.251,0.063,95.686,0,0,3477868,3161790
2009436160,131562622976,50974720,1190154240,3.409,0.063,96.246,0.282,0,3618708,3042220
2009337856,131562721280,50974720,1190154240,3.316,0.031,96.653,0,0,3467500,3978860
2009251840,131562807296,50974720,1190154240,3.498,0.094,96.408,0,0,3397086,2252764
2009079808,131562971136,50982912,1190154240,3.346,0.094,96.498,0.063,0,3274876,3729370
2008821760,131563229184,50982912,1190154240,3.498,0.062,96.440,0,0,3227334,3313742
2008547328,131563491328,50991104,1190158336,3.287,0.031,96.337,0.344,0,3168008,3601892
2010202112,131561795584,50991104,1190158336,3.319,0.063,96.619,0,0,3165806,2283926
2010857472,131561107456,50991104,1190158336,3.565,0,96.435,0,0,3630440,3174782
2010177536,131561771008,50999296,1190158336,3.259,0.031,96.647,0.063,0,3832968,3816082
2010267648,131561680896,50999296,1190158336,3.407,0.063,96.530,0,0,3877056,4224516
2009993216,131561955328,51007488,1190150144,3.348,0.094,95.995,0.563,0,4048104,2973172
2008993792,131562946560,51007488,1190158336,3.409,0.063,96.528,0,0,3908598,3467984
2009645056,131562295296,51007488,1190158336,3.407,0.094,96.499,0,0,3970722,2876982
2009178112,131562749952,51015680,1190162432,3.594,0.094,96.250,0.062,0,4166958,1726370
2008854528,131563073536,51015680,1190162432,3.377,0.094,96.529,0,0,4044338,2633388
2009141248,131562778624,51023872,1190162432,3.625,0.062,96.219,0.094,0,4121064,2797848
2015240192,131556679680,51023872,1190162432,3.698,0.251,96.051,0,0,3834928,1428884
2014973952,131557044224,51023872,1190154240,3.471,0.094,96.435,0,0,3653506,3121518
2014400512,131557609472,51032064,1190154240,3.477,0.031,96.366,0.125,0,3562352,3523052
2014343168,131557666816,51032064,1190154240,3.407,0.094,96.499,0,0,3612816,3489684
2014003200,131557994496,51040256,1190158336,3.561,0.062,95.814,0.562,0,3765036,4767074
2013536256,131558461440,51040256,1190158336,3.165,0.063,96.772,0,0,3361117,3694620
2012184576,131559813120,51040256,1190158336,3.317,0.063,96.621,0,0,3466473,2929556
2011922432,131560062976,51048448,1190162432,3.438,0.125,96.406,0.031,0,3556932,3039046
2012020736,131559964672,51048448,1190162432,3.317,0.094,96.589,0,0,3633132,3439224
2011672576,131560312832,51056640,1190154240,3.255,0.094,96.526,0.125,0,3531886,2588140
2011107328,131560869888,51056640,1190162432,3.286,0.063,96.369,0.282,0,3710016,2052800
2010890240,131561086976,51056640,1190162432,3.285,0.063,96.652,0,0,3683596,2108456
2010546176,131561418752,51064832,1190166528,3.257,0.063,96.618,0.063,0,3754936,3465740
2011529216,131560435712,51064832,1190166528,3.376,0.125,96.499,0,0,3687304,3821794
2011578368,131560386560,51064832,1190166528,3.225,0.094,96.681,0,0,3415034,3155178
2011172864,131560783872,51073024,1190166528,3.224,0.094,96.213,0.469,0,3363564,3254364
2010402816,131561553920,51073024,1190166528,3.319,0.031,96.650,0,0,3170488,3563728
2010169344,131561779200,51081216,1190166528,3.505,0.063,96.369,0.063,0,3357418,3521504
2009911296,131562037248,51081216,1190166528,3.317,0.031,96.652,0,0,3300814,2644474
2010189824,131561758720,51081216,1190166528,3.721,0.094,96.185,0,0,3245866,3927866
2009735168,131562201088,51089408,1190170624,3.226,0.063,96.242,0.470,0,3021408,2866910
2009993216,131561943040,51089408,1190170624,3.379,0.031,96.589,0,0,3243220,3578994
2009698304,131562229760,51097600,1190170624,3.287,0.063,96.587,0.063,0,3311190,2791560
2009640960,131562287104,51097600,1190170624,3.256,0.063,96.681,0,0,3686428,2340830
2009661440,131562266624,51097600,1190170624,3.439,0.031,96.530,0,0,3699394,1903718
2013626368,131558297600,51105792,1190166528,4.030,0.094,95.439,0.437,0,4046434,2900650
2013581312,131558334464,51105792,1190174720,3.317,0.125,96.558,0,0,4136272,4161292
2013118464,131558785024,51113984,1190178816,3.319,0.031,96.587,0.063,0,3847746,2978932
2012954624,131558948864,51113984,1190178816,3.288,0,96.712,0,0,3573606,2901672
2012921856,131558981632,51113984,1190178816,3.283,0.094,96.623,0,0,3308270,1694598
2012753920,131559141376,51122176,1190178816,3.347,0.063,96.434,0.156,0,3386626,3187280
2013249536,131558645760,51122176,1190178816,3.348,0.031,96.621,0,0,3433694,2178420
2013511680,131558375424,51130368,1190178816,3.752,0.063,96.123,0.063,0,3583770,2457528
2012942336,131558944768,51130368,1190178816,3.438,0.031,96.531,0,0,3503402,3646542
2014044160,131557842944,51130368,1190178816,3.595,0.063,96.343,0,0,3467286,3336174
2014187520,131557691392,51138560,1190178816,3.564,0.063,96.218,0.156,0,3366010,2378510
2014539776,131557335040,51138560,1190182912,3.503,0.063,96.434,0,0,3369072,3288462
2014875648,131556990976,51146752,1190182912,4.061,0.094,95.783,0.062,0,3289374,3231858
2022580224,131549286400,51146752,1190182912,5.462,0.094,94.444,0,0,3203612,3113964
2024271872,131547594752,51146752,1190182912,6.320,0.031,93.648,0,0,3056326,2247394
2018594816,131553263616,51154944,1190182912,4.816,0.094,94.747,0.344,0,3410312,3402462
2018955264,131552903168,51154944,1190182912,3.345,0.063,96.593,0,0,3424133,2994696
2014146560,131557703680,51163136,1190182912,3.436,0.062,96.407,0.094,0,3673970,3229482
2015440896,131556409344,51163136,1190182912,3.226,0.031,96.743,0,0,3608084,3186222
2015391744,131556458496,51163136,1190182912,3.284,0.063,96.653,0,0,3553838,3028612
2015272960,131556573184,51171328,1190178816,3.376,0.094,96.186,0.344,0,3463274,4095106
2014482432,131557355520,51171328,1190187008,3.318,0.031,96.651,0,0,3206164,4161738
2013904896,131557924864,51179520,1190187008,3.287,0.063,96.619,0.031,0,3031864,4002774
2014199808,131557629952,51179520,1190187008,3.254,0.031,96.715,0,0,3020770,1760930
2014609408,131557220352,51179520,1190187008,3.316,0.063,96.622,0,0,3215056,3091126
2015883264,131555942400,51183616,1190187008,3.254,0.031,96.277,0.438,0,3408862,2086222
2015571968,131556249600,51187712,1190187008,3.315,0.063,96.748,-0.125,0,3531454,3079156
2021711872,131550101504,51195904,1190187008,3.380,0.313,96.244,0.063,0,3393806,3188470
2022141952,131549671424,51195904,1190187008,4.057,0.031,95.911,0,0,3489030,3250620
2022277120,131549532160,51195904,1190191104,3.562,0.094,96.344,0,0,3480596,2574632
2022645760,131549163520,51195904,1190191104,3.599,0.125,96.275,0,0,3650930,3628616
2022178816,131549622272,51204096,1190191104,3.441,0.031,96.184,0.344,0,3752002,3445884
2022567936,131549224960,51212288,1190191104,3.317,0.031,96.621,0.031,0,3604976,2995426
2022371328,131549421568,51212288,1190191104,3.630,0.063,96.308,0,0,3582969,3577524
2023366656,131548426240,51212288,1190191104,3.348,0.031,96.621,0,0,3888239,2462340
2024730624,131547062272,51212288,1190191104,3.376,0.063,96.561,0,0,3840254,2316798
2024382464,131547410432,51220480,1190182912,3.256,0.063,96.493,0.188,0,3980842,3007930
2024722432,131547049984,51228672,1190195200,3.434,0.156,96.347,0.062,0,3851276,4054932
2025193472,131546578944,51228672,1190195200,3.312,0.125,96.562,0,0,3647886,2111586
2025963520,131545808896,51228672,1190195200,3.193,0.063,96.744,0,0,3979900,2911430
2026471424,131545300992,51228672,1190195200,3.223,0.094,96.683,0,0,3929562,3259232
2027118592,131544653824,51236864,1190187008,3.284,0.094,96.372,0.250,0,3884192,2961302
2027237376,131544518656,51245056,1190195200,3.254,0.031,96.621,0.094,0,3860286,2772710
2027782144,131543973888,51245056,1190195200,3.316,0.063,96.622,0,0,3640086,3260108
2027241472,131544514560,51245056,1190195200,3.314,0.125,96.561,0,0,3600238,3503846
2026999808,131544752128,51245056,1190199296,3.317,0.063,96.621,0,0,3418144,3802656
2027737088,131544014848,51253248,1190191104,3.376,0.063,96.218,0.344,0,3460174,2549572
2028093440,131543638016,51261440,1190199296,3.596,0.094,96.248,0.063,0,3520480,2371108
2028646400,131543080960,51261440,1190203392,3.377,0.031,96.592,0,0,3633518,2995894
2028679168,131543048192,51261440,1190203392,3.348,0.094,96.558,0,0,3591406,4246444
2029191168,131542536192,51261440,1190203392,3.284,0.094,96.622,0,0,3695112,3018382
2028777472,131542949888,51269632,1190195200,3.316,0.094,96.184,0.407,0,3381236,2618778
2029170688,131542540288,51277824,1190203392,3.286,0.063,96.588,0.063,0,3183726,3100570
2028969984,131542736896,51277824,1190207488,3.254,0.063,96.683,0,0,3116068,3035480
2028777472,131542929408,51277824,1190207488,3.562,0.094,96.312,0.031,0,3428682,4362242
2029563904,131542142976,51277824,1190207488,3.256,0.031,96.713,0,0,3389342,2772754
2029400064,131542306816,51286016,1190199296,3.286,0.063,96.244,0.407,0,3697572,2720884
2029297664,131542392832,51294208,1190207488,3.284,0.094,96.559,0.063,0,3859236,3189240
2030120960,131541569536,51294208,1190207488,3.225,0.063,96.713,0,0,3794172,2379872
2030465024,131541225472,51294208,1190207488,3.408,0.063,96.529,0,0,3715552,2977340
2030993408,131540697088,51294208,1190207488,3.317,0.063,96.621,0,0,3632810,2976512
2030882816,131540795392,51302400,1190211584,3.347,0.063,96.215,0.375,0,3292520,3086674
2031013888,131540652032,51310592,1190215680,3.561,0.062,96.345,0.031,0,3280456,3470606
2030878720,131540787200,51310592,1190215680,3.345,0.063,96.593,0,0,3044728,2914870
2031513600,131540152320,51310592,1190215680,3.251,0.125,96.624,0,0,3271004,1607778
2031464448,131540201472,51310592,1190215680,3.440,0,96.560,0,0,3386674,3899108
2031603712,131540062208,51318784,1190207488,3.407,0.094,96.186,0.313,0,3732208,3869936
2031693824,131539955712,51326976,1190215680,3.347,0.063,96.497,0.094,0,3607392,4237462
2031448064,131540201472,51326976,1190215680,3.438,0.094,96.469,0,0,3543274,4171476
2031009792,131540635648,51326976,1190219776,3.498,0.062,96.440,0,0,3491854,2669462
2031611904,131540033536,51326976,1190219776,3.312,0.125,96.562,0,0,3613266,2092876
2031788032,131539857408,51326976,1190219776,3.500,0.062,96.438,0,0,3709560,3864526
2031685632,131539943424,51343360,1190219776,3.503,0.031,95.934,0.532,0,3797400,3051988
2032721920,131538907136,51343360,1190219776,3.351,0.094,96.555,0,0,4020452,2773654
2032005120,131539623936,51343360,1190219776,3.445,0,96.555,0,0,4099646,2749912
2032689152,131538939904,51343360,1190219776,3.349,0.063,96.588,0,0,3710796,2241852
2033065984,131538563072,51343360,1190219776,3.317,0.063,96.621,0,0,3433070,2267818
2033565696,131538055168,51359744,1190211584,3.378,0.063,95.996,0.563,0,3352184,3525872
2032975872,131538628608,51359744,1190227968,3.378,0.063,96.559,0,0,3621896,3518968
2034143232,131537461248,51359744,1190227968,3.598,0.063,96.339,0,0,3735282,2852056
2034286592,131537317888,51359744,1190227968,3.347,0.063,96.591,0,0,3770928,3396920
2034016256,131537555456,51359744,1190227968,3.503,0.063,96.434,0,0,3644326,3746284
2034446336,131537108992,51376128,1190227968,3.256,0.063,96.306,0.376,0,3459482,2574456
2034352128,131537203200,51376128,1190227968,3.227,0.063,96.711,0,0,3702086,3343088
2034851840,131536703488,51376128,1190227968,3.348,0.031,96.621,0,0,3534982,2382632
2034741248,131536814080,51376128,1190227968,3.620,0.156,96.223,0,0,3630986,5042820
2034405376,131537145856,51376128,1190232064,3.380,0.063,96.557,0,0,3695412,2892336
2034659328,131536875520,51392512,1190232064,3.565,0.063,95.904,0.469,0,3916344,4968832
2034360320,131537174528,51392512,1190232064,3.502,0.063,96.435,0,0,3972372,4770552
2033889280,131537645568,51392512,1190232064,3.375,0.125,96.500,0,0,4002498,3030154
2034188288,131537346560,51392512,1190232064,3.377,0.125,96.498,0,0,3994746,3321062
2033815552,131537719296,51392512,1190232064,3.439,0.063,96.499,0,0,3796786,3448932
2034221056,131537301504,51408896,1190227968,3.378,0.063,95.965,0.594,0,3534978,3101646
2035068928,131536445440,51408896,1190236160,3.318,0.031,96.651,0,0,3625166,2512454
2035367936,131536146432,51408896,1190236160,3.436,0.062,96.501,0,0,3426088,2707618
2036977664,131534536704,51408896,1190236160,3.318,0.063,96.620,0,0,3506404,3291682
2036846592,131534667776,51408896,1190236160,3.375,0.094,96.531,0,0,3589792,2591950
2037133312,131534368768,51425280,1190232064,3.347,0.063,96.246,0.344,0,3552264,2856252
2036797440,131534696448,51425280,1190240256,3.317,0.063,96.621,0,0,3571308,3338438
2036994048,131534499840,51425280,1190240256,3.377,0.031,96.592,0,0,3398258,2664380
2037866496,131533627392,51425280,1190240256,3.283,0.125,96.592,0,0,3414200,2634634
2037858304,131533631488,51425280,1190244352,3.316,0.031,96.653,0,0,3430938,2225980
2039222272,131532247040,51441664,1190244352,3.501,0.063,95.967,0.469,0,3657448,3223116
2039140352,131532328960,51441664,1190244352,3.375,0.125,96.500,0,0,3389274,3570954
2039590912,131531878400,51441664,1190244352,3.349,0,96.651,0,0,3318598,3480424
2039226368,131532242944,51441664,1190244352,3.346,0.063,96.592,0,0,3305022,3333460
2039128064,131532439552,51441664,1190146048,3.438,0.031,96.531,0,0,3341226,3028680
2039570432,131531866112,51458048,1190236160,3.255,0.094,96.025,0.626,0,3632412,3189910
2039443456,131531984896,51458048,1190244352,3.564,0.063,96.374,0,0,3621814,2799212
2040934400,131530489856,51458048,1190248448,3.346,0.063,96.592,0,0,4125994,2813064
2040848384,131530575872,51458048,1190248448,3.375,0.125,96.500,0,0,3890304,2987154
2042384384,131529039872,51458048,1190248448,3.316,0.031,96.653,0,0,3857802,2104838
2042527744,131528888320,51474432,1190240256,3.285,0.063,96.464,0.188,0,3851718,2601030
2043949056,131527458816,51474432,1190248448,3.407,0.063,96.280,0.250,0,3726880,3128156
2043928576,131527479296,51474432,1190248448,3.256,0.063,96.681,0,0,3800710,3297484
2044698624,131526709248,51474432,1190248448,3.346,0.094,96.560,0,0,3592044,2959606
2045288448,131526119424,51474432,1190248448,3.406,0.094,96.500,0,0,3623920,2985496
2045489152,131525910528,51482624,1190248448,3.321,0.063,96.585,0.031,0,3721310,3714594
2045800448,131525582848,51490816,1190252544,3.559,0.094,95.785,0.562,0,3724744,4614926
2046062592,131525320704,51490816,1190252544,3.346,0.094,96.560,0,0,3972256,3534326
2046103552,131525279744,51490816,1190252544,3.435,0.094,96.471,0,0,4060630,2771694
2046996480,131524386816,51490816,1190252544,3.316,0.063,96.622,0,0,3942490,2333142
2047877120,131523497984,51499008,1190252544,3.347,0.031,96.528,0.094,0,3846118,3380056
2047946752,131523420160,51507200,1190252544,3.255,0.063,96.369,0.313,0,3612416,2762826
2048221184,131523145728,51507200,1190252544,3.316,0.031,96.653,0,0,3451992,2746122
2049003520,131522359296,51507200,1190256640,3.314,0.125,96.561,0,0,3499010,3022706
2048516096,131522846720,51507200,1190256640,3.226,0.031,96.743,0,0,3524082,3489326
2048761856,131522592768,51515392,1190256640,3.285,0.094,96.558,0.063,0,3474316,2638616
2048516096,131522838528,51523584,1190248448,3.315,0.063,96.185,0.438,0,3662716,3111692
2049126400,131522220032,51523584,1190256640,3.350,0,96.650,0,0,3811938,4244642
2048880640,131522465792,51523584,1190256640,3.468,0.062,96.470,0,0,3740998,3698184
2049294336,131522052096,51523584,1190256640,3.498,0.062,96.440,0,0,3520130,3227836
2048786432,131522551808,51531776,1190256640,3.378,0.031,96.528,0.063,0,3196254,3481080
2049191936,131522142208,51539968,1190252544,3.283,0.094,96.341,0.281,0,3462316,2761956
2052833280,131518185472,51556352,1190260736,3.598,0.125,96.277,0,0,3308618,3316234
2050727936,131520376832,51556352,1190264832,3.467,0.125,96.408,0,0,3376984,4695160
2051207168,131519897600,51556352,1190264832,3.377,0.063,96.560,0,0,3407018,3639584
2051637248,131519455232,51568640,1190264832,3.348,0,96.589,0.063,0,3170752,2785232
2051215360,131519864832,51580928,1190264832,3.315,0.094,95.872,0.719,0,2946694,3285484
2050936832,131520143360,51580928,1190264832,3.316,0.031,96.653,0,0,2513870,2943990
2051256320,131519938560,51580928,1190150144,3.315,0.031,96.654,0,0,2112436,3969658
2050904064,131520172032,51580928,1190268928,3.345,0.031,96.624,0,0,1895524,4028470
2051723264,131519344640,51589120,1190268928,3.223,0.031,96.683,0.063,0,1391166,3080350
2051936256,131519115264,51597312,1190273024,3.220,0,96.468,0.313,0,866842,2076706
2051825664,131519225856,51597312,1190273024,3.251,0.031,96.718,0,0,602714,2448422
2051334144,131519717376,51597312,1190273024,3.221,0.031,96.748,0,0,293336,2952670
2050691072,131520356352,51597312,1190277120,3.281,0.031,96.688,0,0,60416,2646788
2050584576,131520454656,51605504,1190277120,3.311,0.031,96.626,0.031,0,53792,3114342
2051280896,131519758336,51613696,1190268928,3.311,0.031,96.314,0.344,0,96398,3991910
2050125824,131521003520,51613696,1190178816,3.251,0,96.749,0,0,46238,2691754
2050646016,131520503808,51613696,1190158336,3.317,0.031,96.652,0,0,47914,2927004
2049994752,131521032192,51613696,1190281216,3.219,0.031,96.750,0,0,43230,2433788
2049073152,131521945600,51621888,1190281216,3.281,0,96.656,0.062,0,68274,2388962
2048397312,131522613248,51630080,1190281216,3.222,0,96.403,0.375,0,48852,3253844
2047516672,131523493888,51630080,1190281216,3.279,0.031,96.627,0.062,0,69392,2624950
2045509632,131525500928,51630080,1190281216,3.251,0,96.749,0,0,49240,2989794
2043559936,131527450624,51630080,1190281216,3.280,0.031,96.689,0,0,50732,2617700
2042040320,131528957952,51638272,1190285312,3.159,0,96.747,0.094,0,66748,2748316
2041315328,131529678848,51638272,1190289408,3.189,0.031,96.779,0,0,77636,2428278
2039570432,131531415552,51646464,1190289408,3.221,0,96.435,0.344,0,53924,2804122
2037673984,131533312000,51646464,1190289408,3.649,0.031,96.319,0,0,45380,2734604
2036264960,131534721024,51646464,1190289408,3.250,0.031,96.719,0,0,52428,3192222
2034941952,131536035840,51654656,1190289408,3.221,0.031,96.685,0.063,0,46518,2625276
2033664000,131537313792,51654656,1190289408,3.221,0.031,96.748,0,0,77646,3342028
2031919104,131539050496,51662848,1190289408,3.252,0,96.467,0.281,0,63362,3448542
2031910912,131539054592,51662848,1190293504,3.188,0.031,96.780,0,0,150490,1952308
2031910912,131539054592,51662848,1190293504,3.160,0,96.840,0,0,182164,3285562
2031902720,131539062784,51671040,1190285312,3.311,0,96.564,0.125,0,181898,3341300
2031890432,131539066880,51671040,1190293504,3.220,0.031,96.749,0,0,166936,3987152
2031849472,131539103744,51679232,1190289408,3.157,0,96.436,0.406,0,104222,3910162
2031869952,131539075072,51679232,1190297600,3.218,0.031,96.751,0,0,58658,3725344
2031865856,131539079168,51679232,1190297600,3.127,0,96.873,0,0,76494,2741448
1169383424,132401553408,51687424,1190297600,0.812,0.031,99.094,0.062,0,16054,734750
1161465856,132409692160,51687424,1190076416,0,0,100,0,0,12660,220
1161441280,132409708544,51695616,1190076416,0,0,99.469,0.531,0,1178,0
1161441280,132409708544,51695616,1190076416,0,0,100,0,0,2636,0
1161441280,132409708544,51695616,1190076416,0,0,100,0,0,30314,662
1161416704,132409716736,51707904,1190076416,0,0,99.969,0.031,0,3182,0
1161158656,132409974784,51707904,1190076416,0,0,100,0,0,28144,0
1161158656,132409974784,51707904,1190076416,0,0,100,0,0,7542,0
1161158656,132409974784,51707904,1190076416,0,0,100,0,0,4948,0
1161158656,132409974784,51707904,1190076416,0,0.031,99.969,0,0,3974,0
1160900608,132410232832,51707904,1190076416,0,0,100,0,0,31778,708
1160933376,132410150912,51716096,1190076416,0,0,99.937,0.063,0,3662,312
1160933376,132410150912,51716096,1190076416,0,0,100,0,0,27588,624
1160933376,132410150912,51716096,1190076416,0,0,100,0,0,8848,390
1160933376,132410150912,51716096,1190076416,0,0,100,0,0,41320,624
1160933376,132410150912,51716096,1190076416,0,0.031,99.969,0,0,10148,1078
1160933376,132410150912,51716096,1190076416,0,0,100,0,0,38208,1046
1160667136,132410408960,51724288,1190076416,0,0,99.938,0.062,0,41304,234
1181335552,132389699584,51724288,1190084608,0.813,0.188,98.999,0,0,449126,23064
1195909120,132373012480,51724288,1190084608,0.937,0.593,98.470,0,0,227708,37634
