"Dstat 0.7.3 CSV output"
"Author:","Dag Wieers <dag@wieers.com>",,,,"URL:","http://dag.wieers.com/home-made/dstat/"
"Host:","gros-66.nancy.grid5000.fr",,,,"User:","root"
"Cmdline:","dstat -m -c -n -o dstat.csv",,,,"Date:","23 May 2020 23:34:41 CEST"
"memory usage",,,,"total cpu usage",,,,,"net/total",
"used","free","buff","cach","usr","sys","idl","wai","stl","recv","send"
1458737152,97044463616,47316992,1041784832,0.309,0.067,99.574,0.050,0,0,0
1454301184,97048539136,47329280,1042124800,0.721,0.444,98.835,0,0,401866,30990
1453277184,97050009600,47329280,1041678336,0.028,0,99.972,0,0,7770,2512
1454292992,97048961024,47345664,1041686528,0.640,0.362,98.999,0,0,395186,21732
1464082432,97038901248,47374336,1041928192,0.222,0.028,99.750,0,0,385194,10912
1449697280,97053310976,47374336,1041883136,0.528,0.389,99.083,0,0,6688,6138
1449459712,97053724672,47386624,1041694720,0.028,0,99.972,0,0,7234,0
1449459712,97053724672,47386624,1041694720,0.028,0.028,99.944,0,0,9376,0
1449459712,97053724672,47386624,1041694720,0,0.028,99.972,0,0,9930,454
1449459712,97053724672,47386624,1041694720,0,0,100,0,0,2840,0
1449447424,97053724672,47398912,1041694720,0.028,0.028,99.944,0,0,2024,0
1462939648,97039769600,47398912,1042149376,0.444,0.194,99.028,0.333,0,387744,15398
1449803776,97053134848,47407104,1041907712,0.473,0.668,98.859,0,0,173620,17604
1459957760,97042722816,47407104,1042161664,0.667,0.306,99.027,0,0,389884,16894
1458462720,97044213760,47407104,1042161664,0.583,0.500,98.917,0,0,391000,26382
1451184128,97051750400,47407104,1041903616,0.056,0.083,99.861,0,0,5468,3936
1454915584,97047969792,47419392,1041895424,0.694,0.444,98.861,0,0,399513,17954
1484382208,97018490880,47431680,1041862656,0.417,0.111,99.472,0,0,228270,9850
1454456832,97048551424,47431680,1041723392,0.750,0.083,99.167,0,0,15470,5432
1454604288,97048330240,47489024,1041739776,0.306,0.111,99.583,0,0,355712,16522
1462542336,97040207872,47489024,1041924096,0.167,0.306,99.527,0,0,187586,18082
1463304192,97039437824,47489024,1041932288,0.056,0.083,99.861,0,0,40290,10192
1463304192,97039437824,47489024,1041932288,0,0.028,99.972,0,0,12320,10094
1463357440,97039372288,47501312,1041932288,0.028,0.056,99.917,0,0,12612,10412
1463349248,97039380480,47501312,1041932288,0.028,0.028,99.944,0,0,11388,10148
1463595008,97039122432,47513600,1041932288,0,0.028,99.972,0,0,15512,13864
1463595008,97039122432,47513600,1041932288,0.028,0.028,99.944,0,0,13994,11824
1463582720,97039122432,47517696,1041940480,0,0.028,99.972,0,0,12554,9996
1463574528,97039130624,47517696,1041940480,0.056,0.056,99.889,0,0,12248,10094
1463574528,97039130624,47517696,1041940480,0,0.028,99.972,0,0,10964,10094
1456349184,97046355968,47517696,1041940480,0.056,0.056,99.889,0,0,3053,2468
1454518272,97048363008,47525888,1041756160,0.222,0.083,99.694,0,0,173470,15336
1454505984,97048363008,47538176,1041756160,0,0.056,99.917,0.028,0,496,148
1454505984,97048363008,47538176,1041756160,0.028,0,99.972,0,0,2474,0
1454497792,97048371200,47538176,1041756160,0,0.056,99.944,0,0,1926,0
1454497792,97048371200,47538176,1041756160,0,0.028,99.972,0,0,1730,0
1454497792,97048371200,47550464,1041743872,0,0.028,99.972,0,0,2082,0
1450762240,97052090368,47550464,1041760256,0.694,0.472,98.833,0,0,390092,29822
1605283840,96897130496,47550464,1042198528,1.917,0.222,97.861,0,0,333356,13844
1605140480,96897404928,47554560,1042087936,0,0,100,0,0,2354,0
1605140480,96897404928,47554560,1042087936,0.028,0,99.972,0,0,30004,560
1605140480,96897404928,47554560,1042087936,0,0.028,99.972,0,0,18742,560
1605361664,96897155072,47579136,1042087936,0.028,0.028,99.944,0,0,5220,2050
1605394432,96897056768,47579136,1042087936,1.389,0,98.611,0,0,2072,322
1605394432,96897056768,47579136,1042087936,2.806,0,97.194,0,0,1042,0
1605525504,96896925696,47579136,1042087936,2.806,0,97.194,0,0,4234,2100
1605525504,96896925696,47579136,1042087936,2.779,0.028,97.194,0,0,8006,2442
1605627904,96896802816,47587328,1042092032,2.779,0,97.221,0,0,6452,1680
1605738496,96896688128,47587328,1042096128,2.778,0.028,97.194,0,0,10930,2520
1605746688,96896671744,47595520,1042096128,2.779,0,97.221,0,0,4114,0
1649684480,96852692992,47595520,1042104320,4.685,0.305,95.010,0,0,6911056,1982892
1744429056,96757948416,47595520,1042104320,7.936,0.499,91.565,0,0,22577958,3232390
1831268352,96671100928,47603712,1042104320,5.769,0.641,93.590,0,0,38761600,4095586
1847107584,96655261696,47603712,1042104320,3.152,0.167,96.681,0,0,54181862,3141426
1890926592,96611434496,47611904,1042104320,3.338,0.195,96.467,0,0,58238102,3500414
1946718208,96555638784,47611904,1042108416,3.389,0.167,96.444,0,0,60666756,3482274
1988083712,96514273280,47611904,1042108416,3.035,0.223,96.742,0,0,55816926,3615088
2059440128,96442908672,47620096,1042108416,3.337,0.556,96.107,0,0,56850956,3317840
2090086400,96412258304,47620096,1042112512,3.360,0.139,96.501,0,0,57383372,3867376
2118725632,96383610880,47628288,1042112512,3.202,0.167,96.631,0,0,56366546,4754544
2149707776,96352628736,47628288,1042112512,3.200,0.167,96.633,0,0,57240877,4125724
2181029888,96321306624,47628288,1042112512,3.146,0.139,96.715,0,0,58644898,3734598
2213765120,96288563200,47636480,1042112512,3.064,0.139,96.797,0,0,59596412,4060110
2241757184,96260571136,47636480,1042112512,3.235,0.139,96.626,0,0,58388492,5414568
2272395264,96229924864,47644672,1042112512,3.037,0.139,96.824,0,0,57645316,3899060
2307227648,96195088384,47644672,1042116608,3.369,0.195,96.437,0,0,60898298,3696978
2336403456,96165912576,47644672,1042116608,3.062,0.167,96.771,0,0,56683120,3446456
2370457600,96131850240,47652864,1042116608,3.305,0.167,96.529,0,0,62065912,3665864
2407784448,96094523392,47652864,1042116608,3.255,0.139,96.606,0,0,54114702,5270818
2452180992,96050118656,47661056,1042116608,3.331,0.167,96.502,0,0,56715206,3423526
2518847488,95983452160,47661056,1042116608,3.220,0.944,95.836,0,0,54806360,3991446
2548862976,95953436672,47661056,1042116608,3.198,0.195,96.607,0,0,56096124,4210512
2580373504,95921917952,47669248,1042116608,3.333,0.139,96.500,0.028,0,59662186,4233192
2610290688,95892000768,47669248,1042116608,3.306,0.167,96.527,0,0,58971926,4688394
2638802944,95863488512,47669248,1042116608,3.276,0.194,96.530,0,0,56984654,3033562
2667790336,95834488832,47677440,1042120704,3.548,0.166,96.286,0,0,56318610,4983334
2699145216,95803133952,47677440,1042120704,3.116,0.139,96.745,0,0,59646476,4366870
2726342656,95775928320,47685632,1042120704,3.118,0.139,96.743,0,0,54466292,5937926
2755543040,95746686976,47685632,1042120704,2.981,0.223,96.796,0,0,57748476,4449952
2788777984,95713452032,47685632,1042120704,3.062,0.223,96.715,0,0,62422194,4453494
2817642496,95684579328,47693824,1042120704,3.147,0.167,96.686,0,0,58136832,5091524
2852192256,95650029568,47693824,1042120704,3.258,0.167,96.575,0,0,61916442,4688540
2898419712,95603789824,47702016,1042124800,3.091,0.139,96.770,0,0,57313874,3698270
2939195392,95563014144,47702016,1042124800,3.062,0.139,96.799,0,0,54107882,3243798
2992648192,95509561344,47702016,1042124800,3.145,0.167,96.688,0,0,58202436,4777210
3076669440,95425531904,47710208,1042124800,3.142,0.945,95.912,0,0,60969740,3758806
3105447936,95396753408,47710208,1042124800,3.114,0.222,96.664,0,0,55884558,3065274
3137986560,95364206592,47718400,1042124800,3.175,0.084,96.742,0,0,61941064,3832614
3171368960,95330824192,47718400,1042124800,3.196,0.195,96.609,0,0,61256448,4166396
3201142784,95301050368,47718400,1042124800,3.413,0.166,96.421,0,0,58015192,4645202
3232731136,95269453824,47726592,1042124800,3.037,0.139,96.824,0,0,61634423,3943646
3261698048,95240486912,47726592,1042124800,3.115,0.195,96.690,0,0,54800098,4267956
3291848704,95210328064,47734784,1042124800,3.143,0.167,96.690,0,0,57342936,2610480
3321143296,95181029376,47734784,1042128896,2.980,0.195,96.825,0,0,55266912,4233962
3351302144,95150870528,47734784,1042128896,3.118,0.167,96.715,0,0,58086670,3332698
3381182464,95120982016,47742976,1042128896,3.197,0.195,96.608,0,0,57839478,3400170
3412852736,95089311744,47742976,1042128896,3.116,0.167,96.717,0,0,57025360,4492446
3442921472,95059234816,47751168,1042128896,3.117,0.195,96.688,0,0,60314638,4151848
3470303232,95031836672,47751168,1042128896,3.253,0.167,96.580,0,0,58338896,4770322
3500589056,95001550848,47751168,1042128896,2.954,0.139,96.906,0,0,57726084,3744114
3531718656,94970470400,47759360,1042124800,3.147,0.195,96.658,0,0,61241996,3774980
3564560384,94937628672,47759360,1042124800,3.200,0.139,96.661,0,0,58512270,4713774
3593236480,94908940288,47767552,1042128896,3.282,0.167,96.551,0,0,56080352,4509642
3631767552,94870409216,47767552,1042128896,4.149,0.111,95.739,0,0,56885250,4247650
3670224896,94831951872,47767552,1042128896,3.394,0.195,96.412,0,0,58639958,4661082
3722915840,94779252736,47775744,1042128896,3.228,0.195,96.578,0,0,56366508,4058162
3769946112,94732181504,47775744,1042128896,3.281,0.222,96.496,0,0,52189602,3856636
3817938944,94684180480,47783936,1042128896,3.151,0.139,96.709,0,0,57176328,3917680
3872362496,94629756928,47783936,1042128896,3.088,0.250,96.661,0,0,57051486,4796290
3915685888,94586433536,47783936,1042128896,3.224,0.139,96.637,0,0,57422038,3893562
3968462848,94533656576,47792128,1042120704,3.034,0.223,96.744,0,0,56432942,3849046
4031438848,94470569984,47792128,1042132992,3.199,0.223,96.579,0,0,57885386,5343804
4074844160,94427156480,47800320,1042132992,3.115,0.139,96.718,0.028,0,58474088,3683870
4127166464,94374834176,47800320,1042132992,3.254,0.139,96.607,0,0,61508738,3738440
4202692608,94299308032,47800320,1042132992,3.177,0.641,96.182,0,0,60112310,3859974
4234559488,94267441152,47800320,1042132992,3.199,0.167,96.634,0,0,60493834,3300368
4265988096,94236004352,47808512,1042132992,3.496,0.111,96.393,0,0,59370852,4809700
4293750784,94208233472,47816704,1042132992,3.281,0.167,96.552,0,0,58013820,4078322
4324814848,94177169408,47816704,1042132992,3.142,0.195,96.663,0,0,56437166,3280768
4351713280,94150270976,47816704,1042132992,3.307,0.139,96.554,0,0,53630400,4156794
4382560256,94119419904,47816704,1042137088,4.525,0.222,95.253,0,0,54643487,3246190
4411777024,94090194944,47824896,1042137088,3.091,0.167,96.742,0,0,54308206,4208518
4442189824,94059773952,47833088,1042137088,3.330,0.194,96.476,0,0,56970474,3185408
4470456320,94031507456,47833088,1042137088,3.812,0.139,96.049,0,0,56707166,5168506
4498743296,94003220480,47833088,1042137088,3.062,0.167,96.771,0,0,55280062,4678532
4529082368,93972881408,47833088,1042137088,3.062,0.223,96.716,0,0,58425728,4111826
4558827520,93943128064,47841280,1042137088,2.953,0.195,96.851,0,0,57866502,4050840
4588687360,93913260032,47849472,1042137088,3.036,0.139,96.825,0,0,58193031,4180350
4618424320,93883523072,47849472,1042137088,2.953,0.195,96.852,0,0,56944102,3676634
4650450944,93851492352,47849472,1042141184,3.010,0.111,96.878,0,0,60124022,2790562
4682223616,93819719680,47849472,1042141184,2.984,0.139,96.877,0,0,60793294,4021582
4724043776,93777891328,47857664,1042141184,5.118,0.223,94.659,0,0,63576649,3888058
4753166336,93748760576,47865856,1042141184,3.012,0.167,96.821,0,0,57209298,4808008
4783710208,93718216704,47865856,1042141184,3.035,0.167,96.798,0,0,58547254,4061438
4814770176,93687156736,47865856,1042141184,3.362,0.111,96.527,0,0,59428316,4385524
4844257280,93657669632,47865856,1042141184,3.144,0.139,96.717,0,0,57601971,3222422
4870758400,93631160320,47874048,1042141184,3.224,0.083,96.693,0,0,51162842,3284296
4902100992,93599809536,47882240,1042141184,3.171,0.223,96.606,0,0,60299980,3987922
4930572288,93571338240,47882240,1042141184,3.449,0.111,96.439,0,0,53825606,4078288
4959748096,93542158336,47882240,1042145280,3.447,0.167,96.386,0,0,55019211,4143732
4991213568,93510692864,47882240,1042145280,3.171,0.223,96.606,0,0,59424032,4260658
5021315072,93480583168,47890432,1042145280,3.694,0.222,96.083,0,0,57206432,3873248
5053128704,93448761344,47898624,1042145280,3.090,0.223,96.687,0,0,62784682,4564790
5087531008,93414359040,47898624,1042145280,3.090,0.195,96.715,0,0,62447188,4032560
5116854272,93385035776,47898624,1042145280,3.531,0.167,96.302,0,0,54438378,4188248
5148950528,93352939520,47898624,1042145280,3.039,0.112,96.850,0,0,62190180,5303718
5177782272,93324099584,47906816,1042145280,3.196,0.195,96.609,0,0,55416662,3538722
5208961024,93292912640,47915008,1042145280,3.141,0.222,96.637,0,0,58562674,4202774
5241700352,93260173312,47915008,1042145280,3.146,0.195,96.659,0,0,63774262,4836536
5270769664,93231095808,47915008,1042153472,3.194,0.222,96.583,0,0,55558430,3544316
5300514816,93201350656,47915008,1042153472,3.038,0.084,96.878,0,0,57840945,4374828
5330960384,93170905088,47923200,1042145280,3.170,0.139,96.663,0.028,0,59124018,3597032
5362016256,93139832832,47931392,1042153472,3.116,0.195,96.689,0,0,59953716,4587844
5393068032,93108781056,47931392,1042153472,3.115,0.167,96.718,0,0,59919072,3860362
5421068288,93080780800,47931392,1042153472,3.089,0.139,96.772,0,0,55076418,4253536
5451468800,93050380288,47931392,1042153472,3.115,0.222,96.663,0,0,57335186,4418888
5480857600,93020979200,47939584,1042157568,3.172,0.167,96.661,0,0,57808648,3920152
5513809920,92988018688,47947776,1042157568,3.039,0.167,96.794,0,0,63015847,4461178
5545680896,92956147712,47947776,1042157568,3.250,0.194,96.556,0,0,60068186,3074040
5576589312,92925239296,47947776,1042157568,3.224,0.167,96.609,0,0,58151860,3588766
5608169472,92893659136,47947776,1042157568,3.035,0.167,96.798,0,0,57965022,3754082
5636804608,92865024000,47947776,1042157568,3.170,0.167,96.663,0,0,56163553,3515434
5665886208,92835926016,47964160,1042157568,2.953,0.195,96.852,0,0,55336812,3334122
5696462848,92805349376,47964160,1042157568,3.227,0.111,96.662,0,0,58945884,3923584
5728108544,92773703680,47964160,1042157568,3.194,0.250,96.556,0,0,59456844,3837540
5758554112,92743258112,47964160,1042157568,3.170,0.195,96.635,0,0,58270708,4389262
5787930624,92713844736,47964160,1042161664,3.306,0.139,96.556,0,0,56260184,3967628
5818490880,92683268096,47980544,1042161664,3.195,0.278,96.527,0,0,59038340,4676252
5847363584,92654395392,47980544,1042161664,3.061,0.195,96.745,0,0,55621564,3627296
5876297728,92625461248,47980544,1042161664,3.094,0.167,96.739,0,0,55371274,3030594
5905915904,92595843072,47980544,1042161664,3.276,0.222,96.502,0,0,57539902,3692266
5934161920,92567597056,47980544,1042161664,3.198,0.111,96.691,0,0,55251082,3478548
5967532032,92534210560,47996928,1042161664,3.119,0.111,96.770,0,0,63426764,3482708
5999841280,92501893120,47996928,1042165760,3.281,0.195,96.525,0,0,61664660,3833710
6031196160,92470538240,47996928,1042165760,3.168,0.222,96.610,0,0,58308922,3525018
6060220416,92441509888,47996928,1042169856,3.062,0.139,96.799,0,0,55849126,3428194
6089801728,92411928576,47996928,1042169856,3.170,0.167,96.663,0,0,58287688,4146422
6121172992,92380540928,48013312,1042169856,3.142,0.167,96.691,0,0,58105482,3914026
6152425472,92349288448,48013312,1042169856,2.955,0.139,96.905,0,0,61883608,3382220
6183768064,92317941760,48013312,1042173952,2.984,0.084,96.933,0,0,57177048,3498498
6214021120,92287688704,48013312,1042173952,3.168,0.306,96.527,0,0,59227921,4070682
6243696640,92258013184,48013312,1042173952,2.953,0.223,96.825,0,0,56488660,3541338
6273613824,92228075520,48029696,1042173952,3.065,0.139,96.796,0,0,58091946,3979570
6304415744,92197273600,48029696,1042173952,3.331,0.194,96.474,0,0,58857668,3930424
6334537728,92167143424,48029696,1042178048,3.088,0.167,96.745,0,0,56086942,3872688
6369910784,92131770368,48029696,1042178048,3.171,0.223,96.606,0,0,68339312,4498024
6397972480,92103708672,48029696,1042178048,3.114,0.222,96.664,0,0,54113308,3180768
6429274112,92072390656,48046080,1042178048,3.195,0.222,96.582,0,0,61087226,4118406
6460723200,92040941568,48046080,1042178048,3.169,0.195,96.636,0,0,57452118,4006480
6488526848,92013137920,48046080,1042178048,3.034,0.167,96.799,0,0,53880732,3113874
6518849536,91982815232,48046080,1042178048,3.115,0.195,96.691,0,0,58472772,3891868
6550573056,91951091712,48046080,1042178048,3.034,0.223,96.744,0,0,60635550,3524334
6580248576,91921399808,48062464,1042178048,3.033,0.167,96.772,0.028,0,55823005,3330472
6610796544,91890851840,48062464,1042178048,2.981,0.111,96.907,0,0,56895176,2575918
6640533504,91861110784,48062464,1042182144,3.035,0.139,96.826,0,0,55410712,3483032
6670757888,91830886400,48062464,1042182144,3.223,0.194,96.582,0,0,58402684,4284546
6702948352,91798695936,48062464,1042182144,3.116,0.195,96.689,0,0,62061247,3937960
6733508608,91768127488,48078848,1042173952,3.199,0.139,96.662,0,0,59247466,4276718
6764679168,91736944640,48078848,1042186240,3.061,0.223,96.717,0,0,60005226,3898644
6798458880,91703164928,48078848,1042186240,3.035,0.167,96.798,0,0,61965346,3686076
6828236800,91673387008,48078848,1042186240,2.981,0.195,96.824,0,0,60258758,4229822
6862008320,91639615488,48078848,1042186240,3.197,0.167,96.636,0,0,62278726,3711330
6891098112,91610521600,48078848,1042190336,3.250,0.194,96.556,0,0,56614622,4194616
6919786496,91581812736,48099328,1042190336,3.224,0.139,96.637,0,0,54897256,3873382
6951940096,91549659136,48099328,1042190336,3.094,0.139,96.767,0,0,60624038,3796134
6982881280,91518717952,48099328,1042190336,3.223,0.194,96.582,0,0,59732084,4800836
7016333312,91485265920,48099328,1042190336,3.226,0.167,96.607,0,0,64633748,4390290
7047344128,91454255104,48099328,1042190336,3.063,0.167,96.770,0,0,59268108,4532892
7077134336,91424448512,48115712,1042190336,3.118,0.111,96.771,0,0,57234986,3164878
7110701056,91390881792,48115712,1042190336,3.065,0.223,96.712,0,0,64591202,4240298
7142035456,91359547392,48115712,1042190336,3.306,0.139,96.556,0,0,59342775,4249502
7171497984,91330080768,48115712,1042194432,3.306,0.111,96.583,0,0,57624400,4778684
7200169984,91301408768,48115712,1042194432,3.225,0.139,96.636,0,0,57930346,4232280
7229288448,91272273920,48132096,1042194432,3.198,0.139,96.663,0,0,54938616,3838400
7259045888,91242516480,48132096,1042194432,3.171,0.167,96.662,0,0,59201034,4238210
7290109952,91211452416,48132096,1042194432,3.196,0.222,96.581,0,0,59242424,3494496
7322431488,91179130880,48132096,1042194432,3.142,0.167,96.691,0,0,59823788,4548924
7355154432,91146407936,48132096,1042194432,3.063,0.195,96.742,0,0,62512148,4533814
7384363008,91117182976,48148480,1042194432,3.586,0.195,96.219,0,0,60772646,4850838
7414505472,91087036416,48148480,1042198528,3.064,0.139,96.797,0,0,57708282,4131380
7442792448,91058749440,48148480,1042198528,3.306,0.139,96.555,0,0,54856616,3785460
7475339264,91026202624,48148480,1042198528,3.143,0.167,96.690,0,0,60921394,4189412
7502495744,90999046144,48148480,1042198528,3.281,0.083,96.636,0,0,55384110,4583808
7531819008,90969706496,48164864,1042198528,3.142,0.195,96.663,0,0,55573732,3246468
7563460608,90938064896,48164864,1042198528,3.063,0.167,96.770,0,0,60638968,4897806
7592103936,90909421568,48164864,1042198528,3.062,0.139,96.798,0,0,54793196,3590454
7621906432,90879614976,48164864,1042202624,3.223,0.167,96.610,0,0,58542672,3977536
7650643968,90850877440,48164864,1042202624,3.494,0.111,96.395,0,0,55929128,4553890
7679627264,90821877760,48181248,1042202624,3.117,0.139,96.744,0,0,55601786,4117858
7710031872,90791473152,48181248,1042202624,3.035,0.195,96.771,0,0,58952430,4008016
7740289024,90761216000,48181248,1042202624,3.007,0.195,96.798,0,0,56706162,3375522
7773368320,90728103936,48181248,1042202624,3.063,0.278,96.658,0,0,59606784,4320528
7803916288,90697555968,48181248,1042202624,3.251,0.222,96.527,0,0,59520688,3564830
7834062848,90667393024,48197632,1042202624,3.143,0.167,96.662,0.028,0,57873874,4173574
7861604352,90639851520,48197632,1042202624,3.117,0.139,96.744,0,0,51601010,3717160
7890726912,90610724864,48197632,1042206720,3.062,0.167,96.772,0,0,57234346,3781976
7924342784,90577108992,48197632,1042206720,3.145,0.139,96.716,0,0,62943562,3768464
7954210816,90547240960,48197632,1042206720,3.174,0.111,96.715,0,0,59461592,4580270
7983255552,90518179840,48214016,1042206720,3.139,0.222,96.639,0,0,55350598,3170334
8012562432,90488872960,48214016,1042206720,3.277,0.194,96.529,0,0,55766198,3985008
8044228608,90457206784,48214016,1042206720,3.197,0.195,96.608,0,0,60437171,4602718
8075640832,90425794560,48214016,1042206720,3.142,0.222,96.635,0,0,61006648,4332604
8106799104,90394636288,48214016,1042206720,3.118,0.111,96.771,0,0,58895200,2951590
8137367552,90364059648,48222208,1042206720,3.063,0.139,96.798,0,0,57742344,3317022
8166580224,90334834688,48230400,1042210816,3.198,0.139,96.663,0,0,57420780,4744730
8198238208,90303176704,48230400,1042210816,3.090,0.167,96.743,0,0,60994442,4138420
8224657408,90276757504,48230400,1042210816,3.141,0.222,96.637,0,0,52949626,3856778
8256995328,90244419584,48230400,1042210816,3.142,0.167,96.691,0,0,58694792,3377552
8289431552,90211971072,48238592,1042214912,3.064,0.167,96.769,0,0,63173144,3705156
8320421888,90180972544,48246784,1042214912,3.030,0.278,96.692,0,0,58068028,2673920
8350244864,90151149568,48246784,1042214912,3.224,0.167,96.609,0,0,57587244,4522458
8378564608,90122829824,48246784,1042214912,3.138,0.250,96.612,0,0,53849766,3454544
8406945792,90094444544,48246784,1042219008,3.143,0.111,96.745,0,0,54078260,2447142
8437088256,90064293888,48254976,1042219008,3.221,0.194,96.584,0,0,55875300,2690208
8466255872,90035118080,48263168,1042219008,3.060,0.223,96.718,0,0,55401330,3112078
8496963584,90004410368,48263168,1042219008,3.116,0.195,96.689,0,0,59078914,3361050
8530800640,89970573312,48263168,1042219008,3.062,0.167,96.771,0,0,63610518,4225994
8559964160,89941409792,48263168,1042219008,3.062,0.195,96.743,0,0,55891912,4400760
8588271616,89913094144,48271360,1042219008,3.171,0.195,96.634,0,0,58322258,4603836
8618774528,89882583040,48279552,1042219008,3.091,0.195,96.714,0,0,57565718,3128110
8649224192,89852133376,48279552,1042219008,3.061,0.195,96.745,0,0,56670418,3827878
8680927232,89820397568,48279552,1042219008,3.095,0.139,96.765,0,0,60069001,4279534
8712921088,89788399616,48279552,1042223104,3.088,0.223,96.689,0,0,61521652,3560196
8743813120,89757499392,48287744,1042223104,3.143,0.167,96.690,0,0,58812552,4370202
8774127616,89727176704,48295936,1042223104,3.117,0.167,96.716,0,0,58880044,4891260
8805711872,89695592448,48295936,1042223104,2.981,0.223,96.797,0,0,60755102,3062632
8836902912,89664401408,48295936,1042223104,3.170,0.195,96.635,0,0,60347620,3739668
8866963456,89634340864,48295936,1042223104,3.195,0.194,96.610,0,0,55760058,3587288
8894435328,89606860800,48304128,1042223104,3.170,0.167,96.663,0,0,54855170,4608148
8924450816,89576837120,48312320,1042223104,3.200,0.167,96.633,0,0,59192718,4736732
8947994624,89553289216,48312320,1042227200,3.089,0.083,96.827,0,0,46382292,3028934
8961536000,89539747840,48312320,1042227200,2.976,0.083,96.940,0,0,26898423,3182404
8969220096,89532063744,48312320,1042227200,3.052,0.055,96.892,0,0,15177438,2779932
8968712192,89532481536,48320512,1042227200,2.863,0,97.137,0,0,1280584,1465710
8968179712,89533005824,48328704,1042227200,2.833,0,97.139,0.028,0,21034,1722690
8966766592,89534418944,48328704,1042227200,2.862,0.028,97.110,0,0,33920,3328930
8968404992,89532780544,48328704,1042227200,2.889,0,97.111,0,0,31978,2726704
8967618560,89533566976,48328704,1042227200,2.834,0.028,97.138,0,0,34734,2779892
8969490432,89531682816,48336896,1042227200,2.888,0.028,97.084,0,0,31630,2902624
8968331264,89532829696,48345088,1042227200,2.807,0.028,97.165,0,0,32294,3233618
8966463488,89534697472,48345088,1042227200,2.862,0,97.138,0,0,48826,3597098
8968818688,89532338176,48345088,1042231296,2.890,0,97.110,0,0,50582,3582420
8966819840,89534337024,48345088,1042231296,2.887,0.056,97.057,0,0,38628,3398640
8967909376,89533239296,48353280,1042231296,2.863,0,97.137,0,0,30794,3268566
8965804032,89535295488,48361472,1042231296,2.917,0,97.083,0,0,33476,3531934
8967036928,89534062592,48361472,1042231296,2.916,0.056,97.029,0,0,29152,3050560
8964874240,89536225280,48361472,1042231296,2.890,0,97.110,0,0,49766,4268044
8965885952,89535209472,48361472,1042235392,2.835,0,97.165,0,0,37518,3414436
8964501504,89536585728,48369664,1042235392,3.082,0.056,96.863,0,0,29834,1671280
8963321856,89537765376,48369664,1042235392,2.808,0,97.192,0,0,38062,2981840
8965058560,89536020480,48377856,1042235392,2.808,0,97.192,0,0,30258,3212158
8962764800,89538314240,48377856,1042235392,2.862,0,97.138,0,0,29682,3661672
8962240512,89538838528,48377856,1042235392,3.161,0.028,96.811,0,0,17522,1749216
8993148928,89505095680,48410624,1042698240,4.315,0.498,95.187,0,0,428506,2711590
8992628736,89505890304,48410624,1042251776,2.833,0.028,97.139,0,0,28276,2731526
