"Dstat 0.7.3 CSV output"
"Author:","Dag Wieers <dag@wieers.com>",,,,"URL:","http://dag.wieers.com/home-made/dstat/"
"Host:","grisou-35.nancy.grid5000.fr",,,,"User:","root"
"Cmdline:","dstat -m -c -n -o dstat.csv",,,,"Date:","27 May 2020 10:27:26 CEST"
"memory usage",,,,"total cpu usage",,,,,"net/total",
"used","free","buff","cach","usr","sys","idl","wai","stl","recv","send"
1229918208,132327354368,54423552,1191923712,0.600,0.048,99.307,0.045,0,0,0
1240162304,132316798976,54435840,1192251392,0.593,0.218,99.157,0.031,0,387430,15134
1233104896,132324290560,54435840,1191817216,0.500,0.657,98.593,0.250,0,385666,26904
1225629696,132331741184,54448128,1191821312,0.907,0.594,98.124,0.375,0,4910,15882
1237667840,132319440896,54448128,1192079360,0.344,0.063,99.593,0,0,383420,12264
1226416128,132330946560,54448128,1191821312,0.563,0.657,98.780,0,0,5916,15882
1226297344,132331065344,54448128,1191821312,0,0.031,99.969,0,0,1676,0
1225994240,132331356160,54460416,1191821312,0,0,99.969,0.031,0,6234,1324
1225994240,132331356160,54460416,1191821312,0,0,100,0,0,5516,84
1225981952,132331356160,54472704,1191821312,0,0,99.969,0.031,0,992,0
1225723904,132331614208,54472704,1191821312,0,0,100,0,0,1404,0
1225723904,132331614208,54472704,1191821312,0,0,100,0,0,1158,0
1225658368,132331679744,54472704,1191821312,0,0,100,0,0,346,0
1225650176,132331679744,54480896,1191821312,0,0,99.938,0.062,0,2906,496
1225392128,132331937792,54480896,1191821312,0,0,100,0,0,812,0
1225134080,132332195840,54480896,1191821312,0.031,0,99.969,0,0,586,0
1224876032,132332453888,54480896,1191821312,0,0,100,0,0,7336,0
1224876032,132332453888,54480896,1191821312,0,0,100,0,0,1972,0
1237524480,132319358976,54480896,1192267776,0.970,0.689,98.341,0,0,389642,28858
1224314880,132333006848,54489088,1191821312,0.031,0.031,99.875,0.062,0,10064,5238
1225236480,132332068864,54489088,1191837696,0.313,0.250,99.437,0,0,170040,12112
1237794816,132319059968,54489088,1192284160,0.594,0.188,99.218,0,0,386738,15034
1224908800,132332388352,54489088,1191841792,0.501,0.344,99.155,0,0,3968,18728
1237352448,132319481856,54501376,1192288256,0.563,0.188,98.312,0.938,0,383810,11986
1224347648,132332920832,54513664,1191841792,0.313,0.626,98.999,0.063,0,5422,15600
1235984384,132321284096,54513664,1191841792,0.344,0.063,99.594,0,0,382414,10624
1228849152,132328411136,54513664,1191845888,0.719,0.500,98.780,0,0,4960,15982
1228820480,132328439808,54513664,1191845888,0,0,100,0,0,934,0
1230147584,132327092224,54525952,1191845888,1.626,0.281,98.031,0.063,0,222610,11368
1229746176,132327481344,54538240,1191845888,0,0,99.687,0.313,0,3674,2668
1229467648,132327759872,54538240,1191845888,0,0,100,0,0,2086,0
1229090816,132328026112,54538240,1191956480,0.031,0,99.969,0,0,166602,4156
1229049856,132328042496,54538240,1191981056,0.437,0.156,99.406,0,0,180360,10760
1236471808,132320428032,54538240,1192173568,0.188,0.063,99.750,0,0,179914,21210
1236152320,132320710656,54566912,1192181760,0,0.031,99.531,0.438,0,12600,13132
1235886080,132320976896,54566912,1192181760,0.031,0,99.969,0,0,13654,13328
1235361792,132321501184,54566912,1192181760,0,0.031,99.969,0,0,13542,13132
1235087360,132321775616,54566912,1192181760,0.031,0,99.969,0,0,14294,13034
1234804736,132322058240,54566912,1192181760,0,0.031,99.969,0,0,26970,19040
1234518016,132322332672,54579200,1192181760,0,0,99.875,0.125,0,13006,13132
1234259968,132322590720,54579200,1192181760,0,0,100,0,0,18724,13328
1234001920,132322848768,54579200,1192181760,0,0,100,0,0,40668,13230
1234001920,132322848768,54579200,1192181760,0.031,0.031,99.938,0,0,15188,13312
1225703424,132331331584,54579200,1191997440,0,0,100,0,0,3802,2236
1224765440,132332265472,54579200,1192001536,0.281,0.094,99.281,0.344,0,173890,14652
1223970816,132333047808,54591488,1192001536,0,0,99.969,0.031,0,1338,0
1223708672,132333309952,54591488,1192001536,0,0,100,0,0,1098,0
1223708672,132333309952,54591488,1192001536,0,0,100,0,0,1040,84
1223688192,132333318144,54603776,1192001536,0,0,99.938,0.062,0,2256,0
1223671808,132333334528,54603776,1192001536,0,0,99.812,0.188,0,2948,0
1223671808,132333334528,54603776,1192001536,0,0,100,0,0,2318,0
1223143424,132333850624,54611968,1192005632,0,0,99.938,0.062,0,752,0
1229602816,132327391232,54611968,1192005632,1.034,0.658,98.308,0,0,390234,30778
1229570048,132327424000,54611968,1192005632,0,0,100,0,0,586,0
1382514688,132174225408,54611968,1192312832,3.035,0.469,96.496,0,0,333658,14176
1384198144,132172644352,54616064,1192206336,0,0,99.625,0.375,0,1790,0
1383710720,132173135872,54616064,1192206336,0.031,0,99.969,0,0,2716,0
1382936576,132173881344,54640640,1192206336,0,0,99.938,0.062,0,1844,84
1382420480,132174397440,54640640,1192206336,0,0,100,0,0,6108,180
1382420480,132174397440,54640640,1192206336,0.125,0,99.875,0,0,1040,84
1382088704,132174729216,54640640,1192206336,3.160,0,96.527,0.313,0,2490,0
1381830656,132174987264,54640640,1192206336,3.122,0,96.878,0,0,2510,0
1381822464,132174987264,54648832,1192206336,3.126,0,96.843,0.031,0,2024,2404
1381785600,132175024128,54648832,1192206336,3.156,0,96.844,0,0,6814,0
1381269504,132175540224,54648832,1192206336,3.128,0,96.872,0,0,2542,220
1381003264,132175798272,54657024,1192206336,3.122,0,96.472,0.406,0,6002,0
1380745216,132176056320,54657024,1192206336,3.497,0,96.503,0,0,3114,0
1380728832,132176064512,54665216,1192206336,3.158,0.031,96.748,0.063,0,11502,0
1380728832,132176064512,54665216,1192206336,3.159,0,96.841,0,0,6046,0
1380470784,132176322560,54665216,1192206336,3.152,0.031,96.816,0,0,11710,0
1379946496,132176838656,54673408,1192206336,3.126,0,96.468,0.406,0,6544,0
1379688448,132177096704,54673408,1192206336,3.156,0,96.844,0,0,6524,0
1379680256,132177096704,54681600,1192206336,3.127,0,96.811,0.063,0,3308,0
1379680256,132177096704,54681600,1192206336,3.123,0,96.877,0,0,4752,496
1379164160,132177612800,54681600,1192206336,3.125,0,96.875,0,0,8078,0
1378897920,132177870848,54689792,1192206336,3.156,0,96.500,0.344,0,1504,0
1378123776,132178644992,54689792,1192206336,3.128,0,96.872,0,0,9922,0
1377857536,132178903040,54697984,1192206336,3.123,0,96.783,0.094,0,1296,0
1377599488,132179161088,54697984,1192206336,3.156,0,96.844,0,0,6146,840
1377542144,132179214336,54697984,1192210432,3.126,0,96.874,0,0,7668,2762
1377280000,132179472384,54702080,1192210432,3.156,0,96.812,0.031,0,4104,1260
1376759808,132179980288,54706176,1192210432,3.156,0,96.688,0.156,0,30586,1754
1376251904,132180488192,54714368,1192202240,3.126,0,96.812,0.063,0,4816,2100
1403011072,132153716736,54714368,1192214528,4.466,0.094,95.440,0,0,2300894,835120
1455755264,132100886528,54714368,1192218624,8.620,0.527,90.853,0,0,12338794,3830204
1538969600,132017631232,54714368,1192218624,9.201,0.749,90.050,0,0,27024678,4512444
1594142720,131962404864,54722560,1192222720,5.239,0.592,93.982,0.187,0,34408068,3624666
1681469440,131875065856,54730752,1192226816,4.466,0.531,94.972,0.031,0,49291804,3305426
1713082368,131843452928,54730752,1192226816,3.998,0.312,95.690,0,0,60087626,4091098
1736835072,131819700224,54730752,1192226816,4.212,0.374,95.413,0,0,69250996,4381566
1780953088,131775582208,54730752,1192226816,4.156,0.406,95.438,0,0,85546566,4705312
1833058304,131723468800,54738944,1192226816,4.242,0.811,94.541,0.405,0,99597466,4340418
1891864576,131664654336,54747136,1192226816,4.894,0.686,94.389,0.031,0,113408522,6133372
1958776832,131597742080,54747136,1192226816,4.613,0.561,94.825,0,0,122316708,6275644
2021908480,131534610432,54747136,1192226816,4.308,0.781,94.911,0,0,116837340,5752872
2082328576,131474190336,54747136,1192226816,4.036,0.688,95.275,0,0,115283656,5204450
2153385984,131403120640,54755328,1192230912,3.914,0.595,95.053,0.438,0,113599212,4711082
2232827904,131323670528,54763520,1192230912,3.853,0.595,95.489,0.063,0,118145916,5002078
2308648960,131247849472,54763520,1192230912,4.061,0.687,95.251,0,0,115623468,4894778
2392895488,131163602944,54763520,1192230912,3.951,0.596,95.453,0,0,114796352,5312398
2475708416,131080790016,54763520,1192230912,4.068,0.657,95.275,0,0,111968222,5840472
2563674112,130992824320,54763520,1192230912,4.124,0.656,95.220,0,0,114526538,5768922
2646511616,130909970432,54779904,1192230912,4.130,0.594,95.213,0.063,0,118285222,5694676
2734149632,130822332416,54779904,1192230912,4.038,0.626,95.336,0,0,113883336,6356378
2814509056,130741968896,54779904,1192235008,4.068,0.782,95.150,0,0,111856348,5505308
2894913536,130661560320,54779904,1192239104,4.126,0.625,95.249,0,0,115225166,5509844
2992930816,130563543040,54779904,1192239104,5.005,0.657,94.338,0,0,119535946,5836082
3077111808,130479353856,54788096,1192239104,4.038,0.751,95.149,0.063,0,117766348,5633090
3153776640,130402689024,54788096,1192239104,3.885,0.595,95.520,0,0,112619572,4790390
3225333760,130331131904,54788096,1192239104,3.940,0.657,95.403,0,0,118942016,4485126
3307241472,130249224192,54788096,1192239104,4.006,0.563,95.430,0,0,115576650,5236350
3387117568,130169348096,54788096,1192239104,3.944,0.689,95.368,0,0,117534412,5375128
3468824576,130087632896,54796288,1192239104,4.038,0.626,95.336,0,0,115024426,4873776
3544702976,130011754496,54796288,1192239104,3.725,0.689,95.587,0,0,114497730,4644218
3628683264,129927770112,54796288,1192243200,3.911,0.751,95.338,0,0,116781766,5140556
3714428928,129842020352,54796288,1192247296,4.219,0.656,95.125,0,0,115388708,6000268
3836227584,129720221696,54796288,1192247296,7.304,1.160,91.348,0.188,0,120692366,5571548
3903377408,129653063680,54804480,1192247296,5.908,0.594,93.435,0.063,0,114825412,4915074
3964801024,129591607296,54804480,1192247296,3.979,0.533,95.489,0,0,110533014,4497060
4011040768,129545367552,54804480,1192247296,3.999,0.656,95.345,0,0,115950992,4859922
4069965824,129486442496,54804480,1192247296,4.073,0.533,95.395,0,0,112465688,5254088
4129234944,129427165184,54812672,1192247296,3.882,0.564,95.335,0.219,0,110508166,4868058
4186861568,129369530368,54820864,1192247296,3.940,0.563,95.278,0.219,0,106647150,3643944
4247953408,129308438528,54820864,1192247296,3.979,0.533,95.489,0,0,115417918,5402476
4311048192,129245343744,54820864,1192247296,3.977,0.689,95.334,0,0,116805414,5222468
4373946368,129182572544,54820864,1192243200,4.564,0.719,94.717,0,0,114939806,6119384
4450856960,129105661952,54820864,1192243200,6.993,0.562,92.445,0,0,120567298,5505202
4509409280,129047093248,54837248,1192243200,4.255,0.532,95.119,0.094,0,111901554,5444454
4568645632,128987856896,54837248,1192243200,4.133,0.470,95.398,0,0,112065938,5139530
4624560128,128931942400,54837248,1192243200,3.939,0.750,95.311,0,0,114627564,6209554
4685787136,128870715392,54837248,1192243200,3.915,0.658,95.427,0,0,114784072,4716518
4744966144,128811536384,54837248,1192243200,4.098,0.657,95.246,0,0,113955394,5789890
4803829760,128752664576,54845440,1192243200,3.922,0.502,95.576,0,0,109952370,5223666
4865593344,128690900992,54845440,1192243200,3.881,0.626,95.493,0,0,116972170,5361926
4930187264,128626302976,54845440,1192247296,3.814,0.844,95.342,0,0,118755794,4320644
4993912832,128562577408,54845440,1192247296,4.035,0.719,95.246,0,0,119451340,4706928
5056667648,128499822592,54845440,1192247296,4.065,0.719,95.216,0,0,118852494,5178222
5119315968,128437166080,54853632,1192247296,4.156,0.656,95.125,0.062,0,118615066,5057026
5182603264,128373878784,54853632,1192247296,4.035,0.657,95.308,0,0,118618914,4846304
5249024000,128307458048,54853632,1192247296,3.914,0.657,95.429,0,0,123019402,4480878
5311488000,128244994048,54853632,1192247296,3.980,0.595,95.425,0,0,119485436,5373710
5372624896,128183857152,54853632,1192247296,4.090,0.656,95.254,0,0,113208276,4772140
5433225216,128123248640,54861824,1192247296,3.791,0.721,95.457,0.031,0,113331668,4577478
5492936704,128063537152,54861824,1192247296,3.883,0.532,95.584,0,0,114095426,5636830
5553922048,128002551808,54861824,1192247296,3.887,0.564,95.549,0,0,114555132,4847148
5616574464,127939895296,54861824,1192251392,4.119,0.624,95.257,0,0,118261580,5190228
5678137344,127878332416,54861824,1192251392,4.190,0.657,95.153,0,0,113324538,5054388
5740613632,127815856128,54870016,1192243200,3.920,0.564,95.484,0.031,0,118252188,4671410
5803315200,127753146368,54870016,1192251392,3.945,0.908,95.147,0,0,113682082,5065514
5865467904,127690993664,54870016,1192251392,4.184,0.656,95.161,0,0,114506628,6245542
5926584320,127629877248,54870016,1192251392,4.152,0.656,95.192,0,0,115648238,5135934
5987475456,127568986112,54870016,1192251392,4.094,0.625,95.281,0,0,116793616,4719872
6051991552,127504465920,54878208,1192247296,4.133,0.532,95.304,0.031,0,121040810,5507406
6114889728,127441559552,54878208,1192255488,4.130,0.563,95.307,0,0,118750544,5292908
6171492352,127384956928,54878208,1192255488,4.033,0.688,95.280,0,0,108261506,6077374
6234370048,127322075136,54878208,1192259584,3.911,0.720,95.369,0,0,117493972,4773774
6296637440,127259807744,54878208,1192259584,4.469,0.562,94.969,0,0,119295936,5014278
6360993792,127195443200,54886400,1192259584,5.772,0.718,93.229,0.281,0,119651568,4875668
6420639744,127135789056,54894592,1192259584,4.095,0.594,95.280,0.031,0,112508446,5694052
6482317312,127074111488,54894592,1192259584,4.906,0.562,94.531,0,0,115788074,5257912
6549073920,127007354880,54894592,1192259584,3.853,0.721,95.426,0,0,122341990,4774678
6609063936,126947364864,54894592,1192259584,4.191,0.532,95.277,0,0,114183130,5567386
6671749120,126884671488,54902784,1192259584,3.949,0.533,95.487,0.031,0,119037964,4919420
6734422016,126821998592,54902784,1192259584,4.003,0.719,95.278,0,0,118884770,5759432
6798241792,126758174720,54902784,1192263680,4.061,0.812,95.127,0,0,122262558,6300018
6865227776,126691188736,54902784,1192263680,4.129,0.626,95.246,0,0,124923322,5052336
6925033472,126631383040,54902784,1192263680,3.886,0.501,95.613,0,0,112733422,4806262
6986199040,126570209280,54910976,1192263680,4.043,0.627,95.299,0.031,0,117121706,6405204
7047602176,126508806144,54910976,1192263680,3.887,0.502,95.611,0,0,114444652,4860798
7107989504,126448418816,54910976,1192263680,3.974,0.563,95.463,0,0,116233742,5551594
7171280896,126385127424,54910976,1192263680,4.096,0.563,95.341,0,0,118019188,4977716
7233896448,126322511872,54910976,1192263680,4.219,0.500,95.281,0,0,116438976,5571224
7295221760,126261174272,54919168,1192263680,4.062,0.688,95.188,0.062,0,114646170,4860166
7357370368,126199025664,54919168,1192263680,4.062,0.594,95.344,0,0,115219236,5465982
7419133952,126137257984,54919168,1192267776,4.064,0.625,95.311,0,0,116559818,4997766
7474528256,126081863680,54919168,1192267776,4.345,0.656,94.998,0,0,106434836,5784708
7542534144,126013857792,54919168,1192267776,4.131,0.814,95.055,0,0,123756714,5622322
7605047296,125951336448,54927360,1192267776,4.568,0.751,94.650,0.031,0,115803926,5687824
7664283648,125892100096,54927360,1192267776,4.009,0.626,95.365,0,0,111279228,5719540
7725658112,125830725632,54927360,1192267776,4.074,0.627,95.299,0,0,115196932,6094824
7794626560,125761757184,54927360,1192267776,5.094,0.656,94.250,0,0,117779944,4672610
7864418304,125691965440,54927360,1192267776,7.344,0.562,92.094,0,0,120412586,4507462
7931973632,125624401920,54935552,1192267776,6.508,0.594,92.866,0.031,0,119218842,6283354
7993602048,125562769408,54935552,1192271872,3.912,0.657,95.430,0,0,116527366,4855360
8048529408,125507833856,54935552,1192275968,4.031,0.688,95.281,0,0,114602524,5185532
8110784512,125445578752,54935552,1192275968,4.071,0.532,95.396,0,0,117381946,5676880
8172990464,125383372800,54935552,1192275968,4.129,0.563,95.308,0,0,117129540,5253490
8236883968,125319471104,54943744,1192275968,4.257,0.563,95.149,0.031,0,120160320,5736906
8296919040,125259427840,54951936,1192275968,3.923,0.596,95.449,0.031,0,112049776,4508480
8359460864,125196886016,54951936,1192275968,3.852,0.752,95.396,0,0,117926070,5244956
8422268928,125134077952,54951936,1192275968,4.065,0.625,95.310,0,0,117537934,5322120
8484790272,125071556608,54951936,1192275968,4.125,0.656,95.219,0,0,118520082,5321432
8545615872,125010718720,54960128,1192280064,4.005,0.626,95.307,0.063,0,116085446,5765874
8605368320,124950966272,54960128,1192280064,3.855,0.595,95.299,0.251,0,113106586,5214848
8667975680,124888358912,54960128,1192280064,4.098,0.532,95.371,0,0,115356446,5047490
8729260032,124827074560,54960128,1192280064,3.944,0.657,95.399,0,0,114808840,4999256
8789843968,124766490624,54960128,1192280064,4.232,0.627,95.141,0,0,114455862,5561594
8854528000,124701798400,54968320,1192280064,4.038,0.563,95.368,0.031,0,121064608,6113558
8918249472,124638076928,54968320,1192280064,4.030,0.750,95.127,0.094,0,120595376,4886306
8982024192,124574294016,54968320,1192288256,4.850,0.688,94.462,0,0,117962742,6099084
9042108416,124514205696,54968320,1192292352,4.011,0.595,95.393,0,0,113679766,5387708
9100193792,124456120320,54968320,1192292352,4.466,0.625,94.909,0,0,108165480,5785426
9161719808,124394586112,54976512,1192292352,4.158,0.625,95.186,0.031,0,116729666,5842708
9223372800,124332933120,54976512,1192292352,3.885,0.627,95.489,0,0,116436690,5852912
9289265152,124267032576,54984704,1192292352,4.128,0.750,95.059,0.063,0,117183402,5215806
9353498624,124202782720,55001088,1192292352,4.004,0.688,94.839,0.469,0,121537594,5354782
9409703936,124146577408,55001088,1192292352,4.215,0.500,95.286,0,0,108108242,5172336
9475055616,124081217536,55009280,1192292352,3.942,0.720,95.307,0.031,0,122061394,5059488
9538555904,124017713152,55009280,1192296448,4.128,0.688,95.184,0,0,121648840,5901204
9597046784,123959222272,55009280,1192296448,4.213,0.593,95.194,0,0,110704852,5841042
9656737792,123899531264,55009280,1192296448,3.979,0.564,95.457,0,0,116481444,6757768
9716830208,123839438848,55009280,1192296448,3.972,0.563,95.464,0,0,112199340,5425504
9780805632,123775463424,55009280,1192296448,3.882,0.689,95.429,0,0,119223942,5661178
9840820224,123715428352,55021568,1192304640,4.096,0.594,95.247,0.063,0,113975722,5819524
9904259072,123651989504,55021568,1192304640,4.159,0.532,95.310,0,0,118191856,5105180
9966428160,123589820416,55021568,1192304640,3.912,0.689,95.399,0,0,119391428,5210292
10029764608,123526479872,55021568,1192308736,4.003,0.782,95.216,0,0,118531304,6206128
10092589056,123463655424,55021568,1192308736,3.915,0.595,95.490,0,0,119819390,5096968
10153709568,123402526720,55029760,1192308736,4.068,0.594,95.307,0.031,0,116098568,4950430
10216927232,123339309056,55029760,1192308736,3.892,0.565,95.543,0,0,116835882,6271938
10282221568,123274014720,55029760,1192308736,4.061,0.687,95.251,0,0,123733056,5256448
10345242624,123210993664,55029760,1192308736,3.852,0.658,95.490,0,0,114935352,4346016
10409963520,123146272768,55029760,1192308736,4.160,0.563,95.277,0,0,118731184,5344364
10467024896,123089203200,55037952,1192308736,3.874,0.656,95.408,0.062,0,107531900,4506980
10525245440,123030978560,55037952,1192312832,3.856,0.564,95.580,0,0,110692576,5650786
10587598848,122968625152,55037952,1192312832,4.062,0.656,95.281,0,0,118426410,6029144
10651947008,122904276992,55037952,1192312832,3.980,0.564,95.456,0,0,121420050,6689440
10715168768,122841055232,55037952,1192312832,4.099,0.501,95.401,0,0,118929020,5204012
10775756800,122780459008,55046144,1192312832,3.942,0.626,95.369,0.063,0,116442976,4820666
10833432576,122722783232,55046144,1192312832,3.910,0.626,95.246,0.219,0,108505958,5196194
10893795328,122662420480,55046144,1192312832,3.912,0.595,95.493,0,0,114410232,5103962
10954674176,122601541632,55046144,1192312832,4.228,0.626,95.146,0,0,117230552,5439694
11015802880,122540408832,55046144,1192316928,3.970,0.656,95.374,0,0,111046408,5565186
11075788800,122480414720,55054336,1192316928,3.942,0.657,95.338,0.063,0,114522882,5713910
11133677568,122422517760,55062528,1192316928,3.793,0.533,95.643,0.031,0,109115698,4712404
11193516032,122362679296,55062528,1192316928,4.033,0.656,95.311,0,0,113521822,5154546
11254292480,122301902848,55062528,1192316928,3.976,0.564,95.460,0,0,114652488,5121320
11319439360,122236755968,55062528,1192316928,4.006,0.595,95.399,0,0,120948080,4979802
11385856000,122170331136,55070720,1192316928,3.975,0.689,95.274,0.063,0,124037728,4909118
11445956608,122110230528,55070720,1192316928,3.977,0.532,95.365,0.125,0,114050168,4914090
11505958912,122050228224,55070720,1192316928,3.947,0.595,95.457,0,0,114098306,5767854
11566936064,121989246976,55070720,1192321024,3.915,0.470,95.615,0,0,111429892,5028154
11629039616,121927143424,55070720,1192321024,4.130,0.532,95.338,0,0,117196524,5664332
11686776832,121869398016,55078912,1192321024,3.910,0.688,95.339,0.063,0,110968068,5751790
11750617088,121805557760,55078912,1192321024,4.008,0.689,95.304,0,0,119025042,5516184
11810410496,121745756160,55087104,1192321024,3.756,0.626,95.587,0.031,0,112322950,4339518
11870048256,121686114304,55087104,1192325120,3.944,0.626,95.430,0,0,113724886,5607980
11933941760,121622220800,55087104,1192325120,4.095,0.656,95.249,0,0,118483560,5127964
11995209728,121560944640,55095296,1192325120,3.886,0.658,95.425,0.031,0,114429080,5508702
12055932928,121500217344,55095296,1192329216,3.970,0.625,95.405,0,0,113523268,5777310
12118671360,121437478912,55095296,1192329216,3.949,0.564,95.487,0,0,117091132,5268328
12178444288,121377705984,55095296,1192329216,4.033,0.813,95.155,0,0,116032284,5702818
12236898304,121319243776,55103488,1192329216,3.972,0.532,95.433,0.063,0,110356188,4696404
12294807552,121261326336,55111680,1192329216,4.069,0.469,95.430,0.031,0,110600500,5397550
12357234688,121198899200,55111680,1192329216,3.977,0.720,95.302,0,0,115647862,6552200
12420562944,121135570944,55111680,1192329216,4.008,0.626,95.366,0,0,119544702,4927034
12481220608,121074913280,55111680,1192329216,4.125,0.562,95.312,0,0,112449340,5369304
12540071936,121016057856,55111680,1192333312,3.944,0.595,95.462,0,0,111164378,5119764
12602511360,120953610240,55119872,1192333312,4.008,0.470,95.492,0.031,0,116484744,5182254
12667002880,120889118720,55119872,1192333312,4.138,0.596,95.266,0,0,120300578,5987056
12732035072,120824086528,55119872,1192333312,4.122,0.687,95.191,0,0,120459192,5405790
12795043840,120761077760,55119872,1192333312,3.822,0.658,95.520,0,0,118805564,4993962
12857552896,120698568704,55119872,1192333312,3.824,0.533,95.643,0,0,114762032,4710108
12919046144,120637063168,55128064,1192333312,3.976,0.657,95.335,0.031,0,117081168,6102268
12981309440,120574799872,55128064,1192333312,4.005,0.594,95.401,0,0,115796292,5057494
13041668096,120514441216,55128064,1192333312,4.099,0.532,95.369,0,0,115389644,6057026
13107093504,120449011712,55128064,1192337408,3.976,0.657,95.366,0,0,121241318,5113824
13170655232,120385449984,55128064,1192337408,3.910,0.751,95.339,0,0,119451814,5174860
13233061888,120323035136,55136256,1192337408,4.040,0.595,95.302,0.063,0,118760212,6035458
13294862336,120261234688,55136256,1192337408,3.945,0.657,95.398,0,0,118284952,4945440
13353644032,120202452992,55136256,1192337408,3.949,0.564,95.331,0.157,0,110207920,5740148
13417816064,120138280960,55136256,1192337408,4.100,0.595,95.305,0,0,120014992,5254644
13478789120,120077307904,55136256,1192337408,3.792,0.689,95.519,0,0,115335514,5314290
13537705984,120018382848,55144448,1192337408,3.793,0.502,95.643,0.063,0,111486170,4778748
13597958144,119958126592,55144448,1192341504,4.148,0.686,95.165,0,0,111702394,5355322
13661831168,119894245376,55152640,1192341504,4.004,0.594,95.246,0.156,0,120033378,3790566
13725650944,119830425600,55152640,1192341504,4.133,0.438,95.429,0,0,119413004,5509368
13787213824,119768862720,55152640,1192341504,3.917,0.627,95.456,0,0,117961550,6490606
13847662592,119708405760,55160832,1192341504,3.880,0.657,95.401,0.063,0,113084776,4876256
13907918848,119648145408,55160832,1192345600,3.946,0.595,95.459,0,0,113754122,5439496
13974212608,119581851648,55160832,1192345600,3.974,0.720,95.307,0,0,123756394,5368156
14037659648,119518404608,55160832,1192345600,3.979,0.658,95.363,0,0,121362516,5988842
14095986688,119460073472,55160832,1192349696,3.917,0.533,95.550,0,0,109370230,6372362
14156361728,119399690240,55169024,1192349696,3.942,0.751,95.275,0.031,0,117475932,6604454
14219231232,119336820736,55169024,1192349696,4.215,0.624,95.161,0,0,117527962,5337202
14280056832,119275995136,55169024,1192349696,3.914,0.595,95.492,0,0,113918216,5495560
14340411392,119215640576,55169024,1192349696,4.261,0.564,95.175,0,0,117307312,5982194
14401306624,119154745344,55169024,1192349696,3.946,0.564,95.490,0,0,115423388,4631592
14462767104,119093276672,55177216,1192349696,3.974,0.563,95.432,0.031,0,115258908,4477988
14522175488,119033868288,55177216,1192349696,4.098,0.563,95.339,0,0,113275156,5913042
14579941376,118976098304,55177216,1192353792,3.917,0.501,95.581,0,0,110061322,5440518
14639742976,118916296704,55185408,1192345600,3.977,0.564,95.427,0.031,0,113804460,5687422
14701010944,118855020544,55185408,1192353792,3.975,0.563,95.462,0,0,115117688,5044936
14763757568,118792261632,55193600,1192357888,4.038,0.657,95.274,0.031,0,117932642,6066942
14824448000,118731571200,55193600,1192357888,3.850,0.626,95.524,0,0,112197046,4314972
14886539264,118669479936,55193600,1192357888,4.094,0.594,95.312,0,0,116493862,4700212
14948024320,118607994880,55193600,1192357888,4.129,0.563,95.308,0,0,117298050,6341220
15010922496,118545096704,55193600,1192357888,4.004,0.688,95.308,0,0,117676080,5049086
15073046528,118482960384,55201792,1192361984,3.975,0.626,95.368,0.031,0,117477666,4810176
15133052928,118422953984,55201792,1192361984,3.914,0.657,95.429,0,0,112039420,5471774
15190048768,118365958144,55201792,1192361984,3.822,0.533,95.645,0,0,105027894,5030128
15244779520,118311227392,55201792,1192361984,3.664,0.689,95.647,0,0,105978248,5208630
15307001856,118249005056,55201792,1192361984,4.034,0.625,95.341,0,0,116001424,4299714
15364825088,118191173632,55209984,1192361984,3.911,0.563,95.432,0.094,0,109632004,5060782
15414689792,118141308928,55209984,1192361984,3.817,0.501,95.682,0,0,93052370,4993510
15455739904,118100254720,55209984,1192366080,3.662,0.501,95.837,0,0,79765682,4073890
15489765376,118066221056,55218176,1192366080,3.782,0.313,95.655,0.250,0,64873642,3837478
15519444992,118036537344,55218176,1192370176,3.604,0.313,96.083,0,0,56609922,4065218
15539351552,118016622592,55226368,1192370176,3.871,0.187,95.910,0.031,0,40520794,3783846
15556210688,117999763456,55226368,1192370176,3.594,0.188,96.219,0,0,32394878,3743098
15565164544,117990809600,55226368,1192370176,3.349,0.094,96.557,0,0,18895254,3329132
15567253504,117988708352,55234560,1192374272,3.314,0.094,96.343,0.250,0,7413858,2728222
15566077952,117989883904,55234560,1192374272,3.280,0,96.720,0,0,158378,2572428
15566499840,117989462016,55242752,1192366080,3.564,0,96.405,0.031,0,82756,4054626
15565631488,117990322176,55242752,1192374272,3.282,0,96.718,0,0,92754,3063452
15565701120,117990248448,55242752,1192378368,3.286,0.031,96.682,0,0,87362,4058018
15564460032,117991489536,55242752,1192378368,3.279,0,96.627,0.094,0,99512,2516926
15564374016,117991567360,55250944,1192378368,3.191,0.031,96.746,0.031,0,94072,2133302
15562727424,117993205760,55259136,1192378368,3.221,0.031,96.717,0.031,0,116818,3047026
11907854336,121648074752,55259136,1192378368,2.879,0.438,96.683,0,0,101144,2773642
9415507968,124140642304,55259136,1192157184,0.250,0.312,99.438,0,0,46438,0
9415499776,124140650496,55259136,1192157184,0,0,99.812,0.188,0,12390,0
9415495680,124140654592,55259136,1192157184,0,0,100,0,0,5510,0
9415487488,124140662784,55259136,1192157184,0,0,100,0,0,7078,0
9415467008,124140662784,55279616,1192157184,0,0,99.906,0.094,0,3154,1228
9415442432,124140687360,55279616,1192157184,0,0,100,0,0,2290,0
9415426048,124140703744,55279616,1192157184,0,0.031,99.969,0,0,10626,0
9415426048,124140703744,55279616,1192157184,0,0,100,0,0,10280,0
9415159808,124140969984,55279616,1192157184,0,0.031,99.969,0,0,6932,0
9415151616,124140969984,55287808,1192157184,0,0.031,99.938,0.031,0,3452,0
9415151616,124140969984,55287808,1192157184,0,0,100,0,0,31548,0
9414893568,124141228032,55287808,1192157184,0,0,100,0,0,1474,0
9414893568,124141228032,55287808,1192157184,0,0,100,0,0,22752,78
9414893568,124141228032,55287808,1192157184,0,0,100,0,0,6536,312
9414893568,124141228032,55287808,1192157184,0,0,100,0,0,36478,156
9414627328,124141486080,55296000,1192157184,0,0,99.937,0.063,0,33030,468
9414627328,124141486080,55296000,1192157184,0,0,100,0,0,69664,156
9414627328,124141486080,55296000,1192157184,0,0,100,0,0,14692,398
9442037760,124111683584,55296000,1192615936,1.376,0.751,97.873,0,0,493811,51698
