172.16.72.14 : 4.26 4.28 4.30 4.30 4.29 4.29 4.30 4.29 4.27 4.28
172.16.72.23 : 4.24 4.25 4.24 4.27 4.26 4.27 4.27 4.26 4.26 4.26
172.16.72.25 : 200.23 - 200.31 200.31 200.30 200.26 200.28 200.25 200.28 200.31
172.16.72.26 : - 200.30 200.29 200.32 200.32 200.29 200.32 200.32 200.30 200.27
172.16.72.27 : 200.28 - 200.31 200.33 200.33 200.32 200.34 200.32 200.33 200.34
172.16.72.28 : 200.27 200.28 200.33 200.31 200.29 200.32 200.32 200.32 - 200.32
172.16.72.29 : 200.26 200.28 200.27 200.26 200.27 200.28 200.26 200.30 200.25 200.25
172.16.72.3  : 200.25 200.31 200.29 200.32 - - - 200.31 200.30 200.27
172.16.72.30 : 200.30 200.34 200.33 - 200.30 - 200.32 200.28 200.28 200.30
172.16.72.31 : 200.34 - 200.33 200.32 200.33 200.32 200.33 200.24 200.30 200.31
172.16.72.32 : - 200.34 200.27 - 200.30 200.33 200.27 200.29 - -
172.16.72.33 : 200.30 200.29 200.28 200.33 - 200.29 200.31 200.27 200.30 200.31
172.16.72.34 : 200.29 200.23 200.30 200.27 200.28 200.28 - 200.25 200.29 200.27
172.16.72.35 : 200.31 200.30 200.30 200.26 200.24 200.29 200.30 200.26 200.30 200.30
172.16.72.36 : 200.25 200.27 - 200.27 200.28 200.28 200.29 200.28 200.30 200.30
172.16.72.37 : 200.28 200.28 200.29 200.26 200.30 200.33 200.30 200.32 200.31 200.30
172.16.72.38 : 200.33 200.33 200.31 200.32 200.33 200.33 200.32 200.30 200.34 200.35
172.16.72.39 : 200.23 200.29 200.30 200.31 200.32 200.32 200.31 200.32 200.32 200.29
172.16.72.4  : 0.16 0.21 0.19 0.20 0.16 0.17 0.20 0.20 0.19 0.19
172.16.72.40 : 0.03 0.03 0.04 0.03 0.03 0.03 0.03 0.03 0.03 0.03
172.16.72.41 : 0.20 0.17 0.20 0.19 0.18 0.20 0.21 0.20 0.20 0.19
172.16.72.42 : 0.27 0.17 0.20 0.20 0.20 0.20 0.17 0.21 0.16 0.21
172.16.72.43 : 0.28 0.16 0.19 0.17 0.19 0.19 0.20 0.19 0.19 0.18
172.16.72.44 : 0.28 0.21 0.20 0.21 0.18 0.17 0.21 0.18 0.19 0.20
172.16.72.46 : 0.29 0.20 0.15 0.21 0.20 0.19 0.20 0.19 0.21 0.21
172.16.72.47 : 0.29 0.21 0.17 0.17 0.19 0.20 0.22 0.19 0.20 0.14
172.16.72.48 : 0.20 0.19 0.19 0.19 0.19 0.20 0.19 0.20 0.21 0.21
172.16.72.49 : 0.32 0.16 0.22 0.21 0.20 0.18 0.13 0.19 0.19 0.18
172.16.72.5  : 0.32 0.21 0.19 0.18 0.21 0.15 0.18 0.17 0.19 0.18
172.16.72.50 : 0.32 0.20 0.19 0.16 0.20 0.20 0.20 0.19 0.17 0.20
172.16.72.51 : 0.31 0.19 0.21 0.20 0.18 0.15 0.18 0.17 0.20 0.21
172.16.72.6  : 0.25 0.21 0.21 0.20 0.21 0.18 0.21 0.19 0.20 0.19
172.16.72.7  : 0.21 0.18 0.14 0.12 0.20 0.19 0.20 0.19 0.19 0.22
172.16.72.8  : 0.29 0.19 0.19 0.19 0.20 0.17 0.21 0.18 0.17 0.22
172.16.72.9  : 4.26 4.29 4.29 4.30 4.29 4.27 4.27 4.23 4.30 4.26

      35 targets
      35 alive
       0 unreachable
       0 unknown addresses

      11 timeouts (waiting for response)
     350 ICMP Echos sent
     333 ICMP Echo Replies received
       0 other ICMP received

 0.03 ms (min round trip time)
 86.4 ms (avg round trip time)
 200 ms (max round trip time)
       10.153 sec (elapsed real time)

