172.16.97.11 : 20.92 10.10 10.16 10.20 10.25 10.20 10.25 10.22 10.20 10.20
172.16.97.12 : 11.51 - 10.29 - - 10.26 10.24 10.30 - 10.30
172.16.97.14 : 0.04 0.03 0.01 0.01 0.03 0.01 0.01 0.01 0.03 0.01
172.16.97.21 : 0.22 0.18 0.17 0.18 0.18 0.16 0.17 0.13 0.18 0.17
172.16.97.24 : 0.24 0.17 0.16 0.16 0.20 0.19 0.18 0.20 0.20 0.20
172.16.97.25 : 0.26 0.19 0.21 0.14 0.20 0.22 0.19 0.17 0.21 0.18
172.16.97.27 : 100.37 100.28 100.30 100.32 100.31 100.29 - 100.30 100.31 100.28
172.16.97.28 : 100.77 100.27 100.30 100.32 100.30 - 100.31 100.28 100.28 100.33
172.16.97.3  : 111.16 - 100.26 100.31 100.29 100.31 100.27 100.29 100.32 100.29
172.16.97.4  : 100.29 100.32 100.30 - 100.34 - 100.31 100.31 100.34 100.29
172.16.97.5  : 106.10 100.32 100.29 100.31 100.31 100.30 - 100.29 100.31 100.25
172.16.97.6  : 100.31 100.27 100.29 100.29 100.32 100.32 100.28 100.24 100.26 100.31
172.16.97.7  : 106.58 100.28 100.29 100.30 100.31 100.29 100.31 100.30 100.29 100.31
172.16.97.8  : - 100.27 - 100.31 100.31 - 100.27 100.29 100.29 100.29
172.16.97.9  : 13.12 4.28 4.27 4.29 4.31 4.31 4.31 4.29 4.33 4.29

      15 targets
      15 alive
       0 unreachable
       0 unknown addresses

       7 timeouts (waiting for response)
     150 ICMP Echos sent
     137 ICMP Echo Replies received
       0 other ICMP received

 0.01 ms (min round trip time)
 53.8 ms (avg round trip time)
 111 ms (max round trip time)
       10.144 sec (elapsed real time)

