"Dstat 0.7.3 CSV output"
"Author:","Dag Wieers <dag@wieers.com>",,,,"URL:","http://dag.wieers.com/home-made/dstat/"
"Host:","econome-5.nantes.grid5000.fr",,,,"User:","root"
"Cmdline:","dstat -m -c -n -o dstat.csv",,,,"Date:","26 May 2020 22:32:42 CEST"
"memory usage",,,,"total cpu usage",,,,,"net/total",
"used","free","buff","cach","usr","sys","idl","wai","stl","recv","send"
842883072,65422991360,66850816,967065600,3.650,0.825,95.359,0.166,0,0,0
839819264,65425965056,66850816,967147520,1.124,0.656,98.220,0,0,397430,29606
839274496,65426698240,66850816,966959104,0,0.031,99.875,0.094,0,5126,0
836616192,65429340160,66850816,966963200,1.032,0.626,98.342,0,0,392122,21534
836632576,65429323776,66850816,966963200,0,0.031,99.969,0,0,17600,3618
838406144,65427488768,66875392,966967296,1.188,0.500,98.312,0,0,394566,15716
837365760,65428529152,66875392,966967296,0,0,100,0,0,13240,132
836841472,65429053440,66875392,966967296,0,0.031,99.781,0.188,0,7792,614
836841472,65429053440,66875392,966967296,0,0,100,0,0,7464,0
836583424,65429311488,66875392,966967296,0,0,100,0,0,3404,0
844357632,65421524992,66899968,966955008,0.219,0.094,99.656,0.031,0,386936,14918
833679360,65432178688,66899968,966967296,0.907,0.469,98.655,-0.031,0,6594,6466
836464640,65429274624,66899968,967086080,0.250,0.188,99.562,0,0,170946,11008
847466496,65417891840,66899968,967421952,0.626,0.250,99.124,0,0,387496,15090
838438912,65426919424,66899968,967421952,0.375,0.469,99.156,0,0,8650,14292
837120000,65428680704,66899968,966975488,1.001,0.657,98.343,0,0,387958,17106
836829184,65428946944,66924544,966975488,0,0,100,0,0,3820,0
838311936,65427464192,66924544,966975488,1.125,0.656,98.219,0,0,387388,17014
837165056,65428611072,66924544,966975488,0,0,100,0,0,1482,0
836907008,65428869120,66924544,966975488,0,0,100,0,0,610,0
838029312,65427701760,66924544,966979584,1.782,0.250,97.968,0,0,222586,10864
837771264,65427959808,66924544,966979584,0.594,0.125,99.281,0,0,345216,17500
843870208,65421651968,66949120,967163904,0.219,0.063,99.719,0,0,170868,12244
843161600,65422360576,66949120,967163904,0,0.031,99.969,0,0,6572,3822
842895360,65422626816,66949120,967163904,0,0,100,0,0,7476,3920
842887168,65422635008,66949120,967163904,0,0.031,99.969,0,0,11344,4386
842629120,65422893056,66949120,967163904,0,0,100,0,0,5724,3724
842629120,65422893056,66949120,967163904,0,0,100,0,0,8038,5864
842342400,65423151104,66969600,967172096,0,0,100,0,0,3640,3920
842084352,65423409152,66969600,967172096,0,0,100,0,0,6104,3822
842084352,65423409152,66969600,967172096,0,0,100,0,0,3960,3906
841568256,65423925248,66969600,967172096,0,0,100,0,0,12094,3822
835706880,65429786624,66969600,967172096,0.250,0.156,99.594,0,0,179864,16012
834572288,65431101440,66969600,966991872,0,0,100,0,0,5998,1948
834281472,65431367680,66994176,966991872,0,0,100,0,0,10750,652
833753088,65431896064,66994176,966991872,0,0,100,0,0,10302,220
833495040,65432154112,66994176,966991872,0,0,100,0,0,11244,180
833228800,65432420352,66994176,966991872,0,0,100,0,0,10992,496
833040384,65432608768,66994176,966991872,0,0,100,0,0,6672,0
832782336,65432866816,66994176,966991872,0,0,100,0,0,2242,0
832516096,65433124864,67002368,966991872,0,0,100,0,0,1006,0
832258048,65433382912,67002368,966991872,0,0,100,0,0,494,84
849203200,65415983104,67002368,967442432,0.844,0.562,98.594,0,0,387956,16570
834256896,65431375872,67002368,966995968,0.219,0.188,99.594,0,0,2148,13296
1444413440,64821325824,67002368,966778880,7.439,2.583,89.978,0,0,1328580,51000
4036198400,62228066304,67006464,968015872,30.266,12.050,57.684,0,0,1328268,52268
6754557952,59508097024,67022848,969539584,35.255,12.943,51.739,0.063,0,1323420,55034
9688268800,56573108224,67039232,970678272,40.244,15.447,44.215,0.094,0,1322874,55709
12412678144,53847126016,67039232,972099584,33.836,14.892,51.210,0.063,0,1158394,49612
15305097216,50953052160,67043328,973668352,37.862,13.994,47.767,0.377,0,1158680,50568
18189414400,48067612672,67043328,974639104,38.191,12.877,48.901,0.031,0,1323260,163742
20889935872,45365612544,67059712,975982592,41.507,13.187,45.181,0.126,0,1330394,592452
23581622272,42672660480,67072000,977186816,38.906,13.622,47.377,0.095,0,1343680,1140486
26386849792,39866306560,67076096,978268160,43.088,13.730,43.151,0.032,0,1357876,1664195
29306286080,36945444864,67129344,979501056,45.440,13.960,40.443,0.156,0,379858,1922163
30239543296,36011819008,67166208,979828736,25.773,4.873,61.949,7.404,0,52824,2077012
30423031808,35828248576,67174400,979886080,13.540,1.273,81.304,3.882,0,56674,2383717
30688751616,35562483712,67174400,979931136,18.865,1.871,79.233,0.031,0,67214,2926967
30892249088,35358883840,67186688,980008960,15.827,1.648,82.400,0.124,0,77936,3328210
31038472192,35212587008,67186688,980082688,17.684,2.077,80.208,0.031,0,83342,3771428
31158976512,35091984384,67186688,980180992,16.724,1.543,81.701,0.031,0,96496,4318904
31314575360,34936147968,67194880,980402176,17.645,1.811,80.418,0.125,0,98422,4365196
31428714496,34821910528,67194880,980496384,16.188,3.119,80.630,0.062,0,97278,4079948
31514718208,34735820800,67194880,980582400,14.851,1.825,83.292,0.031,0,94056,4019164
31603032064,34647408640,67194880,980676608,16.254,1.848,81.835,0.063,0,95922,3909782
31656640512,34593542144,67194880,980922368,13.734,1.931,84.273,0.062,0,94540,3925632
31620562944,34629537792,67203072,980996096,9.262,1.314,89.299,0.125,0,93458,3997182
31585251328,34664730624,67203072,981114880,8.380,1.184,90.436,0,0,95050,4183012
31533125632,34716753920,67203072,981213184,7.726,1.792,90.482,0,0,94252,4053188
31507435520,34742358016,67203072,981299200,7.472,1.526,90.971,0.031,0,93022,3694552
31502221312,34747465728,67203072,981405696,6.587,1.040,92.373,0,0,85308,3493348
31490162688,34759421952,67211264,981495808,7.065,1.058,91.752,0.124,0,95010,3618520
31489949696,34759544832,67211264,981585920,6.365,1.404,92.200,0.031,0,93736,3648970
31480684544,34768683008,67211264,981712896,6.616,1.223,92.161,0,0,95668,3522526
31474089984,34775207936,67211264,981782528,6.417,0.654,92.897,0.031,0,88770,3492744
31478304768,34770882560,67211264,981893120,6.411,0.965,92.624,0,0,87828,3268380
31480160256,34768916480,67219456,981995520,6.342,0.875,92.690,0.094,0,95158,3383804
31483142144,34765852672,67219456,982073344,4.997,0.660,94.343,0,0,94294,3500584
31484669952,34764210176,67219456,982183936,7.699,0.897,91.404,0,0,90016,3447682
31485665280,34763137024,67219456,982261760,5.780,1.212,93.008,0,0,86390,3605154
31487508480,34761179136,67219456,982376448,5.732,0.756,93.512,0,0,83200,3557966
31492485120,34756009984,67256320,982528000,6.612,1.097,90.097,2.194,0,82166,3520248
31492997120,34755272704,67256320,982749184,5.717,1.250,93.033,0,0,82964,3644958
31493611520,34754535424,67256320,982867968,5.278,1.288,93.434,0,0,82724,3673706
31497375744,34750685184,67256320,982953984,4.936,0.975,94.090,0,0,87582,3344772
31499251712,34748706816,67256320,983056384,6.440,1.125,92.435,0,0,83644,3480222
31500394496,34747330560,67317760,983216128,4.202,1.129,88.053,6.616,0,80452,3422258
31503810560,34743787520,67317760,983339008,6.462,1.223,92.315,0,0,81714,3542622
31508344832,34739138560,67317760,983449600,4.913,1.039,94.047,0,0,79548,3448740
31508459520,34738937856,67317760,983531520,4.291,0.564,95.114,0.031,0,86450,3607652
31512502272,34734800896,67317760,983625728,5.910,1.689,92.402,0,0,83310,3603112
31513980928,34733203456,67325952,983728128,3.829,0.910,95.166,0.094,0,86900,3373058
31515516928,34731552768,67334144,983834624,6.795,1.416,83.076,8.713,0,88408,3667848
31521230848,34725744640,67334144,983924736,2.836,0.851,96.314,0,0,88210,3541762
31521611776,34725269504,67334144,984018944,3.925,0.823,95.252,0,0,93114,3694572
31522672640,34724093952,67334144,984129536,5.169,1.535,93.296,0,0,88822,3693064
31523733504,34722942976,67342336,984211456,5.824,1.152,92.931,0.093,0,97842,3794144
31526141952,34720423936,67342336,984317952,4.964,1.100,93.937,0,0,94826,3720668
31527952384,34718519296,67342336,984403968,3.346,0.568,96.086,0,0,95010,3701048
31527342080,34719035392,67342336,984498176,4.299,0.879,94.823,0,0,83400,3599776
31528669184,34717581312,67342336,984621056,5.503,0.750,93.715,0.031,0,86158,3656042
31529984000,34716164096,67350528,984715264,5.899,0.816,93.222,0.063,0,83088,3614464
31535632384,34710421504,67350528,984801280,4.937,0.881,93.522,0.660,0,85808,3626582
31536463872,34709356544,67350528,985030656,5.582,0.842,93.577,0,0,87010,3587366
31542267904,34703441920,67350528,985141248,5.499,0.601,93.900,0,0,89702,3840558
31543361536,34702241792,67350528,985243648,7.024,0.721,92.255,0,0,92714,3965936
31545438208,34700062720,67358720,985337856,8.333,0.905,90.699,0.062,0,95168,3987720
31546834944,34698567680,67358720,985436160,5.783,0.534,93.652,0.031,0,86980,3956498
31549292544,34696028160,67358720,985518080,6.345,0.698,92.925,0.032,0,91644,4030460
31552737280,34692481024,67358720,985620480,6.869,0.570,92.561,0,0,91924,3922796
31552962560,34692161536,67358720,985714688,6.537,0.594,92.868,0,0,89708,3909764
31554560000,34690449408,67366912,985821184,6.326,0.626,92.922,0.125,0,90634,3749640
31558086656,34686803968,67366912,985935872,5.915,0.720,93.365,0,0,83944,3424922
31559680000,34685120512,67375104,986013696,7.886,0.660,91.266,0.189,0,85114,3449962
31561277440,34683547648,67375104,986116096,6.940,0.662,92.397,0,0,79610,3404602
31589584896,34655166464,67375104,986189824,6.850,0.694,92.456,0,0,81012,3408736
31621849088,34622779392,67383296,986300416,6.970,0.911,92.025,0.094,0,86360,3375564
31663607808,34580914176,67383296,986406912,8.634,0.754,90.612,0,0,82680,3522286
31710519296,34533924864,67383296,986484736,9.028,1.062,89.909,0,0,88864,3858772
31750578176,34493743104,67383296,986583040,9.065,0.875,90.059,0,0,91894,3983804
31778390016,34465841152,67383296,986673152,7.846,0.875,91.279,0,0,92816,4037892
31818153984,34425962496,67391488,986779648,7.947,0.782,91.114,0.156,0,86776,3670798
31840788480,34403102720,67391488,987004928,8.793,0.774,90.433,0,0,85856,3785062
31855116288,34388668416,67391488,987111424,7.996,0.690,90.405,0.909,0,86624,3924066
31909654528,34334031872,67391488,987201536,9.891,0.811,89.298,0,0,98202,3874660
31915307008,34328268800,67391488,987308032,5.164,0.876,93.959,0,0,97430,3902730
31916331008,34327134208,67399680,987406336,3.403,0.441,96.062,0.095,0,83340,3582108
31913680896,34329681920,67399680,987508736,5.058,0.691,94.251,0,0,85770,3741096
31914496000,34328752128,67399680,987611136,5.060,0.974,93.935,0.031,0,85902,3691254
31913635840,34329526272,67399680,987697152,7.183,0.681,92.105,0.031,0,81374,3496084
31914045440,34329006080,67399680,987807744,4.616,0.873,94.510,0,0,79814,3541674
31913365504,34329591808,67407872,987893760,4.560,1.006,94.340,0.094,0,84460,3530972
31911292928,34331557888,67407872,988000256,4.938,0.781,94.281,0,0,83880,3644320
31909511168,34333237248,67407872,988098560,3.632,0.877,95.492,0,0,82628,3595146
31910862848,34331783168,67416064,988188672,4.859,0.752,94.201,0.188,0,86876,3685986
31909896192,34332655616,67416064,988282880,4.385,0.752,94.864,0,0,88526,3730654
31910195200,34332233728,67424256,988389376,5.662,0.594,93.682,0.063,0,84158,3456246
31911145472,34331201536,67424256,988471296,4.765,0.721,94.514,0,0,82272,3485750
31911886848,34330329088,67424256,988598272,4.365,0.624,95.011,0,0,79926,3519366
31913029632,34329104384,67424256,988676096,4.706,0.569,94.725,0,0,78664,3361262
31913140224,34328838144,67424256,988790784,2.892,0.534,96.573,0,0,89228,3505582
31914016768,34327867392,67432448,988872704,6.198,0.899,92.842,0.062,0,83940,3579608
31914364928,34327416832,67432448,988975104,4.573,0.626,94.801,0,0,80244,3526906
31915429888,34326253568,67432448,989069312,4.513,0.877,93.826,0.783,0,86378,3650196
31915823104,34325643264,67432448,989282304,4.510,0.725,94.765,0,0,87252,3544736
31915913216,34325446656,67432448,989384704,5.441,0.750,93.809,0,0,84754,3415798
31917404160,34323832832,67448832,989491200,5.083,0.879,93.725,0.314,0,78872,3493080
31917428736,34323705856,67448832,989593600,2.970,0.688,96.343,0,0,81312,3600378
31916822528,34324193280,67448832,989704192,6.512,0.845,92.611,0.031,0,82838,3543386
31917899776,34323054592,67448832,989765632,4.287,0.782,94.900,0.031,0,79890,3499672
31917969408,34322870272,67448832,989880320,5.601,0.688,93.711,0,0,80666,3444812
31919255552,34321350656,67457024,990105600,4.671,0.721,94.451,0.157,0,80442,3535900
31919226880,34321256448,67457024,990224384,3.784,0.883,95.333,0,0,84766,3636618
31921127424,34319253504,67457024,990322688,4.594,0.755,94.651,0,0,87926,3668424
31922675712,34317606912,67465216,990412800,3.864,0.880,95.162,0.094,0,87420,3758124
31922167808,34318004224,67465216,990515200,6.244,0.690,93.066,0,0,95366,3958058
31922552832,34317516800,67473408,990605312,3.939,0.844,95.061,0.156,0,92886,3780464
31922995200,34316963840,67473408,990711808,4.545,0.965,94.489,0,0,93130,3956516
31925211136,34314637312,67473408,990822400,6.291,1.147,92.563,0,0,89792,3790356
31925977088,34313768960,67473408,990920704,4.983,0.788,93.756,0.473,0,88314,3649808
31925891072,34313740288,67473408,991031296,3.902,0.692,95.406,0,0,84766,3620822
31927029760,34312511488,67481600,991105024,3.361,0.691,95.791,0.157,0,93604,3854268
31927246848,34312192000,67481600,991203328,4.897,1.029,94.074,0,0,90468,3770776
31927934976,34311385088,67481600,991313920,4.470,0.818,94.712,0,0,86646,3760388
31929114624,34310090752,67481600,991416320,4.820,1.008,94.171,0,0,93598,3656210
31929561088,34309513216,67481600,991539200,3.733,0.941,95.295,0.031,0,90082,3794906
31929675776,34309320704,67489792,991608832,4.842,0.719,94.314,0.125,0,89136,3667876
31932039168,34306834432,67489792,991727616,3.907,0.844,95.249,0,0,84520,3367622
31930724352,34308059136,67489792,991813632,4.655,0.937,94.408,0,0,83054,3449588
31932542976,34306125824,67489792,991928320,5.739,0.967,93.294,0,0,82328,3578650
31932076032,34306478080,67497984,992034816,4.044,0.871,95.023,0.062,0,87390,3848700
31932145664,34306322432,67506176,992112640,4.068,0.757,95.112,0.063,0,88440,3646710
31933247488,34305093632,67506176,992235520,4.719,0.844,94.438,0,0,74580,3086556
31935324160,34302902272,67506176,992350208,4.823,1.002,94.175,0,0,75620,3237954
31936667648,34301349888,67506176,992559104,3.910,0.657,95.433,0,0,77724,3360628
31937482752,34300416000,67506176,992677888,4.571,1.002,94.427,0,0,76262,3319054
31937630208,34300157952,67514368,992780288,5.427,0.596,93.852,0.125,0,83314,3498490
31938281472,34299420672,67514368,992866304,3.812,0.630,95.558,0,0,87336,3686512
31939411968,34298159104,67514368,992985088,5.489,0.627,93.883,0,0,85540,3644694
31939813376,34297675776,67514368,993067008,3.847,0.662,95.049,0.442,0,84724,3514888
31940902912,34296479744,67514368,993173504,5.240,1.185,93.543,0.031,0,79494,3313768
31942578176,34294677504,67522560,993292288,5.232,0.965,93.647,0.156,0,89902,3479736
31943495680,34293673984,67522560,993374208,3.579,0.408,96.013,0,0,85014,3637894
31943593984,34293452800,67522560,993497088,4.786,0.688,94.526,0,0,93116,3719318
31943962624,34293002240,67522560,993570816,3.125,0.726,96.149,0,0,94148,3660108
31945101312,34291609600,67522560,993820672,5.684,0.781,93.504,0.031,0,87934,3556892
31946080256,34290515968,67530752,993927168,5.917,0.997,92.962,0.125,0,88052,3205630
31946674176,34289836032,67530752,994013184,5.461,0.869,93.670,0,0,83706,3391534
31947300864,34289094656,67530752,994127872,2.814,0.537,96.649,0,0,85870,3590968
31947620352,34288676864,67530752,994217984,4.814,0.781,94.405,0,0,85632,3681818
31949455360,34286743552,67538944,994308096,4.510,0.908,92.765,1.816,0,81826,3455266
31948414976,34287644672,67547136,994435072,3.907,0.693,95.274,0.126,0,80146,3462680
31949938688,34286026752,67547136,994525184,5.036,0.500,94.464,0,0,79818,3351930
31950381056,34285453312,67547136,994652160,3.713,0.787,95.500,0,0,81386,3471982
31951384576,34284384256,67547136,994713600,4.193,0.725,95.082,0,0,81098,3678128
31952805888,34282840064,67547136,994832384,6.066,1.001,92.933,0,0,89994,3827358
31954296832,34281095168,67555328,995074048,4.077,0.659,95.171,0.094,0,91352,3780168
31954472960,34280837120,67555328,995151872,4.576,0.820,94.604,0,0,87208,3611180
31955435520,34279768064,67555328,995258368,3.682,0.718,95.601,0,0,83268,3492436
31956881408,34278219776,67555328,995360768,5.050,0.784,94.166,0,0,86012,3520980
31957159936,34277834752,67555328,995467264,5.370,0.937,93.693,0,0,79434,3414990
31958650880,34276220928,67563520,995577856,3.737,0.879,95.289,0.094,0,80436,3348034
31958433792,34276356096,67563520,995659776,4.900,0.780,94.320,0,0,82980,3528346
31958896640,34275721216,67563520,995786752,3.610,1.036,95.355,0,0,83722,3590248
31960543232,34273980416,67563520,995880960,7.360,0.528,92.112,0,0,94462,3716788
31962124288,34272301056,67563520,995979264,3.786,0.814,95.401,0,0,90082,3759882
31962054656,34272243712,67571712,996093952,3.305,0.598,95.971,0.126,0,88330,3796336
31962370048,34271850496,67571712,996167680,4.191,0.751,95.058,0,0,84762,3620052
31962857472,34271236096,67571712,996290560,5.154,0.691,94.155,0,0,81156,3509488
31966367744,34267623424,67571712,996392960,6.095,1.037,92.868,0,0,86282,3673308
31964844032,34269044736,67575808,996491264,2.836,0.599,94.865,1.701,0,82908,3490772
31965372416,34268401664,67584000,996597760,3.724,0.820,94.446,1.010,0,80394,3333422
31966433280,34267238400,67592192,996679680,3.083,0.755,96.068,0.094,0,81564,3381618
31967576064,34265980928,67600384,996786176,5.196,0.970,90.423,3.412,0,78606,3422456
31969169408,34264268800,67600384,996900864,5.223,0.724,94.053,0,0,77788,3216230
31967948800,34265403392,67600384,996986880,3.390,0.502,96.077,0.031,0,82776,3470478
31969173504,34264047616,67600384,997113856,5.317,0.782,93.901,0,0,86642,3573022
31970148352,34262982656,67600384,997199872,3.540,0.564,95.896,0,0,88788,3638710
31969484800,34263400448,67608576,997437440,5.835,0.811,93.261,0.094,0,87632,3735456
31970500608,34262269952,67608576,997548032,5.130,0.688,94.182,0,0,82788,3483640
31970410496,34262274048,67608576,997634048,3.788,0.532,95.648,0.031,0,80770,3337266
31971196928,34261368832,67616768,997744640,3.749,0.882,95.211,0.158,0,74170,3252136
31976062976,34256400384,67616768,997842944,3.472,0.568,95.960,0,0,78724,3491274
31977660416,34254721024,67624960,997916672,5.829,0.815,93.231,0.125,0,87996,3855472
31978577920,34253660160,67624960,998055936,4.378,0.630,94.992,0,0,85648,3463700
31985778688,34246361088,67624960,998154240,3.213,0.724,96.063,0,0,82368,3280480
31985913856,34246139904,67624960,998236160,3.699,0.632,95.669,0,0,79478,3443340
31986622464,34245300224,67624960,998359040,4.206,0.601,95.193,0,0,80478,3599604
31987769344,34244042752,67633152,998453248,4.725,0.751,94.431,0.094,0,84076,3660144
31989493760,34242207744,67633152,998563840,4.013,0.721,95.235,0.031,0,84768,3671194
31988850688,34242777088,67633152,998637568,2.949,0.753,96.299,0,0,81418,3557126
31989231616,34242269184,67633152,998764544,4.094,0.661,94.110,1.134,0,85872,3598752
31988105216,34243301376,67633152,998858752,4.329,0.600,95.071,0,0,84140,3606512
31989579776,34241724416,67641344,998948864,6.067,0.778,93.093,0.062,0,84858,3642860
31992352768,34238816256,67641344,999079936,4.334,0.873,94.793,0,0,85700,3757910
31993335808,34237628416,67641344,999280640,3.644,0.691,95.664,0,0,93632,3706740
31993970688,34236878848,67641344,999395328,4.850,0.626,94.524,0,0,85826,3546292
31994359808,34236395520,67641344,999489536,4.826,0.568,94.574,0.032,0,82850,3537010
31996391424,34234232832,67649536,999600128,4.863,1.309,93.734,0.094,0,83080,3562628
31997394944,34233110528,67649536,999718912,4.688,0.875,94.438,0,0,80536,3442106
31997673472,34232745984,67649536,999800832,3.737,0.879,95.383,0,0,86078,3636858
31999025152,34231300096,67649536,999895040,6.317,0.754,92.929,0,0,83060,3690068
31999893504,34230300672,67657728,1000009728,6.188,0.902,92.600,0.311,0,88492,3807106
31999840256,34230267904,67665920,1000087552,4.065,0.876,94.903,0.156,0,85278,3800456
32001515520,34228457472,67665920,1000218624,3.112,0.629,96.259,0,0,91310,3419530
32001310720,34228555776,67665920,1000316928,5.934,0.781,93.285,0,0,80734,3182624
32001355776,34228420608,67665920,1000407040,6.458,0.815,92.727,0,0,78558,3256502
32002740224,34226913280,67665920,1000525824,3.528,0.661,95.811,0,0,76194,3273620
32002088960,34227494912,67674112,1000583168,5.119,0.714,94.043,0.124,0,74878,3344424
32002695168,34226753536,67674112,1000718336,3.869,1.101,95.030,0,0,86922,3564664
32003137536,34226204672,67674112,1000820736,5.881,1.095,93.025,0,0,81866,3404268
32004952064,34224300032,67674112,1000910848,4.969,0.755,94.277,0,0,93274,3698058
32004902912,34224234496,67674112,1001021440,3.885,0.783,93.860,1.472,0,93938,3595180
32005730304,34223296512,67682304,1001123840,5.202,0.810,93.956,0.031,0,94220,3704918
32005304320,34223493120,67682304,1001353216,3.546,0.596,95.858,0,0,92118,3554576
32005820416,34222882816,67682304,1001447424,5.031,0.912,94.025,0.031,0,95808,3990554
32006647808,34221936640,67682304,1001558016,4.103,0.814,95.083,0,0,102508,3979414
32007122944,34221330432,67682304,1001680896,4.842,1.093,94.064,0,0,106960,3930920
32007434240,34220908544,67690496,1001779200,4.618,0.811,94.509,0.062,0,92374,3543200
32008273920,34219982848,67690496,1001865216,4.680,0.785,94.535,0,0,86898,3582776
32009539584,34218610688,67690496,1001967616,5.356,0.851,93.793,0,0,84532,3471030
32008814592,34219237376,67690496,1002065920,4.272,0.811,94.917,0,0,80786,3523002
32009646080,34218291200,67690496,1002180608,4.361,0.690,94.948,0,0,83056,3807710
32010891264,34216943616,67706880,1002266624,3.528,0.661,95.433,0.378,0,90032,3787168
32017555456,34210164736,67706880,1002373120,5.884,1.127,92.989,0,0,87910,3736410
32019066880,34208546816,67706880,1002475520,4.458,0.696,94.847,0,0,89386,3930088
32017920000,34209591296,67706880,1002573824,3.749,0.630,95.621,0,0,83894,3520634
32019701760,34207686656,67706880,1002684416,5.585,1.186,93.229,0,0,85160,3848492
32020922368,34206363648,67715072,1002774528,3.188,0.719,96.030,0.063,0,89910,4012614
30514544640,35712647168,67715072,1002864640,4.708,1.475,93.817,0,0,86572,3520792
27423223808,38804066304,67715072,1002758144,4.729,1.221,94.049,0,0,73384,3172240
23518494720,42709835776,67715072,1001717760,4.130,0.939,94.931,0,0,71136,2712158
21128298496,45100613632,67715072,1001132032,2.838,0.749,95.352,1.061,0,63804,2496916
18015035392,48214892544,67727360,1000091648,3.380,1.054,92.868,2.698,0,62730,2300770
14925320192,51305308160,67727360,999387136,2.548,0.661,96.791,0,0,49528,1864880
11765747712,54465720320,67727360,998547456,1.342,0.406,98.253,0,0,43968,1586564
8674476032,57557843968,67727360,997695488,1.407,0.344,98.249,0,0,43122,1147362
6299881472,59933302784,67727360,996831232,1.628,0.344,98.028,0,0,29932,745812
3226726400,63007088640,67739648,996188160,0.470,0.251,99.217,0.063,0,21680,532024
890834944,65343860736,67739648,995307520,0.156,0.094,99.750,0,0,6804,137484
864407552,65370951680,67739648,994643968,0.031,0.031,99.937,0,0,1410,0
864374784,65370984448,67739648,994643968,0,0,100,0,0,2994,0
864116736,65371242496,67739648,994643968,0,0,100,0,0,214,0
863846400,65371500544,67751936,994643968,0,0,99.937,0.063,0,0,0
863838208,65371500544,67760128,994643968,0,0,99.906,0.094,0,9618,0
863838208,65371500544,67760128,994643968,0,0,100,0,0,5396,0
863838208,65371500544,67760128,994643968,0,0,100,0,0,848,0
863838208,65371500544,67760128,994643968,0,0.031,99.969,0,0,166,0
863821824,65371516928,67760128,994643968,0,0,100,0,0,0,0
863555584,65371774976,67768320,994643968,0,0,99.969,0.031,0,388,0
863555584,65371774976,67768320,994643968,0,0,100,0,0,214,0
863555584,65371774976,67768320,994643968,0,0,100,0,0,1870,0
862781440,65372549120,67768320,994643968,0,0,100,0,0,1862,0
862523392,65372807168,67768320,994643968,0,0,100,0,0,2544,0
862523392,65372807168,67768320,994643968,0,0,100,0,0,3558,0
862515200,65372807168,67776512,994643968,0,0,99.938,0.062,0,4310,2292
862257152,65373065216,67776512,994643968,0,0,100,0,0,9114,3954
861261824,65372225536,67776512,994910208,1.529,0.749,97.722,0,0,408218,45786
859250688,65374085120,67776512,994652160,0,0,100,0,0,2968,0
