172.16.97.11 : 20.54 10.23 10.27 10.29 10.25 10.23 10.31 10.29 10.30 10.30
172.16.97.12 : 10.23 10.27 10.29 10.28 10.29 10.30 10.32 10.29 10.30 10.33
172.16.97.14 : 3.66 0.18 0.15 0.17 0.15 0.19 0.21 0.20 0.19 0.19
172.16.97.21 : 0.14 0.19 0.20 0.20 0.17 0.17 0.20 0.16 0.17 0.17
172.16.97.24 : 0.20 0.21 0.16 0.17 0.20 0.16 0.20 0.17 0.19 0.20
172.16.97.25 : 0.02 0.03 0.03 0.03 0.03 0.03 0.01 0.01 0.03 0.03
172.16.97.27 : - 100.17 100.23 100.16 100.13 100.17 100.17 100.25 100.22 -
172.16.97.28 : 100.28 100.26 - 100.30 - 100.29 100.33 100.29 100.30 100.28
172.16.97.3  : 100.29 100.27 100.34 100.32 100.31 100.33 100.32 100.28 100.31 100.26
172.16.97.4  : 100.25 100.32 100.31 100.32 100.31 100.30 100.32 100.34 100.31 100.30
172.16.97.5  : 100.27 100.33 100.29 100.30 - 100.31 100.33 100.26 - 100.29
172.16.97.6  : 100.27 100.29 100.28 100.31 - - 100.29 100.31 100.31 100.26
172.16.97.7  : 100.23 100.32 100.27 100.27 100.32 100.28 100.29 100.28 100.29 100.31
172.16.97.8  : 100.23 100.29 100.27 100.29 100.27 100.26 100.30 100.34 100.24 100.24
172.16.97.9  : 8.40 4.30 4.34 4.31 4.32 4.30 4.32 4.30 4.25 4.24

      15 targets
      15 alive
       0 unreachable
       0 unknown addresses

       4 timeouts (waiting for response)
     150 ICMP Echos sent
     142 ICMP Echo Replies received
       0 other ICMP received

 0.01 ms (min round trip time)
 52.7 ms (avg round trip time)
 100 ms (max round trip time)
       10.123 sec (elapsed real time)

