172.16.72.14 : 10.21 10.26 10.25 10.29 10.18 10.27 10.32 - 10.33 10.27
172.16.72.23 : 10.25 10.28 10.22 10.23 10.25 10.24 10.29 10.27 10.28 10.27
172.16.72.25 : 0.19 0.20 0.15 0.16 0.20 0.18 0.16 0.19 0.18 0.18
172.16.72.26 : 0.03 0.03 0.03 0.03 0.03 0.03 0.03 0.03 0.03 0.03
172.16.72.27 : 0.15 0.18 0.17 0.20 0.12 0.15 0.22 0.19 0.14 0.20
172.16.72.28 : 0.21 0.21 0.20 0.17 0.18 0.19 0.19 0.19 0.18 0.21
172.16.72.29 : 0.10 0.16 0.20 0.17 0.20 0.15 0.17 0.19 0.20 0.20
172.16.72.3  : 0.14 0.17 0.20 0.21 0.17 0.18 0.20 0.19 0.21 0.20
172.16.72.30 : 0.14 0.20 0.17 0.19 0.20 0.18 0.18 0.17 0.18 0.17
172.16.72.31 : 0.18 0.16 0.22 0.17 0.20 0.20 0.20 0.20 0.17 0.20
172.16.72.32 : 0.11 0.21 0.18 0.20 0.16 0.20 0.21 0.21 0.21 0.19
172.16.72.33 : 0.18 0.18 0.20 0.21 0.22 0.12 0.21 0.20 0.21 0.18
172.16.72.34 : 0.12 0.18 0.20 0.22 0.20 0.20 0.21 0.21 0.21 0.20
172.16.72.35 : 0.15 0.20 0.19 0.18 0.18 0.20 0.19 0.20 0.15 0.20
172.16.72.36 : 0.15 0.20 0.18 0.18 0.16 0.18 0.20 0.19 0.21 0.19
172.16.72.37 : 0.22 0.22 0.19 0.21 0.20 0.20 0.20 0.20 0.21 0.20
172.16.72.38 : 0.20 0.20 0.20 0.20 0.21 0.21 0.19 0.20 0.21 0.20
172.16.72.39 : 0.16 0.21 0.20 0.20 0.20 0.21 0.20 0.18 0.17 0.20
172.16.72.4  : 200.28 - 200.33 - - 200.34 200.33 200.33 200.33 200.34
172.16.72.40 : 200.30 200.33 200.29 200.33 200.33 200.31 200.31 200.31 200.33 200.30
172.16.72.41 : 200.33 200.28 200.32 200.32 200.29 200.32 200.32 200.34 - 200.33
172.16.72.42 : 200.28 200.29 200.26 200.28 200.28 200.28 200.29 200.28 200.29 200.32
172.16.72.43 : 200.28 - 200.31 200.26 - 200.30 200.33 200.32 200.32 200.30
172.16.72.44 : 200.27 200.32 200.31 200.30 200.34 200.32 200.29 - 200.33 200.32
172.16.72.46 : 200.27 200.33 200.29 200.34 200.31 200.29 200.32 200.29 200.31 200.33
172.16.72.47 : 200.24 200.30 200.33 200.29 200.31 200.30 200.29 200.31 200.33 -
172.16.72.48 : 200.30 200.34 200.31 200.33 200.29 - 200.34 200.34 200.29 200.32
172.16.72.49 : 200.22 200.31 200.30 200.31 200.32 200.32 200.30 200.31 200.32 -
172.16.72.5  : 200.22 200.32 200.31 200.31 200.33 200.33 200.34 200.34 200.29 200.33
172.16.72.50 : 200.32 200.28 200.28 200.33 200.32 - 200.28 200.32 200.30 200.33
172.16.72.51 : 200.25 200.32 200.33 200.29 200.32 200.32 200.31 200.32 - -
172.16.72.6  : 200.27 200.32 - 200.30 200.24 200.25 200.26 200.31 200.30 200.33
172.16.72.7  : 200.31 200.33 - 200.30 200.31 200.30 200.31 200.31 200.31 200.26
172.16.72.8  : 200.27 - 200.31 200.30 200.29 200.30 200.29 200.32 200.28 200.28
172.16.72.9  : 4.29 4.33 4.30 4.24 4.32 4.30 4.31 4.32 4.30 4.29

      35 targets
      35 alive
       0 unreachable
       0 unknown addresses

      13 timeouts (waiting for response)
     350 ICMP Echos sent
     333 ICMP Echo Replies received
       0 other ICMP received

 0.03 ms (min round trip time)
 87.4 ms (avg round trip time)
 200 ms (max round trip time)
       10.347 sec (elapsed real time)

