172.16.66.55 : 9.18 4.33 4.34 4.38 4.39 4.34 4.35 4.32 4.31 4.30
172.16.66.56 : 7.74 4.40 4.33 4.39 4.38 4.38 4.37 4.35 4.38 4.33
172.16.66.57 : 18.81 10.38 10.35 10.28 10.38 10.39 10.38 10.34 10.35 10.37
172.16.66.58 : 20.27 10.34 10.25 10.36 10.31 10.35 10.35 10.36 10.37 10.35
172.16.66.59 : 20.44 10.33 10.39 10.34 10.37 10.36 10.36 10.38 10.37 10.33
172.16.66.6  : 13.58 10.31 10.32 10.32 10.31 10.38 10.40 10.36 10.37 10.38
172.16.66.60 : 19.15 10.38 10.35 10.35 10.38 10.36 10.38 10.37 - -
172.16.66.61 : 15.16 10.37 10.36 10.35 - 10.34 10.33 - 10.32 10.37
172.16.66.62 : 15.05 10.37 10.28 10.33 10.34 10.33 10.31 10.33 - 10.26
172.16.66.64 : 21.49 10.36 10.35 10.34 10.30 10.29 10.36 10.36 10.29 10.28
172.16.66.65 : 11.53 10.38 10.29 10.29 10.28 10.31 10.30 10.28 10.29 10.30
172.16.66.66 : 17.24 10.40 10.39 10.35 10.38 10.38 10.31 10.39 10.34 10.41
172.16.66.67 : 13.86 10.35 10.36 10.37 10.34 10.37 10.37 10.35 10.36 10.36
172.16.66.69 : 16.11 10.31 10.27 10.25 10.25 10.30 10.30 10.32 10.29 10.27
172.16.66.7  : 0.03 0.02 0.03 0.03 0.03 0.03 0.03 0.03 0.03 0.03
172.16.66.70 : 0.17 0.22 0.20 0.21 0.21 0.23 0.22 0.22 0.17 0.19
172.16.66.71 : 0.21 0.23 0.21 0.22 0.23 0.22 0.22 0.22 0.22 0.22
172.16.66.72 : 0.20 0.22 0.18 0.19 0.20 0.19 0.21 0.22 0.21 0.23
172.16.66.73 : 0.15 0.21 0.21 0.21 0.22 0.19 0.21 0.22 0.21 0.22
172.16.66.74 : 0.18 0.19 0.20 0.20 0.21 0.21 0.18 0.22 0.22 0.23
172.16.66.75 : 0.19 0.21 0.19 0.21 0.22 0.22 0.22 0.22 0.23 0.24
172.16.66.76 : 5.42 0.19 0.19 0.19 0.19 0.21 0.21 0.19 0.17 0.19
172.16.66.77 : 0.59 0.19 0.20 0.20 0.19 0.19 0.21 0.19 0.19 0.19
172.16.66.78 : 0.19 0.18 0.20 0.19 0.19 0.19 0.19 0.18 0.22 0.19
172.16.66.79 : 0.20 0.22 0.22 0.22 0.21 0.21 0.21 0.21 0.21 0.23
172.16.66.8  : 0.21 0.21 0.22 0.22 0.21 0.22 0.22 0.21 0.22 0.22
172.16.66.80 : 11.31 4.30 4.28 4.28 4.27 4.35 4.38 4.33 4.38 4.33

      27 targets
      27 alive
       0 unreachable
       0 unknown addresses

       3 timeouts (waiting for response)
     270 ICMP Echos sent
     265 ICMP Echo Replies received
       0 other ICMP received

 0.02 ms (min round trip time)
 5.44 ms (avg round trip time)
 21.4 ms (max round trip time)
       10.096 sec (elapsed real time)

