172.16.97.1  : 4.26 4.31 4.26 4.28 4.30 4.29 4.30 4.30 4.31 4.30
172.16.97.16 : 4.20 4.26 4.30 4.29 4.25 4.31 4.28 4.29 4.28 4.27
172.16.97.23 : 4.25 4.30 4.25 4.29 4.29 4.29 4.34 4.33 4.31 4.29
172.16.97.24 : 4.29 4.32 4.30 4.28 4.29 4.26 4.33 4.31 4.30 4.30
172.16.97.25 : 4.30 4.31 4.32 4.30 4.30 4.32 4.32 4.31 4.31 4.31
172.16.97.26 : 4.26 4.28 4.26 4.24 4.26 4.28 4.32 4.31 4.27 4.31
172.16.97.27 : 4.27 4.30 4.30 4.31 4.30 4.28 4.28 4.30 4.32 4.31
172.16.97.28 : 4.25 4.31 4.25 4.30 4.30 4.30 4.29 4.31 4.30 4.27
172.16.97.3  : 4.29 4.30 4.29 4.26 4.30 4.30 4.30 4.28 4.32 4.30
172.16.97.4  : 4.26 4.29 4.32 4.30 4.28 4.30 4.33 4.30 4.32 4.31
172.16.97.5  : 4.26 4.29 4.31 4.30 4.30 4.32 4.29 4.30 4.27 4.30
172.16.97.6  : 4.24 4.27 4.29 4.30 4.30 4.30 4.30 4.29 4.29 4.28
172.16.97.7  : 4.28 4.29 4.29 4.31 4.29 4.27 4.33 4.30 4.31 4.31
172.16.97.8  : 4.28 4.31 4.28 4.29 4.29 4.26 4.29 4.32 4.30 4.28
172.16.97.9  : 0.01 0.03 0.03 0.03 0.03 0.03 0.03 0.03 0.03 0.03

      15 targets
      15 alive
       0 unreachable
       0 unknown addresses

       0 timeouts (waiting for response)
     150 ICMP Echos sent
     150 ICMP Echo Replies received
       0 other ICMP received

 0.01 ms (min round trip time)
 4.00 ms (avg round trip time)
 4.34 ms (max round trip time)
        9.142 sec (elapsed real time)

