"Dstat 0.7.3 CSV output"
"Author:","Dag Wieers <dag@wieers.com>",,,,"URL:","http://dag.wieers.com/home-made/dstat/"
"Host:","gros-72.nancy.grid5000.fr",,,,"User:","root"
"Cmdline:","dstat -m -c -n -o dstat.csv",,,,"Date:","23 May 2020 23:34:41 CEST"
"memory usage",,,,"total cpu usage",,,,,"net/total",
"used","free","buff","cach","usr","sys","idl","wai","stl","recv","send"
1266069504,97594916864,46956544,694603776,0.610,0.167,99.190,0.033,0,0,0
1260367872,97600135168,46956544,694947840,0.583,0.361,99.056,0,0,400984,29394
1260122112,97600827392,46956544,694501376,0,0,100,0,0,9172,204
1257955328,97602916352,46977024,694517760,0.695,0.333,98.611,0.361,0,387108,16750
1268846592,97591992320,46977024,694517760,0.195,0.056,99.750,0,0,385034,11370
1256554496,97604251648,46989312,694517760,0.389,0.306,99.306,0,0,14870,10254
1256546304,97604259840,46989312,694517760,0,0,100,0,0,8106,0
1256546304,97604259840,46989312,694517760,0,0,100,0,0,8504,0
1256534016,97604259840,47001600,694517760,0,0,100,0,0,10052,180
1256534016,97604259840,47001600,694517760,0,0,100,0,0,3000,102
1256521728,97604259840,47013888,694517760,0,0,100,0,0,1804,0
1271160832,97589358592,47013888,694775808,0.389,0.167,99.444,0,0,388319,15662
1260347392,97600176128,47013888,694722560,0.445,0.667,98.888,0,0,173396,16812
1268387840,97591578624,47013888,695193600,0.667,0.417,98.917,0,0,391374,28434
1258360832,97601404928,47026176,695328768,0.638,0.416,98.945,0,0,391446,19290
1257988096,97602224128,47026176,694882304,0,0,100,0,0,8103,132
1258610688,97601564672,47026176,694882304,0.639,0.333,99.028,0,0,395108,17896
1289138176,97570881536,47038464,695025664,0.445,0.111,99.444,0,0,229280,9658
1258455040,97601708032,47038464,694882304,0.805,0.056,99.140,0,0,14524,5902
1259507712,97600638976,47050752,694886400,0.278,0.139,99.583,0,0,356006,17490
1267249152,97592659968,47050752,695078912,0.251,0.278,99.471,0,0,191134,18700
1267429376,97592479744,47050752,695078912,0.028,0.028,99.944,0,0,36448,10412
1267421184,97592487936,47050752,695078912,0,0.056,99.944,0,0,12320,9996
1267408896,97592487936,47063040,695078912,0,0,100,0,0,12832,10094
1267396608,97592487936,47075328,695078912,0,0.028,99.972,0,0,12510,10094
1267396608,97592487936,47075328,695078912,0,0.028,99.972,0,0,15284,14476
1267396608,97592487936,47075328,695078912,0,0,100,0,0,12994,10820
1267396608,97592487936,47075328,695078912,0,0,100,0,0,12554,10094
1267396608,97592487936,47075328,695078912,0,0.028,99.972,0,0,12320,10192
1267396608,97592487936,47075328,695078912,0.028,0,99.972,0,0,11532,10192
1260040192,97599946752,47083520,694968320,0,0.028,99.972,0,0,2220,2432
1259958272,97600102400,47083520,694894592,0.167,0.083,99.750,0,0,173102,14208
1259950080,97600110592,47083520,694894592,0,0,100,0,0,2156,0
1259950080,97600110592,47083520,694894592,0,0,100,0,0,758,0
1259933696,97600126976,47083520,694894592,0,0,100,0,0,1816,0
1259933696,97600126976,47083520,694894592,0,0.028,99.972,0,0,1730,0
1259909120,97600126976,47108096,694894592,0,0,100,0,0,2082,0
1259909120,97600126976,47108096,694894592,0,0,100,0,0,1052,78
1262342144,97597239296,47108096,695341056,0.611,0.417,98.972,0,0,392028,30110
1262546944,97597480960,47108096,694894592,0,0,100,0,0,3462,0
2017898496,96841383936,47108096,695242752,4.018,1.646,94.336,0,0,1345450,56080
5773099008,93083807744,47120384,696934400,26.473,9.215,64.312,0,0,1674053,75154
9411284992,89443631104,47120384,698605568,25.699,9.284,65.017,0,0,1660856,73149
13208260608,85644509184,47144960,700452864,28.488,10.463,61.021,0.028,0,1656456,71388
15968186368,82883547136,47226880,701329408,20.145,7.244,72.555,0.056,0,336668,20056
15965347840,82886385664,47226880,701329408,0.083,0.028,99.889,0,0,2214,0
15978430464,82873290752,47235072,701333504,1.252,0.139,98.609,0,0,82640,6277790
16035758080,82815938560,47235072,701353984,2.563,0.223,97.214,0,0,306444,20710112
16125054976,82726580224,47247360,701399040,3.856,0.583,95.562,0,0,564710,36496422
16245968896,82605600768,47247360,701460480,5.237,0.585,94.178,0,0,829666,53705866
16360620032,82490916864,47247360,701493248,5.025,0.810,94.165,0,0,951456,56889894
16543035392,82308435968,47255552,701550592,11.757,0.584,87.660,0,0,918190,57865366
16669200384,82182209536,47255552,701612032,9.537,0.832,89.631,0,0,975452,57278782
16784949248,82066415616,47255552,701657088,8.547,0.559,90.894,0,0,965388,56782044
16858574848,81992716288,47263744,701722624,8.426,0.640,90.934,0,0,1081532,64562062
16858886144,81992364032,47263744,701763584,3.007,0.334,96.659,0,0,983122,59788244
16853245952,81997946880,47271936,701812736,3.362,0.389,96.249,0,0,990946,61079206
16856395776,81994665984,47271936,701943808,2.737,0.391,96.872,0,0,966628,60774606
16837402624,82013618176,47271936,701984768,3.097,0.474,96.429,0,0,970608,58327116
16836575232,82014384128,47271936,702046208,3.033,0.556,96.411,0,0,976318,57898048
16823349248,82027540480,47271936,702111744,3.369,0.418,96.214,0,0,984774,57956550
16776273920,82074570752,47280128,702148608,3.758,0.251,95.991,0,0,942312,54737078
16736456704,82114314240,47280128,702214144,3.032,0.417,96.551,0,0,1111380,65996988
16699392000,82151313408,47280128,702279680,3.382,0.475,96.143,0,0,984364,59339588
16694784000,82155868160,47280128,702332928,2.624,0.279,97.097,0,0,1033372,63793060
16694870016,82155728896,47280128,702386176,2.205,0.279,97.488,0.028,0,957730,58956328
16694607872,82155929600,47288320,702439424,2.116,0.418,97.466,0,0,972658,58534270
16690724864,82159759360,47288320,702492672,1.889,0.444,97.667,0,0,914580,55345132
16681779200,82168496128,47288320,702685184,2.315,0.335,97.351,0,0,1012850,60680500
16682119168,82168102912,47288320,702738432,2.142,0.501,97.357,0,0,983616,58214388
16686727168,82163433472,47296512,702791680,3.196,0.417,96.387,0,0,979114,59881364
16689082368,82161025024,47304704,702832640,2.287,0.223,97.490,0,0,912563,55321094
16688017408,82161799168,47304704,703102976,2.258,0.418,97.324,0,0,913182,55506952
16692428800,82157330432,47304704,703160320,2.254,0.362,97.384,0,0,942000,56630988
16693698560,82156003328,47304704,703205376,1.925,0.307,97.768,0,0,1073276,61495088
16695013376,82154622976,47304704,703270912,2.496,0.416,97.088,0,0,1018496,62827972
16695402496,82154151936,47312896,703328256,1.951,0.307,97.742,0,0,1067678,64870974
16695685120,82153824256,47312896,703373312,1.950,0.446,97.604,0,0,1009310,60835094
16695971840,82153467904,47312896,703438848,1.862,0.278,97.861,0,0,1065204,63020036
16695705600,82153693184,47312896,703479808,2.698,0.501,96.801,0,0,960286,57426778
16694751232,82154582016,47312896,703545344,1.872,0.335,97.793,0,0,982840,56687556
16696160256,82153111552,47321088,703598592,1.810,0.390,97.800,0,0,960616,55762138
16700448768,82148626432,47321088,703795200,2.886,0.389,96.725,0,0,1046992,61546128
16721539072,82127491072,47321088,703840256,2.034,0.585,97.381,0,0,1052594,60750516
16721571840,82127396864,47321088,703897600,1.863,0.361,97.776,0,0,1068076,61615690
16727298048,82121609216,47321088,703959040,1.536,0.223,98.240,0,0,965614,57493406
16737079296,82111791104,47329280,703987712,2.248,0.527,97.225,0,0,986416,59442112
16738258944,82110525440,47329280,704065536,1.395,0.419,98.186,0,0,1019784,58572616
16741761024,82106957824,47329280,704126976,1.781,0.445,97.774,0,0,958364,56373130
16741838848,82106830848,47329280,704172032,1.503,0.390,98.107,0,0,1014448,59684480
16741965824,82106642432,47329280,704233472,1.838,0.390,97.772,0,0,1050092,63112784
16743387136,82105004032,47337472,704421888,1.974,0.445,97.553,0.028,0,943222,57020542
16743301120,82105044992,47337472,704466944,1.949,0.473,97.578,0,0,896802,56537822
16744341504,82103939072,47337472,704532480,1.760,0.307,97.933,0,0,1035796,63113130
16745562112,82102661120,47337472,704577536,1.922,0.334,97.744,0,0,941830,57717264
16743538688,82104627200,47337472,704634880,1.566,0.196,98.238,0,0,893088,56981518
16745582592,82102497280,47353856,704704512,2.688,0.305,97.007,0,0,955244,59177866
16756940800,82091094016,47353856,704749568,1.589,0.362,98.049,0,0,945102,58397860
16759050240,82088935424,47353856,704798720,1.453,0.391,98.155,0,0,991666,58986874
16767954944,82079961088,47353856,704868352,2.552,0.388,97.060,0,0,964862,58092386
16769556480,82078326784,47353856,704901120,2.946,0.445,96.609,0,0,966398,56551526
16791052288,82056749056,47362048,704974848,3.954,0.501,95.544,0,0,962097,55878212
16801357824,82046386176,47362048,705032192,4.210,0.335,95.456,0,0,1022328,60582386
16810274816,82037411840,47362048,705089536,3.485,0.362,96.153,0,0,1025370,59584812
16832749568,82014846976,47362048,705142784,3.870,0.362,95.768,0,0,941772,55827546
16832679936,82014863360,47362048,705196032,2.036,0.167,97.797,0,0,956948,56569836
16834707456,82012647424,47370240,705245184,2.490,0.415,97.095,0,0,992442,58411648
16834678784,82012618752,47370240,705302528,1.447,0.334,98.219,0,0,978634,61257560
16835817472,82011410432,47370240,705372160,1.835,0.389,97.775,0,0,958260,57315420
16836476928,82010742784,47370240,705400832,1.256,0.391,98.353,0,0,1014470,61325752
16833277952,82013872128,47370240,705470464,2.679,0.307,97.015,0,0,991904,61349954
16893493248,81953583104,47378432,705531904,6.405,0.418,93.177,0,0,936808,56461938
16958136320,81888903168,47378432,705564672,5.348,0.501,94.150,0,0,951078,56684380
16994979840,81852002304,47378432,705622016,4.540,0.446,95.014,0,0,979882,57973104
17006190592,81840713728,47378432,705699840,2.997,0.333,96.670,0,0,981036,58687870
17006743552,81840128000,47378432,705728512,1.505,0.362,98.133,0,0,1037548,61086100
16997068800,81849716736,47386624,705802240,1.643,0.418,97.912,0.028,0,946660,55534932
16981389312,81865334784,47386624,705863680,1.477,0.390,98.133,0,0,960848,55942864
16988262400,81858424832,47386624,705896448,1.229,0.251,98.519,0,0,967580,58327780
16990969856,81855655936,47386624,705957888,1.533,0.307,98.161,0,0,918724,55577782
16991125504,81855389696,47386624,706027520,1.649,0.335,98.016,0,0,979140,57497376
16991379456,81855074304,47403008,706072576,2.283,0.334,97.383,0,0,983282,59504354
16991707136,81854554112,47403008,706265088,2.519,0.498,96.982,0,0,1003186,61231384
16992358400,81853841408,47403008,706326528,1.501,0.306,98.193,0,0,1079966,65869410
16993660928,81852506112,47403008,706359296,1.558,0.417,98.025,0,0,982632,60362288
16992870400,81853227008,47403008,706428928,1.336,0.362,98.302,0,0,928834,57381426
16991252480,81854771200,47411200,706490368,1.281,0.446,98.273,0,0,1034062,60106138
16991309824,81854676992,47411200,706527232,1.671,0.362,97.967,0,0,982183,56529726
16991145984,81854775296,47411200,706592768,2.140,0.445,97.415,0,0,956726,57198816
16991416320,81854447616,47411200,706650112,1.115,0.363,98.522,0,0,950206,56784478
16991916032,81853898752,47411200,706699264,1.730,0.363,97.907,0,0,991874,60109302
16991883264,81853865984,47419392,706756608,1.363,0.556,98.080,0,0,991370,58392400
16991027200,81854820352,47419392,706822144,1.786,0.279,97.935,0,0,976624,57386978
16992464896,81853345792,47419392,706859008,1.530,0.389,98.081,0,0,997280,60613680
16991768576,81853968384,47419392,706932736,1.034,0.307,98.658,0,0,1019188,59693852
16991932416,81853739008,47419392,706998272,1.557,0.334,98.110,0,0,1006617,59873810
16992550912,81853087744,47427584,707022848,1.815,0.251,97.934,0,0,1006360,61259198
16980516864,81865052160,47427584,707084288,2.363,0.361,97.276,0,0,1063192,64271296
16981688320,81863806976,47427584,707158016,1.700,0.418,97.882,0,0,1033576,61240064
16982687744,81862766592,47427584,707194880,1.395,0.251,98.354,0,0,980723,58743460
16983302144,81862086656,47427584,707260416,2.285,0.474,97.241,0,0,1016116,60921486
16982114304,81863200768,47435776,707325952,2.309,0.417,97.273,0,0,994544,59681774
16983314432,81861963776,47435776,707362816,2.312,0.251,97.437,0,0,1034756,60908304
16982974464,81862234112,47435776,707432448,2.174,0.334,97.492,0,0,967100,58027948
16984084480,81861058560,47435776,707497984,2.561,0.250,97.189,0,0,974100,58299882
16984211456,81860898816,47435776,707530752,1.643,0.362,97.994,0,0,966944,57798496
16985931776,81859108864,47443968,707588096,1.892,0.306,97.803,0,0,1029810,62127030
16985174016,81859801088,47443968,707653632,1.421,0.446,98.106,0.028,0,858870,55271502
16984993792,81859936256,47443968,707698688,1.259,0.252,98.489,0,0,933052,56536604
16985419776,81859452928,47443968,707756032,1.340,0.279,98.380,0,0,1013584,59585992
16985079808,81859715072,47443968,707833856,1.198,0.251,98.552,0,0,947958,56978154
16985735168,81859031040,47452160,707854336,2.306,0.472,97.222,0,0,970046,57706094
16986066944,81858609152,47460352,707936256,1.147,0.308,98.545,0,0,1022292,61081768
16986271744,81858351104,47460352,707989504,1.366,0.418,98.216,0,0,992828,59112566
16987189248,81857376256,47460352,708038656,2.118,0.334,97.547,0,0,977528,56924870
16986570752,81857933312,47460352,708100096,2.250,0.389,97.361,0,0,932382,56086232
16988004352,81856405504,47468544,708177920,1.371,0.280,98.350,0,0,973516,57270138
16987136000,81857232896,47476736,708210688,1.730,0.502,97.768,0,0,1074753,63574722
16991842304,81852465152,47476736,708272128,4.134,0.416,95.450,0,0,952312,56992474
16991756288,81852477440,47476736,708345856,3.616,0.306,96.078,0,0,989648,58621984
16990908416,81853267968,47476736,708403200,3.436,0.554,96.010,0,0,966694,57246686
16992256000,81851867136,47484928,708440064,2.785,0.278,96.937,0,0,1005988,60323690
16993050624,81850994688,47484928,708513792,3.035,0.278,96.686,0,0,1040520,60885022
16992858112,81851125760,47484928,708575232,2.501,0.333,97.166,0,0,1001478,57912704
16993394688,81850540032,47484928,708624384,1.337,0.446,98.218,0,0,988314,58404062
16993501184,81850376192,47484928,708681728,1.084,0.445,98.471,0,0,1038424,62281028
16993931264,81849737216,47493120,708866048,3.380,0.360,96.260,0,0,1021148,58927860
16995889152,81847721984,47493120,708923392,1.365,0.223,98.412,0,0,928588,53888480
16994844672,81848709120,47493120,708980736,1.363,0.417,98.220,0,0,950414,55276314
16995991552,81847480320,47493120,709054464,1.923,0.362,97.715,0,0,1059060,63202812
16996728832,81846697984,47493120,709095424,1.114,0.445,98.441,0,0,1052858,61729972
16997048320,81846308864,47501312,709156864,1.424,0.419,98.157,0,0,1063522,64744168
16995086336,81848201216,47501312,709226496,1.031,0.418,98.551,0,0,1002322,62356998
16993341440,81849901056,47501312,709271552,1.505,0.335,98.160,0,0,1009370,60407632
16992358400,81850826752,47501312,709328896,1.480,0.279,98.241,0,0,948418,57266150
16993026048,81850085376,47501312,709398528,1.974,0.473,97.554,0,0,964126,57035246
16992514048,81850544128,47509504,709443584,1.227,0.418,98.354,0,0,938232,54971194
16992681984,81850318848,47509504,709500928,1.583,0.417,97.973,0.028,0,957746,56966020
16994197504,81848745984,47509504,709558272,0.977,0.307,98.715,0,0,990414,59054270
16993443840,81849438208,47509504,709619712,1.614,0.362,98.024,0,0,997946,58509750
16993353728,81849475072,47509504,709672960,1.506,0.335,98.159,0,0,1057326,62967552
16993681408,81849085952,47517696,709726208,1.170,0.362,98.468,0,0,1015246,57943900
16993513472,81849184256,47517696,709795840,1.283,0.307,98.410,0,0,994234,58243690
16993865728,81848762368,47525888,709857280,1.476,0.418,98.106,0,0,978694,57774986
16992972800,81849614336,47525888,709898240,1.889,0.361,97.749,0,0,865164,52251316
16994041856,81848471552,47525888,709971968,1.421,0.362,98.216,0,0,982136,58143234
16992960512,81849491456,47534080,710021120,1.144,0.363,98.493,0,0,953928,57424244
16994086912,81848315904,47534080,710070272,1.780,0.362,97.858,0,0,993952,60444346
16993976320,81848352768,47534080,710139904,0.949,0.363,98.688,0,0,998558,59946744
16995065856,81847205888,47542272,710189056,1.720,0.333,97.947,0,0,980560,58307128
16994119680,81848094720,47542272,710246400,1.312,0.447,98.241,0,0,961572,58230732
16995098624,81847050240,47550464,710303744,1.447,0.362,98.191,0,0,972391,56808636
16995246080,81846829056,47550464,710369280,1.365,0.418,98.217,0,0,951399,57789874
16994635776,81847386112,47550464,710422528,1.394,0.418,98.187,0,0,973532,59114040
16994971648,81846996992,47550464,710471680,1.089,0.363,98.547,0,0,997242,59493612
16996044800,81845854208,47550464,710537216,1.644,0.279,98.077,0,0,1010570,59806946
16996888576,81844948992,47558656,710590464,1.310,0.279,98.411,0,0,1083985,66236010
16996728832,81845047296,47558656,710643712,1.807,0.306,97.888,0,0,985376,59241600
16996683776,81845014528,47566848,710713344,1.280,0.390,98.331,0,0,1009250,64337502
16996184064,81845448704,47566848,710774784,1.645,0.418,97.937,0,0,940964,56032708
16996818944,81844768768,47566848,710815744,1.200,0.391,98.410,0,0,1030100,62249734
16998088704,81843429376,47575040,710877184,1.339,0.307,98.354,0,0,986496,59276014
16997707776,81843732480,47575040,710950912,1.088,0.391,98.521,0,0,949914,58514694
16998629376,81842765824,47575040,710991872,2.164,0.361,97.476,0,0,1084846,63179866
16998862848,81842470912,47583232,711045120,1.086,0.418,98.497,0,0,1014942,59987488
16998227968,81843032064,47583232,711118848,1.445,0.361,98.193,0,0,1040662,60594106
16999116800,81842089984,47591424,711163904,1.700,0.279,98.021,0,0,953472,56968018
16999219200,81841913856,47591424,711221248,1.390,0.445,98.165,0,0,962736,57638926
16999313408,81841750016,47591424,711286784,1.281,0.418,98.302,0,0,949108,56627200
16999309312,81841557504,47591424,711483392,1.059,0.362,98.579,0,0,1040432,62240966
16999161856,81841655808,47591424,711532544,0.978,0.335,98.687,0,0,994988,59657696
17000390656,81840357376,47599616,711593984,1.311,0.251,98.410,0.028,0,943038,56995822
17000689664,81839996928,47599616,711655424,1.535,0.307,98.157,0,0,984246,58234968
17000013824,81840619520,47603712,711704576,1.478,0.363,98.160,0,0,1020652,59879278
16999456768,81841115136,47603712,711761920,1.286,0.252,98.463,0,0,1038184,60063102
17000951808,81839550464,47603712,711827456,1.886,0.444,97.671,0,0,1103410,63335438
17000435712,81840013312,47611904,711872512,1.392,0.278,98.329,0,0,1015374,60271982
17001152512,81839235072,47611904,711933952,1.231,0.280,98.489,0,0,945912,57590290
17001512960,81838809088,47611904,711995392,1.004,0.279,98.717,0,0,970164,58660274
17001709568,81838551040,47620096,712048640,1.447,0.390,98.163,0,0,969576,56218506
17000517632,81839697920,47620096,712093696,1.198,0.390,98.412,0,0,1038822,59373760
17001525248,81838608384,47628288,712167424,1.339,0.391,98.271,0,0,1020415,57501954
17001197568,81838874624,47628288,712228864,1.506,0.391,98.103,0,0,1021246,59427600
17001721856,81838252032,47628288,712327168,1.531,0.334,98.135,0,0,972110,57078724
17001652224,81838260224,47628288,712384512,1.943,0.444,97.612,0,0,1005698,60733190
17002569728,81837281280,47628288,712445952,1.282,0.390,98.328,0,0,977014,59270710
17003036672,81836756992,47644672,712486912,1.140,0.389,98.471,0,0,927818,56285944
17002041344,81837678592,47644672,712560640,1.281,0.473,98.246,0,0,1002336,61088156
17002213376,81837449216,47644672,712617984,1.311,0.279,98.410,0,0,945280,56732548
17001967616,81837649920,47644672,712663040,1.254,0.362,98.384,0,0,974426,58149622
17001533440,81838018560,47644672,712724480,1.280,0.390,98.331,0,0,980148,59070018
17002385408,81837105152,47652864,712777728,1.391,0.362,98.247,0,0,941456,56136684
17002799104,81836617728,47652864,712847360,1.311,0.530,98.158,0,0,1003692,58787170
17003204608,81836163072,47652864,712896512,1.340,0.335,98.325,0,0,895768,52454390
17004126208,81835184128,47652864,712953856,1.558,0.334,98.108,0,0,955046,58138368
17004642304,81834614784,47652864,713007104,2.197,0.389,97.413,0,0,945450,58013604
17005084672,81834094592,47661056,713076736,1.421,0.362,98.217,0,0,1025918,61558100
17006051328,81833082880,47661056,713121792,1.086,0.390,98.524,0,0,1011936,58523608
17005989888,81833082880,47661056,713183232,0.951,0.196,98.854,0,0,1002682,57158958
17005662208,81833345024,47661056,713240576,1.337,0.334,98.300,0.028,0,1026880,61832276
17005301760,81833639936,47661056,713306112,1.004,0.391,98.605,0,0,1043886,60184290
17005228032,81833648128,47669248,713363456,1.365,0.390,98.245,0,0,1016412,57891232
17005174784,81833648128,47669248,713416704,1.171,0.335,98.494,0,0,943658,57262998
17005895680,81832861696,47669248,713482240,1.197,0.278,98.524,0,0,1027592,60147266
17006223360,81832472576,47677440,713535488,1.200,0.279,98.520,0,0,1028956,59271044
17006010368,81832640512,47677440,713580544,1.921,0.195,97.884,0,0,1008430,61725894
17005113344,81833336832,47685632,713768960,1.818,0.308,97.874,0,0,1014562,61229192
17007075328,81831305216,47685632,713834496,1.253,0.445,98.302,0,0,987606,59121606
17006264320,81832062976,47685632,713887744,1.225,0.390,98.385,0,0,1093468,63782906
17006563328,81831706624,47685632,713945088,1.308,0.278,98.414,0,0,958950,56702854
17007763456,81830432768,47693824,714010624,0.894,0.335,98.771,0,0,932280,55813502
17007034368,81831092224,47702016,714072064,0.837,0.391,98.773,0,0,991861,59606118
17006428160,81831649280,47702016,714121216,1.115,0.418,98.467,0,0,1076826,63328490
17006424064,81831583744,47702016,714182656,1.089,0.307,98.604,0,0,1016014,61988530
17007841280,81830113280,47702016,714235904,1.451,0.307,98.242,0,0,956890,59240814
17007067136,81830821888,47702016,714297344,1.230,0.252,98.518,0,0,987050,60711178
17007910912,81829908480,47710208,714354688,1.559,0.306,98.134,0,0,967004,58235018
17007943680,81829810176,47710208,714420224,1.967,0.388,97.645,0,0,922946,55735644
17007992832,81829711872,47710208,714469376,1.557,0.306,98.137,0,0,953230,57771156
17008476160,81829167104,47710208,714526720,1.893,0.417,97.690,0,0,1012472,59338890
17007894528,81829699584,47710208,714575872,1.694,0.444,97.862,0,0,997572,60092416
17010016256,81827360768,47718400,714633216,1.555,0.361,98.084,0,0,1005230,57791468
17010696192,81826611200,47718400,714698752,1.005,0.391,98.604,0,0,931824,57332150
17009651712,81827594240,47718400,714760192,0.781,0.307,98.912,0,0,972238,58707542
17010151424,81827037184,47718400,714817536,1.226,0.306,98.440,0.028,0,899604,54248082
15486091264,83350704128,47718400,714866688,1.284,0.251,98.465,0,0,852588,52081294
11532050432,87305158656,47742976,714473472,1.117,0.363,98.520,0,0,721286,47256160
7570321408,91267964928,47742976,713404416,0.810,0.251,98.939,0,0,486918,32002192
3643662336,95195541504,47742976,712527872,0.697,0.167,99.136,0,0,245520,18327498
1315520512,97525047296,47742976,711204864,0.167,0.083,99.750,0,0,21178,1767352
1289650176,97551622144,47742976,710541312,0.083,0,99.917,0,0,658,102
1289650176,97551622144,47742976,710541312,0,0,100,0,0,1510,0
1289883648,97551364096,47763456,710541312,0,0,100,0,0,2116,0
1289883648,97551364096,47763456,710541312,0,0,100,0,0,1946,102
1289383936,97551822848,47763456,710541312,0,0,100,0,0,152025,22068
1289400320,97551806464,47763456,710541312,0,0.028,99.972,0,0,2122,0
1289400320,97551806464,47763456,710541312,0,0,100,0,0,4598,0
1289392128,97551814656,47763456,710541312,0,0,100,0,0,1944,0
1289408512,97551790080,47771648,710541312,0,0.028,99.972,0,0,840,0
1289408512,97551790080,47771648,710541312,0,0,100,0,0,2064,102
1289408512,97551790080,47771648,710541312,0,0,100,0,0,14846,1948
1289408512,97551790080,47771648,710541312,0,0,100,0,0,9547,220
1289408512,97551790080,47771648,710541312,0,0,100,0,0,4468,0
1289408512,97551790080,47771648,710541312,0,0,100,0,0,712,0
1289383936,97551790080,47796224,710541312,0,0,99.972,0.028,0,3866,0
1289416704,97551757312,47796224,710541312,0,0,100,0,0,1362,0
1289158656,97552015360,47796224,710541312,0,0,100,0,0,6404,0
1289158656,97552015360,47796224,710541312,0,0,100,0,0,6014,0
1289158656,97552015360,47796224,710541312,0,0,100,0,0,7960,0
1289158656,97552015360,47796224,710541312,0,0,100,0,0,4130,0
1289150464,97552015360,47804416,710541312,0,0,100,0,0,2292,0
1289150464,97552015360,47804416,710541312,0,0,100,0,0,718,0
1289150464,97552015360,47804416,710541312,0,0,100,0,0,1142,0
1290174464,97549598720,47812608,710549504,0.889,0.417,98.694,0,0,403446,45990
1289687040,97549660160,47812608,710549504,0,0.028,99.972,0,0,1622,0
