"Dstat 0.7.3 CSV output"
"Author:","Dag Wieers <dag@wieers.com>",,,,"URL:","http://dag.wieers.com/home-made/dstat/"
"Host:","gros-79.nancy.grid5000.fr",,,,"User:","root"
"Cmdline:","dstat -m -c -n -o dstat.csv",,,,"Date:","23 May 2020 23:34:41 CEST"
"memory usage",,,,"total cpu usage",,,,,"net/total",
"used","free","buff","cach","usr","sys","idl","wai","stl","recv","send"
1268391936,97593413632,46252032,694484992,0.612,0.171,99.170,0.047,0,0,0
1264787456,97596985344,46264320,694382592,0.721,0.388,98.891,0,0,402500,32132
1264771072,97597001728,46264320,694382592,0,0,100,0,0,5976,102
1265623040,97596141568,46264320,694382592,0.667,0.333,99,0,0,387290,16866
1279356928,97582145536,46264320,694640640,0.333,0.056,99.611,0,0,385778,11308
1261207552,97600520192,46276608,694370304,0.416,0.305,99.279,0,0,14674,10992
1261338624,97600376832,46276608,694382592,0,0.028,99.972,0,0,9068,0
1261326336,97600376832,46288896,694382592,0,0,100,0,0,8614,0
1261326336,97600376832,46288896,694382592,0,0,100,0,0,8972,180
1261326336,97600376832,46288896,694382592,0,0,100,0,0,2764,342
1261314048,97600376832,46301184,694382592,0,0,100,0,0,1804,0
1274023936,97587195904,46301184,694849536,0.444,0.139,99.417,0,0,387720,16522
1261965312,97599516672,46301184,694587392,0.611,0.638,98.751,0,0,173432,16696
1260761088,97600090112,46313472,695185408,0.666,0.417,98.917,0,0,393528,30394
1261412352,97599422464,46313472,695189504,0.804,0.388,98.808,0,0,390109,16820
1261686784,97599594496,46313472,694743040,0,0.028,99.972,0,0,8809,0
1261400064,97599848448,46325760,694743040,0.970,0.277,98.752,0,0,395086,18118
1290764288,97570340864,46325760,694886400,0.528,0.083,99.389,0,0,229228,8776
1261989888,97599180800,46338048,694747136,0.666,0.083,99.250,0,0,14166,5432
1268805632,97592365056,46338048,694747136,0.139,0.028,99.833,0,0,178928,6862
1270050816,97590923264,46338048,694943744,0.611,0.195,99.194,0,0,369298,28160
1270120448,97590841344,46342144,694951936,0.028,0.056,99.889,0.028,0,34856,10514
1270112256,97590849536,46342144,694951936,0,0.028,99.972,0,0,12684,10192
1270087680,97590849536,46366720,694951936,0,0,100,0,0,12468,9996
1270087680,97590849536,46366720,694951936,0.028,0.028,99.944,0,0,12146,10094
1270087680,97590849536,46366720,694951936,0.028,0,99.972,0,0,14890,14174
1270087680,97590849536,46366720,694951936,0,0.028,99.972,0,0,13790,11318
1270087680,97590849536,46366720,694951936,0,0.028,99.972,0,0,12334,10094
1270087680,97590849536,46366720,694951936,0,0,100,0,0,12358,10144
1270079488,97590849536,46374912,694951936,0,0,100,0,0,11130,10192
1262862336,97598066688,46374912,694951936,0,0,100,0,0,2038,2236
1262444544,97598668800,46374912,694767616,0.250,0.056,99.695,0,0,173094,14208
1262436352,97598676992,46374912,694767616,0,0,100,0,0,2212,180
1262436352,97598676992,46374912,694767616,0,0,100,0,0,1034,0
1262436352,97598676992,46374912,694767616,0,0,100,0,0,1706,0
1262399488,97598701568,46387200,694767616,0,0,100,0,0,1730,0
1262354432,97598734336,46399488,694767616,0,0.028,99.972,0,0,2082,0
1262354432,97598734336,46399488,694767616,0,0,100,0,0,1264,264
1262354432,97598734336,46399488,694767616,0,0,100,0,0,3070,0
1275121664,97585516544,46399488,695214080,0.584,0.306,99.110,0,0,395652,18066
1260126208,97600942080,46399488,694767616,0.139,0.111,99.750,0,0,28780,13216
1260113920,97600942080,46411776,694767616,0.028,0,99.972,0,0,15390,2728
1260113920,97600942080,46411776,694767616,0,0.028,99.972,0,0,4860,102
1260113920,97600942080,46411776,694767616,0,0,100,0,0,2292,102
1260105728,97600950272,46411776,694767616,0,0,100,0,0,1519,204
1260077056,97600966656,46424064,694767616,0,0,100,0,0,2320,102
1260077056,97600966656,46424064,694767616,0,0,100,0,0,5030,0
1279508480,97581527040,46432256,694767616,0.333,0.111,99.556,0,0,335698,14832
4354547712,94504542208,46432256,696369152,19.667,8.516,71.817,0,0,1987062,83870
8136306688,90720735232,46432256,698048512,27.285,9.699,63.016,0,0,1659408,72142
12015849472,86839058432,46436352,699977728,27.857,10.064,62.080,0,0,1671370,76230
15690985472,83162726400,46448640,701038592,25.611,9.277,65.111,0,0,1005164,46102
16034430976,82819014656,46538752,701202432,2.592,0.446,96.906,0.056,0,5322,2581
16028266496,82825154560,46551040,701210624,0.861,0.139,99.000,0,0,32842,2556100
16048001024,82805403648,46551040,701227008,2.365,0.167,97.468,0,0,226070,16877674
16100835328,82752536576,46551040,701255680,3.765,0.335,95.901,0,0,557910,35434536
16197550080,82655776768,46551040,701300736,4.907,0.362,94.731,0,0,781760,45663330
16329142272,82524135424,46559232,701341696,5.520,0.610,93.870,0,0,961872,58392046
16489943040,82363260928,46567424,701407232,9.189,0.775,90.036,0,0,998756,59030998
16624017408,82229133312,46567424,701460480,10.392,0.691,88.917,0,0,1008782,61039240
16726151168,82126954496,46567424,701505536,9.773,0.692,89.535,0,0,979872,57012542
16827691008,82025340928,46567424,701579264,8.525,0.500,90.975,0,0,1004462,58346654
16831315968,82021666816,46575616,701620224,3.456,0.418,96.098,0.028,0,1048500,62365406
16799223808,82053697536,46575616,701677568,3.086,0.417,96.497,0,0,992366,59983188
16798289920,82054569984,46575616,701739008,4.004,0.939,95.057,0,0,1022714,61371262
16782524416,82070220800,46575616,701845504,3.630,0.416,95.955,0,0,968976,59282484
16762359808,82090319872,46575616,701906944,2.940,0.472,96.588,0,0,927514,56258216
16786698240,82065915904,46592000,701956096,3.859,0.500,95.641,0,0,1010198,60387858
16769953792,82082594816,46592000,702013440,3.551,0.416,96.033,0,0,876968,53565110
16740184064,82112303104,46592000,702074880,3.965,0.416,95.620,0,0,967292,60518398
16704073728,82148364288,46592000,702124032,3.779,0.445,95.777,0,0,894332,55374548
16689274880,82163109888,46592000,702173184,2.641,0.278,97.081,0,0,921962,55706840
16689692672,82162618368,46600192,702238720,2.473,0.417,97.110,0,0,982382,61658840
16689770496,82162487296,46600192,702291968,2.583,0.389,97.028,0,0,1019938,62202078
16689782784,82162409472,46600192,702341120,2.392,0.389,97.218,0,0,988279,59847334
16689094656,82162896896,46600192,702541824,2.336,0.584,97.080,0,0,983278,58902208
16691179520,82160766976,46600192,702586880,1.732,0.419,97.849,0,0,985850,58880218
16692969472,82158911488,46608384,702640128,2.539,0.335,97.126,0,0,1048644,62408716
16692027392,82159796224,46608384,702697472,1.898,0.363,97.739,0,0,988618,58789100
16703033344,82148651008,46608384,702816256,2.650,0.335,97.015,0,0,949910,57028920
16703959040,82147532800,46608384,703004672,2.271,0.443,97.285,0,0,994596,57206288
16703221760,82148171776,46608384,703062016,2.084,0.306,97.610,0,0,959048,54166298
16704339968,82146988032,46616576,703115264,2.779,0.361,96.859,0,0,980348,57435178
16704532480,82146729984,46624768,703172608,2.218,0.444,97.339,0,0,1024124,61009416
16706330624,82144878592,46624768,703225856,2.656,0.609,96.736,0,0,997106,59613216
16706572288,82144583680,46624768,703279104,2.703,0.497,96.800,0,0,1009262,59855816
16706998272,82144100352,46624768,703336448,2.470,0.527,97.002,0,0,993110,58402166
16707391488,82143641600,46632960,703393792,2.739,0.415,96.846,0,0,1088542,64803510
16707055616,82143911936,46632960,703455232,2.471,0.333,97.196,0,0,937764,57823188
16707289088,82143621120,46632960,703512576,1.652,0.280,98.068,0,0,969480,58207652
16706740224,82143969280,46632960,703696896,2.475,0.250,97.275,0,0,925144,56959594
16720449536,82130210816,46632960,703746048,2.367,0.334,97.299,0,0,909272,56214118
16731787264,82118795264,46641152,703807488,2.280,0.667,97.052,0,0,1038678,63297042
16733175808,82117357568,46641152,703856640,1.477,0.334,98.189,0,0,926886,59971856
16733540352,82116939776,46641152,703909888,1.283,0.363,98.354,0,0,978568,62339664
16733274112,82117140480,46641152,703971328,2.062,0.334,97.603,0,0,1021456,59812398
16732590080,82117763072,46641152,704032768,1.557,0.445,97.998,0,0,1009946,61524606
16733536256,82116755456,46649344,704077824,2,0.444,97.556,0,0,939796,58843828
16734871552,82115227648,46649344,704262144,1.621,0.307,98.072,0,0,939310,57645666
16733790208,82116247552,46649344,704323584,2.033,0.418,97.549,0,0,973228,57859824
16734191616,82115788800,46649344,704380928,1.752,0.445,97.803,0,0,1013194,60595310
16735191040,82114691072,46649344,704442368,2.248,0.388,97.364,0,0,973624,58967288
16734982144,82114830336,46657536,704499712,2.472,0.389,97.139,0,0,993346,60109418
16734871552,82114895872,46657536,704544768,2.302,0.471,97.199,0.028,0,944172,57491000
16736174080,82113523712,46657536,704610304,1.314,0.364,98.322,0,0,974329,59041512
16736190464,82113384448,46657536,704663552,2.139,0.361,97.500,0,0,920768,56274344
16736665600,82112864256,46657536,704708608,2.303,0.499,97.198,0,0,966228,59675386
16744783872,82104676352,46665728,704770048,2.589,0.306,97.105,0,0,986150,59772550
16745074688,82104315904,46673920,704831488,3.487,0.415,96.097,0,0,987706,59696922
16752214016,82097131520,46673920,704876544,4.495,0.444,95.061,0,0,993158,58888042
16758890496,82090393600,46673920,704937984,4.534,0.278,95.188,0,0,995154,59199114
16768430080,82080792576,46673920,704987136,3.874,0.526,95.600,0,0,930684,55485768
16768114688,82081054720,46682112,705032192,2.506,0.278,97.216,0,0,990474,59526626
16768737280,82080370688,46682112,705093632,1.997,0.333,97.671,0,0,940486,55930572
16763379712,82085666816,46682112,705155072,1.419,0.390,98.191,0,0,936288,55992230
16761643008,82087354368,46682112,705204224,1.977,0.278,97.744,0,0,968236,56800564
16761253888,82087682048,46682112,705265664,1.699,0.334,97.967,0,0,1025064,60760764
16768307200,82080571392,46690304,705314816,2.445,0.500,97.055,0,0,875436,56062458
16810758144,82038063104,46690304,705372160,5.125,0.526,94.321,0.028,0,1000800,59991704
16847675392,82001084416,46690304,705429504,4.250,0.361,95.389,0,0,982772,60930934
16904511488,81944190976,46690304,705482752,5.954,0.498,93.547,0,0,994436,60534388
16973938688,81874710528,46690304,705536000,5.588,0.470,93.942,0,0,950894,57955044
16974196736,81874386944,46698496,705593344,1.727,0.613,97.661,0,0,955516,58246900
16974168064,81874358272,46698496,705650688,1.749,0.389,97.862,0,0,996938,58029124
16975540224,81872928768,46706688,705699840,2.586,0.417,96.997,0,0,996242,60238534
16973217792,81875189760,46706688,705761280,2,0.361,97.639,0,0,905994,54995288
16957796352,81890553856,46706688,705818624,1.309,0.390,98.301,0,0,1007894,58890096
16958173184,81890127872,46714880,705859584,1.254,0.418,98.328,0,0,1046361,62401068
16958160896,81890066432,46714880,705933312,1.364,0.417,98.219,0,0,963476,56786604
16959180800,81888993280,46714880,705982464,1.699,0.390,97.911,0,0,1000574,60983998
16958754816,81889210368,46714880,706170880,1.456,0.336,98.208,0,0,946642,59579534
16958365696,81889538048,46714880,706232320,1.889,0.444,97.667,0,0,985527,59636196
16959238144,81888620544,46723072,706269184,2.543,0.525,96.932,0,0,983272,59641802
16958603264,81889185792,46723072,706338816,1.588,0.390,98.022,0,0,995996,60461164
16959270912,81888464896,46723072,706392064,1.669,0.362,97.969,0,0,1050055,62462274
16951762944,81895919616,46723072,706445312,1.773,0.388,97.839,0,0,1068873,63186430
16950427648,81897197568,46723072,706502656,1.678,0.308,98.014,0,0,1040532,62408280
16949022720,81898541056,46731264,706555904,2.499,0.361,97.140,0,0,961856,58012810
16951152640,81896353792,46731264,706613248,1.502,0.556,97.942,0,0,949846,55427222
16950181888,81897271296,46731264,706666496,1.529,0.417,98.054,0,0,1037441,63032532
16951181312,81896230912,46731264,706707456,1.613,0.334,98.053,0,0,969860,60039876
16950804480,81896529920,46731264,706785280,1.807,0.334,97.859,0,0,978216,57242632
16951816192,81895452672,46739456,706842624,1.723,0.389,97.888,0,0,1043358,61465482
16950562816,81896665088,46739456,706879488,2.423,0.306,97.271,0,0,922600,56177286
16951226368,81895936000,46739456,706945024,1.587,0.473,97.912,0.028,0,944380,57493376
16951615488,81895485440,46739456,707002368,1.779,0.306,97.915,0,0,970994,59378116
16951328768,81895718912,46739456,707055616,1.581,0.499,97.920,0,0,907852,56141726
16951967744,81895010304,46747648,707112960,2.887,0.472,96.641,0,0,963256,61562940
16952172544,81894748160,46747648,707170304,2.661,0.277,97.062,0,0,957078,60538068
16963342336,81883512832,46755840,707227648,2.621,0.390,96.989,0,0,1033488,60377752
16973168640,81873633280,46755840,707280896,2.914,0.611,96.475,0,0,943096,55695160
16974942208,81871806464,46755840,707334144,2.249,0.389,97.362,0,0,969364,55584364
16975097856,81871589376,46764032,707387392,1.892,0.334,97.775,0,0,1005548,58964466
16974905344,81871720448,46764032,707448832,1.950,0.446,97.604,0,0,956026,57313828
16975630336,81870938112,46764032,707506176,1.473,0.445,98.082,0,0,1035904,61597442
16975876096,81870643200,46764032,707555328,2.082,0.333,97.585,0,0,923908,56005236
16976490496,81869955072,46772224,707620864,1.640,0.445,97.916,0,0,1031320,62818986
16975736832,81870643200,46780416,707678208,2.132,0.471,97.397,0,0,1074473,64025542
16975818752,81870512128,46780416,707727360,1.694,0.417,97.889,0,0,1029250,60786986
16975548416,81870712832,46780416,707792896,1.970,0.416,97.614,0,0,920194,55417890
16975757312,81870454784,46780416,707842048,1.365,0.306,98.329,0,0,993984,61178282
16976736256,81869336576,46780416,707907584,2.553,0.555,96.892,0,0,983645,59859746
16976916480,81869086720,46788608,707960832,1.471,0.444,98.084,0,0,958486,56689450
16977379328,81868562432,46788608,708022272,2.164,0.416,97.420,0,0,944148,55254940
16977219584,81868660736,46788608,708079616,1.974,0.362,97.664,0,0,957175,57526396
16982687744,81863143424,46788608,708124672,4.670,0.580,94.750,0,0,932052,55478398
16985952256,81859821568,46788608,708182016,3.480,0.390,96.130,0,0,917998,55388584
16989376512,81856327680,46796800,708243456,4.436,0.388,95.148,0.028,0,1000518,60706694
16994643968,81851002880,46796800,708300800,3.005,0.417,96.578,0,0,962928,59631968
16995381248,81850204160,46796800,708362240,2.718,0.416,96.866,0,0,902222,54484900
16993075200,81852444672,46796800,708423680,3.248,0.416,96.335,0,0,964714,57277144
16991535104,81853939712,46796800,708468736,2.058,0.473,97.469,0,0,1031890,61696440
16991682560,81853710336,46804992,708538368,1.226,0.418,98.357,0,0,980418,57464844
16991240192,81854103552,46804992,708587520,1.558,0.306,98.136,0,0,924612,54839036
16991170560,81853972480,46804992,708788224,2.164,0.444,97.392,0,0,947246,55926194
16992329728,81852747776,46813184,708841472,1.996,0.333,97.672,0,0,909990,57238550
16992702464,81852321792,46813184,708894720,1.691,0.443,97.866,0,0,957062,56741222
16992829440,81852129280,46821376,708952064,2.515,0.470,97.015,0,0,927882,57628312
16991977472,81852919808,46821376,709009408,1.662,0.554,97.784,0,0,1040146,62696378
16992731136,81852104704,46821376,709070848,1.309,0.446,98.246,0,0,1013868,60804938
16993304576,81851461632,46837760,709124096,1.610,0.389,97.973,0.028,0,933548,56823284
16994422784,81850286080,46837760,709181440,1.914,0.527,97.559,0,0,954654,57390200
16994119680,81850523648,46837760,709246976,1.529,0.528,97.942,0,0,973804,58988122
16994029568,81850560512,46837760,709296128,1.559,0.417,98.024,0,0,952192,58149078
16995020800,81849516032,46837760,709345280,1.562,0.363,98.076,0,0,979610,58541214
16994717696,81849745408,46845952,709410816,1.978,0.279,97.744,0,0,939230,58578624
16995119104,81849286656,46845952,709468160,1.361,0.417,98.222,0,0,947120,57703110
16994443264,81849913344,46845952,709517312,1.446,0.306,98.248,0,0,963170,57825160
16995274752,81849004032,46845952,709591040,1.775,0.444,97.781,0,0,1028848,62050046
16995323904,81848905728,46845952,709640192,1.059,0.474,98.467,0,0,973142,60092526
16995053568,81849110528,46854144,709697536,1.421,0.474,98.105,0,0,943510,56669320
16995028992,81849077760,46854144,709754880,1.531,0.334,98.135,0,0,951374,61091694
16996302848,81847746560,46854144,709812224,1.863,0.445,97.693,0,0,980747,58165456
16995958784,81848041472,46854144,709861376,1.280,0.390,98.331,0,0,917398,57465732
16996974592,81846964224,46854144,709922816,1.921,0.390,97.689,0,0,954763,56341326
16996765696,81847099392,46862336,709984256,1.417,0.417,98.166,0,0,957932,57685464
16997511168,81846288384,46862336,710049792,1.283,0.363,98.355,0,0,929091,56617752
16996974592,81846779904,46862336,710090752,1.224,0.389,98.387,0,0,991312,59348378
16996773888,81846910976,46862336,710160384,1.555,0.500,97.945,0,0,1017314,60406520
16996904960,81846718464,46862336,710217728,1.391,0.390,98.219,0,0,1015908,60876150
16997773312,81845776384,46878720,710270976,1.758,0.446,97.796,0,0,1114114,65213424
16998244352,81845231616,46878720,710332416,1.962,0.525,97.512,0,0,1042580,63461090
16998711296,81844707328,46878720,710389760,1.803,0.472,97.725,0,0,920664,53564140
16998035456,81845329920,46878720,710443008,1.564,0.335,98.101,0,0,1010656,58940246
16998330368,81844969472,46878720,710508544,1.197,0.446,98.357,0,0,946790,56269016
16997609472,81845624832,46886912,710565888,1.309,0.362,98.329,0,0,927084,57851244
16999149568,81844023296,46895104,710619136,1.168,0.445,98.387,0,0,898376,55178898
16998531072,81844584448,46895104,710676480,1.417,0.389,98.194,0,0,931402,57529300
16999325696,81843736576,46895104,710729728,1.559,0.306,98.135,0,0,916626,55699508
16999571456,81843412992,46895104,710799360,1.892,0.501,97.608,0,0,1073746,64821620
16999768064,81843159040,46903296,710848512,1.663,0.388,97.921,0.028,0,995780,59085282
16999751680,81843101696,46903296,710914048,1.890,0.361,97.748,0,0,944798,56114634
16998805504,81843990528,46903296,710971392,1.636,0.471,97.892,0,0,980964,59496012
16999542784,81843204096,46903296,711020544,1.919,0.278,97.803,0,0,961514,58130722
16999907328,81842782208,46903296,711077888,1.743,0.553,97.704,0,0,910132,55611930
17000275968,81842331648,46911488,711143424,1.389,0.417,98.194,0,0,896232,55615282
17001402368,81841152000,46915584,711188480,1.361,0.528,98.111,0,0,929128,56601264
17000800256,81841684480,46915584,711258112,1.468,0.609,97.923,0,0,1002334,62883346
17001553920,81840726016,46915584,711442432,2.055,0.389,97.556,0,0,942036,57685296
17002049536,81840177152,46915584,711491584,2.128,0.442,97.430,0,0,1019190,59261856
17001381888,81840766976,46923776,711553024,1.473,0.389,98.138,0,0,1001456,58740856
17002889216,81839194112,46931968,711610368,1.250,0.472,98.277,0,0,963742,57783038
17002094592,81839935488,46931968,711663616,1.991,0.498,97.512,0,0,964992,59528398
17002348544,81839611904,46931968,711729152,1.307,0.584,98.109,0,0,945114,57491496
17001902080,81840005120,46931968,711782400,1.473,0.445,98.083,0,0,1000787,58605414
17002491904,81839349760,46940160,711839744,1.144,0.335,98.522,0,0,1069498,63283914
17003798528,81837981696,46940160,711901184,1.808,0.362,97.830,0,0,1016030,60780766
17002287104,81839427584,46948352,711958528,1.913,0.499,97.588,0,0,925208,56557118
17002524672,81839132672,46948352,712015872,1.831,0.361,97.808,0,0,953956,58725388
17002369024,81839235072,46948352,712069120,2.053,0.472,97.475,0,0,1085684,64869486
17002852352,81838686208,46956544,712126464,1.692,0.471,97.837,0,0,1042642,64528338
17003016192,81838456832,46956544,712192000,1.004,0.307,98.661,0.028,0,936282,57425162
17004081152,81837342720,46956544,712241152,1.276,0.472,98.252,0,0,1046772,62753422
17004077056,81837281280,46956544,712302592,1.389,0.500,98.112,0,0,994632,60759330
17004400640,81836900352,46956544,712359936,1.837,0.417,97.746,0,0,954522,58194564
17004232704,81837002752,46964736,712413184,1.741,0.608,97.651,0,0,871254,56162066
17004482560,81836679168,46972928,712478720,2.051,0.582,97.367,0,0,964550,57155008
17004752896,81836355584,46972928,712531968,2.325,0.471,97.205,0,0,998064,62495774
17004789760,81836257280,46972928,712593408,1.584,0.445,97.971,0,0,962698,59201018
17004900352,81836093440,46972928,712646656,1.616,0.362,98.022,0,0,945464,58725672
17004544000,81836388352,46981120,712699904,1.886,0.416,97.698,0,0,1028676,60372802
17004244992,81836617728,46981120,712765440,1.282,0.362,98.356,0,0,985714,59529290
17004175360,81836621824,46989312,712822784,1.363,0.278,98.359,0,0,994644,61388032
17004580864,81836163072,46989312,712876032,1.638,0.527,97.835,0,0,903904,57098486
17004691456,81836003328,46989312,712925184,1.362,0.500,98.138,0,0,924194,55843154
17005146112,81835479040,46997504,712986624,1.579,0.471,97.951,0,0,928826,56676142
17004613632,81835945984,46997504,713052160,2.104,0.498,97.398,0,0,905360,54947626
17004879872,81835630592,46997504,713101312,2.109,0.500,97.391,0,0,958314,57014018
17006129152,81834319872,46997504,713158656,1.225,0.306,98.469,0,0,948238,57608694
17005801472,81834582016,46997504,713224192,1.797,0.498,97.706,0,0,1088932,66240738
17005735936,81834582016,47005696,713281536,1.911,0.637,97.452,0,0,990070,58248962
17005707264,81834553344,47005696,713338880,1.583,0.583,97.834,0,0,926580,55920994
17006231552,81833967616,47005696,713400320,1.943,0.444,97.613,0,0,947122,58114492
17006505984,81833512960,47005696,713580544,1.333,0.389,98.278,0,0,908446,56602170
17006661632,81833283584,47005696,713641984,1.223,0.472,98.305,0,0,945571,59188828
17005678592,81834201088,47013888,713699328,1.170,0.390,98.440,0,0,970408,58755944
17005490176,81834336256,47013888,713752576,1.504,0.362,98.134,0,0,991472,57717466
17006592000,81833172992,47013888,713814016,1.308,0.334,98.331,0.028,0,1023282,62697128
17006788608,81832914944,47013888,713875456,1.497,0.527,97.976,0,0,1058452,62292778
17006854144,81832792064,47013888,713932800,1.780,0.417,97.803,0,0,898536,55187564
17007345664,81832243200,47022080,713981952,1.780,0.417,97.803,0,0,983848,58441864
17008906240,81830391808,47022080,714047488,1.280,0.417,98.303,0,0,999975,57798562
17009524736,81829711872,47030272,714096640,2.053,0.444,97.503,0,0,1024460,60987766
17009651712,81829515264,47030272,714158080,1.530,0.362,98.108,0,0,1035952,62284430
17010409472,81828704256,47030272,714211328,1.663,0.526,97.811,0,0,894726,53662174
17010163712,81828876288,47038464,714276864,1.417,0.306,98.278,0,0,938740,56686108
17011097600,81827893248,47038464,714326016,1.636,0.444,97.920,0,0,925188,57526532
17010020352,81828909056,47038464,714387456,1.527,0.361,98.112,0,0,946716,58997088
17011212288,81827635200,47046656,714457088,1.314,0.308,98.379,0,0,1065872,63518616
17010417664,81828388864,47046656,714498048,1.502,0.278,98.220,0,0,999060,60948008
17010507776,81828225024,47054848,714563584,1.468,0.665,97.868,0,0,981830,57616382
17010737152,81827934208,47054848,714625024,1.644,0.279,98.077,0,0,1023360,60954962
17010499584,81828130816,47054848,714665984,1.580,0.471,97.948,0,0,1027486,61011802
13112881152,85725151232,47054848,714850304,1.668,0.556,97.777,0,0,797160,48506062
9189003264,89650032640,47067136,713793536,1.225,0.445,98.330,0,0,862642,37581074
4490530816,94349623296,47079424,712704000,0.474,0.223,99.302,0,0,312618,21721348
1322573824,97518727168,47079424,711606272,0.334,0.167,99.500,0,0,69354,5060040
1287897088,97554550784,47079424,710500352,0.056,0.028,99.889,0.028,0,1026,0
1287897088,97554550784,47079424,710500352,0,0.028,99.972,0,0,1754,102
1287897088,97554550784,47079424,710500352,0,0,100,0,0,1958,0
1287884800,97554550784,47091712,710500352,0,0,100,0,0,15176,0
1287876608,97554558976,47091712,710500352,0.028,0,99.972,0,0,7874,2820
1287872512,97554558976,47095808,710500352,0,0,100,0,0,4136,0
1287872512,97554558976,47095808,710500352,0,0,100,0,0,822,0
1287872512,97554558976,47095808,710500352,0,0,100,0,0,4131,0
1287872512,97554558976,47095808,710500352,0,0,100,0,0,1472,0
1287864320,97554558976,47104000,710500352,0,0,100,0,0,6404,0
1287864320,97554558976,47104000,710500352,0,0,100,0,0,7600,0
1287864320,97554558976,47104000,710500352,0,0,100,0,0,6264,0
1287864320,97554558976,47104000,710500352,0,0,100,0,0,4842,0
1287864320,97554558976,47104000,710500352,0,0,100,0,0,1746,0
1287864320,97554558976,47104000,710500352,0,0.028,99.972,0,0,718,0
1287856128,97554558976,47112192,710500352,0,0,100,0,0,1322,0
1289678848,97551032320,47112192,710508544,0.863,0.306,98.831,0,0,403294,45654
1289678848,97551032320,47112192,710508544,0,0,100,0,0,1572,0
