172.16.66.55 : 0.02 0.03 0.03 0.03 0.03 0.03 0.03 0.03 0.03 0.03
172.16.66.56 : 0.23 0.23 0.21 0.20 0.24 0.24 0.21 0.26 0.27 0.21
172.16.66.57 : 23.43 10.36 10.39 10.40 10.36 10.31 10.30 10.36 10.36 10.35
172.16.66.58 : 16.61 10.36 10.36 10.34 10.34 10.36 10.35 10.34 10.32 10.34
172.16.66.59 : 14.56 10.29 10.24 10.31 10.31 10.31 10.32 10.31 10.31 10.32
172.16.66.6  : 16.62 10.34 10.29 10.34 10.36 10.31 10.34 10.33 10.33 10.35
172.16.66.60 : 16.57 10.30 10.30 10.31 10.28 10.33 10.31 10.24 10.28 10.30
172.16.66.61 : 20.09 10.38 10.31 10.38 10.41 10.37 10.36 10.32 10.39 10.39
172.16.66.62 : 20.14 10.33 10.29 10.36 10.31 10.35 - 10.35 10.38 10.32
172.16.66.64 : 11.08 10.38 10.38 10.34 10.37 10.24 10.37 10.35 10.39 10.38
172.16.66.65 : 19.99 10.35 10.30 10.29 10.24 10.24 10.34 10.37 10.37 10.34
172.16.66.66 : 14.55 10.36 10.32 10.33 10.29 - 10.29 10.30 10.27 10.30
172.16.66.67 : 20.11 10.32 10.30 10.35 10.29 10.33 10.30 10.32 10.32 10.34
172.16.66.69 : 14.59 10.33 10.35 - 10.32 10.39 10.33 - 10.38 10.38
172.16.66.7  : 11.09 4.37 4.37 4.40 4.39 4.37 4.40 4.35 4.38 4.36
172.16.66.70 : 16.58 4.34 4.33 4.35 4.34 4.33 4.39 4.41 4.41 4.40
172.16.66.71 : 16.57 4.33 4.35 4.33 4.32 4.34 4.36 4.33 4.33 4.33
172.16.66.72 : 11.13 4.33 4.40 4.33 4.41 4.39 4.41 4.33 4.39 4.39
172.16.66.73 : 7.72 4.30 4.33 4.40 4.38 4.40 4.25 4.30 4.34 4.38
172.16.66.74 : 7.66 4.39 4.39 4.38 4.39 4.40 4.39 4.38 4.40 4.43
172.16.66.75 : 22.17 4.33 4.29 4.31 4.31 4.34 4.33 4.33 4.38 4.41
172.16.66.76 : 20.02 4.36 4.32 4.38 4.37 4.33 4.38 4.39 4.34 4.39
172.16.66.77 : 16.23 4.39 4.38 4.38 4.37 4.36 4.38 4.37 4.37 4.38
172.16.66.78 : 16.33 4.39 4.37 4.40 4.31 4.37 4.38 4.30 4.36 4.39
172.16.66.79 : 20.04 4.39 4.39 4.40 4.31 4.33 4.39 4.36 4.35 4.37
172.16.66.8  : 16.56 4.41 4.38 4.40 4.42 4.40 4.38 4.39 4.35 4.38
172.16.66.80 : 16.60 4.40 4.35 4.41 4.39 4.38 4.38 4.38 4.38 4.39

      27 targets
      27 alive
       0 unreachable
       0 unknown addresses

       3 timeouts (waiting for response)
     270 ICMP Echos sent
     266 ICMP Echo Replies received
       0 other ICMP received

 0.02 ms (min round trip time)
 7.50 ms (avg round trip time)
 23.4 ms (max round trip time)
       10.150 sec (elapsed real time)

