172.16.66.55 : 17.64 10.33 10.30 10.26 10.29 10.33 10.36 10.36 - 10.37
172.16.66.56 : 13.27 10.38 10.35 10.38 10.36 10.33 10.28 10.27 10.32 -
172.16.66.57 : 5.56 0.20 0.17 0.23 0.20 0.20 0.19 0.21 0.22 0.22
172.16.66.58 : 0.23 0.21 0.21 0.20 0.22 0.20 0.22 0.23 0.23 0.23
172.16.66.59 : 0.23 0.23 0.20 0.22 0.18 0.22 0.21 0.23 0.22 0.20
172.16.66.6  : 0.25 0.23 0.22 0.23 0.22 0.23 0.20 0.19 0.23 0.22
172.16.66.60 : 0.21 0.25 0.22 0.22 0.20 0.22 0.22 0.21 0.24 0.22
172.16.66.61 : 0.21 0.23 0.22 0.22 0.24 0.24 0.23 0.20 0.22 0.22
172.16.66.62 : 0.23 0.23 0.23 0.21 0.23 0.22 0.21 0.22 0.23 0.23
172.16.66.64 : 0.20 0.24 0.20 0.22 0.21 0.23 0.21 0.23 0.22 0.24
172.16.66.65 : 0.04 0.03 0.03 0.03 0.03 0.03 0.03 0.03 0.03 0.03
172.16.66.66 : 0.24 0.22 0.22 0.22 0.23 0.23 0.19 0.24 0.23 0.20
172.16.66.67 : 0.25 0.19 0.22 0.13 0.22 0.22 0.23 0.23 0.23 0.21
172.16.66.69 : 0.25 0.23 0.22 0.23 0.22 0.23 0.20 0.22 0.23 0.23
172.16.66.7  : 11.12 4.39 4.39 4.37 4.40 4.38 4.30 4.32 4.32 4.35
172.16.66.70 : 11.05 4.33 4.38 - 4.38 4.36 4.36 4.37 4.34 4.36
172.16.66.71 : 11.10 4.32 4.31 4.32 4.22 4.28 4.32 4.33 4.32 4.40
172.16.66.72 : 11.11 - 4.32 4.39 4.38 4.37 4.33 4.39 4.35 4.37
172.16.66.73 : 11.20 4.30 4.30 4.31 4.31 4.37 4.37 4.35 4.40 4.35
172.16.66.74 : 7.66 4.32 - 4.33 4.36 4.40 4.40 4.38 4.41 4.37
172.16.66.75 : 11.14 4.40 4.38 4.38 4.38 4.37 4.38 4.39 4.36 4.38
172.16.66.76 : 11.08 4.30 4.28 4.28 4.28 4.30 4.29 4.28 4.28 4.28
172.16.66.77 : 11.08 4.36 4.38 4.38 4.38 4.37 4.33 4.37 4.38 4.38
172.16.66.78 : 11.09 4.31 4.31 4.31 4.32 4.33 4.31 4.33 4.33 4.27
172.16.66.79 : 11.06 4.33 4.37 4.37 4.38 4.38 4.37 4.38 4.36 4.33
172.16.66.8  : - 4.27 4.24 4.28 4.27 4.28 4.29 4.29 4.28 4.25
172.16.66.80 : 11.10 4.31 4.38 4.36 4.34 4.38 4.36 4.34 4.36 4.37

      27 targets
      27 alive
       0 unreachable
       0 unknown addresses

       6 timeouts (waiting for response)
     270 ICMP Echos sent
     264 ICMP Echo Replies received
       0 other ICMP received

 0.03 ms (min round trip time)
 3.22 ms (avg round trip time)
 17.6 ms (max round trip time)
       10.266 sec (elapsed real time)

