"Dstat 0.7.3 CSV output"
"Author:","Dag Wieers <dag@wieers.com>",,,,"URL:","http://dag.wieers.com/home-made/dstat/"
"Host:","grisou-23.nancy.grid5000.fr",,,,"User:","root"
"Cmdline:","dstat -m -c -n -o dstat.csv",,,,"Date:","27 May 2020 10:27:26 CEST"
"memory usage",,,,"total cpu usage",,,,,"net/total",
"used","free","buff","cach","usr","sys","idl","wai","stl","recv","send"
1728466944,107407081472,85946368,24871342080,0.275,0.130,99.491,0.103,0,0,0
1740525568,107394899968,85946368,24871497728,0.561,0.218,99.220,0,0,387444,16494
1737617408,107398049792,85958656,24871243776,0.656,0.719,97.374,1.250,0,385486,26628
1734828032,107400835072,85958656,24871243776,1.093,0.656,98.251,0,0,5084,15946
1746313216,107389284352,85970944,24871297024,0.438,0.094,99.406,0.062,0,383162,10888
1735553024,107400097792,85970944,24871243776,0.719,0.594,98.688,0,0,6142,15914
1735528448,107400122368,85970944,24871243776,0.031,0,99.969,0,0,1976,662
1735135232,107400503296,85983232,24871243776,0,0,99.969,0.031,0,5680,84
1734524928,107401113600,85983232,24871243776,0.031,0.031,99.938,0,0,5124,0
1733996544,107401629696,85995520,24871243776,0.063,0,99.844,0.094,0,1278,0
1733734400,107401854976,85995520,24871243776,0.031,0.031,99.937,0,0,1464,0
1733091328,107402498048,85995520,24871243776,0,0,100,0,0,812,0
1732833280,107402756096,85995520,24871243776,0.094,0.031,99.875,0,0,692,0
1732825088,107402756096,86003712,24871243776,0,0,99.937,0.063,0,2256,0
1732308992,107403272192,86011904,24871235584,0.062,0.031,99.813,0.094,0,406,0
1732300800,107403272192,86011904,24871243776,0,0,100,0,0,812,0
1731526656,107404046336,86011904,24871243776,0,0.031,99.969,0,0,7334,0
1731010560,107404562432,86011904,24871243776,0,0,100,0,0,770,0
1741033472,107394088960,86016000,24871690240,0.938,0.562,98.406,0.094,0,390050,17806
1733287936,107402272768,86032384,24871235584,0.281,0.312,99.282,0.125,0,3254,13660
1736814592,107398574080,86032384,24871391232,0.657,0.407,98.937,0,0,339020,22648
1747677184,107387367424,86032384,24871731200,0.500,0.219,99.281,0,0,394588,20016
1737879552,107397611520,86032384,24871284736,0.532,0.594,98.874,0,0,3968,17184
1748979712,107386060800,86032384,24871731200,0.563,0.188,98.937,0.313,0,383768,11226
1735811072,107399643136,86056960,24871284736,0.407,0.532,98.937,0.125,0,5016,15428
1746870272,107388583936,86056960,24871284736,0.344,0.156,99.500,0,0,382726,10640
1737388032,107398066176,86056960,24871284736,0.563,0.719,98.718,0,0,5020,16030
1737379840,107398074368,86056960,24871284736,0.031,0.062,99.906,0,0,934,0
1736560640,107398848512,86056960,24871284736,1.752,0.188,97.685,0.375,0,222980,10948
1735184384,107400212480,86069248,24871284736,0.031,0.031,99.812,0.125,0,3268,2668
1734893568,107400503296,86069248,24871284736,0,0,100,0,0,1740,0
1734918144,107400478720,86069248,24871284736,0.062,0.031,99.906,0,0,167010,3924
1736249344,107399139328,86069248,24871292928,0.562,0.125,99.313,0,0,180462,11096
1743421440,107391778816,86069248,24871485440,0.250,0.063,99.687,0,0,180086,21538
1742835712,107392356352,86077440,24871485440,0.062,0.031,99.844,0.062,0,12964,13328
1742307328,107392872448,86089728,24871485440,0,0.031,99.937,0.031,0,13472,13230
1741533184,107393646592,86089728,24871485440,0.031,0,99.969,0,0,13318,13328
1741533184,107393646592,86089728,24871485440,0.031,0.031,99.937,0,0,14372,13328
1741275136,107393904640,86089728,24871485440,0.031,0,99.969,0,0,27480,19040
1741275136,107393904640,86097920,24871477248,0.031,0.031,99.875,0.063,0,12842,15276
1740861440,107394277376,86097920,24871485440,0,0.063,99.937,0,0,18524,12838
1740595200,107394535424,86106112,24871485440,0,0,99.937,0.063,0,41214,13548
1740595200,107394535424,86106112,24871485440,0,0,100,0,0,14616,13328
1732788224,107402526720,86106112,24871301120,0.125,0.062,99.813,0,0,4030,2236
1733120000,107402145792,86114304,24871305216,0.344,0.125,99.500,0.031,0,173898,14268
1733120000,107402145792,86114304,24871305216,0.031,0,99.969,0,0,1218,0
1732603904,107402661888,86114304,24871305216,0.031,0,99.969,0,0,1218,0
1732333568,107402919936,86126592,24871305216,0.031,0,99.875,0.094,0,994,0
1732075520,107403177984,86126592,24871305216,0.031,0,99.969,0,0,2256,0
1732317184,107402919936,86134784,24871309312,0,0,99.937,0.063,0,2542,0
1731543040,107403694080,86134784,24871309312,0,0.031,99.969,0,0,2542,0
1754869760,107380310016,86147072,24871313408,3.595,0.656,95.530,0.219,0,65120,99136
1776463872,107357880320,86482944,24871645184,5.682,0.749,91.258,2.310,0,7712,9056
1780768768,107352780800,86847488,24871890944,2.130,0.251,95.803,1.816,0,7352,6812
1780269056,107353264128,86855680,24871899136,0.219,0.063,99.000,0.719,0,3886,1868
1780269056,107353264128,86855680,24871899136,0.062,0.031,99.906,0,0,2610,1604
1780269056,107353264128,86855680,24871899136,0.094,0.031,99.875,0,0,3928,1604
1768910848,107364618240,86855680,24871903232,0.125,0.063,99.812,0,0,2338,1814
1768652800,107364876288,86855680,24871903232,0.063,0.031,99.906,0,0,6994,1604
1768644608,107364876288,86872064,24871895040,0.094,0.031,99.406,0.469,0,2024,1688
1765498880,107368013824,86872064,24871903232,0.094,0.031,99.875,0,0,3492,1604
1765498880,107368013824,86872064,24871903232,0.031,0.062,99.906,0,0,2954,2034
1764982784,107368529920,86872064,24871903232,0.062,0.031,99.906,0,0,3324,1604
1765322752,107368189952,86872064,24871903232,0.094,0.031,99.875,0,0,7288,1604
1766170624,107367157760,86880256,24872071168,2.403,0.218,97.316,0.062,0,3828390,3684058
1800130560,107323596800,86888448,24881291264,5.105,0.564,94.206,0.125,0,15393656,11226798
1806876672,107309527040,86900736,24888410112,3.035,0.563,96.151,0.250,0,15584172,16048713
1798148096,107309559808,86904832,24896847872,2.122,0.531,97.316,0.031,0,16012140,18726270
1807822848,107292528640,86904832,24903991296,1.813,0.313,97.874,0,0,14878976,14585937
1808580608,107285012480,86913024,24910454784,1.623,0.343,97.939,0.094,0,13465840,14952340
1807446016,107279511552,86921216,24916914176,1.473,0.470,97.398,0.658,0,14484942,14599209
1806581760,107272769536,86921216,24924323840,0.877,0.407,98.716,0,0,14405668,14370517
1803522048,107268939776,86921216,24931004416,1.065,0.251,98.684,0,0,13963288,13960812
1805901824,107259346944,86921216,24938024960,1.124,0.406,98.470,0,0,14478110,14678959
1806790656,107248021504,86929408,24948191232,2.561,0.656,96.721,0.062,0,21693146,21660103
1824747520,107214979072,86929408,24962887680,5.554,0.628,93.693,0.126,0,30620556,30901825
1841668096,107185557504,86937600,24975028224,4.477,0.595,94.897,0.031,0,25094958,25329450
1850966016,107162492928,86937600,24988430336,2.853,0.502,96.646,0,0,28089784,28389594
1889378304,107109036032,86945792,25003073536,4.629,0.626,94.620,0.125,0,31341522,31564258
1926905856,107055755264,86953984,25018351616,5.499,0.715,93.694,0.093,0,31016514,31402932
1929940992,107039227904,86953984,25031495680,3.225,0.376,96.399,0,0,27388254,27544816
1941700608,107013648384,86953984,25044942848,10.788,0.438,88.774,0,0,27751328,28058176
1936424960,107005206528,86962176,25058308096,1.999,0.500,97.470,0.031,0,27710178,28042702
1935568896,106990874624,86962176,25073045504,1.908,0.532,97.560,0,0,31320988,31468354
1961512960,106946002944,86970368,25091399680,2.506,0.689,96.742,0.063,0,40295486,40732209
2005090304,106880753664,86970368,25112481792,1.721,0.720,97.559,0,0,42138104,42608590
2027675648,106836373504,86970368,25133690880,1.409,0.720,97.870,0,0,44141626,44657417
2027151360,106815942656,86970368,25154068480,1.034,0.658,98.308,0,0,42837041,43052873
2027417600,106793816064,86978560,25175347200,1.160,0.658,98.119,0.063,0,44255771,44903655
2028982272,106768461824,86986752,25198485504,1.160,0.878,97.900,0.063,0,48783684,49419585
2028572672,106745704448,86990848,25220997120,1.561,0.718,97.346,0.375,0,46155848,46796915
2070757376,106681282560,86990848,25242681344,1.190,0.814,97.057,0.939,0,45282074,45727990
2115514368,106615771136,86990848,25262862336,1.127,0.689,98.184,0,0,42007478,42562118
2146148352,106562596864,86990848,25284804608,1.507,0.659,97.834,0,0,45017830,45448026
2145591296,106542444544,87007232,25304944640,1.128,0.721,98.058,0.094,0,42340086,42754555
2147348480,106518532096,87007232,25326440448,1.346,0.814,97.840,0,0,45049548,45687969
2145804288,106498420736,87011328,25347506176,1.285,0.627,96.614,1.473,0,44038956,44538765
2143735808,106477948928,87015424,25369432064,1.348,0.753,94.951,2.948,0,45749508,46332342
2144124928,106453016576,87019520,25393352704,1.440,0.814,96.337,1.409,0,50534500,51009008
2143232000,106431602688,87027712,25415061504,1.439,0.720,97.747,0.094,0,45302854,45458762
2159951872,106393075712,87035904,25436184576,1.343,0.781,97.783,0.094,0,43937304,44207703
2208043008,106321346560,87035904,25459216384,1.438,0.938,97.624,0,0,48604267,48900206
2254585856,106251419648,87035904,25481936896,1.562,0.719,97.719,0,0,47177983,47705008
2312216576,106170474496,87035904,25504632832,1.626,0.969,97.405,0,0,47465188,47924444
2309337088,106147364864,87044096,25529905152,1.408,0.814,97.746,0.031,0,52851837,53276606
2309017600,106125111296,87044096,25551843328,1.250,1.000,97.749,0,0,46036329,46204143
2308722688,106102411264,87052288,25574244352,1.343,0.812,97.751,0.094,0,46416646,47105845
2308399104,106078629888,87052288,25597689856,1.127,0.908,97.964,0,0,48967652,49624232
2307928064,106056335360,87052288,25619808256,1.127,0.908,97.964,0,0,47344214,47681380
2308329472,106033631232,87060480,25641529344,1.375,0.875,97.688,0.062,0,44510284,44947085
2307760128,106010951680,87060480,25664139264,1.190,0.815,97.995,0,0,47230706,47736962
2306732032,105986785280,87060480,25688666112,1.222,0.752,98.026,0,0,51050816,51602666
2305736704,105966223360,87068672,25709645824,1.187,1.031,97.751,0.031,0,44068874,44391127
2305789952,105943441408,87068672,25731727360,1.160,0.847,97.993,0,0,46353709,46955188
2335965184,105890635776,87076864,25753784320,1.284,0.658,97.964,0.094,0,47195542,47353595
2387685376,105812918272,87076864,25779032064,1.534,0.814,97.653,0,0,51810015,52546334
2446835712,105729122304,87076864,25802997760,1.348,0.972,97.680,0,0,49279150,49810420
2446991360,105706397696,87076864,25825017856,1.658,0.626,97.717,0,0,45380882,45864030
2449629184,105682223104,87085056,25845927936,1.785,0.846,97.307,0.063,0,44372740,44680274
2448953344,105660764160,87093248,25867419648,1.190,0.689,98.027,0.094,0,45092919,45797443
2449547264,105638932480,87093248,25888083968,1.718,0.875,97.407,0,0,44466347,44971849
2456375296,105606918144,87093248,25912606720,4.250,1.031,94.719,0,0,49092732,67964534
2455097344,105585967104,87093248,25934233600,1.218,1.031,97.751,0,0,46479913,75305401
2454859776,105563394048,87097344,25956429824,1.693,0.659,96.457,1.192,0,45535391,75555975
2458828800,105538015232,87117824,25977245696,2.632,0.815,92.103,4.450,0,44314116,71973517
2457272320,105515597824,87121920,26000588800,2.061,0.874,91.131,5.934,0,48459078,78105276
2456969216,105492688896,87150592,26023112704,1.130,0.847,94.288,3.735,0,47051438,76515249
2456248320,105469997056,87150592,26045857792,3.246,0.936,95.818,0,0,47555514,75266703
2456621056,105446301696,87150592,26068545536,1.252,1.002,97.746,0,0,47855512,77735959
2455834624,105423511552,87166976,26091438080,1.726,0.847,97.145,0.282,0,47625368,76366318
2455601152,105398968320,87166976,26115575808,1.750,0.844,97.406,0,0,50924562,80882179
2455515136,105376530432,87166976,26137497600,1.129,0.721,98.150,0,0,45902502,75652705
2453659648,105356038144,87166976,26159243264,1.128,0.815,98.057,0,0,45602356,75793091
2452938752,105333587968,87166976,26181742592,1.222,0.689,98.089,0,0,46284730,75199213
2452180992,105312387072,87183360,26203074560,1.343,0.937,97.251,0.469,0,45292894,74547369
2452119552,105290211328,87183360,26224742400,1.097,0.721,98.182,0,0,44880567,74758817
2451947520,105266647040,87183360,26247794688,1.346,0.814,97.840,0,0,48565155,76708441
2451656704,105244241920,87183360,26269917184,1.375,0.843,97.782,0,0,46339310,76254593
2453282816,105218375680,87191552,26293469184,1.814,0.844,97.217,0.125,0,48758320,79273593
2453757952,105197744128,87199744,26313134080,1.312,0.812,97.812,0.062,0,42164886,67716709
2453671936,105176002560,87207936,26334363648,1.312,0.812,97.813,0.062,0,43070474,73184881
2454233088,105150742528,87207936,26358349824,1.413,0.628,97.959,0,0,50219526,80316031
2454339584,105127243776,87207936,26381135872,1.880,0.721,97.399,0,0,47707178,76782087
2453991424,105105240064,87207936,26402848768,1.065,0.846,98.089,0,0,46516750,76846863
2452713472,105084575744,87216128,26424201216,1.345,0.688,97.904,0.063,0,43610766,73993547
2458484736,105056583680,87216128,26445783040,2.157,0.688,97.155,0,0,45736354,75154160
2457083904,105034391552,87224320,26468757504,1.100,0.629,98.240,0.031,0,47264152,77670090
2453807104,105015132160,87224320,26490662912,1.160,0.783,98.057,0,0,45870355,76187033
2454290432,104992202752,87224320,26512498688,1.252,0.876,97.872,0,0,46175773,76415488
2453848064,104969187328,87232512,26535264256,1.065,0.971,97.902,0.063,0,47567384,77232700
2453450752,104946978816,87232512,26557300736,1.223,0.847,97.930,0,0,45263956,75690449
2451558400,104924979200,87232512,26580541440,1.377,0.845,97.778,0,0,49007276,78216088
2452885504,104900366336,87240704,26603167744,1.345,1.001,97.624,0.031,0,48009593,76834488
2452660224,104879890432,87248896,26623291392,1.157,0.813,97.936,0.094,0,41129563,70706116
2450735104,104857391104,87257088,26647080960,1.410,0.658,97.838,0.094,0,49737604,79610253
2450939904,104833380352,87265280,26670206976,1.753,0.845,94.834,2.567,0,48074208,77585570
2451718144,104808820736,87269376,26693341184,1.377,0.720,94.930,2.973,0,48453422,77812689
2450149376,104788140032,87281664,26714972160,1.286,0.847,94.920,2.948,0,45546666,75986622
2449784832,104765698048,87285760,26737180672,1.221,1.064,94.679,3.036,0,46998036,75719946
2449649664,104742424576,87302144,26759970816,1.190,0.783,97.714,0.313,0,46617172,76471946
2450624512,104718635008,87302144,26782113792,1.158,0.876,97.966,0,0,46113400,76127811
2452054016,104695193600,87302144,26803548160,1.065,0.814,98.121,0,0,45224644,75100748
2451431424,104673722368,87302144,26825003008,1.283,0.751,97.966,0,0,44345232,73583309
2449448960,104653131776,87302144,26846982144,1.375,0.875,97.751,0,0,46273906,75926880
2449870848,104630083584,87310336,26869063680,1.221,0.814,97.870,0.094,0,47076477,69505176
2450186240,104607842304,87318528,26890326016,1.249,0.874,97.814,0.062,0,43355851,72388809
2451185664,104585347072,87318528,26911215616,1.066,0.784,98.150,0,0,44697550,74533946
2450231296,104560717824,87318528,26936115200,1.439,0.782,97.779,0,0,51095404,81020288
2449899520,104539234304,87318528,26957320192,1.688,0.907,97.405,0,0,44203182,74717863
2453114880,104512040960,87326720,26980634624,1.657,1.032,97.062,0.250,0,48988932,78502440
2452729856,104489779200,87326720,27002720256,1.284,0.658,98.058,0,0,46223824,76750724
2452987904,104466399232,87334912,27025158144,1.191,0.815,97.681,0.313,0,46991288,77514233
2451218432,104443834368,87343104,27048812544,1.255,0.879,94.885,2.981,0,49288555,79689158
2451337216,104420806656,87367680,27071066112,1.466,0.967,96.474,1.092,0,46790167,76669488
2450509824,104396603392,87375872,27095437312,1.410,0.846,97.713,0.031,0,50249220,80641023
2450292736,104373895168,87375872,27117776896,1.375,0.781,97.844,0,0,48086112,78369889
2449481728,104350126080,87375872,27141668864,1.315,0.845,97.840,0,0,48958006,78613548
2448510976,104327970816,87384064,27164188672,1.561,0.843,97.565,0.031,0,48003320,78354940
2448568320,104303939584,87384064,27187490816,1.378,0.814,97.808,0,0,48099338,77665828
2448633856,104278843392,87392256,27211812864,1.467,1.030,97.409,0.094,0,50990860,80584120
2448846848,104257662976,87392256,27232251904,2.310,0.812,96.878,0,0,43219106,73323779
2448445440,104233746432,87392256,27255865344,1.127,0.939,97.934,0,0,48657374,78355815
2448199680,104209977344,87392256,27279249408,1.285,0.783,97.932,0,0,48798196,78555137
2449612800,104185401344,87400448,27301789696,1.742,1.089,97.106,0.062,0,48216352,78060425
2450001920,104163491840,87408640,27322699776,1.127,0.751,97.965,0.157,0,43919800,72204792
2449313792,104140234752,87408640,27346014208,1.127,0.845,98.028,0,0,47552880,77595978
2448281600,104118829056,87408640,27367862272,1.127,0.845,98.028,0,0,45631052,74593069
2449162240,104094801920,87408640,27390312448,1.250,0.906,97.844,0,0,46892142,75527820
2448646144,104073826304,87408640,27411275776,1.066,0.596,98.338,0,0,43707892,72161407
2448748544,104051884032,87425024,27432488960,1.252,0.783,97.840,0.125,0,45072012,74053171
2449752064,104028110848,87425024,27454672896,1.034,0.940,98.027,0,0,46038220,75655556
2448637952,104006455296,87425024,27476779008,1.129,0.690,98.182,0,0,45872606,74898719
2448216064,103985025024,87425024,27498061824,0.973,0.659,98.367,0,0,44811010,74513176
2448572416,103962005504,87425024,27520094208,1.940,0.907,97.153,0,0,45466325,74998708
2447572992,103936937984,87433216,27545456640,1.438,0.938,97.530,0.094,0,53036785,83188052
2448252928,103915212800,87441408,27565953024,1.188,0.813,97.936,0.063,0,44471242,74572729
2448187392,103891816448,87441408,27588718592,1.283,0.751,97.966,0,0,46852092,76387822
2448355328,103869095936,87441408,27610669056,1.066,0.878,98.056,0,0,45031946,74829474
2448175104,103846387712,87449600,27632918528,1.408,0.719,97.717,0.156,0,46660152,76978153
2448003072,103822823424,87457792,27656019968,1.189,0.939,97.621,0.250,0,48145752,78674251
2448879616,103797800960,87461888,27679547392,1.251,1.001,96.404,1.345,0,49137866,77891400
2448941056,103774842880,87470080,27701805056,1.372,1.060,97.505,0.062,0,46777708,77249118
2449440768,103752400896,87470080,27723145216,1.284,0.626,98.090,0,0,44395387,74682047
2448855040,103729451008,87470080,27746050048,1.066,0.816,98.118,0,0,47600883,77177743
2449022976,103705870336,87474176,27768778752,1.126,0.939,97.872,0.063,0,47325824,77105087
2448744448,103682908160,87478272,27791462400,1.284,0.783,96.680,1.253,0,48109030,78635542
2448031744,103659618304,87482368,27814776832,1.477,0.911,94.657,2.954,0,48154608,78441184
2448285696,103635283968,87511040,27838181376,1.190,0.908,93.926,3.976,0,48371678,77563005
2448109568,103612612608,87515136,27860402176,1.097,0.972,94.984,2.947,0,46942692,76522627
2448035840,103589355520,87527424,27883122688,1.344,0.781,96.530,1.344,0,47784790,77128517
2446491648,103568388096,87527424,27904999424,1.407,0.625,97.967,0,0,45183786,71951298
2446606336,103545663488,87527424,27927023616,1.096,0.814,98.090,0,0,45958022,75363362
2446417920,103523622912,87535616,27948568576,1.190,0.751,98.028,0.031,0,45154146,74116649
2445127680,103499091968,87535616,27973730304,1.562,0.875,97.562,0,0,52648749,82986055
2445107200,103474847744,87543808,27997319168,1.315,0.845,97.746,0.094,0,49101689,79017602
2445234176,103451840512,87543808,28019560448,1.097,0.658,98.245,0,0,46661330,76800177
2445262848,103428112384,87543808,28042633216,1.190,0.720,98.090,0,0,48330162,78475111
2444763136,103403106304,87543808,28067438592,1.313,1.094,97.593,0,0,51783632,81671548
2444820480,103377506304,87552000,28092264448,1.530,1.062,97.377,0.031,0,51796900,79701720
2447339520,103350833152,87556096,28115742720,1.322,0.724,95.120,2.834,0,49033934,77762130
2447585280,103327305728,87572480,28138393600,1.160,0.878,95.298,2.665,0,47367012,77667077
2447106048,103305830400,87572480,28159758336,1.282,0.845,97.873,0,0,44991650,74500233
2447179776,103282106368,87572480,28182777856,1.312,0.937,97.751,0,0,47976146,77717356
2447458304,103259598848,87572480,28204412928,1.315,0.782,97.903,0,0,45943794,74303942
2447097856,103239421952,87584768,28224356352,1.158,0.720,97.997,0.125,0,40976456,68788490
2446893056,103216664576,87584768,28246716416,1.188,0.938,97.874,0,0,46242582,75332264
2447319040,103192035328,87584768,28270239744,1.503,0.689,97.808,0,0,50618812,80682114
2447228928,103170297856,87584768,28291432448,1.251,0.688,98.061,0,0,43089522,73598860
2447523840,103149862912,87584768,28311044096,1.094,0.938,97.968,0,0,42407976,71740582
2446036992,103127789568,87588864,28333948928,1.285,0.752,97.900,0.063,0,46797324,76170214
2446995456,103104770048,87597056,28355436544,1.252,0.814,97.872,0.063,0,44363582,74245278
2447081472,103080706048,87597056,28378730496,1.564,0.720,97.716,0,0,49253784,79186119
2446934016,103056416768,87597056,28402528256,1.660,0.909,97.431,0,0,49129018,79093294
2447474688,103031812096,87597056,28425891840,1.594,0.750,97.656,0,0,48733386,77863981
2447503360,103011176448,87609344,28445974528,1.622,0.749,97.566,0.062,0,42580796,71911859
2447396864,102987853824,87609344,28468707328,1.507,0.722,97.772,0,0,47670044,77571905
2447794176,102965129216,87617536,28490469376,1.066,0.784,98.119,0.031,0,45313026,75881463
2447437824,102942396416,87617536,28512935936,1.498,0.811,97.691,0,0,46125354,75758659
2446774272,102919364608,87617536,28536029184,1.254,0.753,97.993,0,0,47907181,77552960
2447552512,102895304704,87625728,28558602240,1.286,0.659,97.992,0.063,0,48370211,77858754
2447454208,102872260608,87625728,28581134336,1.160,0.721,98.056,0.063,0,46914092,76478363
2447077376,102848978944,87625728,28604116992,1.068,0.691,98.241,0,0,47854428,76851975
2447450112,102824689664,87633920,28627398656,1.345,0.907,97.685,0.063,0,48568808,78351402
2447085568,102800703488,87633920,28651085824,1.315,0.877,97.808,0,0,49597029,79577542
2449674240,102774042624,87642112,28674527232,2.196,0.753,97.019,0.031,0,49725563,78412626
2449600512,102751895552,87642112,28696125440,1.313,0.625,98.061,0,0,44401472,73281651
2449330176,102729633792,87642112,28718014464,1.097,0.752,98.151,0,0,45554692,75131523
2448891904,102705569792,87642112,28741840896,1.190,0.909,97.901,0,0,49933646,79826804
2449248256,102681542656,87650304,28764868608,1.130,0.785,98.023,0.063,0,48180318,78018177
2449633280,102658752512,87658496,28786630656,1.191,0.721,98.057,0.031,0,45392582,74971560
2449719296,102635479040,87658496,28809183232,1.439,0.782,95.840,1.939,0,47244550,75674782
2449813504,102612250624,87666688,28831694848,1.318,0.722,94.978,2.982,0,47254946,77053607
2450063360,102590509056,87674880,28852563968,1.345,1.001,94.714,2.940,0,43643532,73909165
2449248256,102568599552,87683072,28874719232,1.192,0.878,94.951,2.979,0,46656344,76321329
2449620992,102544683008,87703552,28897570816,1.440,0.814,95.429,2.317,0,47584886,76947446
2449539072,102520700928,87703552,28921040896,1.560,0.874,97.566,0,0,48990580,77566980
2449301504,102497689600,87703552,28943605760,1.532,0.781,97.687,0,0,47286040,73594989
2451652608,102473957376,87703552,28964470784,1.755,0.690,97.555,0,0,43732782,73595782
2452402176,102450749440,87715840,28986294272,1.251,0.782,97.842,0.125,0,45092400,74971626
2453012480,102425665536,87719936,29010063360,1.597,0.626,97.714,0.063,0,50748324,80280208
2453192704,102402392064,87728128,29032525824,1.253,0.689,98.027,0.031,0,46442608,76544985
2454183936,102379384832,87728128,29053960192,1.314,0.751,97.935,0,0,46390940,76293454
2453159936,102355255296,87728128,29078355968,1.440,0.845,97.715,0,0,49074546,78522495
2452934656,102332608512,87728128,29100679168,1.223,0.784,97.992,0,0,46502352,76357660
2455801856,102305431552,87732224,29124243456,1.936,0.812,97.189,0.062,0,49305576,78704474
2453872640,102286045184,87732224,29144981504,1.252,0.814,97.934,0,0,44574406,74137381
2453495808,102263345152,87740416,29167448064,1.189,0.939,97.841,0.031,0,45992675,74671296
2453434368,102240538624,87744512,29189640192,1.255,0.878,95.577,2.290,0,47015947,76581551
2454261760,102216601600,87773184,29212110848,1.408,1.001,95.277,2.315,0,46038174,75422894
2456190976,102191259648,87781376,29234905088,1.747,0.967,97.193,0.094,0,48425814,78309168
2458460160,102165626880,87781376,29257588736,2.248,0.843,96.909,0,0,46562872,75273262
2458152960,102142631936,87781376,29280301056,1.282,0.688,98.029,0,0,46870803,76916275
2457108480,102121369600,87789568,29301956608,1.437,0.750,97.782,0.031,0,44755347,74874700
2456690688,102100938752,87789568,29322260480,1.344,0.688,97.969,0,0,42674024,72298820
2456641536,102078971904,87797760,29343670272,1.564,0.720,97.309,0.407,0,45453326,75224938
2456465408,102055682048,87801856,29366521856,1.283,0.782,97.810,0.125,0,47578130,76894363
2457026560,102032424960,87801856,29388582912,1.221,0.752,98.027,0,0,45274010,74340725
2457796608,102006820864,87801856,29412777984,1.410,0.783,97.806,0,0,50984150,79691214
2458234880,101982965760,87810048,29435482112,1.377,0.876,97.715,0.031,0,47749982,77223129
2457309184,101961515008,87814144,29457235968,1.284,0.689,97.933,0.094,0,45154274,75127343
2457550848,101938225152,87814144,29479649280,1.316,0.564,98.120,0,0,46202854,75369316
2457178112,101916524544,87814144,29501116416,1.315,0.657,98.028,0,0,44960224,73371642
2456326144,101895315456,87814144,29522587648,1.280,0.874,97.845,0,0,44980058,74926629
2459250688,101869674496,87814144,29544722432,1.939,0.750,97.311,0,0,47542324,77714774
2458624000,101845856256,87830528,29568442368,1.066,0.784,98.087,0.063,0,48142844,78174539
2457858048,101822861312,87830528,29591584768,1.286,0.690,98.024,0,0,47830474,76714476
2458173440,101799759872,87830528,29613752320,1.345,0.814,97.841,0,0,47134778,77129575
2457337856,101775712256,87830528,29637980160,1.344,0.907,97.749,0,0,49725764,80068689
2457255936,101751132160,87830528,29661978624,1.348,0.690,97.962,0,0,50964580,74586558
2456346624,101727875072,87838720,29685489664,1.438,0.750,97.749,0.063,0,48910058,77014270
2457587712,101703585792,87846912,29707919360,1.284,0.751,97.902,0.063,0,47420137,75938938
2456723456,101679538176,87846912,29732110336,1.469,0.875,97.656,0,0,49768869,80434618
2456817664,101654974464,87846912,29755936768,1.348,0.690,97.962,0,0,50145709,80530723
2456469504,101633765376,87846912,29776891904,1.344,0.750,97.906,0,0,43290003,72902375
2456133632,101613092864,87855104,29797363712,1.282,0.751,97.904,0.063,0,43312952,73090319
2456391680,101588787200,87855104,29820731392,1.500,0.875,96.220,1.406,0,48132254,75938340
2458009600,101562126336,87863296,29845078016,1.353,0.786,97.767,0.094,0,50843952,79942945
2458619904,101538816000,87863296,29867163648,1.437,0.843,97.720,0,0,46245532,76222965
2457796608,101515526144,87863296,29890600960,1.097,0.940,97.963,0,0,48830524,78254956
2457481216,101493067776,87871488,29912768512,1.374,0.999,97.565,0.062,0,46527732,76495887
2457571328,101469507584,87871488,29935591424,1.561,0.968,97.472,0,0,47514730,76874619
2457522176,101448847360,87879680,29955719168,1.161,0.659,95.358,2.823,0,42146920,72455733
2457870336,101425594368,87887872,29977989120,1.348,0.784,91.847,6.021,0,46596032,76524501
2457296896,101402390528,87904256,30001090560,1.472,0.939,90.420,7.170,0,47851896,77229925
2457169920,101379170304,87916544,30023852032,1.316,0.846,91.319,6.518,0,47966780,76030481
2456064000,101354938368,87916544,30048423936,1.443,0.690,97.333,0.533,0,51212332,79766830
2455842816,101333004288,87916544,30070022144,1.002,1.002,97.996,0,0,45109192,75346968
2456633344,101308129280,87916544,30093398016,1.314,0.938,97.748,0,0,48700690,77773369
2456006656,101284433920,87924736,30117072896,1.375,1.000,97.593,0.031,0,49467196,79574152
2458726400,101259612160,87932928,30138617856,1.690,0.845,97.402,0.063,0,45504938,75069128
2458062848,101235843072,87932928,30162358272,1.530,0.906,97.564,0,0,49153572,78981208
2457329664,101212577792,87932928,30185734144,1.593,0.874,97.533,0,0,48453908,78540963
2457935872,101188546560,87932928,30208503808,1.468,0.874,97.658,0,0,47837280,75164489
2457473024,101166825472,87932928,30230106112,1.192,0.753,98.056,0,0,45141928,75025812
2457550848,101143261184,87953408,30252937216,1.068,0.785,96.922,1.225,0,47325890,76854206
2457260032,101121036288,87982080,30274756608,1.286,0.722,92.281,5.711,0,46776388,77411529
2456444928,101098020864,87982080,30297944064,1.285,0.752,97.963,0,0,47706272,76343719
2456350720,101073899520,87982080,30321487872,1.315,0.846,97.839,0,0,49143924,78297891
2457731072,101049851904,87990272,30343589888,1.562,0.906,97.438,0.094,0,46177370,76192951
2459643904,101029175296,87998464,30361772032,1.313,0.813,97.811,0.063,0,38665142,68548275
2459656192,101027868672,88006656,30363009024,0.125,0.063,99.781,0.031,0,2062056,31290024
2459422720,101028102144,88006656,30363009024,0.125,0.062,99.812,0,0,59714,28761244
2459201536,101028323328,88006656,30363009024,0.094,0,99.906,0,0,51014,28700438
2459201536,101028323328,88006656,30363009024,0.125,0.063,99.812,0,0,52330,28691646
2459086848,101028429824,88014848,30363009024,0.094,0,99.844,0.063,0,43934,26168882
2459025408,101028491264,88014848,30363009024,0.094,0.063,99.844,0,0,50752,29265056
2459275264,101028233216,88023040,30363009024,0.094,0.063,99.781,0.063,0,55480,28200834
2475790336,101011718144,88023040,30363009024,1.219,0.063,98.718,0,0,65682,28995406
2471403520,101016104960,88023040,30363009024,0.094,0.031,99.875,0,0,51828,28695464
2471313408,101016195072,88031232,30363000832,0.125,0.063,99.750,0.063,0,47792,28032418
2471301120,101016195072,88031232,30363013120,0.094,0.063,99.844,0,0,74718,27545888
2471272448,101016223744,88031232,30363013120,0.094,0.031,99.875,0,0,46536,27586872
2471256064,101016231936,88039424,30363013120,0.156,0.062,99.750,0.031,0,68424,28306164
2470551552,101016936448,88039424,30363013120,0,0.031,99.969,0,0,8560,3968
2470543360,101016936448,88047616,30363013120,0.063,0,99.875,0.063,0,36944,1916
2470543360,101016936448,88047616,30363013120,0,0.031,99.844,0.125,0,18694,1916
2470543360,101016936448,88047616,30363013120,0,0,100,0,0,85324,1760
2470526976,101016948736,88047616,30363017216,0.063,0.031,99.906,0,0,13064,2298
2511110144,100974542848,88055808,30363471872,1.345,0.563,98.030,0.063,0,495729,37940
