172.16.72.14 : 4.29 4.31 4.28 4.27 4.28 4.29 4.28 4.29 4.29 4.29
172.16.72.23 : 4.28 4.29 4.19 4.27 4.25 4.27 4.33 4.29 4.32 4.27
172.16.72.25 : 4.31 4.32 4.32 4.25 4.30 4.26 4.26 4.27 4.27 4.27
172.16.72.26 : 4.27 4.30 4.33 4.33 4.30 4.33 4.29 4.31 4.31 4.28
172.16.72.27 : 4.24 4.27 4.26 4.27 4.27 4.28 4.28 4.29 4.29 4.28
172.16.72.28 : 4.32 4.33 4.33 4.31 4.29 4.31 4.33 4.30 4.29 4.32
172.16.72.29 : 4.26 4.26 4.30 4.32 4.30 4.30 4.31 4.31 4.28 4.31
172.16.72.3  : 4.30 4.30 4.33 4.31 4.32 4.31 4.32 4.29 - 4.31
172.16.72.30 : 4.28 4.28 4.25 4.29 4.31 4.29 4.32 4.32 4.31 4.29
172.16.72.31 : 4.31 4.30 4.27 4.31 4.33 4.29 4.32 4.32 4.31 4.32
172.16.72.32 : 4.32 4.30 4.32 4.31 4.32 4.32 4.30 4.31 4.30 4.34
172.16.72.33 : 4.29 4.32 4.31 4.30 4.33 4.32 4.31 4.33 4.31 4.33
172.16.72.34 : 4.30 4.31 4.31 4.32 4.33 4.31 4.33 4.30 4.30 4.31
172.16.72.35 : 4.32 4.33 4.33 4.31 4.32 4.32 4.31 4.30 4.31 4.30
172.16.72.36 : 4.30 4.32 4.30 4.32 4.31 4.32 4.32 4.31 4.28 4.31
172.16.72.37 : 4.32 4.30 4.27 4.28 4.30 4.31 4.30 4.31 4.33 4.30
172.16.72.38 : 4.28 4.27 4.32 4.31 4.32 4.31 4.32 4.31 4.34 4.23
172.16.72.39 : 4.30 4.31 4.27 4.30 4.26 4.30 4.32 4.31 4.32 4.30
172.16.72.4  : 4.30 4.29 4.30 4.28 4.29 4.29 4.31 4.28 4.31 4.31
172.16.72.40 : 4.30 4.17 4.34 4.27 4.30 4.30 4.30 4.29 4.24 4.27
172.16.72.41 : 4.31 4.32 4.29 4.27 4.27 4.26 4.29 4.28 4.29 4.28
172.16.72.42 : 4.34 4.31 4.27 4.26 4.30 4.26 4.28 4.30 4.24 4.26
172.16.72.43 : 4.26 4.31 4.29 4.30 4.31 4.30 4.31 4.31 4.32 4.33
172.16.72.44 : 4.30 4.27 4.29 4.26 4.26 4.31 4.28 4.27 4.30 4.29
172.16.72.46 : 4.28 4.32 4.29 4.31 4.32 4.27 4.32 4.26 4.30 4.30
172.16.72.47 : 4.27 4.29 4.29 4.30 4.29 4.31 4.30 4.30 4.33 4.28
172.16.72.48 : 4.28 4.31 4.31 4.32 4.28 4.29 4.26 4.28 4.32 4.24
172.16.72.49 : 4.25 4.28 4.31 4.28 4.29 4.30 4.30 4.29 4.29 4.29
172.16.72.5  : 4.27 4.32 4.30 4.30 4.29 4.30 4.31 4.30 4.30 4.31
172.16.72.50 : 4.28 4.28 4.29 4.28 4.30 4.26 4.31 4.28 4.29 4.23
172.16.72.51 : 4.28 4.32 4.30 4.30 4.33 4.26 4.31 4.30 4.28 4.21
172.16.72.6  : 4.29 4.30 4.31 4.32 4.25 4.26 4.32 4.27 4.31 4.31
172.16.72.7  : 4.26 4.24 4.29 4.31 4.32 4.24 4.29 4.29 4.29 4.28
172.16.72.8  : 4.28 4.31 4.30 4.31 4.31 4.30 4.30 4.31 4.31 4.31
172.16.72.9  : 0.03 0.03 0.03 0.03 0.01 0.03 0.03 0.03 0.01 0.03

      35 targets
      35 alive
       0 unreachable
       0 unknown addresses

       1 timeouts (waiting for response)
     350 ICMP Echos sent
     349 ICMP Echo Replies received
       0 other ICMP received

 0.01 ms (min round trip time)
 4.17 ms (avg round trip time)
 4.34 ms (max round trip time)
       10.082 sec (elapsed real time)

