"Dstat 0.7.3 CSV output"
"Author:","Dag Wieers <dag@wieers.com>",,,,"URL:","http://dag.wieers.com/home-made/dstat/"
"Host:","grisou-49.nancy.grid5000.fr",,,,"User:","root"
"Cmdline:","dstat -m -c -n -o dstat.csv",,,,"Date:","27 May 2020 10:04:35 CEST"
"memory usage",,,,"total cpu usage",,,,,"net/total",
"used","free","buff","cach","usr","sys","idl","wai","stl","recv","send"
992043008,133075509248,48918528,714387456,0.927,0.215,98.739,0.119,0,0,0
1003450368,133063753728,48918528,714731520,0.625,0.469,98.907,0,0,391694,16858
993255424,133074395136,48918528,714285056,0.500,0.219,99.282,0,0,385076,24784
987607040,133080039424,48918528,714285056,0.906,0.593,98.501,0,0,5710,15482
987570176,133080039424,48947200,714293248,0.031,0.031,99.093,0.844,0,9122,0
987856896,133079740416,48947200,714293248,1.093,0.624,98.283,0,0,389428,26122
987578368,133080018944,48947200,714293248,0,0,100,0,0,7092,0
987553792,133080043520,48947200,714293248,0,0.031,99.969,0,0,13111,1008
987295744,133080301568,48947200,714293248,0,0,100,0,0,11075,0
987271168,133080313856,48959488,714293248,0,0,99.969,0.031,0,3017,0
987242496,133080330240,48971776,714293248,0,0,99.938,0.062,0,3486,0
986951680,133080621056,48971776,714293248,0,0,100,0,0,3005,662
986951680,133080621056,48971776,714293248,0,0,100,0,0,2048,0
986427392,133081145344,48971776,714293248,0,0,100,0,0,826,0
986427392,133081145344,48971776,714293248,0.031,0.031,99.938,0,0,346,0
986419200,133081145344,48979968,714293248,0,0,99.969,0.031,0,1038,0
986161152,133081403392,48979968,714293248,0,0,100,0,0,1554,580
985903104,133081661440,48979968,714293248,0,0,100,0,0,3470,0
991055872,133076058112,48979968,714739712,1.154,0.686,98.160,0,0,395168,30082
989626368,133077934080,48979968,714293248,0.031,0,99.969,0,0,4584,132
992985088,133074526208,48979968,714317824,0.281,0.250,99.468,0,0,187732,11972
1004273664,133062832128,48992256,714711040,0.563,0.188,99.187,0.063,0,406285,16100
987897856,133079465984,48992256,714452992,0.624,0.375,99.001,0,0,24885,15524
989454336,133077893120,49004544,714452992,0.907,0.563,98.467,0.063,0,403653,26570
989429760,133077917696,49004544,714452992,0,0,100,0,0,11766,0
1003986944,133062914048,49004544,714899456,0.844,0.563,98.593,0,0,388588,13042
991518720,133075812352,49016832,714457088,0.094,0.063,99.812,0.031,0,37544,13180
991444992,133075886080,49016832,714457088,0,0,100,0,0,16639,86
991682560,133075349504,49029120,714706944,1.593,0.312,98.063,0.031,0,223540,11136
991690752,133075591168,49029120,714457088,0.031,0.031,99.625,0.312,0,3148,2800
991399936,133075881984,49029120,714457088,0,0.031,99.250,0.719,0,1098,84
991399936,133075881984,49029120,714457088,0,0,100,0,0,978,0
991358976,133075902464,49041408,714465280,0.375,0.156,99.406,0.063,0,342416,15152
999268352,133067800576,49041408,714657792,0.188,0.063,99.750,0,0,179312,21210
998465536,133068591104,49053696,714657792,0,0,99.969,0.031,0,12356,13132
998465536,133068591104,49053696,714657792,0.031,0.031,99.938,0,0,12280,12936
998465536,133068591104,49053696,714657792,0,0,100,0,0,13112,13034
998465536,133068591104,49065984,714645504,0.031,0,99.906,0.062,0,12358,13132
997937152,133069107200,49065984,714657792,0,0.031,99.969,0,0,19688,18844
997679104,133069365248,49065984,714657792,0.031,0,99.969,0,0,12946,13328
997658624,133069312000,49065984,714657792,0,0.031,99.969,0,0,13112,15178
997392384,133069578240,49065984,714657792,0,0,100,0,0,12176,13058
997036032,133069934592,49065984,714657792,0.031,0.031,99.938,0,0,12418,13034
989200384,133077942272,49074176,714473472,0,0.031,99.937,0.031,0,1712,2236
989085696,133078056960,49074176,714473472,0.312,0.125,99.563,0,0,174156,14252
988672000,133078470656,49074176,714473472,0,0,100,0,0,56944,1008
988672000,133078470656,49074176,714473472,0,0,100,0,0,4776,3024
988155904,133078986752,49074176,714473472,0,0,100,0,0,572,0
987897856,133079244800,49086464,714461184,0,0,99.937,0.063,0,468,0
987615232,133079502848,49098752,714473472,0,0,99.969,0.031,0,572,0
987615232,133079502848,49098752,714473472,0,0,100,0,0,586,0
987615232,133079502848,49098752,714473472,0.031,0,99.969,0,0,346,0
987615232,133079502848,49098752,714473472,0,0,100,0,0,918,0
987611136,133079502848,49098752,714477568,0,0,100,0,0,572,0
987353088,133079760896,49098752,714477568,0,0,100,0,0,1072,662
987344896,133079760896,49106944,714477568,0,0,99.969,0.031,0,572,0
987344896,133079760896,49106944,714477568,0,0,100,0,0,286,0
987328512,133079777280,49106944,714477568,0,0,100,0,0,2920,0
988045312,133079060480,49106944,714477568,1.092,0.655,98.252,0,0,391640,30410
988045312,133079060480,49106944,714477568,0,0,100,0,0,2862,474
988045312,133079060480,49106944,714477568,0,0,100,0,0,3194,0
988033024,133079060480,49119232,714477568,0,0.031,99.938,0.031,0,2956,1508
988033024,133079060480,49119232,714477568,0,0,100,0,0,2946,0
987496448,133079560192,49156096,714477568,0,0,99.312,0.688,0,1244,336
987492352,133079564288,49156096,714477568,0,0,100,0,0,392,84
987492352,133079564288,49156096,714477568,0,0,100,0,0,1716,0
987492352,133079564288,49156096,714477568,0,0,99.812,0.188,0,346,0
987484160,133079572480,49156096,714477568,0,0,100,0,0,5238,0
987484160,133079572480,49156096,714477568,0,0,100,0,0,2184,0
987475968,133079572480,49164288,714477568,0,0,99.938,0.062,0,286,0
1940103168,132126875648,49172480,714072064,7.174,4.304,88.490,0.031,0,1327446,54318
4884414464,129180430336,49172480,715534336,28.277,12.606,59.118,0,0,1323040,54290
7890051072,126172798976,49184768,717066240,32.096,11.323,56.519,0.062,0,1326790,56045
11029110784,123032457216,49184768,718270464,36.550,13.263,50.187,0,0,1491140,61095
14008053760,120051814400,49184768,719876096,32.938,13.007,53.961,0.094,0,1493728,57789
17085689856,116972490752,49205248,721424384,36.819,12.449,50.545,0.187,0,1338666,58885
20418891776,113637670912,49250304,722829312,40.517,14.839,43.447,1.197,0,1448764,426684
23361576960,110693462016,49254400,724185088,41.138,13.029,45.647,0.187,0,1367146,1410484
26638594048,107414929408,49258496,725630976,44.612,13.705,41.525,0.158,0,1499828,2790451
29595394048,104456761344,49262592,726855680,41.352,13.050,45.440,0.157,0,1075522,3213852
30932770816,103118974976,49283072,727224320,24.597,5.979,69.021,0.403,0,213482,3754657
31112024064,102939566080,49332224,727330816,12.671,1.152,83.904,2.273,0,131192,4418347
31320711168,102730702848,49348608,727486464,15.466,1.025,71.553,11.957,0,345180,4881823
31540862976,102510493696,49348608,727543808,15.972,1.545,82.206,0.278,0,256702,5442149
31705640960,102345625600,49348608,727633920,17.468,1.831,80.422,0.279,0,166862,5627280
31831175168,102220009472,49356800,727707648,18.213,1.986,79.398,0.403,0,134018,5477406
31965372416,102085718016,49356800,727801856,18.848,2.098,78.491,0.564,0,160652,5215664
32085942272,101965041664,49364992,727896064,17.676,2.299,79.372,0.652,0,111656,4634318
32177733632,101873147904,49364992,727990272,17.745,1.579,80.025,0.650,0,134016,4423980
32270536704,101780242432,49364992,728092672,15.533,1.553,82.386,0.528,0,96708,3764448
32290258944,101760417792,49373184,728186880,13.605,1.732,84.045,0.618,0,119316,3449886
32248590336,101801963520,49373184,728301568,9.652,2.390,87.306,0.652,0,84952,3537762
32207482880,101842993152,49373184,728379392,6.227,1.001,91.646,1.126,0,82054,3395226
32174362624,101876015104,49373184,728477696,6.602,1.619,89.785,1.993,0,80760,3461200
32135880704,101914398720,49373184,728576000,8.375,1.024,90.292,0.310,0,89740,3579878
32146206720,101903958016,49381376,728670208,7.384,0.900,91.312,0.403,0,93760,3778412
32126500864,101923540992,49381376,728788992,7.793,0.876,91.017,0.313,0,122236,3834058
32123424768,101926391808,49381376,728997888,6.314,0.719,92.623,0.344,0,90766,3882940
32115310592,101934198784,49442816,729235456,6.778,0.941,85.378,6.903,0,118486,3785910
32113557504,101935878144,49442816,729305088,6.731,1.024,91.998,0.248,0,84458,3441434
32118562816,101930749952,49451008,729411584,5.500,0.875,93.312,0.312,0,113820,3398958
32120721408,101928484864,49451008,729518080,7.628,0.926,91.044,0.401,0,88814,3656550
32122470400,101926649856,49451008,729604096,6.824,1.241,91.687,0.248,0,113636,3541758
32122855424,101926137856,49451008,729718784,6.098,1.032,92.589,0.281,0,84266,3569232
32126935040,101921972224,49459200,729796608,5.468,0.911,93.023,0.597,0,81962,3557966
32127266816,101921525760,49467392,729903104,6.020,1.092,92.576,0.312,0,80700,3510654
32134127616,101914562560,49467392,730005504,6.404,1.156,92.127,0.312,0,114548,3561892
32136081408,101912522752,49467392,730091520,5.860,0.909,92.855,0.376,0,103342,3734512
32140492800,101907996672,49467392,730206208,6.168,1.215,92.305,0.312,0,89654,3643060
32139706368,101908692992,49467392,730292224,6.065,0.995,90.358,2.582,0,84652,3565756
32141230080,101907046400,49475584,730402816,6.219,1.031,92.250,0.500,0,112116,3503264
32141750272,101906432000,49475584,730492928,4.639,0.757,94.352,0.252,0,89548,3688166
32143208448,101904875520,49475584,730591232,5.798,1.271,92.682,0.248,0,90706,3554342
32146653184,101901324288,49475584,730693632,7.112,1.248,91.391,0.250,0,118164,3707140
32148979712,101898907648,49475584,730779648,5.158,0.901,91.858,2.082,0,91892,3801916
32150249472,101897519104,49491968,730882048,5.868,1.030,92.728,0.375,0,117290,3782984
32150642688,101897035776,49491968,730972160,5.306,0.999,93.383,0.312,0,91134,3841132
32151851008,101895712768,49491968,731086848,5.181,0.874,93.664,0.281,0,82684,3416894
32152342528,101895004160,49491968,731303936,5.984,0.868,92.744,0.403,0,83050,3399680
32155508736,101891776512,49491968,731385856,6.106,0.841,91.246,1.807,0,85000,3497648
32155082752,101892067328,49500160,731504640,6.629,0.747,92.157,0.467,0,82894,3368162
32156585984,101890428928,49500160,731574272,4.894,0.810,94.046,0.249,0,84860,3573466
32161808384,101885067264,49500160,731705344,5.747,0.848,93.122,0.283,0,93964,3468242
32162398208,101884403712,49500160,731774976,5.053,1.054,93.676,0.217,0,363094,3403244
32164130816,101882556416,49500160,731885568,6.380,1.058,91.441,1.120,0,86488,3474840
32164814848,101881757696,49508352,731983872,6.766,1.117,91.806,0.310,0,87764,3575600
32164990976,101881499648,49508352,732065792,5.526,1.019,93.208,0.247,0,101722,3544132
32167776256,101878607872,49508352,732172288,6.779,1.182,91.853,0.187,0,97644,3451096
32168837120,101877456896,49508352,732258304,4.856,0.752,93.985,0.407,0,99830,3276954
32169631744,101876543488,49508352,732372992,6.567,1.276,91.939,0.218,0,95042,3365528
32172036096,101874040832,49524736,732454912,6.579,0.815,92.199,0.407,0,86722,3403068
32174997504,101870981120,49524736,732553216,8.796,1.852,89.136,0.216,0,92576,3373678
32177303552,101868560384,49524736,732667904,7.743,1.062,90.915,0.281,0,92726,3312924
32178114560,101867663360,49524736,732745728,7.002,0.911,91.837,0.251,0,128304,3657922
32181514240,101864140800,49524736,732864512,7.955,1.150,90.615,0.280,0,99322,3745108
32180989952,101864562688,49532928,732954624,5.500,0.969,91.875,1.656,0,128772,3624804
32181911552,101863546880,49532928,733048832,8.860,1.534,89.324,0.282,0,135652,3535958
32185053184,101860274176,49532928,733175808,7.699,1.304,90.686,0.310,0,126046,3572856
32186687488,101858447360,49532928,733368320,7.855,1.372,90.493,0.281,0,99130,3567548
32186097664,101858926592,49532928,733478912,7.428,0.749,91.573,0.250,0,122094,3456574
32202440704,101842444288,49541120,733560832,7.301,1.479,88.694,2.526,0,134489,3460744
32259055616,101785710592,49541120,733671424,8.250,0.847,90.621,0.282,0,78472,3303798
32313876480,101730807808,49541120,733753344,9.344,1.531,88.781,0.344,0,77734,3380344
32364666880,101679910912,49541120,733859840,8.788,1.215,89.623,0.374,0,81586,3377016
32442609664,101601853440,49541120,733970432,10.288,1.032,88.368,0.313,0,78766,3414374
32481509376,101562851328,49557504,734052352,10.393,0.593,87.703,1.311,0,85000,3289552
32551735296,101492506624,49557504,734158848,10.056,0.996,88.076,0.872,0,77746,3359412
32567136256,101477015552,49557504,734248960,7.947,0.782,90.895,0.375,0,83118,3514756
32603258880,101440790528,49557504,734351360,9.346,1.184,89.252,0.218,0,83292,3548688
32639152128,101404790784,49557504,734457856,9.530,0.866,89.418,0.186,0,87596,3559552
32672280576,101371568128,49565696,734539776,9.787,0.895,88.916,0.401,0,93826,3554134
32671731712,101371990016,49565696,734666752,5.458,0.690,92.848,1.004,0,86148,3475024
32669126656,101374504960,49565696,734756864,5.202,0.564,94.077,0.157,0,80194,3348876
32658792448,101384732672,49565696,734863360,7.203,0.900,91.618,0.279,0,81428,3531888
32647258112,101396172800,49565696,734957568,5.869,0.687,93.194,0.250,0,96862,3737824
32642551808,101400756224,49573888,735059968,6.147,0.718,92.480,0.655,0,91740,3973116
32643358720,101399822336,49582080,735174656,5.255,0.661,93.864,0.220,0,93648,4020674
32631885824,101411213312,49582080,735252480,4.370,0.754,94.656,0.220,0,95548,3959338
32623755264,101419245568,49582080,735350784,5.509,0.939,93.239,0.313,0,96424,4059972
32623710208,101419053056,49582080,735584256,5.945,0.871,92.966,0.218,0,94188,3954008
32619053056,101423513600,49590272,735694848,6.264,0.779,92.365,0.592,0,94178,3881432
32615763968,101426708480,49590272,735780864,5.462,0.900,92.272,1.366,0,89496,3681170
32615260160,101427097600,49590272,735887360,5.640,0.717,93.300,0.343,0,87686,3681208
32615514112,101426737152,49590272,735993856,5.377,0.719,93.529,0.375,0,84148,3478450
32612651008,101429510144,49590272,736083968,4.239,0.691,94.694,0.377,0,83562,3412212
32613044224,101429002240,49598464,736178176,5.159,0.692,93.646,0.503,0,82710,3668174
32614043648,101427900416,49598464,736280576,4.705,0.726,94.285,0.284,0,87162,3683744
32615723008,101426122752,49598464,736370688,5.620,0.659,91.994,1.727,0,88002,3710618
32615313408,101426417664,49598464,736485376,5.155,0.719,93.877,0.250,0,92658,4033574
32605642752,101435998208,49598464,736571392,2.863,0.724,96.193,0.220,0,118638,3750776
32604717056,101436801024,49606656,736681984,6.781,0.688,92.188,0.344,0,86410,3489324
32604770304,101436538880,49606656,736890880,4.766,1.010,93.908,0.316,0,111952,3407982
32605556736,101435645952,49614848,736989184,4.733,0.600,92.332,2.335,0,89195,3637050
32605478912,101435609088,49614848,737103872,4.823,0.501,94.300,0.376,0,118410,3879816
32605114368,101435904000,49614848,737173504,4.564,0.594,94.342,0.500,0,92630,3910206
32606523392,101434355712,49623040,737296384,5.252,0.881,93.491,0.377,0,124864,3885626
32607318016,101433483264,49623040,737374208,5.240,0.753,93.693,0.314,0,89892,3746490
32607719424,101432963072,49623040,737492992,6.798,0.935,90.583,1.684,0,83504,3280640
32608333824,101432254464,49623040,737587200,4.942,0.751,93.744,0.563,0,96651,3184226
32608075776,101432422400,49623040,737673216,4.044,0.964,94.619,0.373,0,84533,3234530
32608501760,101431869440,49631232,737787904,6.512,0.720,92.235,0.532,0,81670,3396536
32608555008,101431738368,49631232,737865728,5.424,0.935,93.329,0.312,0,83474,3631794
32608366592,101431787520,49631232,737984512,4.507,0.689,94.491,0.313,0,88136,3620186
32608690176,101431369728,49639424,738070528,5.233,0.783,93.576,0.407,0,90386,3681634
32609325056,101430624256,49639424,738177024,4.199,0.721,94.767,0.313,0,94236,3556842
32609611776,101430218752,49647616,738283520,5.829,0.627,93.137,0.407,0,82479,3138090
32610279424,101429473280,49647616,738357248,4.980,0.934,93.775,0.311,0,84337,2955752
32610836480,101428793344,49647616,738480128,6.025,0.963,92.795,0.217,0,87325,3237830
32610246656,101429284864,49647616,738578432,5,0.776,92.391,1.832,0,81131,3232680
32610271232,101429022720,49647616,738816000,4.790,0.814,93.707,0.689,0,79660,3375900
32610230272,101428957184,49655808,738914304,6.499,1.319,91.334,0.848,0,81617,3373302
32611168256,101427924992,49655808,739008512,4.329,0.753,94.668,0.251,0,80164,3367372
32611676160,101427298304,49655808,739123200,4.781,0.881,93.960,0.377,0,86838,3677942
32612265984,101426601984,49655808,739229696,4.040,0.715,93.350,1.896,0,146940,3566124
32613892096,101424889856,49655808,739311616,7.161,1.595,90.994,0.250,0,81614,3522874
32615178240,101423472640,49664000,739426304,5.543,0.814,92.765,0.877,0,154180,3991050
32615542784,101423017984,49664000,739512320,3.673,0.659,95.416,0.251,0,90816,3832712
32618291200,101420146688,49664000,739631104,6.275,0.843,92.663,0.219,0,150724,3594640
32618635264,101419696128,49664000,739737600,3.938,0.656,95,0.406,0,92492,3614882
32618782720,101419474944,49672192,739803136,5.542,0.913,93.136,0.409,0,146986,3645282
32619077632,101418958848,49680384,739934208,3.991,0.717,94.824,0.468,0,85960,3482584
32620978176,101416960000,49680384,740028416,5.103,0.908,93.644,0.344,0,78208,3219382
32622997504,101414830080,49680384,740134912,6.575,1.091,91.898,0.436,0,77254,3265868
32624160768,101413539840,49680384,740257792,4.341,1.062,94.066,0.531,0,87428,3304158
32624668672,101412962304,49680384,740327424,5.583,0.878,92.127,1.412,0,79616,3261530
32625352704,101412151296,49688576,740442112,5.740,0.931,92.957,0.372,0,116034,3591618
32627507200,101409902592,49688576,740536320,5.444,0.845,93.273,0.438,0,97532,3761338
32627163136,101410123776,49688576,740651008,4.341,0.781,94.628,0.250,0,192676,3466284
32628461568,101408731136,49688576,740745216,5.301,1.091,93.140,0.468,0,331824,3402888
32628609024,101408473088,49688576,740847616,5.674,0.752,92.288,1.285,0,278996,3209500
32631283712,101405679616,49696768,740954112,5.250,0.938,93.250,0.562,0,114644,3114412
32631988224,101404893184,49696768,741036032,5.201,1.183,93.335,0.280,0,111218,3363612
32631717888,101404909568,49696768,741273600,3.850,1.033,94.742,0.376,0,83468,3589900
32632340480,101404168192,49696768,741392384,4.752,0.839,93.913,0.497,0,93502,3555210
32632438784,101403975680,49704960,741478400,4.651,0.849,92.552,1.948,0,86878,3798316
32632487936,101403811840,49713152,741580800,5.020,1.278,93.202,0.499,0,95348,3978402
32632668160,101403492352,49713152,741720064,4.989,0.879,93.881,0.251,0,96870,3872872
32634286080,101401780224,49713152,741814272,5.523,1.055,93.236,0.186,0,90488,3747322
32634687488,101401264128,49713152,741928960,3.691,0.876,95.214,0.219,0,93799,3674078
32635772928,101400100864,49713152,742006784,5.073,1.058,92.468,1.401,0,95707,3655122
32635858944,101399883776,49721344,742129664,6.197,0.747,92.619,0.436,0,166284,3604412
32637661184,101397975040,49721344,742232064,5.352,1.002,93.459,0.188,0,291896,3400096
32638365696,101397180416,49721344,742318080,4.314,1.055,94.227,0.403,0,445327,3327374
32639483904,101395943424,49721344,742436864,5.869,0.999,92.882,0.250,0,417421,3443764
32641073152,101394268160,49721344,742522880,5.901,0.781,93.100,0.219,0,330503,3404162
32641404928,101393813504,49737728,742629376,5.353,0.716,92.686,1.245,0,209078,3373154
32642637824,101392490496,49737728,742719488,4.361,0.941,94.446,0.251,0,166955,3590938
32643117056,101391908864,49737728,742821888,3.568,0.876,95.211,0.344,0,153975,3560394
32644018176,101390876672,49737728,742944768,4.820,0.751,94.147,0.282,0,104528,3578232
32645476352,101389328384,49737728,743026688,5.714,0.691,93.155,0.440,0,137340,3740090
32644636672,101390041088,49745920,743141376,4.499,0.906,90.722,3.874,0,86204,3514636
32645840896,101388713984,49745920,743256064,4.931,0.817,94.001,0.251,0,120176,3436884
32648835072,101385650176,49745920,743325696,5.151,0.874,93.506,0.468,0,95040,3251954
32649355264,101385019392,49745920,743436288,4.410,1.001,94.088,0.500,0,173288,3445876
32650260480,101383892992,49745920,743657472,4.859,0.721,94.169,0.251,0,194173,3580112
32651128832,101382893568,49754112,743776256,5.881,0.836,92.820,0.464,0,221424,3441494
32651649024,101382262784,49762304,743874560,4.947,0.902,92.502,1.649,0,220383,3646272
32652697600,101381103616,49762304,743976960,3.938,0.693,95.148,0.221,0,150338,3649602
32652779520,101380915200,49762304,744083456,3.852,0.846,95.083,0.219,0,122160,3338780
32652767232,101380849664,49762304,744157184,5.910,0.959,92.853,0.278,0,110871,3496490
32653283328,101380202496,49770496,744275968,4.998,0.719,93.689,0.594,0,117861,3954688
32654102528,101379268608,49770496,744386560,5.554,0.910,92.218,1.318,0,98530,4143128
32656486400,101376782336,49770496,744480768,5.028,0.900,93.855,0.217,0,90806,3837840
32655728640,101377429504,49770496,744591360,5.415,0.845,93.552,0.188,0,98971,4132706
32655622144,101377429504,49770496,744697856,4.917,0.658,94.049,0.376,0,92500,3813812
32656551936,101376344064,49778688,744775680,5.998,0.812,92.690,0.500,0,101611,3791300
32656748544,101376020480,49786880,744882176,4.147,0.748,94.824,0.281,0,96022,3788624
32655482880,101377183744,49786880,744984576,4.893,0.659,94.134,0.314,0,96988,3958714
32658489344,101374066688,49786880,745095168,5.895,0.815,92.976,0.314,0,100810,3716150
32659673088,101372760064,49786880,745205760,4.231,0.809,94.555,0.404,0,88006,3598388
32659058688,101373276160,49795072,745295872,4.992,0.754,93.469,0.785,0,83270,3468592
32663396352,101368823808,49795072,745406464,3.962,1.006,93.585,1.447,0,83268,3535526
32661368832,101370765312,49795072,745492480,5.561,0.594,93.658,0.187,0,84824,3553208
32662450176,101369438208,49795072,745738240,6.230,0.908,92.674,0.188,0,81284,3399276
32663506944,101368279040,49795072,745840640,4.320,0.978,94.450,0.252,0,81090,3440686
32664453120,101367242752,49803264,745922560,3.705,0.628,95.133,0.534,0,83928,3431094
32664784896,101366796288,49803264,746037248,4.319,0.751,94.491,0.438,0,81170,3375642
32665587712,101365891072,49807360,746127360,6.129,0.844,91.088,1.939,0,82992,3430650
32666226688,101365145600,49807360,746233856,4.720,0.844,94.123,0.313,0,85016,3533070
32665255936,101365989376,49807360,746356736,3.620,0.755,95.090,0.535,0,83090,3487590
32665014272,101366149120,49815552,746430464,4.989,0.904,93.701,0.405,0,90204,3790514
32666677248,101364371456,49815552,746541056,5.849,1.182,92.626,0.342,0,87762,3504976
32668180480,101362761728,49823744,746635264,6.236,0.846,92.103,0.815,0,87238,3562586
32667545600,101363277824,49823744,746745856,5.128,0.719,93.840,0.313,0,96225,4114310
32668397568,101362311168,49823744,746856448,5.102,0.814,93.865,0.219,0,107319,4243984
32668590080,101362020352,49831936,746942464,4.835,0.942,93.438,0.785,0,99770,4141142
32669908992,101360541696,49831936,747053056,4.714,0.968,93.974,0.343,0,153712,4097630
32671436800,101358739456,49831936,747143168,5.917,0.903,91.155,2.024,0,110547,4359960
32672468992,101357604864,49831936,747245568,6.029,0.843,92.846,0.281,0,132046,4306792
32672858112,101356961792,49831936,747499520,4.649,0.905,94.103,0.343,0,94786,4095532
32675508224,101354217472,49840128,747581440,5.763,0.940,92.734,0.564,0,129966,4191186
32678367232,101351256064,49840128,747683840,5.511,0.996,93.120,0.374,0,108534,4103340
32678223872,101351288832,49848320,747786240,6.148,0.941,91.092,1.819,0,125952,4067734
32678649856,101350764544,49848320,747884544,4.508,1.033,93.895,0.564,0,107752,4050234
32678236160,101351059456,49848320,747999232,4.152,0.968,94.568,0.312,0,95608,3971670
32677621760,101351559168,49856512,748085248,5.397,0.690,93.191,0.722,0,89869,3881120
32678567936,101350490112,49856512,748204032,5.253,0.692,93.677,0.377,0,90922,3754982
32678682624,101350268928,49856512,748306432,6.421,0.779,92.082,0.717,0,82694,3552372
32678854656,101350006784,49864704,748380160,4.004,0.931,93.482,1.583,0,89345,3674588
32680460288,101348265984,49864704,748511232,4.250,1,94.469,0.281,0,93358,3899948
32679399424,101349236736,49872896,748593152,5.696,0.965,93.028,0.311,0,90106,3577942
32679968768,101348556800,49872896,748703744,6.565,0.871,92.190,0.373,0,81526,3377032
32681734144,101346680832,49872896,748810240,5.078,1.121,93.520,0.280,0,88267,3430970
32682987520,101345333248,49872896,748904448,2.957,0.692,93.897,2.454,0,81864,3489506
32684908544,101343297536,49872896,749019136,5.144,1.098,93.444,0.314,0,86972,3624790
32685535232,101342588928,49881088,749088768,5.177,0.659,93.756,0.408,0,90248,3921674
32686481408,101341523968,49881088,749207552,6.542,0.997,92.181,0.280,0,98423,3839928
32688840704,101339041792,49881088,749322240,5.754,1.188,92.589,0.469,0,90020,3877558
32688513024,101339267072,49889280,749412352,3.146,0.841,94.486,1.526,0,89004,3715076
32688340992,101339328512,49889280,749522944,5.714,0.932,93.137,0.217,0,95598,3557640
32688984064,101338587136,49897472,749613056,5.477,0.782,93.396,0.344,0,106123,3851728
32692973568,101334491136,49897472,749719552,5.974,0.876,92.806,0.344,0,101108,3884100
32695025664,101332201472,49897472,749953024,5.550,1.060,92.922,0.468,0,88734,3673024
32697606144,101329526784,49897472,750043136,3.435,0.812,95.440,0.312,0,91048,3742442
32701669376,101325361152,49897472,750145536,5.860,1.060,92.207,0.873,0,103463,3677754
31135444992,102890770432,49913856,750256128,6.086,0.936,92.509,0.468,0,87250,3697306
27235033088,106791575552,49913856,749903872,5.657,1.026,93.130,0.187,0,84678,3409104
24060620800,109966770176,49913856,749125632,4.108,0.784,94.763,0.345,0,89258,2910318
20757504000,113270968320,49913856,748081152,3.258,0.752,95.771,0.219,0,66440,2415182
17545789440,116483522560,49926144,747270144,3.381,0.626,94.865,1.127,0,49598,2086340
14348394496,119681781760,49938432,746434560,2.785,0.563,96.433,0.219,0,41736,1614128
10430324736,123600732160,49938432,745590784,1.356,0.505,98.044,0.095,0,35994,1389742
7301484544,126730465280,49938432,744738816,1.668,0.346,97.892,0.094,0,59796,1115586
4148367360,129884495872,49938432,743866368,0.626,0.407,98.747,0.219,0,22724,770510
1073324032,132960452608,49938432,742993920,0.780,0.624,98.096,0.499,0,42868,417722
1037627392,132997283840,49950720,741888000,0.094,0.062,99.688,0.156,0,5470,32052
1037422592,132997488640,49950720,741888000,0,0,100,0,0,14756,1008
1037422592,132997488640,49950720,741888000,0,0,100,0,0,12562,84
1037414400,132997488640,49950720,741896192,0,0,100,0,0,34582,1008
1037156352,132997746688,49950720,741896192,0,0,100,0,0,4012,168
1037156352,132997746688,49971200,741875712,0,0,99.656,0.344,0,2200,0
1037135872,132997746688,49971200,741896192,0,0,100,0,0,512,0
1036877824,132998004736,49971200,741896192,0,0,100,0,0,3542,0
1036869632,132998012928,49971200,741896192,0,0,100,0,0,25606,0
1036345344,132998537216,49971200,741896192,0,0,100,0,0,60396,0
1035313152,132999569408,49971200,741896192,0.031,0,99.969,0,0,112193,1008
1034260480,133000609792,49979392,741900288,0.031,0.031,99.875,0.063,0,114215,2016
1034002432,133000867840,49979392,741900288,0.031,0,99.969,0,0,95168,1008
1033744384,133001125888,49979392,741900288,0.031,0.031,99.937,0,0,75818,2016
1033228288,133001641984,49979392,741900288,0.031,0,99.969,0,0,10650,1008
1032970240,133001900032,49979392,741900288,0,0,100,0,0,32998,3388
1032962048,133001900032,49987584,741900288,0,0,99.969,0.031,0,3864,1508
1032445952,133002416128,49987584,741900288,0,0,100,0,0,9526,0
1032445952,133002416128,49987584,741900288,0,0,100,0,0,3446,0
1032187904,133002674176,49987584,741900288,0,0,100,0,0,2458,0
1031929856,133002932224,49987584,741900288,0,0,100,0,0,30708,390
1031663616,133003198464,49987584,741900288,0,0,100,0,0,3666,662
1031397376,133003456512,49995776,741900288,0,0,99.969,0.031,0,28400,0
1030881280,133003972608,49995776,741900288,0,0,100,0,0,3484,0
1030881280,133003972608,49995776,741900288,0,0,100,0,0,7750,0
1030623232,133004230656,49995776,741900288,0,0.031,99.344,0.625,0,4394,84
1030623232,133004230656,49995776,741900288,0,0,100,0,0,31564,84
1030623232,133004230656,49995776,741900288,0,0,100,0,0,3688,78
1030098944,133004746752,50003968,741900288,0,0,99.969,0.031,0,25282,546
1030098944,133004746752,50003968,741900288,0,0,100,0,0,4162,234
1030098944,133004746752,50003968,741900288,0,0,99.750,0.250,0,12070,624
1029840896,133005004800,50003968,741900288,0,0,100,0,0,39664,624
1029840896,133005004800,50003968,741900288,0.031,0,99.969,0,0,11812,476
1029677056,133005168640,50003968,741900288,0,0,100,0,0,68112,1070
1029668864,133005168640,50012160,741900288,0,0,99.938,0.062,0,11158,640
1045262336,132988133376,50012160,742354944,1.062,0.469,98.469,0,0,480258,22382
1042083840,132990578688,50020352,741908480,0.469,0.282,99.187,0.063,0,196204,37512
