172.16.72.14 : 0.05 0.04 0.03 0.03 0.03 0.03 0.03 0.03 0.03 0.03
172.16.72.23 : 0.16 0.19 0.21 0.17 0.17 0.18 0.20 0.19 0.21 0.22
172.16.72.25 : 200.33 - 200.32 - - 200.33 200.33 200.32 200.26 200.29
172.16.72.26 : - 200.33 200.33 200.30 200.27 200.32 200.31 200.31 200.31 -
172.16.72.27 : 200.31 200.26 200.32 200.29 - 200.31 200.30 200.34 200.31 200.27
172.16.72.28 : 200.28 200.32 200.31 200.31 200.33 200.30 200.31 200.33 200.30 200.31
172.16.72.29 : 200.33 200.31 200.29 200.30 200.31 200.33 200.30 - 200.28 200.31
172.16.72.3  : 200.33 200.34 - 200.26 200.31 200.27 200.29 200.28 200.27 200.31
172.16.72.30 : 200.32 200.31 200.29 200.32 200.31 200.31 200.29 200.28 - 200.28
172.16.72.31 : 200.32 200.32 200.29 200.31 200.33 200.29 200.30 200.25 200.33 200.29
172.16.72.32 : 200.34 200.32 - 200.32 200.35 200.31 200.27 200.25 200.31 200.30
172.16.72.33 : 200.27 200.25 200.30 200.30 200.34 - 200.23 200.34 200.25 200.29
172.16.72.34 : 200.25 - 200.28 200.32 200.31 200.30 200.23 200.27 200.34 200.24
172.16.72.35 : 200.18 200.20 200.28 - 200.33 200.32 200.29 200.28 200.33 200.29
172.16.72.36 : 200.30 200.20 - 200.31 200.30 200.28 200.30 200.29 200.32 200.28
172.16.72.37 : 200.26 200.29 200.34 200.30 200.29 200.21 200.30 200.33 200.30 200.27
172.16.72.38 : 200.21 200.22 200.30 200.29 200.29 200.30 200.29 200.25 200.30 200.26
172.16.72.39 : 200.23 200.25 200.31 200.31 200.32 200.28 200.28 200.32 200.29 200.28
172.16.72.4  : 4.31 4.26 4.29 4.31 4.30 4.28 4.31 4.29 4.33 4.21
172.16.72.40 : 4.33 4.23 4.29 4.29 4.24 4.31 4.27 4.34 4.31 4.20
172.16.72.41 : 4.33 4.26 4.27 4.21 4.27 4.28 4.31 4.28 4.26 4.21
172.16.72.42 : 4.36 4.24 4.33 4.17 4.29 4.29 4.31 4.26 4.30 4.26
172.16.72.43 : 4.32 4.21 4.27 4.30 4.27 4.32 4.26 4.31 4.27 4.24
172.16.72.44 : 4.32 4.20 4.32 4.27 4.29 4.30 4.30 4.24 4.32 4.25
172.16.72.46 : 4.33 4.20 4.29 4.29 4.28 4.31 4.30 4.22 4.24 4.28
172.16.72.47 : 4.33 4.21 4.23 4.19 4.29 4.30 4.27 4.29 4.27 4.23
172.16.72.48 : 4.32 4.24 4.28 4.26 4.29 4.31 4.29 4.22 4.31 4.25
172.16.72.49 : 4.31 4.24 4.31 4.25 4.29 4.30 4.31 4.27 4.30 4.30
172.16.72.5  : 4.31 4.23 4.25 4.30 4.30 4.28 4.23 4.26 4.27 4.29
172.16.72.50 : 4.32 4.23 4.32 4.24 4.29 4.30 4.25 4.31 4.31 4.24
172.16.72.51 : 4.28 4.26 4.29 4.28 4.30 4.31 4.30 4.27 4.29 4.25
172.16.72.6  : 4.26 4.23 4.26 4.26 4.28 4.29 4.28 4.21 4.30 4.30
172.16.72.7  : 4.29 4.27 4.32 4.24 4.30 4.29 4.27 4.29 4.30 4.19
172.16.72.8  : 4.28 4.27 4.32 4.20 4.30 4.27 4.23 4.28 4.27 4.24
172.16.72.9  : 4.29 4.27 4.29 4.25 4.28 4.27 4.29 4.27 4.29 4.25

      35 targets
      35 alive
       0 unreachable
       0 unknown addresses

      11 timeouts (waiting for response)
     350 ICMP Echos sent
     336 ICMP Echo Replies received
       0 other ICMP received

 0.03 ms (min round trip time)
 89.2 ms (avg round trip time)
 200 ms (max round trip time)
       10.156 sec (elapsed real time)

