"Dstat 0.7.3 CSV output"
"Author:","Dag Wieers <dag@wieers.com>",,,,"URL:","http://dag.wieers.com/home-made/dstat/"
"Host:","grisou-37.nancy.grid5000.fr",,,,"User:","root"
"Cmdline:","dstat -m -c -n -o dstat.csv",,,,"Date:","24 May 2020 18:42:50 CEST"
"memory usage",,,,"total cpu usage",,,,,"net/total",
"used","free","buff","cach","usr","sys","idl","wai","stl","recv","send"
1179963392,132335476736,52404224,1244864512,1.756,0.209,97.967,0.068,0,0,0
1191825408,132323266560,52404224,1245208576,0.936,0.187,98.877,0,0,386652,14986
1180475392,132335050752,52416512,1244762112,0.375,0.656,97.813,1.156,0,4604,15532
1193201664,132322312192,52428800,1244762112,0.313,0.156,99.343,0.188,0,382700,10624
1180315648,132335177728,52428800,1244766208,0.687,0.594,98.719,0,0,11230,15810
1179840512,132335652864,52428800,1244766208,0,0,100,0,0,3604,2148
1178726400,132336750592,52428800,1244766208,1,0.688,98.312,0,0,385926,24270
1178451968,132337025024,52428800,1244766208,0,0,100,0,0,828,0
1178439680,132337025024,52441088,1244766208,0,0,99.938,0.062,0,1670,0
1178169344,132337283072,52453376,1244766208,0,0,99.969,0.031,0,1112,0
1177645056,132337807360,52453376,1244766208,0,0,100,0,0,528,0
1177645056,132337807360,52453376,1244766208,0,0,100,0,0,752,0
1177645056,132337807360,52453376,1244766208,0,0,100,0,0,580,0
1177645056,132337807360,52453376,1244766208,0,0,100,0,0,466,0
1177378816,132338065408,52461568,1244766208,0,0,99.938,0.062,0,640,0
1177112576,132338331648,52461568,1244766208,0.031,0,99.969,0,0,760,0
1177104384,132338339840,52461568,1244766208,0,0,100,0,0,3912,484
1176580096,132338864128,52461568,1244766208,0,0,100,0,0,6010,0
1175547904,132339896320,52461568,1244766208,0,0,100,0,0,7134,400
1175539712,132339904512,52461568,1244766208,0,0,100,0,0,5934,0
1175904256,132339531776,52469760,1244766208,1.124,0.749,98.096,0.031,0,395830,30466
1175576576,132339859456,52469760,1244766208,0,0,100,0,0,9458,168
1176629248,132338782208,52469760,1244790784,0.344,0.312,99.344,0,0,173154,12020
1196351488,132318605312,52473856,1245233152,0.875,0.469,98.062,0.594,0,389554,16398
1181093888,132334297088,52473856,1244798976,0.250,0.219,99.531,0,0,4586,14440
1192669184,132322246656,52498432,1245245440,0.624,0.156,99.063,0.156,0,382920,11226
1178677248,132336685056,52498432,1244798976,0.469,0.469,99.062,0,0,3958,15276
1184272384,132330897408,52498432,1244987392,1.155,0.656,98.189,0,0,386492,26682
1182994432,132332363776,52498432,1244798976,0,0,100,0,0,700,0
1182736384,132332621824,52498432,1244798976,0,0,99.687,0.313,0,974,0
1182838784,132332236800,52523008,1245024256,1.656,0.281,97.969,0.094,0,223076,11136
1181544448,132333756416,52523008,1244798976,0,0.031,99.969,0,0,14456,2884
1181028352,132334272512,52523008,1244798976,0,0,100,0,0,5138,1008
1180762112,132334538752,52523008,1244798976,0,0,100,0,0,1352,1008
1179832320,132335456256,52523008,1244807168,0.438,0.125,99.437,0,0,342226,14832
1186430976,132328665088,52523008,1244999680,0.219,0.125,99.344,0.312,0,180218,21684
1185849344,132329222144,52547584,1244999680,0.125,0.031,99.781,0.063,0,13188,13328
1185841152,132329230336,52547584,1244999680,0,0,100,0,0,13470,15708
1185841152,132329230336,52547584,1244999680,0.031,0.031,99.938,0,0,12782,14836
1185550336,132329521152,52547584,1244999680,0,0.031,99.969,0,0,12956,13328
1185021952,132330037248,52551680,1245007872,0,0,99.593,0.407,0,20200,19534
1184755712,132330295296,52559872,1245007872,0.031,0,99.937,0.031,0,13096,13496
1184497664,132330553344,52559872,1245007872,0,0.063,99.937,0,0,12842,13328
1183981568,132331069440,52559872,1245007872,0.031,0,99.969,0,0,13058,13328
1176678400,132338561024,52559872,1244819456,0.031,0.063,99.906,0,0,14616,15564
1176715264,132338520064,52559872,1244823552,0,0,100,0,0,1406,84
1176055808,132339167232,52572160,1244823552,0.281,0.125,99.562,0.031,0,172376,14236
1176035328,132339175424,52584448,1244823552,0,0,99.969,0.031,0,912,0
1176035328,132339175424,52584448,1244823552,0,0,100,0,0,1214,1148
1175519232,132339691520,52584448,1244823552,0,0,100,0,0,800,0
1174994944,132340215808,52584448,1244823552,0,0,100,0,0,874,0
1174994944,132340215808,52584448,1244823552,0,0,99.656,0.344,0,1384,0
1174720512,132340473856,52596736,1244827648,0,0,99.969,0.031,0,6282,0
1174196224,132340989952,52604928,1244827648,0,0,99.938,0.062,0,924,0
1174196224,132340989952,52604928,1244827648,0,0,100,0,0,466,0
1184419840,132330573824,52604928,1245016064,0.656,0.281,99.063,0,0,394712,18624
1176608768,132338515968,52625408,1244827648,0.375,0.500,98.781,0.344,0,4466,15820
1330962432,132183801856,52633600,1245134848,3.223,0.375,96.339,0.063,0,331730,13968
1332453376,132182478848,52633600,1244971008,0,0.031,99.969,0,0,1260,220
1332125696,132182806528,52633600,1244971008,0,0,100,0,0,294,0
1332023296,132182908928,52633600,1244971008,0,0,100,0,0,1082,168
1332011008,132182908928,52645888,1244971008,0.031,0.031,99.906,0.031,0,928,1008
1331761152,132183117824,52658176,1244983296,0.469,0,98.937,0.594,0,748,0
1331245056,132183633920,52658176,1244983296,3.127,0,96.873,0,0,1182,0
1331245056,132183633920,52658176,1244983296,3.125,0,96.875,0,0,646,0
1330704384,132184174592,52658176,1244983296,3.156,0,96.844,0,0,986,0
1330446336,132184432640,52658176,1244983296,3.124,0.031,96.845,0,0,794,84
1330188288,132184690688,52674560,1244966912,3.126,0,96.780,0.094,0,2510,0
1329913856,132184948736,52674560,1244983296,3.126,0,96.874,0,0,3590,0
1329655808,132185206784,52674560,1244983296,3.125,0,96.875,0,0,1578,0
1329655808,132185206784,52674560,1244983296,3.126,0,96.874,0,0,1396,0
1329397760,132185464832,52674560,1244983296,3.124,0.031,96.845,0,0,2324,0
1329397760,132185464832,52682752,1244975104,3.125,0,96.812,0.062,0,2192,0
1329389568,132185464832,52682752,1244983296,3.156,0,96.844,0,0,528,0
1329389568,132185464832,52682752,1244983296,3.126,0.031,96.843,0,0,508,0
1329213440,132185640960,52682752,1244983296,3.156,0,96.844,0,0,1052,0
1329213440,132185640960,52682752,1244983296,3.126,0,96.874,0,0,1098,0
1329057792,132185788416,52690944,1244983296,3.155,0.031,96.813,0,0,560,1948
1328799744,132186046464,52690944,1244983296,3.126,0,96.874,0,0,914,1508
1328799744,132186046464,52690944,1244983296,3.125,0,96.875,0,0,872,0
1328771072,132186075136,52690944,1244983296,3.156,0,96.844,0,0,1270,0
1328513024,132186333184,52690944,1244983296,3.125,0,96.875,0,0,4732,0
1328513024,132186333184,52699136,1244975104,3.155,0,96.782,0.062,0,690,0
1327968256,132186869760,52699136,1244983296,3.126,0,96.874,0,0,1038,0
1327968256,132186869760,52699136,1244983296,3.125,0,96.875,0,0,568,0
1327968256,132186869760,52699136,1244983296,3.126,0,96.874,0,0,346,0
1327968256,132186869760,52699136,1244983296,3.155,0,96.845,0,0,974,0
1328226304,132186611712,52707328,1244975104,3.126,0,96.812,0.063,0,1050,264
1328136192,132186693632,52707328,1244983296,3.126,0,96.874,0,0,926,0
1328136192,132186693632,52707328,1244983296,3.125,0,96.875,0,0,1722,420
1327878144,132186951680,52707328,1244983296,3.156,0,96.844,0,0,2628,1408
1327878144,132186951680,52707328,1244983296,3.155,0.031,96.813,0,0,2904,1952
1327865856,132186951680,52715520,1244987392,3.126,0,96.843,0.031,0,3494,1848
1327898624,132186918912,52715520,1244987392,3.126,0,96.718,0.156,0,5922,2100
1331093504,132183724032,52723712,1244979200,3.250,0.094,96.594,0.062,0,250104,4918
1455136768,132059623424,52723712,1244995584,8.892,0.438,90.670,0,0,13017248,13156130
1634426880,131880333312,52723712,1244995584,12.656,0.594,86.750,0,0,35806166,34969840
1654722560,131859996672,52731904,1244995584,7.049,0.624,92.296,0.031,0,56328274,43543660
1826299904,131688386560,52731904,1244995584,7.094,0.906,92,0,0,77734488,46900786
1859448832,131655192576,52731904,1244999680,5.654,0.528,93.818,0,0,99668014,16779608
2048819200,131465814016,52740096,1244999680,4.870,0.687,94.411,0.031,0,120472228,26791656
2201067520,131313565696,52740096,1244999680,8.479,1.126,90.394,0,0,138586706,47268258
2261176320,131253444608,52748288,1245003776,7.688,0.622,91.659,0.031,0,159614300,45773822
2374586368,131140034560,52748288,1245003776,9.512,0.594,89.894,0,0,178358116,46187408
2463166464,131051454464,52748288,1245003776,8.932,1.276,89.729,0.062,0,198439510,46984042
2556620800,130957996032,52748288,1245007872,5.554,0.874,93.573,0,0,201388964,39328492
2648399872,130866212864,52748288,1245011968,5.186,0.875,93.939,0,0,201044244,42555494
2711052288,130803560448,52756480,1245003776,5.899,0.749,93.321,0.031,0,201566702,45056258
2802446336,130712154112,52756480,1245016064,4.997,0.843,94.160,0,0,201602082,42768790
2892423168,130622177280,52756480,1245016064,5.688,0.719,93.594,0,0,201574090,47621156
2984554496,130530045952,52756480,1245016064,5.115,0.780,94.105,0,0,201415106,39807154
3080622080,130433974272,52756480,1245020160,5.675,0.655,93.670,0,0,201388156,40289634
3181285376,130333302784,52764672,1245020160,4.533,0.719,94.717,0.031,0,201403804,27149864
3270344704,130244243456,52764672,1245020160,5.357,0.783,93.860,0,0,201577454,44018682
3359272960,130155315200,52764672,1245020160,4.928,0.502,94.570,0,0,201444907,47110744
3446943744,130067640320,52764672,1245024256,5.987,0.564,93.448,0,0,201687537,46599086
3550306304,129964277760,52764672,1245024256,6.794,0.626,92.580,0,0,201420420,39256434
3642540032,129872035840,52772864,1245024256,5.465,0.718,93.754,0.062,0,201184424,37729696
3728396288,129786179584,52772864,1245024256,5.580,0.623,93.579,0.218,0,201594892,48821140
3820937216,129693634560,52772864,1245028352,5.444,0.469,94.086,0,0,201494054,39807156
3908026368,129606545408,52772864,1245028352,5.136,0.626,94.237,0,0,201545074,48838432
4005978112,129508593664,52772864,1245028352,5.493,0.874,93.633,0,0,201265162,38327732
4101115904,129413447680,52781056,1245028352,4.825,0.564,94.580,0.031,0,201696544,37054310
4215214080,129299312640,52781056,1245032448,4.086,0.811,95.103,0,0,201254898,4924640
4313231360,129201287168,52789248,1245032448,5.101,0.778,94.059,0.062,0,201601860,33271586
4400783360,129113735168,52789248,1245032448,5.411,0.782,93.807,0,0,201389608,49292280
4491567104,129022951424,52789248,1245032448,5.053,0.811,94.136,0,0,201493986,42601518
4580597760,128933920768,52797440,1245024256,5.604,0.657,93.707,0.031,0,201441674,46600536
4669177856,128845332480,52797440,1245032448,5.372,0.593,94.035,0,0,201453832,44462212
4759142400,128755363840,52797440,1245036544,5.285,0.688,94.028,0,0,201510040,46569608
4848226304,128666279936,52797440,1245036544,5.092,0.812,94.096,0,0,201563338,44136148
4939456512,128575049728,52797440,1245036544,5.067,0.626,94.307,0,0,201557810,40823568
5031415808,128483008512,52797440,1245040640,4.760,0.720,94.519,0,0,201389178,44796122
5119643648,128394772480,52805632,1245040640,5.100,0.657,94.212,0.031,0,201330148,44637510
5208940544,128305475584,52805632,1245040640,5.038,0.626,94.337,0,0,201742092,44050538
5300813824,128213598208,52805632,1245044736,4.768,0.690,94.542,0,0,201041696,42479372
5406990336,128107421696,52805632,1245044736,4.504,0.500,94.995,0,0,201378284,17258324
5510885376,128003526656,52813824,1245036544,4.258,0.626,95.085,0.031,0,201615320,20027810
5598507008,127915892736,52822016,1245040640,5.199,0.626,94.112,0.063,0,201573040,47319434
5689626624,127824769024,52822016,1245044736,5.159,0.532,94.309,0,0,201114866,42552868
5780115456,127734276096,52822016,1245048832,5.345,0.594,94.061,0,0,201614114,43288576
5870809088,127643582464,52822016,1245048832,5.089,0.749,94.162,0,0,201264996,44342032
5985067008,127529324544,52822016,1245048832,3.941,0.626,95.433,0,0,201522734,3335554
6098198528,127416184832,52830208,1245048832,3.935,0.687,95.315,0.062,0,201217848,3257172
6212739072,127301644288,52830208,1245048832,4.213,0.562,95.225,0,0,201202130,4076818
6324260864,127190122496,52830208,1245048832,4.421,0.592,94.988,0,0,201271164,4030226
6437769216,127076614144,52830208,1245048832,3.940,0.532,95.528,0,0,201272140,3385658
6550716416,126963666944,52830208,1245048832,4.145,0.748,95.108,0,0,201615310,4334212
6663655424,126850727936,52838400,1245040640,4.056,0.593,95.257,0.094,0,201490002,3397740
6777671680,126736703488,52838400,1245048832,4.203,0.716,95.081,0,0,201156874,3285610
6891257856,126623117312,52838400,1245048832,4.116,0.686,95.198,0,0,201427212,4162624
7005597696,126508777472,52838400,1245048832,4.176,0.654,95.170,0,0,201066808,3103234
7119233024,126395142144,52838400,1245048832,4.147,0.655,95.198,0,0,201363598,3448140
7232995328,126281371648,52846592,1245048832,4.146,0.623,95.200,0.031,0,201490232,3025796
7345983488,126168379392,52854784,1245044736,4.298,0.623,94.643,0.436,0,201153374,3307434
7460143104,126054211584,52854784,1245052928,3.965,0.656,95.379,0,0,201429596,4018552
7573487616,125940867072,52854784,1245052928,4.329,0.623,95.048,0,0,201331836,3871034
7674601472,125839753216,52854784,1245052928,5.095,0.625,94.248,0.031,0,201242010,25103250
7768719360,125745635328,52862976,1245044736,4.787,0.594,94.587,0.031,0,201322086,35949560
7857278976,125657063424,52862976,1245057024,5.363,0.780,93.857,0,0,201664266,45020296
7950331904,125564010496,52862976,1245057024,4.850,0.657,94.493,0,0,201433114,40058446
8042971136,125471371264,52862976,1245057024,5.519,0.717,93.764,0,0,201263618,40951382
8130924544,125383417856,52862976,1245057024,5.247,0.593,94.160,0,0,201410708,46511540
8221777920,125292552192,52871168,1245061120,5.192,0.626,94.119,0.063,0,201565676,43954894
8310464512,125203865600,52871168,1245061120,5.033,0.719,94.248,0,0,201526150,46296544
8402460672,125111869440,52871168,1245061120,5.074,0.501,94.425,0,0,201241132,41534868
8492359680,125021970432,52871168,1245061120,5.119,0.718,94.164,0,0,201377998,43768904
8584667136,124929658880,52871168,1245065216,5.294,0.716,93.989,0,0,201509310,41604966
8676577280,124837744640,52879360,1245061120,5.654,0.687,93.596,0.062,0,201341324,43791810
8768147456,124746170368,52879360,1245065216,5.094,0.594,94.312,0,0,201254286,42285164
8859234304,124655083520,52879360,1245065216,5.386,0.809,93.804,0,0,201526180,42776922
8957042688,124557271040,52879360,1245069312,4.746,0.718,94.536,0,0,201486244,30827012
9050083328,124464230400,52879360,1245069312,5.197,0.595,94.208,0,0,201238120,41421370
9142747136,124371558400,52887552,1245069312,5.293,0.654,93.991,0.062,0,201564752,41221560
9231683584,124282621952,52887552,1245069312,5.688,0.594,93.719,0,0,201270330,45758756
9321754624,124192550912,52887552,1245069312,5.059,0.718,94.222,0,0,201535718,43886750
9412591616,124101713920,52887552,1245069312,5.123,0.656,94.221,0,0,201423234,40077958
9503330304,124010971136,52887552,1245073408,5.064,0.594,94.342,0,0,201443322,43331536
9597857792,123916435456,52895744,1245073408,5.554,0.655,93.666,0.125,0,201346758,40325520
9690546176,123823747072,52895744,1245073408,4.972,0.625,94.403,0,0,201511830,41575280
9783279616,123731009536,52895744,1245077504,4.991,0.780,94.230,0,0,201454834,38458374
9875931136,123638358016,52895744,1245077504,4.973,0.719,94.307,0,0,201290746,38772400
9972027392,123542261760,52895744,1245077504,5.298,0.717,93.986,0,0,201486357,42339878
10066345984,123447934976,52903936,1245077504,5.278,0.593,94.066,0.062,0,201586309,39377928
10159284224,123354992640,52903936,1245081600,5,0.688,94.312,0,0,201601132,40030822
10254012416,123260256256,52912128,1245081600,5.230,0.814,93.924,0.031,0,201421404,45264982
10346778624,123167490048,52912128,1245081600,4.994,0.811,94.195,0,0,201150518,43041098
10442448896,123071819776,52912128,1245081600,5.224,0.688,94.057,0.031,0,201649614,38932724
10531205120,122983051264,52920320,1245081600,4.941,0.813,94.184,0.063,0,199834389,43696666
10622730240,122891522048,52920320,1245085696,5.767,0.748,93.485,0,0,201483373,43630872
10714050560,122800201728,52920320,1245085696,5.145,0.686,93.951,0.218,0,201266200,40194476
10812461056,122701791232,52920320,1245085696,4.787,0.563,94.650,0,0,201522510,32254706
10905563136,122608685056,52920320,1245089792,5.009,0.751,94.239,0,0,201398850,39777696
10995445760,122518794240,52928512,1245089792,5.179,0.780,93.978,0.062,0,201499622,45537502
11088007168,122426232832,52928512,1245089792,4.859,0.690,94.451,0,0,201330830,39749528
11181432832,122332807168,52928512,1245089792,5.114,0.655,94.231,0,0,201544168,41098646
11270070272,122244165632,52928512,1245093888,5.281,0.688,94.031,0,0,201514318,44894578
11361492992,122152742912,52928512,1245093888,4.847,0.719,94.434,0,0,201283498,41616466
11448545280,122065551360,52936704,1245220864,4.892,0.654,94.422,0.031,0,178765200,28983774
11542077440,121972011008,52936704,1245229056,4.754,0.626,94.620,0,0,201330790,37168078
11631693824,121882386432,52936704,1245237248,5.181,0.655,94.164,0,0,201418580,45206908
11722543104,121791537152,52936704,1245237248,5.367,0.624,94.009,0,0,201395728,44156258
11811860480,121702219776,52936704,1245237248,5.389,0.592,94.019,0,0,201477812,43095806
11914825728,121599254528,52944896,1245229056,4.832,0.717,94.358,0.094,0,201276828,25135792
12010278912,121503793152,52944896,1245237248,5.222,0.684,94.094,0,0,201429134,34986934
12102963200,121411104768,52944896,1245241344,5.537,0.653,93.810,0,0,201344988,42405538
12193845248,121320222720,52944896,1245241344,4.915,0.626,94.458,0,0,201488294,42657504
12284981248,121229086720,52944896,1245241344,4.917,0.752,94.331,0,0,201499100,44056404
12376743936,121137315840,52953088,1245241344,4.732,0.627,94.547,0.094,0,201396882,41594686
12482899968,121031155712,52953088,1245245440,4.439,0.594,94.967,0,0,201344838,16874330
12575051776,120939003904,52953088,1245245440,5.219,0.656,94.125,0,0,201371704,42971712
12664381440,120849674240,52953088,1245245440,5.102,0.501,94.397,0,0,201412796,45369626
12756758528,120757297152,52953088,1245245440,5.166,0.751,94.083,0,0,201550304,43359506
12849221632,120664825856,52961280,1245245440,4.780,0.843,94.314,0.062,0,201410096,41106768
12952809472,120561233920,52961280,1245249536,4.191,0.782,95.027,0,0,201334678,20212636
13043974144,120470069248,52961280,1245249536,4.919,0.721,94.361,0,0,201546414,42688586
13134913536,120379129856,52969472,1245241344,5.069,0.563,94.337,0.031,0,201491702,45097818
13228654592,120285380608,52969472,1245249536,5.064,0.625,94.311,0,0,201311166,39631836
13319946240,120194084864,52977664,1245245440,4.886,0.564,94.488,0.063,0,201174034,43425290
13418164224,120095858688,52977664,1245253632,4.632,0.751,94.617,0,0,201576430,30858146
13518512128,119995510784,52977664,1245253632,4.385,0.595,95.020,0,0,201403352,26132576
13609549824,119904440320,52977664,1245253632,4.936,0.875,94.189,0,0,201484502,45130538
13700665344,119813324800,52977664,1245253632,4.750,0.598,94.652,0,0,201290848,43795848
13790425088,119723552768,52985856,1245257728,4.967,0.781,94.158,0.094,0,201510508,45413368
13883719680,119630258176,52985856,1245257728,4.829,0.596,94.575,0,0,201521590,39740350
13988376576,119525601280,52985856,1245257728,4.201,0.502,95.298,0,0,201205686,20202830
14078038016,119435939840,52985856,1245257728,4.823,0.658,94.363,0.157,0,201524357,43387626
14169784320,119344189440,52985856,1245261824,4.977,0.689,94.335,0,0,201766785,43271734
14261952512,119252021248,52994048,1245253632,5.206,0.655,94.077,0.062,0,201047854,40657698
14365851648,119148113920,52994048,1245261824,4.805,0.562,94.633,0,0,201414302,19719384
14473605120,119040360448,52994048,1245261824,4.311,0.594,95.095,0,0,201529890,13843618
14584791040,118929174528,52994048,1245261824,4.241,0.624,95.136,0,0,201196498,7965574
14691586048,118822379520,52994048,1245261824,4.345,0.563,95.092,0,0,201471392,17177538
14800220160,118713737216,53002240,1245261824,4.338,0.562,95.037,0.062,0,201095340,13001980
14909403136,118604554240,53002240,1245261824,4.158,0.594,95.249,0,0,201673082,11392054
15019704320,118494253056,53002240,1245261824,4.243,0.593,95.164,0,0,201135642,9763222
15127134208,118386819072,53002240,1245265920,4.292,0.564,95.144,0,0,201470466,16142600
15234596864,118279356416,53002240,1245265920,4.460,0.561,94.978,0,0,201330298,14695044
15344021504,118169931776,53010432,1245257728,4.329,0.841,94.737,0.093,0,201661556,11365262
15452585984,118061359104,53010432,1245265920,4.277,0.656,95.067,0,0,201185754,12959474
15560806400,117953138688,53010432,1245265920,4.215,0.687,95.098,0,0,201299468,14590256
15667228672,117846716416,53010432,1245265920,4.074,0.501,95.425,0,0,201587908,11931568
15774646272,117739298816,53010432,1245265920,4.220,0.656,95.123,0,0,201399772,17456576
15883067392,117630869504,53018624,1245265920,4.579,0.717,94.611,0.093,0,201538520,11658628
15991267328,117522669568,53018624,1245265920,4.280,0.594,95.127,0,0,201080876,16023366
16098516992,117415419904,53018624,1245265920,4.009,0.595,95.396,0,0,201305032,13038364
16205168640,117308768256,53018624,1245265920,4.344,0.625,95.031,0,0,201581920,17818352
16314642432,117199278080,53026816,1245274112,3.886,0.564,95.519,0.031,0,201437438,8165226
16419205120,117094715392,53035008,1245265920,4.317,0.626,94.964,0.094,0,201229536,22645780
16528273408,116985638912,53035008,1245274112,3.915,0.689,95.396,0,0,201252198,11414774
16636727296,116877185024,53035008,1245274112,4.254,0.657,95.089,0,0,201219180,14627344
16743645184,116770267136,53035008,1245274112,4.311,0.750,94.939,0,0,201594304,17803058
16852430848,116661481472,53035008,1245274112,4.003,0.719,95.278,0,0,201272574,12985994
16956141568,116557762560,53043200,1245274112,4.009,0.783,95.052,0.157,0,201319076,19674712
17063178240,116450725888,53043200,1245274112,4.220,0.656,95.123,0,0,201553672,17674390
17170169856,116343734272,53043200,1245274112,4.020,0.565,95.415,0,0,201397689,14533354
17273712640,116240191488,53043200,1245274112,4.137,0.595,95.268,0,0,201220751,18835420
17382076416,116131823616,53043200,1245278208,4.582,0.717,94.701,0,0,201627008,15449632
17489162240,116024729600,53051392,1245278208,3.975,0.720,95.243,0.063,0,201078994,13792882
17594163200,115919728640,53051392,1245278208,4.250,0.688,95.062,0,0,201301834,18558722
17699041280,115814850560,53051392,1245278208,4.135,0.595,95.269,0,0,201554746,17943670
17804386304,115709505536,53051392,1245278208,4.470,0.688,94.842,0,0,201523284,19361002
17910718464,115603173376,53051392,1245278208,4.219,0.656,94.906,0.219,0,201255908,16274254
18016911360,115496972288,53059584,1245278208,4.193,0.532,95.213,0.063,0,201256841,13861342
18122317824,115391565824,53059584,1245278208,4.189,0.719,95.092,0,0,201208311,17646272
18227875840,115286003712,53059584,1245282304,4.253,0.719,95.028,0,0,201443708,17295510
18335518720,115178360832,53059584,1245282304,4.061,0.781,95.158,0,0,201417756,14291080
18438455296,115075424256,53059584,1245282304,4.412,0.626,94.962,0,0,201088124,19877946
18545586176,114968285184,53067776,1245282304,3.940,0.719,95.247,0.094,0,201618918,12963632
18650607616,114863263744,53067776,1245282304,4.223,0.688,95.089,0,0,201321620,18390978
18756558848,114757312512,53067776,1245282304,4.247,0.687,95.066,0,0,201091042,18873010
18864164864,114649706496,53067776,1245282304,4.100,0.626,95.274,0,0,201492778,16287472
18970132480,114543738880,53067776,1245282304,4.289,0.595,95.116,0,0,201445276,16194848
19077222400,114436640768,53075968,1245282304,4.398,0.624,94.916,0.062,0,201308714,14661552
19184005120,114329858048,53075968,1245282304,4.129,0.657,95.214,0,0,201430972,16169616
19290742784,114223120384,53075968,1245282304,4.217,0.687,95.095,0,0,201557460,14728330
19401183232,114112675840,53075968,1245286400,4.031,0.719,95.250,0,0,201157710,10220884
19506282496,114007564288,53088256,1245286400,4.041,0.658,95.238,0.063,0,201435860,17528050
19613196288,113900642304,53096448,1245286400,4.001,0.781,95.123,0.094,0,201362090,15960464
19718189056,113795690496,53096448,1245286400,4.257,0.720,95.023,0,0,201234668,17875096
19828318208,113685561344,53096448,1245286400,4.035,0.594,95.371,0,0,201389410,10320124
19936632832,113577246720,53096448,1245286400,3.916,0.627,95.457,0,0,201264658,14165438
20046970880,113466908672,53096448,1245286400,3.972,0.626,95.402,0,0,201535022,8388076
20153679872,113360187392,53104640,1245290496,4.069,0.626,95.243,0.063,0,201451318,14237100
20261396480,113252470784,53104640,1245290496,4.069,0.657,95.274,0,0,201274690,15472208
20366868480,113146998784,53104640,1245290496,4.466,0.781,94.753,0,0,201446458,19814038
20473724928,113040142336,53104640,1245290496,3.977,0.626,95.396,0,0,201372766,14385116
20577067008,112936796160,53104640,1245294592,4.314,0.781,94.905,0,0,201422534,23263356
20683796480,112830058496,53112832,1245294592,4.103,0.564,95.240,0.094,0,201110120,16519686
20791676928,112722178048,53112832,1245294592,3.998,0.812,95.191,0,0,201524688,11804414
20899364864,112614490112,53112832,1245294592,4.099,0.657,95.244,0,0,201197336,17311436
21003661312,112510193664,53112832,1245294592,4.318,0.720,94.962,0,0,201366212,17764450
21113196544,112400658432,53112832,1245294592,4.129,0.594,95.120,0.156,0,201583290,13119990
21217763328,112296079360,53121024,1245298688,4.224,0.626,95.088,0.063,0,201157142,19383878
21324726272,112189116416,53121024,1245298688,4.341,0.625,95.034,0,0,201801042,15164718
21433126912,112080715776,53121024,1245298688,4.338,0.593,95.069,0,0,201368970,14634680
21540614144,111973228544,53121024,1245298688,4.180,0.780,95.041,0,0,201220448,13594830
21645123584,111868715008,53121024,1245302784,4.900,0.655,94.444,0,0,201257784,19963238
21751824384,111762006016,53129216,1245302784,4.410,0.469,95.058,0.063,0,201293890,16364014
21858664448,111655165952,53129216,1245302784,4.341,0.718,94.941,0,0,201392812,16527238
21966639104,111547191296,53129216,1245302784,4.280,0.562,95.158,0,0,201375390,12726532
22075502592,111438327808,53129216,1245302784,4.310,0.593,95.097,0,0,201451026,11870914
22178066432,111335763968,53129216,1245302784,4.496,0.656,94.849,0,0,201296586,23819444
22284787712,111229034496,53137408,1245302784,4.897,0.686,94.354,0.062,0,201358312,15364020
22392963072,111120859136,53137408,1245302784,4.277,0.749,94.973,0,0,201231076,17224628
22500855808,111012966400,53137408,1245302784,4.581,0.623,94.796,0,0,201349652,13552610
22608322560,110905499648,53137408,1245302784,4.337,0.686,94.977,0,0,201550886,17397414
22714167296,110799650816,53137408,1245306880,4.428,0.717,94.855,0,0,201242984,17883624
22818275328,110695542784,53153792,1245290496,4.950,0.747,94.147,0.156,0,201515828,19389664
22922424320,110591377408,53153792,1245306880,4.283,0.656,95.061,0,0,201341354,17994910
23031083008,110482718720,53153792,1245306880,4.151,0.811,95.037,0,0,201510856,14621820
23136731136,110377070592,53153792,1245306880,5.051,0.682,94.267,0,0,201082230,16307070
23241539584,110272258048,53153792,1245310976,4.521,0.655,94.824,0,0,201411350,16546168
23334658048,110179139584,53161984,1245302784,4.514,0.592,94.863,0.031,0,176143300,17372068
23436726272,110077063168,53161984,1245310976,4.306,0.811,94.883,0,0,191911772,13224242
23527211008,109986578432,53161984,1245310976,4.394,0.561,95.045,0,0,168787478,14414112
23609176064,109904613376,53161984,1245310976,3.936,0.500,95.564,0,0,147603516,9130910
23669456896,109844328448,53161984,1245315072,4.572,0.591,94.837,0,0,126262666,23622594
23719378944,109794406400,53170176,1245306880,4.475,0.404,94.997,0.124,0,105017692,17293210
23757942784,109755826176,53178368,1245315072,4.202,0.436,95.331,0.031,0,83309634,16988548
23787048960,109726715904,53178368,1245319168,4.574,0.249,95.177,0,0,62129268,11787296
23802429440,109711335424,53178368,1245319168,3.897,0.312,95.792,0,0,42347974,16777426
18754031616,114759733248,53178368,1245319168,3.399,0.780,95.822,0,0,19404890,21171834
14992125952,118521851904,53186560,1245097984,0.406,0.500,98.594,0.500,0,4019252,14896
14992125952,118521851904,53186560,1245097984,0,0,100,0,0,508,0
14992117760,118521851904,53194752,1245097984,0,0,99.969,0.031,0,2048,0
14992117760,118521851904,53194752,1245097984,0,0,100,0,0,914,0
14992109568,118521860096,53194752,1245097984,0,0.031,99.969,0,0,1540,0
14992093184,118521876480,53207040,1245085696,0,0,99.969,0.031,0,508,0
14992080896,118521876480,53207040,1245097984,0,0,100,0,0,1642,0
14997274624,118516682752,53207040,1245097984,0,0.031,99.969,0,0,988,0
14997204992,118516752384,53207040,1245097984,0,0,100,0,0,1824,0
14997204992,118516752384,53207040,1245097984,0,0,100,0,0,854,0
14996946944,118517010432,53207040,1245097984,0,0,100,0,0,508,0
14996938752,118517010432,53215232,1245097984,0,0,99.937,0.063,0,742,0
14996680704,118517268480,53215232,1245097984,0,0,100,0,0,2740,0
14996680704,118517268480,53215232,1245097984,0,0,100,0,0,3336,456
14996680704,118517268480,53215232,1245097984,0,0,100,0,0,2048,0
14996664320,118517284864,53215232,1245097984,0,0,100,0,0,688,1508
14997741568,118516097024,53219328,1245097984,0.062,0.094,99.813,0.031,0,23752,11132
15028736000,118483324928,53227520,1245110272,1.405,0.812,97.752,0.031,0,400105,40568
15028641792,118483173376,53227520,1245110272,0,0,100,0,0,4068,0
15028633600,118483181568,53227520,1245110272,0,0,100,0,0,5310,0
15028633600,118483181568,53227520,1245110272,0,0,100,0,0,2048,0
15028293632,118483521536,53227520,1245110272,0,0,100,0,0,826,0
15027974144,118483812352,53252096,1245114368,0,0,99.844,0.156,0,1366,252
15027597312,118484189184,53252096,1245114368,0,0,100,0,0,926,0
15027580928,118484205568,53252096,1245114368,0,0,100,0,0,2394,0
15027580928,118484205568,53252096,1245114368,0,0,100,0,0,992,0
