"Dstat 0.7.3 CSV output"
"Author:","Dag Wieers <dag@wieers.com>",,,,"URL:","http://dag.wieers.com/home-made/dstat/"
"Host:","grisou-40.nancy.grid5000.fr",,,,"User:","root"
"Cmdline:","dstat -m -c -n -o dstat.csv",,,,"Date:","27 May 2020 10:04:35 CEST"
"memory usage",,,,"total cpu usage",,,,,"net/total",
"used","free","buff","cach","usr","sys","idl","wai","stl","recv","send"
1005133824,133070508032,49139712,707137536,0.949,0.217,98.704,0.129,0,0,0
1014202368,133061062656,49139712,707477504,0.531,0.281,99.189,0,0,391322,14986
1001164800,133074554880,49139712,707031040,0.624,0.437,98.938,0,0,385326,25948
998682624,133077028864,49139712,707031040,1.031,0.500,98.469,0,0,7002,16230
998412288,133077286912,49152000,707031040,0.031,0.031,98.781,1.157,0,8870,0
997986304,133077504000,49164288,707219456,1.124,0.593,98.189,0.094,0,392532,27194
997122048,133078556672,49164288,707031040,0.031,0.031,99.938,0,0,6290,0
996868096,133078810624,49164288,707031040,0.031,0,99.969,0,0,14278,0
996868096,133078810624,49164288,707031040,0,0.031,99.969,0,0,14806,0
996593664,133079085056,49164288,707031040,0,0,100,0,0,4372,0
996573184,133079093248,49176576,707031040,0,0.031,99.937,0.031,0,4128,0
996020224,133079633920,49188864,707031040,0,0,99.937,0.063,0,3536,0
996020224,133079633920,49188864,707031040,0,0.031,99.969,0,0,2130,0
995762176,133079891968,49188864,707031040,0.062,0,99.938,0,0,1066,0
995762176,133079891968,49188864,707031040,0,0,100,0,0,466,0
995504128,133080150016,49188864,707031040,0.031,0,99.969,0,0,1158,0
994979840,133080666112,49197056,707031040,0,0,99.969,0.031,0,1338,0
994979840,133080666112,49197056,707031040,0.031,0.031,99.938,0,0,3832,0
1012600832,133062586368,49197056,707481600,1.216,0.655,98.129,0,0,392664,17334
998694912,133076938752,49197056,707035136,0.031,0.062,99.906,0,0,7778,13480
999215104,133076275200,49197056,707174400,0.313,0.250,99.437,0,0,189238,11988
1010667520,133064667136,49197056,707317760,0.438,0.156,99.406,0,0,410306,14368
1001000960,133074567168,49209344,707059712,0.687,0.500,98.751,0.062,0,24168,16154
999383040,133076168704,49221632,707059712,0.970,0.563,98.405,0.063,0,405756,26450
999100416,133076451328,49221632,707059712,0.031,0.031,99.938,0,0,22102,0
1013624832,133061464064,49225728,707514368,0.813,0.469,97.404,1.314,0,389360,13042
1002139648,133073354752,49225728,707067904,0.188,0.188,99.625,0,0,35624,13260
1002192896,133073289216,49238016,707067904,0.031,0,99.906,0.062,0,28088,84
1024339968,133050839040,49250304,707321856,1.719,0.250,98,0.031,0,223274,9552
1002164224,133073231872,49250304,707072000,0.063,0,99.937,0,0,5284,4252
1002156032,133073240064,49250304,707072000,0.031,0,99.969,0,0,1024,168
1001639936,133073756160,49250304,707072000,0,0.031,99.969,0,0,812,0
999682048,133075714048,49250304,707072000,0.469,0.125,99.406,0,0,342790,14948
1007808512,133067395072,49262592,707256320,0.188,0.094,99.656,0.063,0,178790,20916
1007464448,133067726848,49274880,707256320,0.031,0.031,99.906,0.031,0,12538,13034
1007206400,133067984896,49274880,707256320,0.031,0.031,99.938,0,0,12824,12838
1007185920,133067993088,49278976,707264512,0,0.031,99.219,0.750,0,13232,13132
1006665728,133068513280,49278976,707264512,0.031,0,99.969,0,0,12660,13034
1006391296,133068787712,49278976,707264512,0,0.031,99.969,0,0,19566,20792
1006125056,133069045760,49287168,707264512,0,0.031,99.906,0.062,0,13066,13352
1006125056,133069045760,49287168,707264512,0.031,0,99.969,0,0,12746,13230
1006080000,133069090816,49287168,707264512,0,0,100,0,0,12236,13034
1006071808,133069090816,49295360,707264512,0,0.031,99.937,0.031,0,12296,12740
998064128,133077282816,49295360,707080192,0.031,0,99.969,0,0,1772,2236
999272448,133076070400,49295360,707084288,0.125,0.219,99.656,0,0,173642,14300
998993920,133076336640,49307648,707084288,0.031,0.031,99.906,0.031,0,67038,2016
998477824,133076852736,49307648,707084288,0,0,100,0,0,5910,2016
998477824,133076852736,49307648,707084288,0,0,100,0,0,692,0
998473728,133076856832,49307648,707084288,0.031,0,99.969,0,0,528,0
998461440,133076856832,49319936,707084288,0,0.031,99.938,0.031,0,692,0
998461440,133076856832,49319936,707084288,0,0.031,99.969,0,0,646,0
998449152,133076856832,49328128,707088384,0,0,99.938,0.062,0,346,0
998449152,133076856832,49328128,707088384,0,0,100,0,0,812,0
998191104,133077114880,49328128,707088384,0,0,100,0,0,1038,0
998174720,133077131264,49328128,707088384,0.031,0,99.969,0,0,1192,662
998174720,133077131264,49328128,707088384,0,0,100,0,0,692,0
998174720,133077131264,49328128,707088384,0.031,0,99.969,0,0,346,0
1008984064,133065863168,49336320,707534848,1.031,0.468,98.438,0.062,0,391058,16654
997511168,133077774336,49336320,707092480,0.125,0.156,99.718,0,0,4522,13916
997253120,133078032384,49336320,707092480,0,0.031,99.969,0,0,2170,1676
1012174848,133063102464,49336320,707100672,0.312,0.156,99.531,0,0,332354,12880
3369668608,130705059840,49336320,707588096,20.298,8.659,71.043,0,0,1651862,63868
6453116928,127620022272,49360896,709066752,33.658,13.778,51.966,0.598,0,1491740,62418
9444855808,124626841600,49389568,710385664,35.185,13.056,51.235,0.525,0,1484936,59878
12614721536,121455222784,49389568,712036352,34.674,12.753,52.541,0.031,0,1325904,57646
15948464128,118119755776,49389568,713617408,35.717,14.827,49.394,0.062,0,1325004,57136
18898280448,115168456704,49393664,715014144,35.499,12.589,51.818,0.093,0,1488490,82109
22080790528,111984496640,49422336,716275712,38.362,14.548,46.901,0.190,0,1507898,1059472
25013751808,109049806848,49446912,717856768,40.226,13.231,45.726,0.817,0,1369414,2064908
28145303552,105916911616,49451008,719048704,43.207,12.645,43.991,0.157,0,1406280,3891807
30397902848,103663513600,49451008,719802368,34.324,9.904,55.556,0.217,0,109414,4325911
30773252096,103288107008,49451008,719859712,12.818,2.048,84.823,0.310,0,94726,3849306
30964047872,103097262080,49459200,719900672,15.742,1.271,82.430,0.558,0,104278,4602040
31165353984,102895767552,49520640,720015360,17.341,1.183,79.701,1.775,0,127290,5568948
31368245248,102692610048,49565696,720228352,19.134,1.175,67.079,12.612,0,137396,5603778
31585771520,102474981376,49565696,720326656,21.404,1.988,76.266,0.342,0,136612,5542086
31727259648,102333415424,49565696,720404480,20,1.866,77.387,0.747,0,247880,5533846
31854391296,102206177280,49573888,720502784,20.431,2.187,76.632,0.750,0,142564,5280894
31977713664,102082752512,49573888,720605184,18.202,2.147,79.091,0.560,0,229094,4614446
32061501440,101998862336,49582080,720695296,18.802,1.822,78.882,0.494,0,114056,4440116
32140570624,101919690752,49582080,720797696,19.268,2.502,77.479,0.751,0,231260,4394270
32114618368,101945540608,49582080,720896000,11.297,1.548,86.630,0.526,0,121928,4174958
32063528960,101996535808,49590272,720982016,8.698,1.408,89.330,0.563,0,327724,3760700
31988355072,102071590912,49590272,721100800,6.974,1.183,91.376,0.467,0,217112,3567526
31941681152,102117945344,49623040,721383424,7.048,0.958,89.428,2.566,0,130436,3782870
31944556544,102114963456,49623040,721485824,9.094,1.732,87.256,1.918,0,93334,3862084
31948599296,102110842880,49623040,721563648,8.478,1.052,90.006,0.464,0,124888,4085492
31951716352,102107611136,49631232,721670144,7.561,0.806,91.044,0.589,0,94438,4031434
31949635584,102109589504,49631232,721772544,7.016,0.838,91.742,0.404,0,125638,4042882
31951794176,102107328512,49631232,721874944,6.864,1.154,91.451,0.530,0,91748,3652876
31949860864,102109151232,49651712,721965056,6.143,1.024,88.334,4.499,0,106168,3506226
31950516224,102108405760,49651712,722055168,6.357,0.904,92.396,0.343,0,101392,3716242
31959150592,102099648512,49659904,722161664,7.632,1.059,90.779,0.530,0,85760,3732192
31960948736,102097743872,49659904,722264064,5.172,0.946,93.504,0.378,0,90914,3652826
31960039424,102098571264,49659904,722345984,5.595,1.250,92.779,0.375,0,87080,3603466
31961616384,102096887808,49659904,722452480,4.906,0.938,92.844,1.312,0,87024,3433810
31966339072,102092066816,49659904,722550784,6.114,1.324,92.216,0.347,0,87734,3585934
31971168256,102087122944,49668096,722653184,6.719,1.312,91.406,0.562,0,114418,3679202
31971487744,102086717440,49668096,722739200,5.064,0.781,93.748,0.406,0,87764,3690396
31972605952,102085492736,49668096,722845696,6.822,1.364,91.411,0.403,0,112728,3350234
31981338624,102076678144,49668096,722927616,6.545,1.699,91.347,0.409,0,84194,3397498
31981662208,102076235776,49676288,723030016,5.494,0.853,92.264,1.389,0,116288,3618168
31983169536,102074605568,49684480,723132416,5.067,1.251,93.119,0.563,0,93626,3915108
31983947776,102073724928,49684480,723234816,6.236,1.216,91.924,0.624,0,120756,4040734
31986806784,102070767616,49684480,723333120,5.311,1.156,93.033,0.500,0,96024,4069518
31989596160,102067879936,49684480,723431424,5.750,0.938,93,0.312,0,95230,4114032
31990382592,102066860032,49684480,723660800,5.496,1.005,91.269,2.230,0,94688,3917018
31990235136,102066892800,49692672,723759104,5.448,0.996,93.182,0.374,0,139086,3818628
31994855424,102062166016,49692672,723865600,5.587,0.843,93.321,0.250,0,89864,3600334
31996997632,102059921408,49692672,723968000,5.003,1.470,92.839,0.688,0,88588,3704464
31998103552,102058729472,49692672,724049920,5.325,1.059,93.211,0.405,0,84284,3586914
31998205952,102058512384,49700864,724156416,6.273,1.124,91.573,1.030,0,117932,3535596
32000970752,102055632896,49709056,724258816,5.181,0.811,93.321,0.687,0,85604,3390662
32000733184,102055796736,49709056,724328448,5.321,0.782,93.584,0.313,0,112136,3402714
32000634880,102055768064,49709056,724455424,6.292,1.080,92.258,0.370,0,90498,3824146
32005464064,102050865152,49709056,724529152,5.890,1.472,92.356,0.282,0,121678,3944938
32005857280,102050353152,49709056,724643840,7.207,0.808,90.059,1.926,0,96238,4016174
32006397952,102049705984,49717248,724738048,4.994,1.280,93.165,0.562,0,91278,3767560
32009338880,102046670848,49717248,724828160,5.270,0.780,93.577,0.374,0,87282,3568992
32013135872,102042763264,49717248,724930560,5.568,1.038,92.702,0.692,0,85668,3435662
32017580032,102038228992,49717248,725020672,6.351,1.921,91.202,0.527,0,92224,3523530
32018894848,102036811776,49717248,725123072,9.253,1.407,88.965,0.375,0,369494,3678346
32020156416,102035435520,49733632,725209088,8.305,1.306,89.051,1.337,0,92914,4010264
32021377024,102034104320,49733632,725319680,7.141,1.278,91.113,0.468,0,95802,4035176
32023474176,102031888384,49733632,725426176,7.644,1.150,90.491,0.715,0,92450,3736296
32029253632,102026018816,49733632,725516288,7.475,0.754,91.363,0.408,0,92244,3706544
32029667328,102025375744,49733632,725745664,8.655,0.934,89.819,0.592,0,104246,3865134
32032358400,102022586368,49741824,725831680,7.850,1.153,88.380,2.617,0,112622,3892032
32033779712,102021050368,49741824,725946368,8.419,1.118,90.121,0.342,0,113332,3817948
32037109760,102017675264,49741824,726007808,6.885,0.717,91.651,0.748,0,104126,3636108
32036257792,102018408448,49741824,726126592,9.200,1.196,89.206,0.399,0,91904,3478564
32083062784,101971423232,49741824,726200320,8.442,0.807,90.286,0.466,0,100000,3444912
32120934400,101933424640,49750016,726319104,8.389,0.725,89.751,1.135,0,102262,3445700
32188358656,101865881600,49758208,726429696,11.980,1.024,86.468,0.528,0,127756,3488396
32258801664,101795368960,49758208,726495232,9.761,0.933,88.561,0.746,0,95094,3436386
32318152704,101735899136,49758208,726614016,10.626,1.060,87.753,0.561,0,122700,3365228
32387588096,101666365440,49758208,726712320,11.516,0.934,86.959,0.591,0,128170,3137254
32423976960,101629870080,49766400,726806528,9.966,0.654,87.699,1.682,0,134148,3269954
32490541056,101563207680,49782784,726888448,10.969,1.465,83.796,3.771,0,87886,3189470
32542564352,101511053312,49782784,727015424,8.847,0.997,89.533,0.623,0,118642,3093372
32596570112,101456945152,49782784,727117824,9.142,0.967,89.548,0.343,0,120666,3119620
32592859136,101460553728,49782784,727220224,5.359,1.097,92.918,0.627,0,94258,3241432
32581021696,101472296960,49782784,727314432,5.905,0.691,93.028,0.377,0,77418,3291324
32579047424,101474160640,49799168,727408640,6.846,0.625,91.685,0.844,0,77982,3205774
32571740160,101481385984,49799168,727490560,3.739,0.566,95.130,0.566,0,75810,3300152
32559235072,101493772288,49799168,727605248,5.689,0.719,93.029,0.563,0,87272,3562930
32553299968,101499482112,49799168,727826432,7.558,1.031,90.537,0.874,0,85882,3664022
32543895552,101508775936,49799168,727932928,4.833,0.842,93.920,0.405,0,87794,3712594
32544595968,101507969024,49807360,728027136,5.498,0.843,91.034,2.624,0,87030,3700082
32537620480,101514833920,49807360,728133632,4.413,0.970,94.178,0.438,0,91514,3737654
32537944064,101514399744,49807360,728240128,7.286,1.157,91.057,0.500,0,100036,3729136
32539574272,101512675328,49807360,728326144,4.873,0.937,93.627,0.562,0,88120,3727242
32540078080,101512065024,49807360,728428544,4.402,0.593,94.599,0.406,0,89502,3615614
32541749248,101510295552,49815552,728518656,5.014,1.135,92.494,1.356,0,81270,3494414
32542212096,101509709824,49823744,728625152,5.191,0.625,93.684,0.500,0,92384,3312688
32534392832,101517430784,49823744,728723456,5.154,0.974,93.369,0.503,0,77426,3289452
32535793664,101515931648,49823744,728821760,5.087,0.999,93.227,0.687,0,81072,3579454
32536395776,101515223040,49823744,728924160,4.510,0.783,93.862,0.846,0,92212,3730690
32537522176,101513994240,49831936,729006080,4.352,0.689,94.364,0.595,0,89130,3638522
32536395776,101514997760,49831936,729120768,5.521,1.154,92.982,0.343,0,88308,3649034
32537276416,101514031104,49831936,729206784,6.683,1.181,91.514,0.622,0,86616,3719968
32537899008,101513322496,49831936,729292800,3.670,0.690,94.950,0.690,0,92814,3804896
32539525120,101511573504,49831936,729411584,5.334,0.941,93.317,0.408,0,90884,3891080
32540819456,101510189056,49840128,729485312,4.236,0.722,93.944,1.098,0,90162,3819196
32540991488,101509898240,49840128,729600000,6.820,0.903,90.937,1.339,0,90698,3862158
32541921280,101508866048,49840128,729698304,5.602,0.778,93.246,0.373,0,90406,3830520
32542347264,101508354048,49840128,729784320,3.801,0.848,95.005,0.346,0,83574,3550220
32543043584,101507547136,49840128,729890816,4.401,0.880,94.058,0.660,0,84810,3557594
32543313920,101507186688,49848320,729964544,5.760,0.747,92.715,0.778,0,85944,3481254
32542179328,101508190208,49856512,730087424,5.694,0.755,92.576,0.975,0,114482,3433458
32543326208,101506932736,49856512,730198016,6.058,0.816,92.561,0.565,0,79024,3217816
32543641600,101506510848,49856512,730304512,5.231,1.238,93.191,0.340,0,111852,3431166
32543752192,101506289664,49856512,730411008,4.581,1.060,93.830,0.530,0,83574,3518696
32544526336,101505404928,49864704,730505216,4.873,0.812,93.533,0.781,0,118236,3459578
32546902016,101502922752,49864704,730607616,5.754,0.813,92.089,1.345,0,83760,3621402
32547483648,101502242816,49864704,730705920,6.262,0.713,92.498,0.527,0,116900,3559078
32547246080,101502308352,49864704,730877952,3.791,0.752,94.831,0.627,0,84556,3615422
32547291136,101502181376,49864704,730959872,5.824,1.090,92.650,0.436,0,84414,3499310
32547692544,101501661184,49872896,731070464,5.844,0.781,92.938,0.438,0,104828,3423304
32548704256,101500534784,49881088,731172864,5.987,0.846,91.881,1.285,0,87830,3385212
32549801984,101499338752,49881088,731271168,3.918,0.658,94.953,0.470,0,82654,3339680
32549371904,101499666432,49881088,731373568,3.856,0.690,95.141,0.313,0,81336,3403984
32549810176,101498994688,49881088,731602944,5.265,1.215,93.053,0.467,0,84824,3496096
32550199296,101498503168,49889280,731688960,4.442,0.970,93.932,0.657,0,89800,3488310
32550674432,101497892864,49889280,731824128,6.232,0.752,91.951,1.065,0,94198,3361316
32551759872,101496729600,49889280,731901952,4.265,0.909,93.634,1.192,0,90832,3769236
32552611840,101495758848,49889280,732016640,5.395,0.784,93.444,0.376,0,103980,3744858
32552824832,101495291904,49889280,732266496,4.658,0.875,93.842,0.625,0,101712,3733748
32552026112,101496016896,49897472,732332032,4.101,0.720,94.709,0.470,0,89534,3608806
32552747008,101495160832,49897472,732467200,5.281,0.597,93.084,1.037,0,88600,3631812
32553144320,101494681600,49905664,732532736,5.114,0.748,93.171,0.967,0,81684,3438376
32554561536,101493133312,49905664,732663808,6.679,1.217,91.542,0.562,0,83282,3499714
32554823680,101492756480,49905664,732766208,4.843,0.786,93.868,0.503,0,86598,3626974
32557432832,101490065408,49913856,732839936,4.333,0.748,94.077,0.842,0,147856,3611222
32559050752,101488324608,49913856,732954624,5.227,0.724,93.514,0.535,0,80648,3190598
32559263744,101488005120,49913856,733061120,5.311,0.906,91.753,2.031,0,134686,2944744
32560029696,101487132672,49913856,733163520,6.528,0.964,91.794,0.715,0,72976,2999012
32560336896,101486714880,49913856,733274112,4.839,0.744,93.983,0.434,0,139766,3103972
32560734208,101486227456,49922048,733351936,4.295,0.878,93.981,0.846,0,85316,3317330
32560955392,101485875200,49922048,733478912,4.844,0.818,93.960,0.377,0,142584,3359560
32563372032,101483368448,49926144,733560832,5.811,0.989,92.303,0.896,0,84824,3556110
32563658752,101482954752,49934336,733679616,5.099,0.751,93.150,1.001,0,86976,3723506
32563769344,101482758144,49934336,733765632,5.873,0.835,92.798,0.495,0,87782,3807528
32563662848,101482758144,49942528,733859840,4.656,0.969,93.500,0.875,0,90064,3615022
32564604928,101481693184,49942528,733982720,5.153,0.750,93.660,0.437,0,99192,3699882
32564895744,101481308160,49942528,734072832,4.071,0.720,93.768,1.441,0,112168,3445414
32567304192,101478789120,49942528,734183424,6.338,0.999,91.914,0.749,0,94664,3565502
32568352768,101477629952,49942528,734289920,5.291,0.716,93.246,0.747,0,174850,3842452
32570294272,101475598336,49950720,734371840,3.744,0.811,94.696,0.749,0,388328,3539336
32569393152,101476253696,49950720,734609408,5.772,0.690,92.942,0.596,0,338878,3422678
32568872960,101476663296,49950720,734720000,4.221,0.813,94.403,0.563,0,146018,3337094
32570699776,101474729984,49958912,734814208,6.687,0.747,91.446,1.120,0,110748,3319500
32570925056,101474402304,49958912,734916608,5.502,1.057,92.633,0.808,0,80780,3401234
32571641856,101473579008,49967104,735010816,5.473,0.653,92.973,0.902,0,96116,3581024
32572579840,101472526336,49967104,735121408,4.970,0.781,93.873,0.375,0,86204,3695280
32572002304,101472985088,49967104,735240192,4.950,1.121,93.524,0.405,0,87070,3683702
32574287872,101470613504,49967104,735322112,5.312,1,91.594,2.094,0,89520,3484440
32574586880,101470228480,49967104,735408128,4.731,0.989,93.723,0.557,0,86090,3279932
32577003520,101467705344,49975296,735506432,7.511,1.179,90.844,0.466,0,85056,3219920
32576860160,101467721728,49975296,735633408,3.824,0.909,94.922,0.345,0,86518,3171198
32577196032,101467291648,49975296,735727616,4.466,0.843,93.973,0.718,0,148140,3214302
32576835584,101467549696,49983488,735821824,5.396,1.185,91.765,1.653,0,305470,3144904
32580087808,101464186880,49983488,735932416,4.154,0.781,94.691,0.375,0,478262,3284488
32580591616,101463576576,49991680,736026624,6.675,0.873,91.921,0.530,0,486090,3381368
32581095424,101462966272,49991680,736129024,4.470,0.688,94.154,0.688,0,417048,3438420
32579809280,101464129536,49991680,736247808,4.623,0.962,94.012,0.403,0,264806,3779656
32580079616,101463773184,49991680,736333824,5.740,0.847,91.876,1.537,0,181384,3648316
32581083136,101462659072,49991680,736440320,5.981,0.961,91.478,1.580,0,170786,3557126
32584196096,101459447808,49999872,736526336,4.916,0.630,93.445,1.009,0,121256,3589772
32583651328,101459869696,49999872,736645120,4.870,0.718,94.037,0.375,0,101680,3513886
32585125888,101458288640,49999872,736751616,5.327,1.177,93.125,0.372,0,117776,3383378
32585183232,101458141184,49999872,736841728,4.695,1.221,93.427,0.657,0,90194,3653188
32585162752,101457903616,50008064,737075200,5.262,0.747,93.244,0.747,0,127290,3582852
32585359360,101457584128,50016256,737185792,4.915,0.689,93.832,0.564,0,152136,3589676
32585736192,101457113088,50016256,737280000,4.055,0.655,94.947,0.343,0,227434,3424636
32586051584,101456691200,50016256,737382400,6.168,1.190,91.954,0.689,0,209084,3686236
32587341824,101455302656,50016256,737472512,5.059,1.024,93.637,0.279,0,281088,3566990
32588382208,101454147584,50016256,737587200,4.720,1.000,92.716,1.563,0,180536,3799676
32588623872,101453824000,50024448,737660928,5.222,0.688,93.152,0.938,0,148074,4082314
32589180928,101453144064,50024448,737783808,3.333,0.629,95.818,0.220,0,120344,3805976
32588664832,101453561856,50024448,737882112,5.382,0.814,93.335,0.469,0,124268,3834390
32591896576,101450203136,50024448,737976320,5.112,1.029,93.173,0.686,0,105555,3776652
32592302080,101449658368,50032640,738095104,4.626,0.907,92.967,1.500,0,91688,3836594
32593096704,101448757248,50040832,738185216,4.981,1.121,93.524,0.374,0,90866,3689670
32592506880,101449236480,50040832,738291712,4.370,0.749,94.382,0.499,0,91196,3581912
32594055168,101447589888,50040832,738390016,5.248,0.880,93.306,0.566,0,86404,3652426
32593846272,101447688192,50040832,738496512,4.454,0.659,94.417,0.471,0,93734,3803682
32595087360,101446336512,50040832,738607104,5.092,0.900,92.518,1.490,0,94690,3692636
32595419136,101445918720,50049024,738684928,4.508,0.814,94.020,0.657,0,94418,3374246
32597213184,101443878912,50049024,738918400,4.817,0.813,93.963,0.407,0,83456,3456090
32597147648,101443821568,50049024,739041280,5.201,0.752,93.734,0.313,0,82942,3454226
32597950464,101442912256,50049024,739143680,3.884,1.119,94.189,0.808,0,82304,3535984
32597266432,101443497984,50049024,739241984,6.135,0.561,92.993,0.311,0,90432,3857310
32597741568,101442912256,50065408,739332096,4.374,0.937,93.565,1.125,0,87742,3726802
32599252992,101441298432,50065408,739430400,6.873,0.867,91.827,0.433,0,91214,3861330
32602832896,101437607936,50065408,739540992,3.927,0.817,94.565,0.691,0,94138,3818430
32601137152,101439188992,50065408,739651584,4.057,0.786,94.654,0.503,0,90274,3659838
32602357760,101437865984,50065408,739753984,6.242,1.342,92.010,0.406,0,84218,3516382
32602796032,101437317120,50073600,739856384,4.838,0.817,92.303,2.042,0,86154,3525130
32603840512,101436186624,50073600,739942400,5.663,0.657,93.054,0.626,0,83658,3451398
32603881472,101436030976,50073600,740052992,5.906,0.684,92.913,0.497,0,83724,3514708
32603897856,101435908096,50073600,740155392,5.268,0.627,93.446,0.659,0,79044,3279330
32605261824,101434458112,50073600,740241408,4.390,0.753,94.387,0.470,0,88512,3348942
32605958144,101433622528,50089984,740356096,5.585,0.905,90.889,2.621,0,88258,3547278
32606375936,101433106432,50089984,740450304,3.904,0.874,94.785,0.437,0,96946,3573750
32607395840,101431930880,50089984,740560896,5.112,0.935,93.204,0.748,0,87858,3692246
32607440896,101431652352,50089984,740655104,4.988,0.935,93.547,0.530,0,137246,3709244
32608792576,101430034432,50089984,740876288,5.552,1.179,92.866,0.403,0,110772,3890744
32609136640,101429563392,50098176,740990976,4.897,0.998,92.389,1.716,0,115352,3523828
32610430976,101428162560,50098176,741097472,6.917,0.993,91.005,1.086,0,84934,3464628
32611463168,101427032064,50098176,741187584,6.172,0.713,92.649,0.465,0,117576,3645744
32612732928,101425643520,50098176,741302272,4.302,0.810,94.420,0.468,0,99608,3708904
32614371328,101423886336,50106368,741400576,5,0.906,93.531,0.562,0,118852,3658396
32614596608,101423534080,50114560,741515264,5.098,0.995,92.788,1.119,0,100496,3744174
32616230912,101421789184,50114560,741617664,4.653,0.880,93.618,0.849,0,92192,3686556
32617390080,101420531712,50114560,741711872,5.625,1.088,92.666,0.622,0,90366,3783198
32616189952,101421637632,50114560,741801984,3.698,0.595,95.268,0.439,0,93586,3771830
32617099264,101420630016,50114560,741900288,6.712,1.088,91.579,0.622,0,84540,3494622
32617291776,101420314624,50122752,742010880,3.554,0.842,94.763,0.842,0,79902,3168460
32618213376,101419274240,50122752,742125568,5.715,0.750,91.786,1.749,0,75168,3243572
32618180608,101419208704,50122752,742215680,5.369,0.754,93.532,0.345,0,85212,3489560
32618684416,101418598400,50122752,742322176,5.206,0.717,93.454,0.623,0,84976,3543740
32623276032,101413920768,50122752,742408192,5.034,0.657,93.558,0.750,0,86046,3589028
32622567424,101414502400,50130944,742518784,4.011,0.658,94.829,0.501,0,88202,3520470
32624668672,101412302848,50130944,742617088,5.446,0.657,92.520,1.377,0,86708,3476256
32625299456,101411561472,50139136,742719488,5.076,0.810,93.616,0.498,0,85528,3573514
28696944640,105339174912,50147328,742834176,5.573,1.096,92.893,0.438,0,88000,3503664
25554206720,108482732032,50147328,742014976,3.914,1.158,94.521,0.407,0,77144,2802666
22493130752,111544709120,50159616,741138432,2.924,0.503,95.567,1.006,0,60382,2388296
18389151744,115649318912,50159616,740548608,3.648,0.755,94.560,1.038,0,61044,2134854
15228010496,118811549696,50159616,739500032,2.351,0.564,96.583,0.502,0,57260,1952072
12064251904,121976410112,50171904,738435072,3.654,0.500,95.409,0.437,0,63338,1693688
8934752256,125106806784,50171904,737579008,2.032,0.594,97.249,0.125,0,33550,1165452
5071716352,128970735616,50184192,736714752,1.247,0.655,97.848,0.249,0,25472,838028
1859637248,132183691264,50184192,735846400,0.594,0.313,98.905,0.188,0,21032,425454
1047490560,132996763648,50184192,734961664,0.125,0.063,99.593,0.219,0,19786,130648
1037565952,133007163392,50184192,734519296,0.031,0.031,99.938,0,0,4382,216
1037283328,133007437824,50192384,734519296,0,0.031,99.938,0.031,0,5860,0
1037283328,133007437824,50192384,734519296,0,0,100,0,0,28718,0
1037021184,133007687680,50204672,734519296,0,0,99.844,0.156,0,994,1508
1036763136,133007945728,50204672,734519296,0.031,0,99.969,0,0,2698,0
1036812288,133007863808,50204672,734519296,0,0,100,0,0,2766,0
1036812288,133007863808,50204672,734519296,0.031,0,99.969,0,0,32890,264
1036288000,133008388096,50204672,734519296,0,0.031,99.969,0,0,3376,0
1036288000,133008388096,50204672,734519296,0,0,100,0,0,31988,0
1036021760,133008646144,50212864,734519296,0,0,99.969,0.031,0,4008,0
1035505664,133009162240,50212864,734519296,0,0,100,0,0,12496,0
1035247616,133009420288,50212864,734519296,0.031,0.031,99.938,0,0,18746,2016
1035247616,133009420288,50212864,734519296,0,0,100,0,0,34466,0
1034215424,133010452480,50212864,734519296,0,0,100,0,0,4622,1008
1034215424,133010452480,50212864,734519296,0,0,100,0,0,2094,0
1034207232,133010452480,50221056,734519296,0,0.031,99.906,0.062,0,858,0
1034207232,133010452480,50221056,734519296,0.031,0,99.969,0,0,3556,0
1033691136,133010968576,50221056,734519296,0,0,100,0,0,25500,0
1033691136,133010968576,50221056,734519296,0.031,0.031,99.937,0,0,49296,132
1032400896,133012258816,50221056,734519296,0.031,0.031,99.937,0,0,126526,1008
1031360512,133013299200,50221056,734519296,0.063,0.031,99.906,0,0,131470,2016
1030574080,133014073344,50229248,734523392,0.094,0,99.844,0.063,0,111572,2016
1030316032,133014331392,50229248,734523392,0.063,0,99.937,0,0,102612,5404
1029832704,133014810624,50229248,734527488,0,0.031,99.969,0,0,14674,4700
1029832704,133014810624,50229248,734527488,0,0.031,99.375,0.594,0,33058,1008
1029574656,133015068672,50229248,734527488,0,0,100,0,0,3924,0
1029308416,133015326720,50237440,734527488,0,0,99.938,0.062,0,3148,0
1029050368,133015584768,50237440,734527488,0.031,0,99.969,0,0,12018,0
1028792320,133015842816,50237440,734527488,0,0.031,99.969,0,0,2518,0
1028534272,133016100864,50237440,734527488,0,0,100,0,0,30738,0
1028272128,133016358912,50241536,734527488,0,0.031,99.969,0,0,3500,662
1028014080,133016616960,50241536,734527488,0,0,100,0,0,28806,0
1027489792,133017133056,50249728,734527488,0,0,99.938,0.062,0,3904,0
1027231744,133017391104,50249728,734527488,0.031,0,99.969,0,0,8614,0
1027231744,133017391104,50249728,734527488,0,0,100,0,0,3700,0
1026973696,133017649152,50249728,734527488,0,0,99.906,0.094,0,32050,84
1026973696,133017649152,50249728,734527488,0,0,100,0,0,4098,396
1026813952,133017808896,50249728,734527488,0.031,0.031,99.938,0,0,25378,624
1026805760,133017808896,50257920,734527488,0,0,99.938,0.062,0,4494,234
1026805760,133017808896,50257920,734527488,0,0,100,0,0,12834,936
1026547712,133018066944,50257920,734527488,0,0,100,0,0,39660,390
1026547712,133018066944,50257920,734527488,0.031,0,99.969,0,0,11862,890
1026547712,133018066944,50257920,734527488,0,0.031,99.969,0,0,68470,1234
1026805760,133017808896,50257920,734527488,0,0,100,0,0,10972,610
1041002496,133002518528,50266112,734982144,0.968,0.281,98.720,0.031,0,481142,22922
1041756160,133000732672,50266112,734646272,0.469,0.594,98.937,0,0,196380,37724
