"Dstat 0.7.3 CSV output"
"Author:","Dag Wieers <dag@wieers.com>",,,,"URL:","http://dag.wieers.com/home-made/dstat/"
"Host:","grisou-6.nancy.grid5000.fr",,,,"User:","root"
"Cmdline:","dstat -m -c -n -o dstat.csv",,,,"Date:","27 May 2020 10:57:51 CEST"
"memory usage",,,,"total cpu usage",,,,,"net/total",
"used","free","buff","cach","usr","sys","idl","wai","stl","recv","send"
1028526080,132792156160,58777600,918880256,2.059,0.447,97.274,0.220,0,0,0
1046523904,132773695488,58777600,919334912,0.625,0.469,98.907,0,0,391486,16880
1028382720,132792283136,58777600,918888448,0.250,0.250,99.500,0,0,17564,14028
1045508096,132774703104,58777600,919339008,0.626,0.344,99.030,0,0,391562,12772
1026768896,132793876480,58789888,918892544,0.281,0.281,97.687,1.751,0,8906,13408
1041240064,132778954752,58789888,919339008,0.594,0.187,99.219,0,0,391798,11268
1027358720,132793274368,58798080,918892544,0.562,0.406,99.001,0.031,0,5908,17408
1026818048,132793815040,58798080,918892544,0,0,100,0,0,10672,872
1026768896,132793864192,58798080,918892544,0,0,100,0,0,11906,0
1026711552,132793909248,58810368,918892544,0,0,99.937,0.063,0,11474,496
1026711552,132793909248,58810368,918892544,0,0,100,0,0,17364,0
1026703360,132793917440,58810368,918892544,0,0,100,0,0,15818,0
1026621440,132793995264,58814464,918892544,0,0,99.969,0.031,0,13898,0
1026105344,132794511360,58814464,918892544,0,0,100,0,0,33270,0
1026105344,132794511360,58814464,918892544,0,0,100,0,0,50656,0
1026105344,132794511360,58814464,918892544,0,0,100,0,0,34644,0
1026105344,132794511360,58814464,918892544,0,0,100,0,0,19158,0
1026105344,132794511360,58814464,918892544,0,0,100,0,0,19850,0
1025826816,132794785792,58818560,918892544,0.031,0,99.906,0.063,0,9930,0
1044791296,132775366656,58818560,919339008,0.844,0.469,98.688,0,0,405214,17416
1028194304,132792410112,58818560,918892544,0.250,0.188,99.562,0,0,5438,13244
1030340608,132790050816,58818560,919105536,0.375,0.281,99.344,0,0,171382,10956
1040764928,132779368448,58818560,919359488,0.531,0.156,99.312,0,0,407780,16060
1027440640,132793139200,58818560,918913024,0.469,0.562,98.969,0,0,14668,15556
1027158016,132793413632,58826752,918913024,0,0,99.969,0.031,0,27264,0
1025777664,132794773504,58839040,918917120,1.124,0.562,98.251,0.062,0,422124,26016
1026056192,132794494976,58839040,918917120,0,0,100,0,0,73364,0
1025617920,132794482688,58839040,919363584,1.185,0.624,98.191,0,0,436478,25072
1025134592,132795412480,58839040,918917120,0,0,100,0,0,13784,1296
1025019904,132795527168,58839040,918917120,0,0.031,99.969,0,0,4730,0
1069633536,132750753792,58859520,919056384,1.531,0.219,97.157,1.093,0,224640,9280
1026191360,132794277888,58859520,918925312,0.156,0.031,99.812,0,0,10540,2252
1026506752,132793962496,58859520,918925312,0,0.031,99.969,0,0,4368,2736
1026228224,132794241024,58859520,918925312,0,0,100,0,0,1658,0
1027592192,132792991744,58859520,918810624,0.407,0.156,99.437,0,0,348106,14816
1035755520,132784513024,58884096,919097344,0.250,0.125,99.500,0.125,0,182850,21656
1035767808,132784488448,58884096,919109632,0,0.031,99.969,0,0,16068,13328
1035763712,132784492544,58884096,919109632,0,0.031,99.969,0,0,16462,13132
1035247616,132785008640,58884096,919109632,0,0.031,99.969,0,0,36636,12838
1034989568,132785266688,58884096,919109632,0,0.031,99.969,0,0,12886,13132
1034973184,132785283072,58884096,919109632,0,0.031,99.969,0,0,34786,18424
1034702848,132785541120,58896384,919109632,0.031,0,99.875,0.094,0,15742,13748
1034436608,132785807360,58896384,919109632,0,0.062,99.938,0,0,16764,13132
1034436608,132785807360,58896384,919109632,0,0,100,0,0,16346,13328
1034436608,132785807360,58896384,919109632,0,0,100,0,0,26208,13352
1026764800,132793548800,58896384,919035904,0,0,100,0,0,1712,2692
1025884160,132794540032,58896384,918925312,0.219,0.125,99.656,0,0,174012,16364
1024618496,132795793408,58904576,918929408,0,0,99.938,0.062,0,5942,1508
1024602112,132795809792,58904576,918929408,0.031,0,99.969,0,0,15690,0
1024086016,132796325888,58904576,918929408,0,0,100,0,0,5250,0
1024086016,132796325888,58904576,918929408,0,0,100,0,0,17316,0
1024086016,132796325888,58916864,918917120,0,0,99.969,0.031,0,7454,0
1024065536,132796325888,58920960,918933504,0,0,99.969,0.031,0,2046,0
1023807488,132796583936,58920960,918933504,0,0,100,0,0,13840,662
1023549440,132796841984,58920960,918933504,0,0,100,0,0,14856,1000
1023291392,132797100032,58920960,918933504,0,0,100,0,0,5384,0
1023291392,132797100032,58920960,918933504,0.062,0,99.938,0,0,52440,0
1022951424,132797440000,58920960,918933504,0,0.031,99.969,0,0,586,0
1031905280,132788482048,58925056,918933504,0.219,0.063,99.656,0.063,0,404668,14568
1021448192,132798935040,58925056,918933504,0.781,0.500,98.718,0,0,8498,16200
1021108224,132799275008,58925056,918933504,0,0,100,0,0,4812,0
1021100032,132799283200,58925056,918933504,0,0,99.406,0.594,0,4392,0
1021091840,132799291392,58925056,918933504,0,0,100,0,0,21272,0
1021091840,132799291392,58925056,918933504,0,0,100,0,0,346,0
1020555264,132799807488,58945536,918933504,0,0,99.906,0.094,0,13264,252
1020555264,132799807488,58945536,918933504,0,0,100,0,0,13984,0
1020555264,132799807488,58945536,918933504,0,0,100,0,0,9414,0
1020555264,132799807488,58945536,918933504,0,0,100,0,0,4334,220
1020583936,132799778816,58945536,918933504,0,0.031,99.812,0.156,0,14330,0
1020030976,132800331776,58945536,918933504,0,0,100,0,0,13642,496
1019772928,132800589824,58945536,918933504,0,0,100,0,0,6646,0
1019772928,132800589824,58945536,918933504,0,0,100,0,0,990,0
1019772928,132800589824,58945536,918933504,0,0,100,0,0,1912,0
1019756544,132800606208,58945536,918933504,0,0,100,0,0,1504,0
1019490304,132800864256,58953728,918933504,0,0,99.969,0.031,0,1444,0
1019490304,132800864256,58953728,918933504,0,0,100,0,0,956,0
1019490304,132800864256,58953728,918933504,0,0,100,0,0,692,0
1019490304,132800864256,58953728,918933504,0,0,100,0,0,528,0
1019490304,132800864256,58953728,918933504,0,0,100,0,0,1444,0
1018974208,132801380352,58953728,918933504,0,0,100,0,0,1444,0
2598461440,131221397504,58966016,918835200,14.041,5.398,80.468,0.094,0,1657918,67306
5543337984,128273547264,58970112,920702976,32.717,12.567,54.560,0.157,0,1322560,54610
8585691136,125229625344,58978304,922071040,33.073,13.179,53.279,0.468,0,1324466,57917
11748593664,122064969728,58986496,923721728,34.823,14.463,50.652,0.062,0,1488624,61456
14752505856,119059509248,58990592,925188096,33.531,13.831,52.544,0.094,0,1486564,59634
17829261312,115981217792,59011072,926519296,38.086,12.213,49.229,0.472,0,1324940,56390
21070561280,112738603008,59027456,927764480,36.798,13.764,49.313,0.125,0,1410368,6470192
24202092544,109605478400,59035648,929292288,41.287,12.904,44.835,0.973,0,1624946,18739376
27223609344,106582593536,59043840,930521088,44.420,13.186,42.207,0.187,0,1776206,27144099
29976109056,103828746240,59056128,931807232,37.929,11.759,49.938,0.374,0,1423826,42820850
30768967680,103035793408,59076608,931868672,22.486,3.467,73.766,0.281,0,943656,53213844
30956691456,102848016384,59076608,931921920,17.094,1.312,81.219,0.375,0,1125102,62162381
31134822400,102669811712,59076608,931983360,18.048,2.127,77.354,2.471,0,1329898,74654706
31345307648,102459236352,59076608,932073472,23.808,1.870,64.007,10.315,0,1581718,87785605
31557238784,102247227392,59076608,932147200,21.467,2.140,75.889,0.504,0,1945296,104848336
31768600576,102035632128,59076608,932380672,26.009,2.297,71.136,0.559,0,2030996,118908576
31907659776,101896441856,59076608,932511744,22.683,2.715,74.072,0.530,0,2151776,116998324
32031240192,101772775424,59076608,932597760,22.645,2.308,74.517,0.530,0,2107652,115492900
32168919040,101634969600,59084800,932708352,24.495,3.015,71.682,0.808,0,2207092,120052074
32295890944,101507887104,59084800,932814848,20.683,2.883,75.776,0.658,0,2175660,117262662
32331845632,101471805440,59088896,932933632,18.633,2.653,77.809,0.905,0,2201168,119706152
32291405824,101512110080,59088896,933060608,10.592,1.254,87.715,0.439,0,2009278,109163968
32288665600,101514764288,59088896,933146624,10.268,1.742,87.586,0.404,0,2041000,111592926
32293666816,101509640192,59088896,933265408,11.215,1.957,86.176,0.652,0,1968086,113750420
32270077952,101533130752,59088896,933363712,13.569,2.431,81.938,2.062,0,2095786,117341718
32275808256,101527289856,59092992,933470208,9.185,1.505,88.809,0.502,0,2238806,122720796
32292851712,101510111232,59092992,933605376,9.250,1.781,88.562,0.406,0,2053918,117839964
32274235392,101528621056,59092992,933707776,8.024,1.030,90.478,0.468,0,2182904,119292576
32280756224,101521993728,59092992,933814272,9.392,1.240,89.058,0.310,0,2182586,120966384
32276598784,101526028288,59097088,933928960,11.408,1.430,81.753,5.409,0,2079592,112634550
32286658560,101515845632,59101184,934043648,7.127,1.135,91.328,0.410,0,2190434,119096784
32286449664,101515943936,59101184,934150144,8.015,1.212,90.028,0.746,0,2161984,116549246
32287911936,101514371072,59101184,934260736,7.358,1.002,91.234,0.407,0,2066706,112183882
32295514112,101506658304,59101184,934371328,7.683,1.442,90.310,0.564,0,2239210,123355370
32297136128,101504925696,59101184,934477824,9.131,1.820,88.453,0.596,0,2191238,118583824
32295022592,101506924544,59117568,934576128,7.462,1.062,90.884,0.593,0,2198158,119464126
32299085824,101502734336,59117568,934699008,8.297,1.315,89.919,0.470,0,2282336,123590152
32301387776,101500170240,59117568,934957056,7.013,1.069,91.509,0.409,0,2231762,122763114
32301428736,101500030976,59117568,935055360,6.686,1.104,91.801,0.410,0,2180978,116699286
32305696768,101495529472,59117568,935288832,7.127,1.350,90.267,1.256,0,2075590,111468144
32316870656,101484220416,59125760,935411712,9.309,2.428,87.578,0.685,0,2111604,114067396
32320200704,101480792064,59125760,935505920,6.804,1.092,91.667,0.437,0,2161544,119284934
32319336448,101481517056,59125760,935641088,7.998,1.085,90.577,0.341,0,2209166,119809678
32326107136,101474627584,59125760,935755776,8.210,1.137,90.275,0.379,0,2287744,124439620
32326352896,101474144256,59125760,935993344,7.076,1.247,91.303,0.374,0,2288644,124188660
32331427840,101468950528,59129856,936108032,7.265,1.739,89.537,1.459,0,2071202,113077362
32340336640,101459947520,59129856,936202240,6.872,1.368,91.387,0.373,0,2205578,118223764
32344121344,101456048128,59129856,936316928,7.163,0.782,91.617,0.438,0,2222128,118035362
32348856320,101451206656,59129856,936423424,8.833,0.936,89.794,0.437,0,1983998,115505114
32356225024,101443694592,59129856,936644608,7.248,1.468,90.847,0.437,0,2092602,113764194
32357777408,101441998848,59138048,936775680,6.316,0.996,91.381,1.307,0,2119184,112613848
32357347328,101442285568,59138048,936910848,5.930,0.874,92.853,0.343,0,2143166,116066268
32375521280,101424017408,59138048,937000960,6.225,1.314,92.118,0.344,0,2134034,114994628
32380510208,101418926080,59138048,937103360,6.853,1.320,91.449,0.377,0,2251190,122554588
32383651840,101415669760,59138048,937213952,6.107,0.971,92.546,0.376,0,2130564,116702136
32389144576,101410054144,59146240,937324544,6.803,1.034,91.599,0.564,0,2190702,121508160
32397283328,101401792512,59146240,937447424,9.371,2.004,88.009,0.617,0,2187260,118720580
32396935168,101402030080,59146240,937558016,6.345,1.052,92.293,0.310,0,2157120,118869910
32395526144,101403205632,59146240,937791488,6.453,1.060,91.926,0.561,0,2164900,119041802
32409288704,101389312000,59146240,937914368,5.853,1.164,92.574,0.409,0,2173246,122110366
32411492352,101386985472,59150336,938029056,8.255,1.340,90,0.405,0,2199512,120983930
32428769280,101369597952,59158528,938127360,9.969,2.601,86.006,1.424,0,2137800,114866068
32447471616,101350789120,59158528,938233856,10.471,1.673,87.454,0.403,0,2298800,125286760
32462471168,101335523328,59158528,938500096,8.773,1.686,89.104,0.437,0,2192864,119951666
32468852736,101329068032,59158528,938573824,8.396,1.824,89.403,0.377,0,2157192,116385550
32470806528,101326987264,59162624,938696704,10.466,1.204,87.836,0.494,0,2108324,115042222
32472260608,101325434880,59162624,938790912,8.245,1.312,88.976,1.468,0,2142628,115630550
32473878528,101323681792,59162624,938913792,8.312,1.656,89.625,0.406,0,2413844,114676254
32473186304,101324255232,59162624,939028480,9.633,1.475,88.484,0.408,0,2235760,120007314
32484261888,101312917504,59162624,939286528,8.313,1.650,89.695,0.342,0,2031194,112776058
32507547648,101289140224,59166720,939769856,8.788,1.433,88.906,0.873,0,2210588,121992848
32543752192,101252812800,59166720,939888640,9.991,1.037,87.496,1.477,0,2148920,117452216
32585150464,101211291648,59174912,940003328,10.344,1.889,87.395,0.372,0,2151868,117194482
32625516544,101170806784,59174912,940118016,9.962,1.222,88.471,0.345,0,2151788,117902484
32669528064,101126676480,59174912,940232704,10.512,1.302,87.814,0.372,0,2237984,122278050
32733507584,101062467584,59183104,940453888,11.856,1.366,86.282,0.497,0,2081672,112973028
32804798464,100991049728,59183104,940576768,11.432,1.429,86.518,0.621,0,2149484,115041406
32853438464,100942299136,59183104,940687360,10.951,1.255,86.131,1.663,0,2149894,118826168
32898252800,100897378304,59183104,940793856,8.924,1.182,89.614,0.280,0,2254388,120943308
32934998016,100860522496,59183104,940904448,9.187,1.273,89.230,0.310,0,2222692,121196214
32943194112,100852195328,59191296,941023232,7.230,1.278,90.901,0.592,0,2124944,115878490
32921427968,100873707520,59191296,941273088,5.626,0.790,93.236,0.348,0,2110624,113540492
32927432704,100867592192,59199488,941375488,5.363,1.559,91.862,1.216,0,2155112,118502618
32932728832,100862193664,59199488,941477888,5.439,0.817,93.367,0.377,0,2156400,118122600
32939642880,100855156736,59199488,941600768,5.910,1.157,92.589,0.344,0,2124706,115669466
32942747648,100851945472,59207680,941699072,7.043,1.028,91.617,0.312,0,2131206,118290220
32942014464,100852572160,59207680,941805568,5.649,0.968,93.071,0.312,0,2203186,120771228
32942460928,100851859456,59207680,942063616,5.157,1.038,92.516,1.289,0,2124252,115636504
32941195264,100853026816,59207680,942161920,5.879,0.938,92.871,0.313,0,2173096,118938376
32942157824,100851929088,59207680,942292992,5.322,0.814,93.488,0.376,0,2184114,118979796
32938188800,100855783424,59215872,942399488,5.770,0.967,92.670,0.593,0,2047230,111329698
32940675072,100853198848,59215872,942497792,4.864,1.161,93.568,0.408,0,2149728,116368074
32940535808,100853096448,59215872,942739456,4.870,1.037,92.711,1.382,0,2066726,113643114
32948756480,100844744704,59224064,942854144,5.810,1.319,92.368,0.503,0,2166022,118179846
32949862400,100843540480,59224064,942948352,7.012,1.334,90.909,0.745,0,2157856,118113400
32949276672,100843999232,59232256,943067136,4.729,1.065,93.674,0.532,0,2006302,110814696
32949211136,100843921408,59232256,943202304,6.429,1.248,91.854,0.468,0,2200282,120908198
32951078912,100841971712,59232256,943284224,6.122,1.181,92.076,0.622,0,2235580,120694322
32949190656,100843610112,59232256,943521792,6.368,0.963,88.381,4.287,0,2019144,110605866
32954335232,100838326272,59232256,943656960,5.196,0.845,93.552,0.407,0,2110618,114150944
32961544192,100831002624,59240448,943759360,6.107,1.190,92.045,0.658,0,2235904,122627758
32954208256,100838232064,59240448,943861760,5.507,0.782,93.210,0.501,0,2162264,117386514
32954822656,100837502976,59240448,943976448,6.834,0.878,91.912,0.376,0,2173436,119630450
32955600896,100836601856,59248640,944087040,6.489,1.034,90.188,2.288,0,2221366,121382822
32955727872,100836077568,59248640,944476160,7.704,1.341,90.549,0.405,0,2077674,116461506
32955551744,100836134912,59256832,944586752,9.088,1.405,88.882,0.625,0,2311142,127285724
32962232320,100829360128,59256832,944680960,7.205,1.211,91.180,0.404,0,2182986,118992180
32961597440,100829880320,59256832,944791552,6.186,0.968,92.159,0.687,0,2289250,124504864
32962408448,100828942336,59265024,944910336,5.657,0.911,89.818,3.614,0,2262474,119949800
32964202496,100826910720,59265024,945147904,5.399,1.004,93.189,0.408,0,2574720,121181452
32968507392,100822482944,59269120,945262592,6.429,1.561,91.573,0.437,0,2267882,116631544
32969756672,100821110784,59269120,945381376,6.228,0.944,92.450,0.377,0,2129060,111801718
32969789440,100820971520,59269120,945487872,5.285,1.126,93.058,0.532,0,2261982,122405778
32977063936,100813574144,59277312,945594368,5.665,1.158,91.299,1.878,0,2248862,119634278
32976166912,100814327808,59277312,945737728,4.786,0.787,94.049,0.378,0,2256254,119506960
32977358848,100812898304,59285504,945958912,6.099,1.063,92.399,0.438,0,2285324,119963316
32977719296,100812394496,59285504,946094080,5.613,1.135,92.904,0.347,0,2263540,118563256
32978436096,100811554816,59285504,946212864,6.558,1.312,91.755,0.375,0,2354098,123286392
32981385216,100808519680,59289600,946294784,8.713,1.062,89.631,0.593,0,2272396,118720266
32982417408,100807331840,59289600,946446336,5.301,1.066,88.112,5.521,0,2351358,123129436
32983814144,100805832704,59297792,946540544,7.498,1.187,90.878,0.437,0,2192928,119304586
32983502848,100806004736,59297792,946679808,8.496,1.227,89.805,0.472,0,2305194,122399954
32986042368,100803375104,59297792,946765824,10.025,1.339,88.200,0.436,0,2205398,119704268
32988352512,100800917504,59297792,946909184,8.503,1.282,89.809,0.406,0,2213208,119024014
32990597120,100798558208,59305984,947011584,12.238,1.387,85.851,0.524,0,2100900,115581606
32990482432,100798550016,59310080,947126272,8.159,0.997,90.346,0.498,0,2171498,118313140
32991965184,100796944384,59310080,947245056,7.869,0.995,90.793,0.342,0,2184606,119675034
32992079872,100796702720,59310080,947367936,5.592,0.968,93.065,0.375,0,2091100,114968424
32994177024,100794511360,59310080,947462144,4.404,1.195,94.086,0.315,0,2224652,121206724
32995753984,100792807424,59310080,947585024,5.873,1.068,91.175,1.884,0,2218422,121051550
32995811328,100792619008,59326464,947691520,7.426,1.154,90.858,0.562,0,2189896,116483108
32995274752,100793032704,59326464,947810304,4.911,0.876,93.807,0.407,0,1974394,108602894
32996446208,100791750656,59326464,947920896,5.124,0.880,93.618,0.377,0,2293358,118185044
32998232064,100789829632,59326464,948056064,5.624,0.790,93.270,0.316,0,2138026,117520692
32998404096,100789563392,59326464,948150272,5.368,1.436,91.948,1.248,0,2280476,117990992
33000116224,100787732480,59334656,948260864,4.714,1.351,93.369,0.566,0,2275000,123748894
32997515264,100790210560,59334656,948383744,5.587,1.155,92.915,0.343,0,2258632,115526150
32999272448,100788199424,59334656,948637696,5.083,0.904,93.701,0.312,0,2230648,112873974
33001836544,100785537024,59334656,948727808,5.668,0.903,92.962,0.467,0,2285734,123559412
33002315776,100784922624,59334656,948858880,4.925,1.223,93.413,0.439,0,2197392,119545384
33002422272,100784676864,59351040,948977664,4.192,0.945,94.170,0.693,0,2183844,115234018
33002668032,100784336896,59351040,949071872,5.473,1.150,93.035,0.342,0,2185534,116017670
33003896832,100782960640,59351040,949211136,6.355,1.028,92.212,0.405,0,2173792,115453686
33006112768,100780621824,59351040,949334016,6.361,1.123,92.173,0.343,0,2183934,116373952
33005285376,100781350912,59351040,949424128,5.502,0.781,92.998,0.719,0,2220248,117973932
33006059520,100780441600,59359232,949547008,5.348,1.132,90.815,2.705,0,2309746,121086782
33007169536,100779208704,59359232,949665792,3.511,0.972,95.047,0.470,0,2238872,117938352
33006243840,100779999232,59359232,949800960,3.960,0.786,94.940,0.314,0,2175810,113607360
33006039040,100780101632,59359232,949903360,4.061,0.781,94.783,0.375,0,2177544,117655024
33005600768,100780404736,59367424,950022144,5.009,1.197,93.321,0.473,0,2277832,120871892
33007104000,100778782720,59375616,950132736,5.948,1.370,91.155,1.526,0,2315928,125163702
33007767552,100778033152,59375616,950218752,5.564,1.006,93.021,0.409,0,2306824,121362150
33008553984,100777132032,59375616,950329344,5.119,0.999,93.508,0.375,0,2132322,117913876
33009549312,100775993344,59375616,950468608,4.374,1.156,94.158,0.312,0,2177318,118315732
33008078848,100777357312,59375616,950575104,4.247,0.843,94.597,0.312,0,2133828,116827000
33008988160,100776300544,59392000,950706176,3.713,0.975,93.549,1.762,0,2135932,117803316
33009586176,100775571456,59392000,950837248,4.845,1.219,93.592,0.344,0,2098316,113370094
33010536448,100774535168,59392000,950915072,3.974,1.095,94.618,0.313,0,2138504,117356922
33012686848,100772233216,59392000,951058432,6.379,1.251,91.807,0.563,0,2155176,116690498
33013653504,100771041280,59392000,951275520,5.312,1.344,92.969,0.375,0,2147972,118676300
33012920320,100771635200,59400192,951406592,4.724,0.819,93.323,1.134,0,2286434,125159304
33013714944,100770717696,59408384,951517184,4.125,0.724,94.490,0.661,0,2196224,120836578
33012285440,100772036608,59408384,951627776,4.296,1.027,94.396,0.280,0,2181210,121167580
33013157888,100771033088,59408384,951758848,4.098,0.876,94.683,0.344,0,2198518,119104804
33013624832,100770451456,59408384,951865344,5.585,1.498,92.512,0.406,0,2221534,119603762
33013649408,100770283520,59416576,951992320,3.914,0.877,94.521,0.689,0,2180178,117774598
33011781632,100772036608,59424768,952098816,5.531,0.906,93.188,0.375,0,2155870,118026768
33013911552,100769796096,59424768,952201216,5.890,1.347,92.419,0.345,0,2221774,121446812
33014009856,100769558528,59424768,952340480,5.580,1.372,92.737,0.312,0,2235580,122483758
33014091776,100769353728,59424768,952459264,5.822,1.027,92.839,0.311,0,2184452,116322702
33015422976,100767928320,59432960,952545280,4.772,0.848,93.846,0.534,0,2182378,119488094
33017323520,100765896704,59432960,952672256,3.961,1.029,93.762,1.248,0,2274908,125381086
33015734272,100767350784,59441152,952795136,4.311,0.843,94.470,0.375,0,2163044,119222760
33015644160,100767322112,59441152,952913920,5.027,0.874,93.693,0.406,0,2134938,117170062
33016438784,100766425088,59441152,953016320,5.459,1.154,93.013,0.374,0,2089852,114891318
33017720832,100765028352,59449344,953118720,4.784,0.782,94.028,0.407,0,2103140,114715104
33018503168,100764131328,59449344,953233408,4.510,0.689,92.515,2.286,0,2048278,110137354
33019232256,100763262976,59449344,953372672,4.822,1.009,93.823,0.347,0,2122934,115023096
33020764160,100761624576,59449344,953475072,4.483,0.878,94.201,0.439,0,2143604,116585410
33019801600,100762329088,59449344,953724928,5.016,1.223,93.417,0.345,0,2128998,118873366
33018966016,100763037696,59457536,953839616,4.217,0.656,94.595,0.531,0,2050666,111841738
33017651200,100764205056,59465728,953974784,3.602,0.877,94.801,0.720,0,2175452,118200234
33019654144,100762120192,59465728,954064896,4.701,0.877,94.046,0.376,0,2075064,110029610
33019322368,100762345472,59465728,954171392,4.078,0.878,94.668,0.376,0,2109740,113659980
33019379712,100762148864,59465728,954310656,5.464,1.025,93.108,0.404,0,2062278,112341518
33018761216,100762652672,59473920,954408960,4.386,0.877,94.330,0.407,0,2105726,116202502
33018277888,100763013120,59473920,954531840,5.731,1.115,92.751,0.403,0,2010260,109008824
33017516032,100763664384,59473920,954638336,4.870,1.155,92.132,1.842,0,2178266,116948696
33020846080,100760195072,59482112,954769408,5.311,0.937,93.221,0.531,0,2106336,113819806
33023119360,100757798912,59482112,954892288,4.705,1.286,93.632,0.376,0,2245974,119433452
33022607360,100758077440,59486208,955121664,3.941,1.095,94.464,0.500,0,2173746,118103954
33021087744,100759470080,59486208,955228160,5.788,1.189,92.741,0.282,0,2133314,114371138
33022529536,100757913600,59486208,955334656,4.500,0.875,93.156,1.469,0,2251288,122013538
33023922176,100756398080,59486208,955457536,4.864,1.341,93.452,0.343,0,2194498,115232626
33025220608,100754960384,59494400,955588608,3.778,0.945,94.616,0.661,0,2169854,113172224
33024802816,100755267584,59502592,955691008,4.781,0.938,93.625,0.656,0,2200770,117376602
33026871296,100752969728,59502592,955916288,3.610,0.760,95.377,0.253,0,2195354,117532680
33026736128,100752949248,59502592,956067840,4.303,1.005,92.996,1.696,0,2261878,123127830
33028345856,100751245312,59502592,956162048,6.332,0.842,92.452,0.374,0,2048654,112335034
33028448256,100751020032,59510784,956268544,4.175,0.879,94.319,0.628,0,2156930,119121850
33027317760,100752007168,59518976,956399616,3.951,0.941,94.669,0.439,0,2130606,114174760
33026711552,100752494592,59518976,956518400,4.079,0.941,94.572,0.408,0,2085346,110525400
33028517888,100750577664,59518976,956620800,5.184,0.880,93.214,0.723,0,2139832,115868804
33028861952,100750131200,59518976,956719104,4.565,1.032,93.433,0.969,0,2141096,114430006
33028169728,100750692352,59518976,956850176,3.966,0.843,94.722,0.468,0,2105258,113300854
33027723264,100751036416,59527168,956944384,4.585,0.754,94.190,0.471,0,2217680,116929988
33030467584,100748156928,59527168,957079552,5.807,1.249,92.538,0.406,0,2134972,113476100
33032994816,100745502720,59527168,957206528,3.547,0.596,95.512,0.345,0,2143586,111793312
33032318976,100746088448,59535360,957284352,3.641,0.879,91.777,3.704,0,1953516,106242824
33031720960,100746551296,59535360,957411328,3.809,0.818,95.027,0.346,0,2032062,111687452
33029275648,100748861440,59543552,957538304,4.026,1.070,94.338,0.566,0,2058440,112737546
33030545408,100747476992,59543552,957648896,4.508,0.908,94.051,0.532,0,2239926,121222546
33032564736,100745355264,59543552,957747200,5.119,1.005,93.593,0.283,0,2215098,119755176
33033494528,100744261632,59551744,957898752,5.238,0.910,92.597,1.255,0,2181480,117723394
33035239424,100742402048,59551744,958009344,4.148,0.817,94.752,0.283,0,2248666,124216988
33033900032,100743626752,59559936,958115840,3.472,0.821,95.013,0.694,0,2161574,118975528
33034481664,100742942720,59559936,958210048,4.547,0.965,94.207,0.280,0,2129966,114844862
33035313152,100741832704,59559936,958488576,5.045,1.090,93.553,0.311,0,2194530,118535714
33036361728,100740689920,59568128,958570496,5.176,1.123,93.358,0.343,0,2133186,112876922
33034862592,100742053888,59568128,958705664,3.325,0.784,94.103,1.788,0,2036670,109702286
33036144640,100740657152,59576320,958812160,4.790,0.877,93.895,0.438,0,2032718,110730774
33036394496,100740288512,59576320,958930944,4.554,1.123,93.918,0.405,0,2107524,114249044
33036967936,100739600384,59576320,959045632,5.211,1.310,93.011,0.468,0,2125850,115392870
33036476416,100739969024,59576320,959156224,4.314,0.938,94.373,0.375,0,2102078,114098978
33037041664,100739272704,59584512,959279104,3.932,0.975,85.058,10.035,0,2140218,113882186
30467383296,103308795904,59592704,959397888,4.977,1.158,93.459,0.407,0,2279368,119907010
26737082368,107039461376,59592704,959033344,3.830,0.879,94.976,0.314,0,1930788,106383838
23536644096,110240681984,59592704,958251008,4.692,0.813,94.245,0.250,0,1611670,87501584
20369072128,113409478656,59592704,957026304,2.727,0.690,96.332,0.251,0,1398400,79446406
17174704128,116604661760,59592704,956211200,2.070,0.596,96.110,1.223,0,1219256,64871180
13107978240,120672219136,59609088,955363328,1.792,0.377,97.296,0.535,0,1000128,55108278
9909252096,123871780864,59609088,954527744,2.108,0.440,97.263,0.189,0,740332,43189698
6619820032,127162294272,59609088,953446400,0.878,0.282,98.652,0.188,0,464110,29546438
3466452992,130316533760,59609088,952573952,0.970,0.375,98.436,0.219,0,282338,15428276
1095495680,132688367616,59609088,951693312,0.250,0.094,99.562,0.094,0,65862,3550930
1069555712,132714962944,59617280,951029760,0.063,0.031,99.468,0.438,0,48116,0
1069191168,132715327488,59617280,951029760,0,0.031,99.969,0,0,39736,0
1069174784,132715335680,59625472,951029760,0,0,99.937,0.063,0,85420,1288
1068916736,132715593728,59625472,951029760,0,0,100,0,0,48284,168
1068142592,132716367872,59625472,951029760,0,0,100,0,0,55454,0
1067626496,132716883968,59625472,951029760,0,0,100,0,0,48064,0
1067356160,132717142016,59637760,951029760,0,0,99.875,0.125,0,88942,0
1067356160,132717142016,59637760,951029760,0,0.031,99.969,0,0,95514,0
1067339776,132717158400,59637760,951029760,0,0,100,0,0,69310,0
1067339776,132717158400,59637760,951029760,0,0,100,0,0,48410,0
1067081728,132717416448,59637760,951029760,0,0,100,0,0,16002,0
1066565632,132717932544,59637760,951029760,0,0,100,0,0,24082,2380
1066033152,132718456832,59645952,951029760,0,0,99.969,0.031,0,42600,1508
1066033152,132718456832,59645952,951029760,0,0,100,0,0,102668,0
1066033152,132718456832,59645952,951029760,0,0,100,0,0,210658,0
1065775104,132718714880,59645952,951029760,0,0,100,0,0,29528,0
1065517056,132718972928,59645952,951029760,0,0,100,0,0,78166,0
1065259008,132719230976,59645952,951029760,0,0,100,0,0,19020,0
1065250816,132719230976,59654144,951029760,0.031,0,99.937,0.031,0,73486,0
1064992768,132719489024,59654144,951029760,0,0,100,0,0,24612,0
1064476672,132720005120,59654144,951029760,0.031,0,99.969,0,0,84218,0
1064476672,132720005120,59654144,951029760,0,0,100,0,0,17766,0
1064476672,132720005120,59654144,951029760,0,0,100,0,0,2774,652
1063960576,132720521216,59654144,951029760,0,0,100,0,0,12928,0
1063952384,132720521216,59662336,951029760,0,0,99.969,0.031,0,40504,0
1084432384,132699217920,59662336,951296000,1.373,0.406,98.221,0,0,461485,22256
1065254912,132717129728,59662336,951042048,0.219,0.219,98.812,0.750,0,155680,28802
