"Dstat 0.7.3 CSV output"
"Author:","Dag Wieers <dag@wieers.com>",,,,"URL:","http://dag.wieers.com/home-made/dstat/"
"Host:","grisou-33.nancy.grid5000.fr",,,,"User:","root"
"Cmdline:","dstat -m -c -n -o dstat.csv",,,,"Date:","27 May 2020 10:57:51 CEST"
"memory usage",,,,"total cpu usage",,,,,"net/total",
"used","free","buff","cach","usr","sys","idl","wai","stl","recv","send"
1216258048,132325154816,58638336,1197506560,1.377,0.148,98.418,0.057,0,0,0
1228324864,132312645632,58650624,1197961216,0.749,0.156,99.064,0.031,0,390732,14986
1216360448,132325056512,58650624,1197514752,0.407,0.532,98.655,0.407,0,19492,16236
1237258240,132303695872,58662912,1197961216,0.781,0.406,98.781,0.031,0,393278,12910
1219686400,132321714176,58662912,1197514752,0.250,0.281,99.469,0,0,9510,13628
1233842176,132307296256,58662912,1197772800,0.563,0.156,99.280,0,0,391426,11274
1224753152,132316442624,58675200,1197703168,0.469,0.500,98.969,0.062,0,6336,16142
1224359936,132317024256,58675200,1197514752,0,0,99.781,0.219,0,5988,0
1224368128,132317016064,58675200,1197514752,0,0.031,98.688,1.281,0,10994,0
1223688192,132317696000,58687488,1197502464,0,0,99.969,0.031,0,8154,0
1223393280,132317978624,58687488,1197514752,0,0,100,0,0,21146,0
1223135232,132318236672,58687488,1197514752,0,0,100,0,0,18822,168
1223081984,132318281728,58695680,1197514752,0,0.031,99.906,0.062,0,10116,0
1223081984,132318281728,58695680,1197514752,0,0,100,0,0,19852,0
1222787072,132318576640,58695680,1197514752,0,0,100,0,0,46170,496
1222213632,132319150080,58695680,1197514752,0.406,0,99.594,0,0,52162,0
1222213632,132319150080,58695680,1197514752,0,0,100,0,0,23150,0
1221697536,132319666176,58695680,1197514752,0,0,100,0,0,17386,0
1221636096,132319719424,58703872,1197514752,0,0,99.969,0.031,0,14356,0
1237540864,132303364096,58703872,1197961216,0.687,0.250,99.063,0,0,399356,15078
1221521408,132319830016,58703872,1197514752,0.500,0.531,98.969,0,0,9760,15428
1223958528,132317167616,58703872,1197723648,0.313,0.250,99.437,0,0,180248,15790
1232064512,132309254144,58720256,1197514752,0.125,0.125,99.719,0.031,0,402634,14736
1219420160,132321861632,58720256,1197547520,0.999,0.624,98.377,0,0,19110,16346
1218863104,132322394112,58744832,1197547520,0,0,99.906,0.094,0,14016,0
1223516160,132317728768,58744832,1197551616,1.125,0.656,98.218,0,0,413828,26538
1223241728,132318003200,58744832,1197551616,0,0,100,0,0,73838,0
1228152832,132313280512,58744832,1197363200,1.063,0.657,98.280,0,0,444604,26554
1224892416,132316344320,58744832,1197551616,0,0,100,0,0,23062,0
1224859648,132316377088,58744832,1197551616,0,0,99.469,0.531,0,10044,0
1224118272,132316950528,58769408,1197694976,1.963,0.312,97.508,0.218,0,225398,10816
1223544832,132317614080,58769408,1197551616,0.031,0,99.969,0,0,5912,2784
1223286784,132317872128,58769408,1197551616,0,0,100,0,0,6980,0
1223278592,132317880320,58769408,1197551616,0,0,100,0,0,2148,0
1220849664,132320268288,58769408,1197555712,0.375,0.188,99.437,0,0,343468,15020
1229684736,132311187456,58793984,1197744128,0.250,0.063,99.219,0.469,0,186228,20426
1229410304,132311461888,58793984,1197744128,0,0.031,99.969,0,0,15906,13328
1229152256,132311719936,58793984,1197744128,0,0.031,99.969,0,0,16220,13230
1229152256,132311719936,58793984,1197744128,0,0.031,99.969,0,0,13532,13132
1229144064,132311728128,58793984,1197744128,0.031,0,99.969,0,0,37122,13328
1228877824,132311986176,58814464,1197731840,0,0.031,99.343,0.625,0,19490,20572
1228341248,132312502272,58814464,1197752320,0,0.031,99.969,0,0,31404,13580
1228083200,132312760320,58814464,1197752320,0,0,100,0,0,16012,13156
1227034624,132313808896,58814464,1197752320,0.031,0,99.969,0,0,16916,13132
1226518528,132314324992,58814464,1197752320,0.031,0.031,99.938,0,0,26034,13230
1219031040,132321984512,58826752,1197568000,0,0.063,99.750,0.188,0,2736,3216
1218187264,132322717696,58826752,1197678592,0.281,0.063,99.656,0,0,172546,14252
1217732608,132323282944,58826752,1197568000,0,0,100,0,0,6860,180
1217208320,132323807232,58826752,1197568000,0,0,100,0,0,15404,0
1217208320,132323807232,58826752,1197568000,0,0,100,0,0,5536,0
1217187840,132323807232,58847232,1197568000,0,0,99.531,0.469,0,3642,0
1216897024,132324089856,58851328,1197572096,0,0,99.875,0.125,0,21876,1008
1216888832,132324098048,58851328,1197572096,0,0,100,0,0,1638,0
1223708672,132317020160,58851328,1197830144,0.250,0.125,99.625,0,0,397912,14368
1218174976,132322807808,58851328,1197572096,0.657,0.689,98.654,0,0,10998,16722
1217884160,132323098624,58851328,1197572096,0,0,100,0,0,13462,0
1242845184,132297883648,58867712,1197805568,0.500,0.281,98.906,0.313,0,373572,13404
1370275840,132170424320,58867712,1197883392,3.118,0.187,96.695,0,0,11716,696
1372037120,132169445376,58867712,1197133824,0,0,100,0,0,12614,0
1371480064,132169990144,58880000,1197133824,0,0.031,99.937,0.031,0,10572,336
1371480064,132169990144,58880000,1197133824,0.031,0,99.969,0,0,3836,0
1370439680,132171022336,58888192,1197133824,0,0,99.781,0.219,0,4632,0
1440317440,132101132288,58892288,1197142016,2.910,0.282,96.746,0.063,0,14790,1508
1479016448,132062433280,58892288,1197142016,3.317,0,96.683,0,0,7866,0
1517572096,132023877632,58892288,1197142016,3.253,0.031,96.716,0,0,346,0
1573900288,131967549440,58892288,1197142016,3.163,0,96.837,0,0,20630,0
1630621696,131910828032,58900480,1197133824,3.192,0.031,96.745,0.031,0,13984,0
1664274432,131877167104,58908672,1197133824,3.161,0,96.651,0.188,0,3806,0
1692299264,131849134080,58908672,1197142016,3.128,0,96.872,0,0,2258,0
1740394496,131801038848,58908672,1197142016,3.161,0,96.839,0,0,20630,0
1793798144,131747635200,58908672,1197142016,3.191,0.031,96.777,0,0,13638,0
1844637696,131696787456,58916864,1197142016,3.130,0,96.808,0.063,0,992,0
1872703488,131668717568,58925056,1197137920,3.162,0,96.306,0.532,0,2940,1680
1905909760,131635503104,58925056,1197146112,3.253,0.031,96.716,0,0,3928,1680
1962151936,131579260928,58925056,1197146112,3.223,0,96.777,0,0,4048,2176
2004639744,131536760832,58925056,1197150208,3.414,0.063,96.524,0,0,4246,1680
2007302144,131534090240,58933248,1197150208,3.130,0,96.839,0.031,0,3150,2100
2023702528,131517591552,58941440,1197154304,7.303,0.094,92.322,0.281,0,5221868,87918
2064261120,131476951040,58941440,1197154304,10.980,0.310,88.710,0,0,16900426,484338
2084073472,131457093632,58941440,1197158400,10.942,0.435,88.623,0,0,28961844,829466
2119626752,131421499392,58941440,1197158400,8.798,0.689,90.513,0,0,43290444,1231698
2121125888,131419930624,58949632,1197162496,9.476,0.374,90.087,0.062,0,61496548,1669394
2235625472,131305422848,58957824,1197162496,9.761,1.927,87.939,0.373,0,67141396,1855936
2237812736,131303231488,58957824,1197166592,10.579,0.622,88.799,0,0,74016390,1997504
2307731456,131233308672,58957824,1197170688,10.719,1.625,87.656,0,0,88051070,2337638
2312404992,131228635136,58957824,1197170688,10.908,0.868,88.224,0,0,100444070,2597410
2380365824,131160657920,58966016,1197178880,10.765,1.867,87.306,0.062,0,112205074,2867838
2442129408,131098882048,58974208,1197182976,11.571,1.617,86.221,0.591,0,114223790,2962896
2446336000,131094630400,58974208,1197187072,11.031,0.906,88.062,0,0,121242832,3257064
2448527360,131092439040,58974208,1197187072,11.277,0.652,88.071,0,0,117991082,3075898
2479280128,131061641216,58974208,1197195264,12.291,1.490,86.220,0,0,119772792,3224114
2487504896,131053412352,58982400,1197191168,11.170,0.811,87.988,0.031,0,114798482,3173868
2487533568,131053367296,58990592,1197199360,11.270,0.872,87.453,0.405,0,116603028,3236442
2490556416,131050340352,58990592,1197203456,12.582,0.970,86.448,0,0,118487400,3354410
2493341696,131047550976,58990592,1197207552,11.021,0.656,88.323,0,0,111300488,3255654
2493255680,131047632896,58990592,1197211648,11.897,0.654,87.449,0,0,115852506,3235804
2721542144,130819338240,58998784,1197211648,12.422,1.030,86.454,0.094,0,110092496,3245614
3028504576,130512363520,59006976,1197215744,12.663,1.462,85.563,0.311,0,115767700,3345904
3182542848,130358321152,59006976,1197219840,11.007,1.657,87.336,0,0,114895634,3359511
3251441664,130289418240,59006976,1197223936,10.951,0.970,88.079,0,0,115958468,3352330
3710631936,129830227968,59006976,1197223936,10.584,1.093,88.323,0,0,112993320,3363982
3710881792,129829961728,59015168,1197232128,11.523,0.934,87.512,0.031,0,116008110,3480416
3716374528,129824456704,59023360,1197236224,11.369,0.660,87.657,0.314,0,115755110,3447734
3966889984,129573933056,59023360,1197244416,11.167,0.905,87.929,0,0,118417394,3570159
4177129472,129363693568,59023360,1197244416,11.716,0.804,87.481,0,0,110971344,3419698
4181336064,129359482880,59023360,1197248512,10.780,0.932,88.288,0,0,112936278,3483258
4180975616,129359831040,59031552,1197252608,10.969,1.250,87.656,0.125,0,110433970,3434108
4190482432,129350320128,59031552,1197256704,11.570,1.220,87.211,0,0,112519080,3529252
4192083968,129348706304,59039744,1197260800,11.658,0.935,86.970,0.436,0,116238646,3556676
4201037824,129339748352,59039744,1197264896,11.299,0.814,87.887,0,0,114081724,3619032
4512165888,129028616192,59039744,1197268992,10.757,0.938,88.305,0,0,111399374,3471122
4755828736,128784941056,59047936,1197273088,11.469,1.156,87.281,0.094,0,113308422,3584729
4755345408,128785420288,59047936,1197277184,10.896,0.749,88.355,0,0,118246420,3716705
4757700608,128783052800,59056128,1197281280,11.421,1.241,86.778,0.559,0,116261944,3681164
4769079296,128771670016,59056128,1197285376,11.948,1.556,86.497,0,0,113854716,3674310
4773011456,128767733760,59056128,1197289472,11.471,0.717,87.812,0,0,114074914,3667373
4772667392,128768028672,59064320,1197293568,10.758,0.842,88.369,0.031,0,122414910,3828120
4773814272,128766873600,59064320,1197301760,11.653,0.594,87.754,0,0,111964238,3704848
4776108032,128764571648,59072512,1197301760,11.111,0.811,87.703,0.375,0,115263796,3788028
4827648000,128713027584,59072512,1197305856,11.673,1.061,87.235,0.031,0,118809324,3830067
4779474944,128761327616,59072512,1197301760,10.916,0.847,88.237,0,0,121146322,3906578
4780298240,128760496128,59080704,1197301760,11.884,0.905,87.149,0.062,0,116092538,3761084
4779384832,128761401344,59080704,1197309952,11.318,0.808,87.842,0.031,0,113227414,3735881
4779745280,128761028608,59088896,1197314048,12.031,0.875,86.375,0.719,0,117598720,3793634
4780756992,128760008704,59088896,1197322240,11.069,0.969,87.961,0,0,114628970,3769476
4780068864,128760696832,59088896,1197322240,11.921,1.158,86.921,0,0,117640618,3839930
4781596672,128759164928,59092992,1197322240,12.325,0.809,86.835,0.031,0,115268140,3844084
4784488448,128756260864,59097088,1197330432,11.709,0.783,87.477,0.031,0,118375514,3840934
4787253248,128753479680,59105280,1197334528,11.357,0.996,87.243,0.404,0,110753856,3833494
4787408896,128753319936,59105280,1197338624,11.337,0.908,87.754,0,0,116630040,4003136
4787851264,128752877568,59105280,1197338624,11.733,1.314,86.952,0,0,117557508,3979468
4789223424,128751489024,59113472,1197346816,13.485,0.872,85.643,0,0,119521958,4015020
4789641216,128751067136,59113472,1197350912,12.310,0.933,86.727,0.031,0,113855236,3905476
4791906304,128748789760,59121664,1197355008,11.840,0.812,87.067,0.281,0,115238706,4045766
4790185984,128750505984,59121664,1197359104,12.562,0.812,86.625,0,0,110809008,3901563
4795748352,128744939520,59121664,1197363200,13.612,1.342,85.045,0,0,110856364,3892902
4795568128,128745074688,59121664,1197367296,13.306,0.873,85.821,0,0,116855392,4039751
5160689664,128379936768,59129856,1197375488,11.682,1.378,86.878,0.063,0,115092652,3997702
5213155328,128327446528,59138048,1197375488,11.142,1.377,87.230,0.250,0,117900542,4014407
5942661120,127597936640,59138048,1197379584,10.359,2.078,87.563,0,0,115874500,4028818
6027345920,127513247744,59138048,1197383680,10.844,2.026,87.130,0,0,116729030,4043402
6064447488,127476142080,59138048,1197387776,12.457,1.127,86.416,0,0,115295810,4068446
6116593664,127423983616,59146240,1197391872,11.073,1.244,87.621,0.062,0,118937186,4060494
6171660288,127368900608,59154432,1197400064,10.842,1.414,87.398,0.346,0,112769948,4020643
6227001344,127313559552,59154432,1197400064,11.222,1.313,87.434,0.031,0,114764494,4097506
6488465408,127052091392,59154432,1197404160,11.966,2.057,85.977,0,0,118015242,4146418
7224164352,126316388352,59154432,1197408256,10.807,1.366,87.826,0,0,121274970,4226830
7273361408,126267179008,59162624,1197412352,11.225,0.842,87.870,0.062,0,115626703,4195016
7429492736,126111043584,59170816,1197408256,11.306,2.756,85.813,0.125,0,121762540,4207162
7431102464,126109413376,59170816,1197428736,10.880,0.746,88.188,0.187,0,116777064,4268598
7498514432,126042001408,59170816,1197428736,10.889,1.658,87.453,0,0,116549912,4174636
7500795904,126039715840,59170816,1197432832,11.880,0.967,87.153,0,0,114994656,4181642
7500075008,126040424448,59179008,1197436928,10.786,0.779,88.373,0.062,0,113575216,4141087
7500333056,126040162304,59179008,1197441024,11.589,0.748,87.664,0,0,113541904,4119161
7502151680,126038327296,59187200,1197449216,10.264,0.902,88.336,0.498,0,108247780,4100760
7501115392,126039347200,59187200,1197449216,11.689,0.877,87.433,0,0,122220216,4466196
7519678464,126020780032,59187200,1197453312,13.110,0.814,86.076,0,0,114846366,4314688
7510687744,126029758464,59195392,1197457408,11.432,0.911,87.563,0.094,0,117241168,4275838
7521034240,126019407872,59195392,1197461504,11.083,0.999,87.918,0,0,117310764,4291866
7520231424,126020194304,59203584,1197469696,10.238,0.939,88.478,0.344,0,115404200,4362446
7520948224,126019477504,59203584,1197469696,11.101,0.847,88.053,0,0,111290762,4236716
7520022528,126020399104,59203584,1197473792,10.920,0.939,88.141,0,0,115504564,4284736
7521382400,126019026944,59211776,1197477888,11.575,1.286,87.077,0.063,0,113549828,4302476
7520538624,126019866624,59211776,1197481984,11.011,0.624,88.366,0,0,106877726,4201216
7521947648,126018441216,59219968,1197490176,12.031,1.062,86.562,0.344,0,111104266,4278528
7520264192,126020120576,59219968,1197494272,10.945,0.873,88.182,0,0,111718142,4331538
7558381568,125981999104,59219968,1197498368,15.293,0.905,83.801,0,0,114337330,4314126
7597236224,125943132160,59228160,1197502464,18.968,1.555,79.384,0.093,0,111038682,4291350
7597637632,125942730752,59228160,1197502464,10.837,0.625,88.538,0,0,111481930,4280562
7598977024,125941374976,59236352,1197510656,11.258,0.723,87.547,0.472,0,113554206,4302050
7600738304,125939609600,59236352,1197514752,11.531,0.812,87.656,0,0,112160634,4315496
7600832512,125939511296,59236352,1197518848,11.811,0.841,87.348,0,0,112193140,4349827
7570452480,125969879040,59244544,1197522944,11.690,0.810,87.438,0.062,0,116293034,4485984
7571120128,125969207296,59244544,1197527040,12.027,0.968,87.004,0,0,116726940,4484213
7572762624,125967548416,59252736,1197535232,12.741,0.963,85.923,0.373,0,116297530,4409880
7573524480,125966782464,59252736,1197539328,12.160,0.969,86.871,0,0,124123594,4662998
7573983232,125966323712,59252736,1197539328,12.457,0.944,86.600,0,0,116522456,4513704
7572709376,125967585280,59260928,1197543424,11.452,0.939,87.547,0.063,0,117008760,4444086
7571226624,125969063936,59260928,1197547520,12.422,0.936,86.642,0,0,114729636,4405662
7572824064,125967450112,59269120,1197555712,12.782,1.065,85.714,0.439,0,116695246,4446688
7571587072,125968683008,59269120,1197559808,12.422,1.280,86.298,0,0,116244838,4463052
7574781952,125965484032,59269120,1197563904,12.130,1.278,86.592,0,0,107531038,4357958
7576371200,125963886592,59277312,1197563904,13.674,0.992,85.271,0.062,0,120720988,4559325
7576174592,125964075008,59277312,1197568000,12.141,0.905,86.954,0,0,111164394,4443028
7621160960,125919072256,59285504,1197576192,11.571,1.474,86.767,0.188,0,113976088,4470037
7669833728,125870395392,59285504,1197580288,12.118,0.818,87.063,0,0,112750828,4473248
7747100672,125793124352,59285504,1197584384,13.209,1.682,85.109,0,0,113479656,4449551
7797960704,125742252032,59293696,1197588480,13.275,1.910,84.753,0.063,0,119883068,4574592
8355008512,125185196032,59293696,1197596672,12.308,2.224,85.468,0,0,115631138,4482198
8367153152,125173047296,59301888,1197592576,12.366,1.259,86.029,0.346,0,117104774,4374388
8370032640,125170159616,59301888,1197600768,12.844,1.344,85.812,0,0,117654490,4538830
8369061888,125171126272,59301888,1197604864,12.742,0.843,86.415,0,0,118068936,4422370
8370122752,125170012160,59310080,1197608960,12.731,1.063,86.143,0.063,0,118535038,4445606
8369111040,125171015680,59310080,1197617152,12.371,1.000,86.629,0,0,111370236,4321850
8389627904,125150494720,59310080,1197621248,12.117,0.999,86.883,0,0,111895016,4379076
8470106112,125070000128,59318272,1197629440,12.176,1.686,85.732,0.406,0,115569152,4233452
8518430720,125021675520,59318272,1197629440,11.170,1.694,87.135,0,0,113849374,4482244
8549580800,124990509056,59326464,1197637632,11.627,1.137,87.172,0.063,0,112933556,4422544
8594432000,124945649664,59326464,1197645824,11.408,1.446,87.146,0,0,119800560,4562718
8646156288,124893921280,59326464,1197649920,11.873,1.410,86.717,0,0,117568948,4514590
8694775808,124845273088,59351040,1197654016,11.928,1.495,85.861,0.716,0,118476698,4525206
8775237632,124764807168,59351040,1197658112,12.231,1.966,85.803,0,0,116623012,4538532
8830140416,124709888000,59359232,1197666304,13.161,1.867,84.910,0.062,0,120327428,4617875
8880635904,124659392512,59359232,1197666304,12.012,1.778,86.209,0,0,113710512,4454952
8933076992,124606947328,59359232,1197670400,12.492,1.655,85.853,0,0,114295244,4474132
8941924352,124598087680,59367424,1197674496,12.301,1.619,85.612,0.467,0,113388866,4449978
8950984704,124589023232,59367424,1197678592,12.687,0.933,86.381,0,0,116632134,4521575
9010069504,124529922048,59375616,1197686784,12.917,1.422,85.600,0.062,0,116534692,4503607
9077325824,124462665728,59375616,1197686784,12.015,0.820,87.165,0,0,113564176,4406782
9145679872,124394307584,59375616,1197690880,12.328,1.342,86.330,0,0,114480494,4449702
9206206464,124333768704,59383808,1197694976,11.746,1.099,87.123,0.031,0,109351290,4310305
9244405760,124295565312,59383808,1197699072,12.161,1.310,86.529,0,0,111284618,4355680
9277071360,124262883328,59392000,1197707264,12.017,1.308,86.644,0.031,0,109239058,4407094
9369198592,124170752000,59392000,1197711360,12.601,2.676,84.661,0.062,0,118918464,4544166
9433919488,124106027008,59392000,1197715456,12.135,1.098,86.767,0,0,113888020,4423088
9492598784,124047347712,59392000,1197715456,12.453,1.494,85.928,0.125,0,114357632,4512490
9552015360,123987922944,59392000,1197723648,12.259,1.649,86.092,0,0,115399722,4341738
9611255808,123928666112,59400192,1197727744,12.629,0.935,86.280,0.156,0,117747180,4528900
9677811712,123862106112,59400192,1197731840,11.985,1.384,86.631,0,0,121359754,4563750
9743966208,123795947520,59400192,1197735936,12.158,1.803,86.007,0.031,0,115646360,4507856
9803829248,123736072192,59408384,1197740032,12.085,2.004,85.441,0.470,0,117195998,4234718
9873543168,123666354176,59408384,1197744128,12.062,1.469,86.469,0,0,123921232,4963754
9940250624,123599634432,59416576,1197748224,12.035,1.563,86.246,0.156,0,122768816,4659358
10000359424,123539521536,59416576,1197752320,11.717,1.222,87.061,0,0,115468370,4487954
10034262016,123505614848,59416576,1197756416,12.065,1.150,86.785,0,0,113983014,4434318
10079821824,123460001792,59424768,1197760512,12.732,1.394,85.409,0.465,0,118737938,4552370
10144706560,123395112960,59424768,1197764608,12.578,1.090,86.333,0,0,112345496,4463236
10217668608,123322134528,59432960,1197768704,12.398,1.346,86.224,0.031,0,121027698,4518284
10284773376,123255025664,59432960,1197772800,11.779,2.256,85.965,0,0,117674108,4556794
10351628288,123188166656,59432960,1197776896,11.499,1.131,87.370,0,0,110346546,4372140
10388697088,123150843904,59441152,1198022656,10.394,1.096,88.478,0.031,0,114873578,4450766
10457968640,123081809920,59441152,1197785088,11.582,1.475,86.943,0,0,111983638,4311016
10519797760,123019968512,59449344,1197789184,11.860,1.623,86.454,0.062,0,114173122,4372067
10587963392,122951798784,59449344,1197793280,11.465,1.008,87.528,0,0,109929758,4316330
10625118208,122914639872,59449344,1197797376,11.994,1.246,86.760,0,0,112312174,4417578
10694262784,122845446144,59449344,1197805568,12.867,1.187,85.946,0,0,115167348,4443460
10748936192,122790768640,59449344,1197809664,12.351,1.907,85.616,0.125,0,120167360,4382206
10817646592,122722045952,59457536,1197813760,12.114,1.748,86.044,0.094,0,114098340,4428658
10851028992,122688659456,59457536,1197817856,11.329,1.650,87.021,0,0,121917346,4582242
10921123840,122618564608,59457536,1197817856,12.289,1.372,86.338,0,0,113260372,4379524
10994749440,122544930816,59457536,1197826048,11.936,1.723,86.341,0,0,114165328,4434974
11030618112,122509049856,59465728,1197830144,11.655,1.589,86.257,0.499,0,111840250,4388210
11101261824,122438402048,59473920,1197826048,12.394,1.127,86.448,0.031,0,111962468,4417996
11176378368,122363269120,59473920,1197842432,12.698,1.774,85.528,0,0,115175334,4456978
11207598080,122332045312,59473920,1197846528,10.865,1.280,87.855,0,0,115091546,4442938
11286327296,122253307904,59473920,1197854720,12.653,1.973,85.374,0,0,118885338,4571066
11367632896,122171994112,59482112,1197854720,15.842,1.152,82.944,0.062,0,114816174,4511986
11403919360,122135654400,59490304,1197858816,15.873,1.052,83.014,0.062,0,120319386,4556118
11468161024,122071408640,59490304,1197862912,13.959,1.486,84.556,0,0,116363616,4485840
11544375296,121995186176,59490304,1197871104,12.547,1.650,85.803,0,0,118578900,4542694
11581100032,121958457344,59490304,1197875200,11.160,1.153,87.687,0,0,113869966,4397960
11655626752,121883926528,59490304,1197879296,12.578,1.001,86.421,0,0,116518076,4464925
11697086464,121842458624,59498496,1197879296,12.274,1.280,86.384,0.062,0,112420644,4440086
11780820992,121758679040,59498496,1197883392,12.082,2.685,85.233,0,0,114674824,4431650
11816599552,121722892288,59498496,1197891584,10.802,1.030,88.167,0,0,115591514,4516266
11897061376,121642426368,59498496,1197895680,12.605,1.342,86.053,0,0,114106202,4380204
11938365440,121601118208,59498496,1197899776,12.551,0.997,86.453,0,0,114013892,4471018
12019367936,121520103424,59506688,1197903872,12.430,1.218,86.259,0.094,0,114371116,4465048
12075876352,121463590912,59506688,1197907968,11.867,1.646,86.486,0,0,119138844,4557988
12116119552,121423298560,59506688,1197916160,11.059,1.187,87.754,0,0,113720202,4401798
12197556224,121341861888,59506688,1197916160,12.082,1.780,86.138,0,0,113672848,4456148
12241121280,121298288640,59510784,1197920256,12.504,1.029,86.342,0.125,0,116531246,4484881
12321325056,121218031616,59518976,1197924352,11.924,1.712,86.239,0.125,0,115395662,4482218
12358524928,121180823552,59518976,1197932544,11.543,0.933,87.523,0,0,109291534,4364568
12403134464,121136209920,59518976,1197936640,12.352,1.245,86.403,0,0,114582558,4438094
12487741440,121051598848,59518976,1197940736,12.340,1.687,85.973,0,0,109238510,4234894
12525953024,121013383168,59518976,1197944832,10.917,1.123,87.960,0,0,116459218,4430328
12593229824,120946089984,59535360,1197944832,13,1.781,85.156,0.062,0,118367844,4633582
12637110272,120902201344,59535360,1197953024,12.019,1.628,86.354,0,0,110629284,4381992
12720922624,120818384896,59535360,1197957120,12.819,1.462,85.719,0,0,116201494,4259144
12767551488,120771751936,59535360,1197961216,11.398,1.215,87.387,0,0,114347444,4448742
12819517440,120719781888,59535360,1197965312,13.132,1.404,85.184,0.281,0,120706378,4486746
12899291136,120639995904,59543552,1197969408,13.095,1.003,85.871,0.031,0,116998608,4379127
12942348288,120596934656,59543552,1197973504,10.969,1.250,87.781,0,0,116876592,4406925
13030060032,120509218816,59543552,1197977600,12.445,1.317,86.238,0,0,109561162,4241208
13071810560,120467464192,59543552,1197981696,13.379,1.000,85.621,0,0,113931642,4317761
13116243968,120422875136,59543552,1198116864,10.781,0.906,88.250,0.062,0,114401634,4404260
13204574208,120334524416,59559936,1198120960,12.586,1.218,85.790,0.406,0,112190240,4329618
13250568192,120288522240,59559936,1198129152,12.275,1.429,86.296,0,0,114185964,4465477
13276712960,120262377472,59559936,1198129152,11.212,0.687,88.101,0,0,115906844,4513143
13365981184,120172998656,59559936,1198133248,12.520,1.686,85.795,0,0,122269912,4605954
13406908416,120132067328,59559936,1198137344,11.623,1.284,87.093,0,0,109160556,4309445
13451984896,120086958080,59576320,1198149632,10.350,1.220,88.305,0.125,0,109484508,4369809
13543440384,119995457536,59576320,1198153728,12.256,2.011,85.701,0.031,0,117913664,4519168
13590577152,119948316672,59576320,1198157824,12.218,1.535,86.247,0,0,114215106,4493194
13678501888,119860387840,59576320,1198161920,10.791,1.408,87.801,0,0,116386864,4416342
13731454976,119807434752,59576320,1198161920,12.477,2.167,85.356,0,0,112474984,4516986
13776437248,119762436096,59584512,1198170112,12.465,1.184,86.289,0.062,0,113326188,4469694
13808099328,119730528256,59584512,1198415872,10.903,0.997,88.100,0,0,115455000,4506510
13903540224,119635320832,59584512,1198182400,12.241,1.601,86.158,0,0,118961328,4587538
13947817984,119591038976,59584512,1198186496,12.765,1.526,85.710,0,0,123405966,4576852
13995917312,119542939648,59584512,1198186496,11.101,1.154,87.746,0,0,116740154,4417896
14092546048,119446294528,59592704,1198194688,12.442,2.563,84.748,0.247,0,113537906,4414300
14138007552,119400828928,59592704,1198198784,12.196,1.216,86.588,0,0,112632024,4380468
14185955328,119352877056,59592704,1198202880,10.924,0.968,88.109,0,0,117125526,4542240
14292230144,119246557184,59592704,1198206976,12.874,1.714,85.411,0,0,119557902,4456444
14336303104,119202476032,59592704,1198215168,12.477,1.188,86.335,0,0,112769140,4461780
14376366080,119162392576,59609088,1198219264,10.722,0.868,88.038,0.372,0,97587294,4063646
14427377664,119111376896,59609088,1198223360,12.238,1.356,86.406,0,0,86488820,3892214
14453809152,119084941312,59609088,1198227456,10.297,0.804,88.899,0,0,76272822,3646190
14452764672,119086026752,59609088,1198227456,8.739,0.468,90.793,0,0,65003638,3430276
14505398272,119033384960,59609088,1198235648,11.128,0.896,87.975,0,0,50145486,3100410
14504849408,119033917440,59625472,1198235648,8.393,0.373,91.172,0.062,0,40892486,2841206
14548303872,118990462976,59625472,1198235648,7.850,0.717,91.433,0,0,27050276,2656610
14547501056,118991261696,59625472,1198239744,7.007,0.094,92.900,0,0,16329596,2170142
14547456000,118991306752,59625472,1198239744,6.575,0.094,93.331,0,0,5302210,2371858
14548185088,118990573568,59625472,1198243840,6.673,0.062,93.265,0,0,96672,2170140
14548697088,118990057472,59641856,1198231552,6.849,0.062,92.559,0.529,0,69958,2084025
14549151744,118989590528,59641856,1198243840,6.996,0.062,92.942,0,0,66854,2114120
14549528576,118989213696,59641856,1198243840,6.527,0.062,93.410,0,0,96446,2108978
14549749760,118988992512,59641856,1198243840,6.789,0.062,93.149,0,0,96030,2138612
14550282240,118988455936,59641856,1198247936,6.820,0.031,93.149,0,0,92676,2118216
14552596480,118986125312,59658240,1198247936,6.554,0.094,93.040,0.312,0,54764,2110556
14553128960,118985560064,59658240,1198247936,6.876,0.062,93.062,0,0,47130,2130542
14556286976,118982402048,59658240,1198247936,6.558,0.062,93.379,0,0,49212,2068886
14584557568,118954127360,59658240,1198252032,9.001,1.521,89.479,0,0,54330,2103124
14584508416,118954176512,59658240,1198252032,7.023,0.031,92.946,0,0,72214,2105354
14585233408,118953435136,59674624,1198252032,6.965,0.062,92.910,0.062,0,74656,1954760
14585757696,118952910848,59674624,1198252032,6.764,0.031,93.204,0,0,121570,2270329
14586085376,118952583168,59674624,1198252032,6.735,0.031,93.234,0,0,83692,2097233
14586257408,118952407040,59674624,1198256128,6.789,0.062,93.149,0,0,84282,2122629
14587039744,118951624704,59674624,1198256128,6.961,0.124,92.915,0,0,90514,2079072
1190936576,132347723776,59682816,1198252032,1.313,0.250,98.374,0.063,0,78752,471016
1183342592,132355538944,59682816,1198030848,0.062,0.031,99.781,0.125,0,98308,0
1183305728,132355575808,59682816,1198030848,0,0,100,0,0,66258,0
1183232000,132355649536,59682816,1198030848,0,0,100,0,0,48442,0
1183227904,132355653632,59682816,1198030848,0,0,100,0,0,34932,0
1183195136,132355686400,59703296,1198010368,0,0,99.812,0.188,0,5584,0
1183428608,132355428352,59703296,1198030848,0,0,100,0,0,71940,0
1183420416,132355436544,59703296,1198030848,0,0,100,0,0,158300,0
1183162368,132355694592,59703296,1198030848,0,0,100,0,0,146874,0
1183162368,132355694592,59703296,1198030848,0,0,100,0,0,27422,0
1183162368,132355694592,59703296,1198030848,0,0,100,0,0,68092,0
1183154176,132355694592,59711488,1198030848,0,0,99.969,0.031,0,6060,0
1183154176,132355694592,59711488,1198030848,0,0.031,99.969,0,0,74892,0
1183154176,132355694592,59711488,1198030848,0.031,0,99.969,0,0,32390,0
1183154176,132355694592,59711488,1198030848,0,0,100,0,0,74776,0
1183154176,132355694592,59711488,1198030848,0,0,100,0,0,15120,0
1183154176,132355694592,59711488,1198030848,0,0,100,0,0,2570,0
1182629888,132356210688,59719680,1198030848,0,0,99.969,0.031,0,13222,0
1214652416,132324102144,59719680,1198043136,1.064,0.313,98.623,0,0,462503,22246
1212702720,132324179968,59719680,1198489600,0.125,0.063,99.812,0,0,135482,0
