"Dstat 0.7.3 CSV output"
"Author:","Dag Wieers <dag@wieers.com>",,,,"URL:","http://dag.wieers.com/home-made/dstat/"
"Host:","gros-78.nancy.grid5000.fr",,,,"User:","root"
"Cmdline:","dstat -m -c -n -o dstat.csv",,,,"Date:","23 May 2020 23:34:41 CEST"
"memory usage",,,,"total cpu usage",,,,,"net/total",
"used","free","buff","cach","usr","sys","idl","wai","stl","recv","send"
1280503808,97579798528,46616576,694538240,0.635,0.170,99.143,0.052,0,0,0
1271341056,97588928512,46616576,694546432,0.611,0.389,99,0,0,402576,33034
1271324672,97588944896,46616576,694546432,0,0.028,99.972,0,0,5870,0
1271947264,97588211712,46616576,694624256,0.612,0.362,99.026,0,0,387496,17194
1284161536,97575550976,46628864,695013376,0.250,0.083,99.666,0,0,385106,10882
1269518336,97590439936,46641152,694755328,0.389,0.278,99.028,0.306,0,6680,5970
1269518336,97590439936,46641152,694755328,0,0,100,0,0,8958,0
1269518336,97590439936,46641152,694755328,0,0,100,0,0,8398,0
1269518336,97590439936,46641152,694755328,0,0,100,0,0,9022,0
1269518336,97590439936,46641152,694755328,0,0,100,0,0,2784,0
1269493760,97590439936,46665728,694755328,0,0,100,0,0,1804,0
1281347584,97578139648,46665728,695201792,0.361,0.222,99.417,0,0,396304,20402
1271537664,97588137984,46665728,694964224,0.389,0.640,98.971,0,0,173588,17472
1270595584,97588822016,46665728,695222272,0.722,0.417,98.861,0,0,392562,28626
1270026240,97589256192,46665728,695353344,0.777,0.305,98.918,0,0,389888,17046
1269460992,97590267904,46665728,694906880,0,0,100,0,0,9184,0
1267871744,97591840768,46678016,694906880,0.556,0.389,99.055,0,0,395462,18574
1297690624,97561862144,46690304,695054336,0.555,0.083,99.361,0,0,229426,9658
1268736000,97590960128,46690304,694910976,0.639,0.083,99.278,0,0,14284,5902
1268776960,97590919168,46690304,694910976,0.028,0,99.972,0,0,177162,5600
1277087744,97582415872,46690304,695107584,0.501,0.334,99.165,0,0,370854,29498
1277464576,97582026752,46702592,695107584,0,0.083,99.917,0,0,34568,10216
1277464576,97582026752,46702592,695107584,0,0.028,99.972,0,0,12502,10094
1277452288,97582026752,46714880,695107584,0,0.028,99.972,0,0,12832,10192
1277452288,97582026752,46714880,695107584,0,0.028,99.972,0,0,12510,10094
1277452288,97582026752,46718976,695103488,0,0.028,99.972,0,0,14360,13566
1277431808,97582026752,46727168,695115776,0,0.028,99.972,0,0,14210,11926
1277423616,97582034944,46727168,695115776,0,0.056,99.944,0,0,12444,9898
1277423616,97582034944,46727168,695115776,0.028,0.028,99.944,0,0,12430,10192
1277448192,97582010368,46727168,695115776,0,0.028,99.972,0,0,11240,10094
1270231040,97589227520,46735360,695107584,0.056,0.028,99.917,0,0,2038,2236
1269317632,97590317056,46735360,694931456,0.139,0.083,99.778,0,0,173198,14488
1269305344,97590317056,46747648,694931456,0,0,100,0,0,2046,0
1269305344,97590317056,46747648,694931456,0,0,100,0,0,1034,0
1269305344,97590317056,46747648,694931456,0,0,100,0,0,1706,0
1269305344,97590317056,46747648,694931456,0,0,100,0,0,1730,0
1269293056,97590317056,46759936,694931456,0,0,100,0,0,2082,0
1269293056,97590317056,46759936,694931456,0,0,100,0,0,800,0
1273425920,97586176000,46768128,694931456,0.139,0.028,99.833,0,0,388644,14600
1267998720,97591599104,46768128,694931456,0.666,0.250,99.084,0,0,11560,14510
1267982336,97591615488,46768128,694931456,0.028,0,99.972,0,0,26986,1470
1267974144,97591623680,46768128,694931456,0,0,100,0,0,15688,3182
1267974144,97591623680,46768128,694931456,0,0,100,0,0,4754,0
1267965952,97591631872,46768128,694931456,0,0,100,0,0,2186,0
2889129984,95969288192,46792704,695623680,10.676,3.225,86.072,0.028,0,1651600,70270
6733967360,92122030080,46792704,697507840,28.158,9.738,62.104,0,0,1657049,73052
10576605184,88277004288,46850048,699420672,29.011,10.391,60.599,0,0,1662154,74788
14395416576,84456271872,46858240,701165568,27.442,10.298,62.260,0,0,1657520,69824
15990222848,82861281280,46858240,701308928,10.904,4.200,84.896,0,0,10184,4452
15977922560,82873528320,46878720,701308928,0.250,0.056,99.667,0.028,0,6672,163402
16006299648,82845147136,46878720,701313024,2.191,0.166,97.642,0,0,162758,10109764
16041738240,82809581568,46911488,701403136,3.172,0.390,96.411,0.028,0,438350,26240120
16096391168,82754887680,46911488,701444096,4.612,0.500,94.887,0,0,708152,41092331
16194064384,82657165312,46911488,701493248,5.964,0.666,93.370,0,0,966154,56815380
16324648960,82526519296,46919680,701546496,6.672,0.637,92.691,0,0,998738,60334158
16494718976,82356383744,46927872,701603840,11.280,1.048,87.672,0,0,985148,60935302
16605077504,82245971968,46927872,701652992,8.273,0.641,91.086,0,0,928064,57868240
16723300352,82127683584,46927872,701714432,9.928,0.607,89.465,0,0,946892,56607534
16759709696,82091225088,46927872,701763584,4.755,0.473,94.772,0,0,971458,56745950
16746098688,82104770560,46936064,701816832,2.588,0.417,96.995,0,0,987246,57569018
16723435520,82127372288,46936064,701874176,3.506,0.390,96.105,0,0,1015070,58546752
16709378048,82141306880,46936064,701997056,3.198,0.723,96.079,0,0,958870,59937278
16682631168,82168004608,46936064,702046208,3.040,0.335,96.626,0,0,990140,60682378
16689287168,82161283072,46936064,702107648,3.883,0.583,95.534,0,0,985978,59157144
16680828928,82169667584,46944256,702169088,2.839,0.417,96.744,0,0,1006434,59772208
16665550848,82184900608,46944256,702214144,3.844,0.251,95.905,0,0,1037634,59059176
16640487424,82209914880,46944256,702263296,3.667,0.583,95.750,0,0,986844,58695802
16627818496,82222526464,46944256,702320640,3.277,0.305,96.418,0,0,1051086,61292808
16633655296,82216632320,46944256,702377984,2.837,0.445,96.718,0,0,957140,56933906
16634851328,82215370752,46952448,702435328,2.718,0.472,96.810,0,0,975770,56968166
16628879360,82221277184,46952448,702496768,2.745,0.444,96.811,0,0,919254,55619466
16631201792,82218754048,46952448,702676992,2.474,0.278,97.248,0,0,939458,56414914
16629653504,82220240896,46952448,702734336,2.419,0.417,97.164,0,0,1047074,61964326
16628412416,82221420544,46952448,702795776,2.360,0.361,97.279,0,0,1017904,59560574
16632614912,82217127936,46960640,702844928,2.666,0.278,97.056,0,0,949526,56222568
16634650624,82215038976,46960640,702898176,2.917,0.472,96.611,0,0,961383,58200972
16641560576,82207866880,46960640,703160320,2.383,0.526,97.091,0,0,1013974,59057412
16641384448,82207956992,46960640,703205376,2.720,0.333,96.919,0.028,0,965908,55568006
16641720320,82207563776,46960640,703262720,2.476,0.362,97.163,0,0,1014352,58834610
16641286144,82207932416,46968832,703315968,2.228,0.390,97.382,0,0,1072370,63412930
16641949696,82207211520,46968832,703373312,2.415,0.416,97.169,0,0,978680,58616644
16642445312,82206658560,46968832,703430656,1.949,0.362,97.689,0,0,1034106,62161626
16641507328,82207543296,46977024,703475712,2.634,0.361,97.005,0,0,972430,58486568
16643002368,82205986816,46977024,703533056,1.646,0.279,98.075,0,0,928274,55356362
16649777152,82199146496,46985216,703590400,2.812,0.278,96.910,0,0,1018956,59971348
16650006528,82198855680,46985216,703647744,2.336,0.389,97.275,0,0,1028478,60688146
16650072064,82198597632,46985216,703840256,2.672,0.417,96.911,0,0,972806,57691244
16650076160,82198532096,46985216,703901696,2.115,0.362,97.524,0,0,1032796,60975968
16661037056,82187530240,46985216,703942656,2.633,0.443,96.924,0,0,1027716,62115488
16660996096,82187501568,46993408,704000000,1.863,0.195,97.942,0,0,1011418,60206694
16661913600,82186522624,46993408,704061440,1.670,0.334,97.996,0,0,1026394,61360474
16670351360,82178035712,46993408,704110592,2.383,0.360,97.257,0,0,946160,56552346
16669929472,82178400256,46993408,704167936,1.862,0.361,97.777,0,0,967556,56495632
16669995008,82178273280,46993408,704225280,1.674,0.474,97.852,0,0,970720,56845428
16670851072,82177368064,47001600,704266240,2.494,0.333,97.173,0,0,1003728,58946746
16671793152,82176221184,47001600,704450560,1.950,0.334,97.715,0,0,975498,58770852
16671625216,82176323584,47001600,704516096,1.891,0.306,97.803,0,0,971936,57924770
16672309248,82175574016,47001600,704581632,2.810,0.362,96.828,0,0,1032658,61166312
16672358400,82175479808,47001600,704626688,1.835,0.389,97.775,0,0,990632,58672466
16672018432,82175741952,47009792,704696320,1.918,0.389,97.693,0,0,996238,59355416
16672673792,82175025152,47009792,704757760,2.110,0.305,97.585,0,0,1068342,61431800
16674242560,82173419520,47009792,704794624,2.029,0.389,97.581,0,0,989432,59557494
16678559744,82169032704,47009792,704864256,2.500,0.417,97.083,0,0,957974,55837526
16687411200,82160123904,47009792,704917504,2.337,0.501,97.163,0,0,1003588,58878238
16691146752,82156298240,47017984,704958464,3.416,0.361,96.223,0,0,1003190,58568138
16699584512,82147803136,47017984,705015808,3.647,0.306,96.047,0,0,950069,56834320
16700186624,82147151872,47017984,705064960,4.102,0.388,95.510,0,0,897892,53008094
16714432512,82132746240,47017984,705126400,5.147,0.498,94.355,0,0,1010756,59083528
16714833920,82132275200,47017984,705183744,3.099,0.332,96.541,0.028,0,972412,57988288
16723042304,82124009472,47026176,705228800,1.728,0.279,97.993,0,0,916190,56497972
16724029440,82122960896,47026176,705290240,1.642,0.334,98.024,0,0,974428,58277384
16721264640,82125660160,47026176,705351680,2.028,0.417,97.555,0,0,1042036,61314904
16721698816,82125168640,47026176,705409024,2.491,0.554,96.955,0,0,961906,57821974
16723095552,82123710464,47034368,705462272,2.382,0.415,97.203,0,0,998862,60574790
16780824576,82065911808,47042560,705515520,5.158,0.499,94.343,0,0,1009120,62784946
16850059264,81996615680,47042560,705576960,5.948,0.361,93.691,0,0,1023564,60586406
16876404736,81970200576,47042560,705626112,4.628,0.390,94.982,0,0,1024996,59637600
16959066112,81887473664,47042560,705683456,6.556,0.636,92.808,0,0,987240,59114118
16956411904,81890074624,47042560,705736704,1.503,0.418,98.079,0,0,962152,56328130
16943529984,81902891008,47050752,705794048,2.031,0.389,97.580,0,0,929008,53438358
16923070464,81923297280,47050752,705847296,1.976,0.362,97.663,0,0,962686,56059092
16922624000,81923698688,47050752,705892352,1.999,0.333,97.667,0,0,936806,55107264
16906526720,81939734528,47050752,705953792,1.362,0.528,98.110,0,0,965084,57504010
16907579392,81938628608,47050752,706007040,1.782,0.278,97.940,0,0,955266,58407216
16906829824,81939316736,47058944,706060288,1.446,0.362,98.192,0,0,950298,55512036
16912478208,81933594624,47058944,706125824,2.971,0.500,96.529,0,0,1022712,59673092
16912994304,81932881920,47058944,706322432,1.951,0.502,97.547,0,0,996520,58162280
16912392192,81933438976,47058944,706367488,2.494,0.333,97.173,0,0,999649,59621486
16912756736,81933017088,47058944,706424832,2.157,0.498,97.345,0,0,961404,57928570
16910004224,81935716352,47067136,706469888,1.838,0.279,97.883,0,0,993334,60941218
16908136448,81937526784,47067136,706527232,1.584,0.472,97.943,0,0,994528,61917818
16905682944,81939910656,47067136,706592768,1.363,0.528,98.109,0,0,1046907,63979938
16905191424,81940340736,47067136,706650112,1.894,0.362,97.744,0,0,975578,58311816
16905486336,81940000768,47067136,706695168,1.643,0.362,97.994,0,0,991126,59629126
16905445376,81939972096,47075328,706756608,1.530,0.334,98.136,0,0,1015240,59425262
16907747328,81937616896,47075328,706809856,1.994,0.609,97.397,0,0,968744,56210786
16908267520,81937039360,47075328,706863104,1.616,0.362,98.021,0,0,916634,54766136
16908267520,81936982016,47075328,706920448,1.564,0.363,98.073,0,0,1043000,60953868
16907972608,81937215488,47075328,706981888,1.731,0.223,98.017,0.028,0,921288,53019458
16908865536,81936265216,47083520,707031040,1.417,0.417,98.166,0,0,931647,56513272
16908992512,81936072704,47083520,707092480,1.641,0.334,98.025,0,0,1042220,60284926
16910143488,81934860288,47083520,707153920,2.328,0.277,97.395,0,0,1009014,59506518
16912297984,81932656640,47083520,707203072,1.892,0.473,97.635,0,0,1032242,62611652
16912670720,81932230656,47083520,707252224,2.811,0.306,96.883,0,0,1099206,64781202
16913592320,81931227136,47099904,707313664,1.695,0.472,97.832,0,0,952924,54878874
16914817024,81929940992,47099904,707366912,3.272,0.388,96.339,0,0,1015914,61963156
16914862080,81929842688,47099904,707420160,2.168,0.278,97.554,0,0,970446,56376652
16914206720,81930436608,47099904,707477504,1.780,0.389,97.830,0,0,1059750,60789300
16915677184,81928921088,47099904,707522560,3.056,0.361,96.582,0,0,1065732,61985476
16921133056,81923391488,47108096,707584000,2.167,0.333,97.500,0,0,985860,57309658
16921763840,81922703360,47108096,707641344,2.256,0.278,97.466,0,0,995180,59307940
16921038848,81923362816,47108096,707706880,1.420,0.445,98.135,0,0,1012318,60116774
16922390528,81921957888,47108096,707756032,1.281,0.251,98.469,0,0,980012,59074572
16922607616,81921671168,47108096,707825664,1.810,0.390,97.801,0,0,1011432,60875042
16921485312,81922748416,47116288,707862528,1.307,0.445,98.249,0,0,934198,55756934
16922730496,81921437696,47116288,707928064,1.614,0.390,97.996,0,0,961782,58689932
16923004928,81921093632,47116288,707993600,1.479,0.167,98.353,0,0,998658,59326692
16922882048,81921159168,47116288,708050944,2.106,0.443,97.450,0,0,1094953,63749376
16929701888,81914281984,47116288,708108288,2.033,0.390,97.577,0,0,1025462,60073166
16929345536,81914576896,47124480,708161536,2.034,0.334,97.604,0.028,0,984480,58657588
16929288192,81914576896,47124480,708218880,2.806,0.445,96.749,0,0,995292,59822296
16929005568,81914740736,47124480,708272128,2.032,0.278,97.690,0,0,959159,55880536
16932200448,81911496704,47124480,708321280,4.075,0.499,95.426,0,0,967484,55974632
16933285888,81910337536,47124480,708390912,1.893,0.306,97.801,0,0,1021312,60264186
16934129664,81909415936,47140864,708448256,4.188,0.391,95.422,0,0,997776,58838576
16943751168,81899741184,47140864,708501504,2.525,0.638,96.837,0,0,1043467,59899682
16947277824,81896120320,47173632,708558848,3.057,0.389,96.554,0,0,994438,59609928
16947576832,81895759872,47173632,708620288,2.353,0.387,97.260,0,0,957200,55853026
16947441664,81895837696,47173632,708677632,4.071,0.388,95.541,0,0,984880,58344130
16947896320,81895317504,47173632,708743168,2.046,0.470,97.483,0,0,935408,55567914
16945733632,81897287680,47181824,708927488,1.666,0.305,98.028,0,0,965726,58673522
16946409472,81896538112,47190016,708988928,1.504,0.501,97.995,0,0,965888,57461036
16948948992,81893953536,47190016,709033984,1.559,0.278,98.163,0,0,1070288,64389138
16955453440,81887350784,47190016,709091328,2.272,0.388,97.340,0,0,1038064,61394534
16956854272,81885884416,47190016,709156864,1.481,0.251,98.268,0,0,993130,58181396
16956973056,81885720576,47190016,709201920,1.565,0.391,98.044,0,0,935312,57221658
16957784064,81884839936,47198208,709263360,1.420,0.362,98.218,0,0,1005544,58954408
16957194240,81885364224,47198208,709324800,1.226,0.502,98.272,0,0,973682,58541312
16957198336,81885302784,47198208,709382144,1.750,0.445,97.805,0,0,1082412,63732920
16956641280,81885794304,47198208,709447680,1.452,0.419,98.130,0,0,1009624,56754330
16955916288,81886453760,47198208,709509120,1.611,0.389,98.001,0,0,1100000,60466934
16957145088,81885175808,47206400,709550080,1.694,0.472,97.835,0,0,1008564,56500504
16957767680,81884491776,47206400,709611520,1.563,0.279,98.157,0,0,1006164,60277080
16956755968,81885442048,47206400,709672960,1.720,0.527,97.753,0,0,965302,57556932
16957820928,81884327936,47206400,709722112,1.420,0.390,98.163,0.028,0,1024218,61803774
16958496768,81883578368,47206400,709795840,1.669,0.362,97.970,0,0,1083562,65340542
16958005248,81884020736,47214592,709832704,2.599,0.498,96.904,0,0,928020,55189000
16959197184,81882755072,47214592,709898240,1.534,0.307,98.159,0,0,1056056,62700872
16960208896,81881681920,47214592,709959680,1.503,0.473,98.023,0,0,956464,57753906
16959954944,81881882624,47214592,710012928,1.172,0.195,98.633,0,0,930400,55406102
16959803392,81881964544,47222784,710074368,2.301,0.416,97.283,0,0,951130,57366162
16958836736,81882865664,47230976,710127616,1.553,0.444,98.003,0,0,1043062,63265240
16960081920,81881554944,47230976,710193152,1.611,0.361,98.028,0,0,933087,54707574
16959234048,81882341376,47230976,710250496,1.278,0.417,98.305,0,0,972232,59158466
16959987712,81881530368,47230976,710307840,1.816,0.307,97.877,0,0,883414,55326840
16959369216,81882087424,47239168,710361088,1.774,0.443,97.783,0,0,1015807,60151684
16960114688,81881272320,47247360,710422528,1.726,0.390,97.884,0,0,1081053,63869278
16960380928,81880948736,47247360,710479872,1.174,0.447,98.379,0,0,944454,58631168
16961142784,81880129536,47247360,710537216,1.197,0.390,98.413,0,0,1030766,63296522
16960737280,81880489984,47247360,710582272,1.695,0.389,97.916,0,0,989322,59808298
16959688704,81881473024,47247360,710647808,1.060,0.363,98.578,0,0,1052702,63359458
16960512000,81880510464,47255552,710705152,1.225,0.445,98.330,0,0,1049888,61413454
16961089536,81879863296,47259648,710770688,1.198,0.306,98.495,0,0,960450,56238156
16959881216,81881010176,47259648,710832128,1.780,0.334,97.886,0,0,946060,56058748
16960602112,81880231936,47259648,710885376,1.693,0.444,97.863,0,0,1077742,63236910
16961064960,81879711744,47259648,710942720,1.829,0.443,97.727,0,0,988564,60644848
16961642496,81879060480,47267840,711008256,2.056,0.583,97.360,0,0,1017344,64500408
16961355776,81879289856,47267840,711065600,2.003,0.306,97.691,0,0,941680,58716188
16961781760,81878798336,47267840,711131136,1.503,0.306,98.191,0,0,1017980,60458408
16961536000,81878994944,47267840,711180288,1.389,0.444,98.167,0,0,1068100,63806930
16961245184,81879224320,47271936,711237632,1.195,0.417,98.360,0.028,0,1007608,60114750
16962322432,81878081536,47280128,711286784,1.859,0.305,97.836,0,0,945280,57726448
16962121728,81878216704,47280128,711352320,1.971,0.305,97.723,0,0,1022574,59690058
16962211840,81877929984,47280128,711544832,1.394,0.279,98.327,0,0,959374,55896352
16963403776,81876684800,47280128,711598080,2.138,0.444,97.417,0,0,1034028,60007702
16962809856,81877217280,47288320,711647232,1.968,0.471,97.560,0,0,985882,58552796
16963813376,81876144128,47296512,711708672,1.699,0.306,97.995,0,0,1078486,62947106
16961974272,81877917696,47296512,711770112,1.557,0.473,97.971,0,0,1067566,62305008
16963391488,81876447232,47296512,711819264,1.223,0.500,98.277,0,0,993546,60313594
16963735552,81876029440,47296512,711892992,1.307,0.334,98.359,0,0,1011380,58281594
16963022848,81876684800,47296512,711950336,1.524,0.499,97.977,0,0,992448,56654708
16963727360,81875902464,47312896,712011776,1.862,0.445,97.694,0,0,1037150,61986158
16964333568,81875247104,47312896,712060928,0.978,0.308,98.714,0,0,919030,55161036
16963903488,81875619840,47312896,712118272,1.278,0.472,98.250,0,0,985890,56722650
16965472256,81873985536,47312896,712175616,1.364,0.417,98.219,0,0,1044462,60892100
16964665344,81874739200,47312896,712228864,1.508,0.335,98.156,0,0,965291,56843278
16965718016,81873625088,47321088,712282112,1.669,0.445,97.887,0,0,1004594,58289824
16965001216,81874280448,47321088,712343552,1.585,0.389,98.026,0,0,986150,57323188
16965246976,81873985536,47321088,712388608,1.773,0.388,97.839,0,0,971918,57066952
16964288512,81874857984,47321088,712462336,1.474,0.306,98.220,0,0,969914,59185624
16964493312,81874599936,47321088,712515584,1.361,0.389,98.250,0,0,992462,57520336
16965517312,81873522688,47329280,712560640,1.227,0.335,98.439,0,0,1040090,59627266
16964878336,81874083840,47329280,712638464,1.639,0.528,97.833,0,0,1031582,61520836
16965144576,81873760256,47329280,712691712,1.641,0.306,98.053,0,0,914286,57631098
16966209536,81872650240,47329280,712732672,1.115,0.390,98.494,0,0,847492,52193054
16966946816,81871831040,47329280,712810496,1.913,0.610,97.476,0,0,1004816,60031258
16965742592,81872977920,47337472,712859648,1.502,0.501,97.969,0.028,0,1000014,62470736
16965701632,81872949248,47337472,712929280,1.476,0.334,98.189,0,0,984332,59072530
16965328896,81873281024,47337472,712970240,2.078,0.443,97.479,0,0,947522,56529144
16966410240,81872138240,47337472,713031680,1.694,0.444,97.862,0,0,944264,57473714
16966967296,81871523840,47337472,713089024,1.395,0.363,98.242,0,0,1069096,60527956
16967258112,81871085568,47353856,713142272,1.557,0.417,98.026,0,0,1108500,63135100
16967704576,81870565376,47353856,713211904,1.143,0.362,98.495,0,0,985186,58883180
16966406144,81871814656,47353856,713261056,1.587,0.362,98.051,0,0,986596,58540072
16967688192,81870471168,47353856,713318400,1.224,0.362,98.414,0,0,964500,59229216
16966672384,81871425536,47353856,713379840,1.250,0.444,98.306,0,0,936516,59858474
16967397376,81870639104,47362048,713433088,1.640,0.334,98.026,0,0,885108,53349052
16968740864,81869234176,47362048,713494528,1.832,0.416,97.752,0,0,1002158,61528290
16968036352,81869717504,47362048,713695232,1.694,0.472,97.834,0,0,1070316,63723414
16967266304,81870438400,47362048,713744384,2.028,0.306,97.667,0,0,968718,57598852
16967757824,81869881344,47362048,713805824,1.449,0.334,98.217,0,0,1002070,58056890
16967294976,81870278656,47370240,713863168,1.280,0.473,98.247,0,0,894228,55067942
16968605696,81868910592,47370240,713916416,1.394,0.446,98.160,0,0,946908,54963446
16968900608,81868550144,47370240,713981952,1.444,0.417,98.139,0,0,933708,56972652
16968568832,81868828672,47370240,714031104,1.503,0.334,98.164,0,0,947514,57599920
16968450048,81868894208,47370240,714084352,1.226,0.474,98.301,0,0,985995,59478868
16969416704,81867849728,47378432,714145792,1.525,0.471,97.976,0.028,0,1068068,64196030
16968650752,81868570624,47378432,714190848,1.669,0.389,97.942,0,0,888050,55421456
16969424896,81867722752,47378432,714260480,1.088,0.279,98.632,0,0,987248,58810342
16968392704,81868709888,47378432,714305536,1.724,0.389,97.887,0,0,1008674,57767236
16968966144,81867976704,47378432,714379264,1.420,0.390,98.190,0,0,1163247,58416044
16970706944,81865973760,47394816,714444800,1.169,0.306,98.524,0,0,1086018,62533710
16971370496,81865265152,47394816,714489856,1.586,0.417,97.996,0,0,1012734,62220598
16971476992,81865105408,47394816,714543104,1.533,0.418,98.049,0,0,970410,59219168
16971214848,81865302016,47394816,714608640,1.671,0.306,98.023,0,0,960440,58682024
16972046336,81864421376,47394816,714657792,1.477,0.279,98.245,0,0,1047402,62831008
16971931648,81864454144,47411200,714719232,1.612,0.361,98.027,0,0,1041056,60543258
16971833344,81864491008,47411200,714780672,1.751,0.306,97.943,0,0,962224,54567890
16971874304,81864396800,47411200,714833920,1.250,0.555,98.195,0,0,1001118,58563184
14683103232,84152811520,47411200,714895360,1.253,0.362,98.384,0,0,959562,55754154
10803707904,88032833536,47411200,714268672,0.866,0.279,98.855,0,0,722690,44787112
6167105536,92670488576,47423488,713199616,0.586,0.251,99.162,0,0,397050,25532022
2163187712,96675561472,47435776,712105984,0.501,0.111,99.387,0,0,147280,11541200
1310875648,97529249792,47435776,710778880,0.083,0.056,99.861,0,0,5270,230942
1302016000,97538330624,47435776,710557696,0.028,0,99.972,0,0,2546,0
1302016000,97538330624,47435776,710557696,0,0,100,0,0,2228,102
1301741568,97538605056,47435776,710557696,0,0,100,0,0,5682,0
1301729280,97538605056,47448064,710557696,0,0,100,0,0,860,0
1301729280,97538605056,47448064,710557696,0,0,100,0,0,840,0
1301729280,97538605056,47448064,710557696,0,0,100,0,0,1958,0
1301729280,97538605056,47448064,710557696,0,0,100,0,0,16150,0
1301729280,97538605056,47448064,710557696,0,0,100,0,0,8200,2168
1301729280,97538605056,47448064,710557696,0,0,100,0,0,4136,0
1301454848,97538871296,47456256,710557696,0,0,99.972,0.028,0,822,0
1301454848,97538871296,47456256,710557696,0,0,100,0,0,3756,0
1301389312,97538936832,47456256,710557696,0,0.028,99.972,0,0,1847,0
1301389312,97538936832,47456256,710557696,0,0,100,0,0,6570,180
1301389312,97538936832,47456256,710557696,0,0,100,0,0,7384,0
1301389312,97538936832,47456256,710557696,0,0,100,0,0,6480,0
1301381120,97538936832,47464448,710557696,0,0,100,0,0,4842,0
1301372928,97538945024,47464448,710557696,0,0,100,0,0,1746,0
1301356544,97538961408,47464448,710557696,0,0,100,0,0,1370,3032
1301356544,97538961408,47464448,710557696,0,0,100,0,0,1440,132
1315258368,97523949568,47464448,711012352,0.528,0.139,99.333,0,0,391656,19480
1303945216,97534791680,47464448,710565888,0.278,0.333,99.389,0,0,13662,27098
