172.16.66.55 : 10.76 10.28 10.26 10.27 10.28 10.27 10.22 10.29 10.27 10.28
172.16.66.56 : 11.27 10.31 10.34 10.35 10.40 10.35 10.35 10.39 10.36 -
172.16.66.57 : 0.24 0.24 0.22 0.23 0.23 0.23 0.22 0.24 0.24 0.12
172.16.66.58 : 0.21 0.22 0.22 0.22 0.23 0.22 0.23 0.19 0.22 0.22
172.16.66.59 : 0.24 0.20 0.21 0.20 0.20 0.20 0.20 0.20 0.20 0.23
172.16.66.6  : 0.23 0.20 0.25 0.23 0.23 0.19 0.24 0.18 0.22 0.23
172.16.66.60 : 5.02 0.22 0.16 0.21 0.14 0.18 0.14 0.19 0.19 0.18
172.16.66.61 : 0.22 0.15 0.20 0.18 0.19 0.17 0.18 0.20 0.20 0.18
172.16.66.62 : 0.24 0.15 0.21 0.16 0.09 0.20 0.16 0.16 0.20 0.16
172.16.66.64 : 0.24 0.21 0.24 0.22 0.22 0.22 0.23 0.22 0.23 0.21
172.16.66.65 : 0.23 0.22 0.16 0.20 0.21 0.22 0.20 0.23 0.22 0.22
172.16.66.66 : 0.02 0.03 0.03 0.03 0.03 0.03 0.03 0.03 0.03 0.03
172.16.66.67 : 0.18 0.21 0.22 0.20 0.23 0.23 0.21 0.21 0.22 0.23
172.16.66.69 : 0.25 0.23 0.22 0.21 0.22 0.23 0.24 0.22 0.20 0.24
172.16.66.7  : 11.10 10.37 10.35 10.35 10.34 - 10.34 10.40 10.38 10.37
172.16.66.70 : 11.11 10.31 10.30 10.30 10.30 10.29 10.26 10.33 10.32 10.33
172.16.66.71 : 11.13 10.29 10.30 10.28 10.30 10.30 10.30 - 10.31 10.31
172.16.66.72 : - 10.23 10.26 10.23 10.26 10.27 10.36 10.30 10.35 10.36
172.16.66.73 : 11.10 10.23 10.28 10.25 10.28 10.33 10.32 10.31 10.37 10.34
172.16.66.74 : 11.08 10.34 10.28 10.34 10.28 10.37 10.31 10.34 - 10.37
172.16.66.75 : 11.05 10.30 10.31 10.30 10.28 10.30 10.31 10.30 - 10.37
172.16.66.76 : 21.39 - 10.30 10.34 - 10.31 10.29 10.32 10.34 10.35
172.16.66.77 : - 10.35 10.33 10.35 10.35 10.34 - 10.35 10.37 10.28
172.16.66.78 : 11.05 10.35 10.32 10.32 - 10.22 10.30 10.27 10.29 10.30
172.16.66.79 : 11.09 10.23 - 10.28 10.24 10.27 10.31 10.36 10.36 10.35
172.16.66.8  : 11.09 10.33 10.34 10.35 10.35 10.37 10.35 10.39 10.37 10.37
172.16.66.80 : 11.10 4.39 4.39 4.37 4.38 4.38 4.36 4.32 4.34 4.37

      27 targets
      27 alive
       0 unreachable
       0 unknown addresses

      10 timeouts (waiting for response)
     270 ICMP Echos sent
     258 ICMP Echo Replies received
       0 other ICMP received

 0.02 ms (min round trip time)
 5.49 ms (avg round trip time)
 21.3 ms (max round trip time)
       10.255 sec (elapsed real time)

