"Dstat 0.7.3 CSV output"
"Author:","Dag Wieers <dag@wieers.com>",,,,"URL:","http://dag.wieers.com/home-made/dstat/"
"Host:","gros-64.nancy.grid5000.fr",,,,"User:","root"
"Cmdline:","dstat -m -c -n -o dstat.csv",,,,"Date:","23 May 2020 20:22:09 CEST"
"memory usage",,,,"total cpu usage",,,,,"net/total",
"used","free","buff","cach","usr","sys","idl","wai","stl","recv","send"
1558097920,96708407296,59670528,1229242368,3.649,0.388,95.943,0.020,0,0,0
1552650240,96713531392,59670528,1229594624,0.750,0.361,98.889,0,0,392792,29762
1550544896,96716083200,59670528,1229148160,0,0.028,99.972,0,0,1886,1164
1550897152,96715726848,59670528,1229148160,0.501,0.445,99.053,0,0,387074,17246
1549971456,96716652544,59670528,1229148160,0,0,100,0,0,1180,1236
1546760192,96719839232,59682816,1229152256,0.612,0.334,99.054,0,0,385832,15994
1546731520,96719855616,59695104,1229152256,0.028,0.056,99.917,0,0,1384,102
1546731520,96719855616,59695104,1229152256,0.028,0,99.972,0,0,8822,0
1546723328,96719863808,59695104,1229152256,0,0,100,0,0,6124,148
1546723328,96719863808,59695104,1229152256,0.028,0.028,99.944,0,0,10244,0
1546711040,96719863808,59707392,1229152256,0,0,100,0,0,13708,0
1545629696,96720932864,59715584,1229152256,0.640,0.389,98.971,0,0,401724,21618
1549488128,96717037568,59715584,1229172736,0.223,0.418,99.359,0,0,560818,27256
1543598080,96722919424,59715584,1229176832,0.556,0.472,98.972,0,0,388202,25170
1543634944,96722870272,59715584,1229176832,0.501,0.362,99.137,0,0,9916,6902
1556287488,96709767168,59715584,1229623296,0.389,0.111,99.500,0,0,386138,12082
1541099520,96725368832,59727872,1229180928,0.195,0.306,99.499,0,0,25776,7720
1540829184,96725626880,59740160,1229180928,0,0,100,0,0,4354,220
1542152192,96724271104,59740160,1229180928,1.194,0.167,98.640,0,0,226030,11128
1541992448,96724430848,59740160,1229180928,0.028,0.028,99.944,0,0,3038,2652
1543098368,96723292160,59740160,1229180928,0.306,0.083,99.611,0,0,344286,15650
1550897152,96715292672,59752448,1229369344,0.139,0.251,99.582,0.028,0,176846,18304
1550897152,96715292672,59752448,1229369344,0,0.056,99.944,0,0,10282,10192
1550876672,96715300864,59764736,1229369344,0,0,100,0,0,11154,10560
1550876672,96715300864,59764736,1229369344,0.028,0.028,99.944,0,0,10293,9898
1550860288,96715317248,59764736,1229369344,0,0.028,99.972,0,0,9872,9898
1550860288,96715317248,59764736,1229369344,0.028,0.056,99.917,0,0,15126,15300
1550860288,96715317248,59772928,1229361152,0.028,0.028,99.944,0,0,10576,10746
1550852096,96715317248,59772928,1229369344,0.028,0.083,99.889,0,0,10122,10192
1550843904,96715317248,59781120,1229369344,0.028,0.028,99.944,0,0,11050,9996
1550827520,96715333632,59781120,1229369344,0.028,0.056,99.917,0,0,10290,10192
1555824640,96710520832,59781120,1229185024,0.139,0.139,99.722,0,0,169822,10396
1548636160,96717709312,59781120,1229185024,0,0.028,99.972,0,0,9212,5916
1548627968,96717717504,59781120,1229185024,0,0.028,99.972,0,0,4736,0
1548361728,96717983744,59781120,1229185024,0,0.028,99.972,0,0,2980,0
1548349440,96717983744,59793408,1229185024,0.028,0.028,99.944,0,0,5410,264
1548349440,96717983744,59793408,1229185024,0,0.028,99.972,0,0,6178,0
1549881344,96716414976,59809792,1229197312,0.668,0.362,98.971,0,0,398378,30190
1593413632,96672563200,59809792,1229508608,0.639,0.167,99.194,0,0,335468,13412
1704017920,96561963008,59809792,1229508608,1.362,0.083,98.555,0,0,4578,680
1706881024,96559882240,59809792,1228759040,0.028,0,99.972,0,0,3258,204
1706868736,96559882240,59822080,1228759040,0,0.028,99.972,0,0,1576,0
1706856448,96559882240,59838464,1228754944,0,0,100,0,0,544,204
1705811968,96560914432,59838464,1228767232,0,0,100,0,0,2754,0
1807343616,96459382784,59838464,1228767232,3.056,0.333,96.611,0,0,1166,0
1851703296,96415023104,59838464,1228767232,3.113,0.056,96.832,0,0,1308,0
1894154240,96372563968,59846656,1228767232,2.864,0,97.136,0,0,3022,0
1946808320,96319909888,59846656,1228767232,2.837,0,97.163,0,0,7504,1784
2008489984,96258220032,59854848,1228767232,2.809,0.056,97.136,0,0,4836,560
2063507456,96203202560,59854848,1228767232,2.837,0,97.163,0,0,19038,3472
2118385664,96148324352,59854848,1228767232,2.783,0.028,97.189,0,0,17070,2100
2177966080,96088731648,59863040,1228771328,2.812,0,97.188,0,0,14468,1968
2228641792,96038051840,59863040,1228775424,2.809,0.028,97.163,0,0,14292,2022
2283982848,95982702592,59863040,1228775424,2.810,0,97.190,0,0,12552,2202
2336989184,95929696256,59863040,1228775424,2.921,0.028,97.051,0,0,13301,2612
2373382144,95893250048,59871232,1228779520,6.252,0.194,93.554,0,0,6394238,239972
2435309568,95831224320,59879424,1228787712,10.273,0.223,89.504,0,0,21746018,828952
2440912896,95825539072,59879424,1228787712,7.598,0.306,92.096,0,0,33601424,1337676
2480697344,95785754624,59879424,1228787712,7.367,0.862,91.771,0,0,51260476,1839740
2480050176,95786397696,59879424,1228791808,6.977,0.223,92.799,0,0,57597872,2183936
2607046656,95659393024,59887616,1228791808,7.413,2.238,90.350,0,0,74586152,2641712
2610806784,95655620608,59895808,1228795904,8.753,0.308,90.940,0,0,87264756,3055942
2689773568,95576649728,59895808,1228800000,9.073,1.368,89.559,0,0,105263860,3494466
2757681152,95508738048,59895808,1228804096,8.324,1.401,90.275,0,0,115318596,3828563
2789322752,95477096448,59895808,1228804096,8.454,1.172,90.374,0,0,119624814,3994690
2806292480,95460118528,59895808,1228812288,8.471,0.699,90.830,0,0,116560748,4019832
2810216448,95456182272,59904000,1228816384,8.585,0.447,90.968,0,0,116186494,4040590
2840621056,95425773568,59904000,1228820480,8.852,0.531,90.617,0,0,118379834,4277794
2842996736,95423397888,59904000,1228820480,8.697,0.364,90.940,0,0,116900880,4201320
2854699008,95411691520,59904000,1228824576,9.192,0.501,90.306,0,0,110449536,4195378
2859380736,95407005696,59904000,1228828672,8.595,0.448,90.957,0,0,120610422,4327990
2862411776,95403962368,59912192,1228832768,9.043,0.419,90.539,0,0,114745296,4540552
2864771072,95401598976,59912192,1228836864,9.439,0.444,90.117,0,0,116686082,4570616
2867515392,95398850560,59912192,1228840960,9.142,0.446,90.412,0,0,117247956,4542298
2869972992,95396388864,59912192,1228845056,9.707,0.502,89.791,0,0,117291368,4653774
3020197888,95246159872,59912192,1228849152,10.512,1.251,88.237,0,0,114650280,4680184
3381698560,94884646912,59920384,1228853248,8.699,1.119,90.182,0,0,117756438,4757224
3492933632,94773407744,59920384,1228857344,9.685,1.061,89.255,0,0,122795854,4844810
4160536576,94105800704,59920384,1228861440,8.408,1.844,89.749,0,0,119439402,4835462
4201730048,94064603136,59920384,1228865536,8.641,0.979,90.380,0,0,120180626,4949424
4253753344,94012575744,59920384,1228869632,8.513,1.092,90.395,0,0,112469596,4800542
4585918464,93680398336,59928576,1228873728,8.191,0.449,91.332,0.028,0,117738616,4925086
5045555200,93220757504,59928576,1228877824,8.589,0.502,90.909,0,0,114703538,4888590
5044432896,93221875712,59928576,1228881920,8.035,0.476,91.489,0,0,115734752,4766192
5046116352,93220184064,59928576,1228890112,8.696,0.390,90.914,0,0,111968297,4730156
5115162624,93151137792,59928576,1228890112,8.643,1.315,90.042,0,0,111890596,4176014
5116465152,93149822976,59936768,1228894208,8.340,0.474,91.185,0,0,114050954,6088780
5119180800,93147099136,59936768,1228902400,8.652,0.447,90.901,0,0,117479122,5843994
5131595776,93134680064,59936768,1228906496,8.883,0.531,90.587,0,0,119094546,5318688
5130903552,93135360000,59944960,1228910592,8.051,0.559,91.389,0,0,115590836,5099516
5136916480,93129342976,59944960,1228914688,8.471,0.447,91.082,0,0,113491252,5199332
5151678464,93114568704,59953152,1228918784,8.811,0.392,90.797,0,0,116325168,5240208
5152452608,93113790464,59953152,1228922880,8.540,0.391,91.069,0,0,111564316,5175732
5153832960,93112406016,59953152,1228926976,8.170,0.448,91.382,0,0,117750150,5117784
5154656256,93111578624,59953152,1228931072,9.279,0.587,90.134,0,0,118089612,5094068
5155717120,93110509568,59953152,1228939264,8.589,0.446,90.965,0,0,117036632,5038132
5156544512,93109669888,59961344,1228943360,8.977,0.418,90.605,0,0,115720280,4890600
5159284736,93106925568,59961344,1228947456,8.440,0.475,91.084,0,0,120012058,5144784
5160529920,93105770496,59961344,1228947456,9.012,0.558,90.430,0,0,116861190,6124804
5160361984,93105930240,59969536,1228947456,9.419,0.583,89.997,0,0,118722874,5368798
5160759296,93105524736,59969536,1228955648,8.378,0.531,91.092,0,0,118457536,5993674
5162102784,93104164864,59977728,1228963840,8.557,0.391,91.051,0,0,110830964,4842658
5162532864,93103730688,59977728,1228967936,8.873,0.614,90.513,0,0,115402604,5619868
5164589056,93101670400,59977728,1228972032,8.642,0.446,90.912,0,0,115668838,4645550
5166989312,93099261952,59985920,1228972032,8.687,0.559,90.754,0,0,119640122,5222488
5167607808,93098635264,59985920,1228980224,8.796,0.532,90.672,0,0,115244244,5644876
5167648768,93098582016,59994112,1228984320,9.273,0.529,90.198,0,0,114086568,6613254
5169422336,93096804352,59994112,1228988416,9.177,0.502,90.321,0,0,114339250,5048834
5169516544,93096701952,59994112,1228996608,9.358,0.364,90.277,0,0,111944566,5710572
5169377280,93096837120,59994112,1229000704,9.159,0.419,90.422,0,0,113670132,5201092
5170917376,93095292928,59994112,1229004800,10.253,0.472,89.275,0,0,122997348,4909156
5172604928,93093593088,60002304,1229008896,9.413,0.391,90.196,0,0,116114114,6315054
5171376128,93094817792,60002304,1229012992,9.615,0.474,89.911,0,0,116049808,5633330
5172400128,93093789696,60002304,1229017088,10.172,0.500,89.327,0,0,113398146,4809248
5184987136,93081198592,60002304,1229021184,9.315,0.448,90.238,0,0,117928681,5140532
5395763200,92870414336,60002304,1229029376,11.669,1.452,86.879,0,0,120316994,5679324
5630251008,92635910144,60010496,1229033472,8.956,1.618,89.425,0,0,113616302,4503384
5629390848,92636770304,60010496,1229033472,9.202,0.500,90.297,0,0,116413434,5627200
5634060288,92632092672,60010496,1229041664,9.116,0.447,90.436,0,0,115505840,5387036
5663408128,92602732544,60018688,1229045760,9.718,1.033,89.249,0,0,118491206,4604748
5726552064,92539584512,60018688,1229049856,9.289,1.646,89.066,0,0,114241232,5086954
6173900800,92092223488,60026880,1229053952,8.756,1.115,90.128,0,0,111993826,5159146
6339444736,91926675456,60026880,1229058048,9.147,2.294,88.559,0,0,121481408,5755176
6659936256,91606179840,60026880,1229062144,8.824,1.737,89.440,0,0,122482174,5963884
7416360960,90849742848,60035072,1229066240,8.236,2.401,89.363,0,0,116473768,5805176
7422398464,90843697152,60035072,1229074432,9.439,0.475,90.087,0,0,119281686,5702676
7638765568,90627317760,60043264,1229078528,9.192,2.646,88.162,0,0,116370536,4302396
7657435136,90608644096,60043264,1229082624,10.575,0.614,88.811,0,0,118882982,4868818
7670185984,90595893248,60043264,1229082624,8.679,0.756,90.566,0,0,116881964,5883558
7661518848,90604544000,60051456,1229090816,8.261,0.474,91.264,0,0,118742728,5383042
7664427008,90601631744,60051456,1229094912,8.173,0.642,91.185,0,0,110522000,5062658
7667662848,90598379520,60059648,1229099008,8.758,0.504,90.711,0.028,0,120000568,5043772
7711399936,90554638336,60059648,1229103104,8.883,0.863,90.253,0,0,118745348,4955860
7785676800,90480357376,60059648,1229107200,8.590,1.651,89.759,0,0,114190926,5559746
7788298240,90477723648,60067840,1229111296,8.203,0.446,91.350,0,0,111663972,5400350
7857774592,90408243200,60067840,1229115392,7.865,1.651,90.484,0,0,109406564,4200666
7930146816,90335854592,60076032,1229123584,8.855,1.866,89.279,0,0,115529384,4490152
7957262336,90308734976,60076032,1229127680,8.415,0.919,90.666,0,0,113670812,5073426
7959171072,90306822144,60076032,1229131776,9.091,0.390,90.519,0,0,116087164,5023172
7954255872,90311733248,60076032,1229135872,8.410,0.447,91.143,0,0,119458550,4418964
7955202048,90310774784,60084224,1229139968,8.982,0.502,90.516,0,0,118228130,5062498
7954624512,90311340032,60092416,1229144064,8.614,0.362,91.023,0,0,114863832,5772598
7956455424,90309505024,60092416,1229148160,8.964,0.419,90.617,0,0,113672930,4445748
7957065728,90308890624,60092416,1229152256,9.015,0.614,90.371,0,0,126062336,5207058
7956434944,90309513216,60092416,1229160448,9.093,0.530,90.377,0,0,115957841,4916882
7957536768,90308399104,60100608,1229164544,8.200,0.420,91.380,0,0,118357380,5596522
7986868224,90279055360,60108800,1229168640,8.847,1.144,90.008,0,0,112045348,5880506
7990968320,90274951168,60108800,1229172736,9.916,0.447,89.637,0,0,116740126,5806930
7990734848,90275180544,60108800,1229176832,8.781,0.475,90.744,0,0,114004654,6537232
7992520704,90273386496,60108800,1229185024,9.119,0.474,90.407,0,0,118045758,5197256
7992291328,90273599488,60116992,1229193216,9.205,0.586,90.209,0,0,119677658,4521536
7992078336,90273800192,60125184,1229197312,9.344,0.530,90.126,0,0,118308152,5386518
7992872960,90273001472,60125184,1229201408,8.923,0.503,90.573,0,0,118510796,5581796
7992963072,90272907264,60125184,1229205504,9.381,0.420,90.199,0,0,115583664,5677138
7992287232,90273579008,60125184,1229209600,9.007,0.392,90.601,0,0,113814718,5286292
7996317696,90269536256,60133376,1229213696,8.701,0.449,90.850,0,0,120518724,5544674
7995002880,90270838784,60141568,1229217792,9.605,0.336,90.059,0,0,120410826,4268868
7994830848,90271002624,60141568,1229225984,8.852,0.364,90.784,0,0,122417842,5364516
7992901632,90272927744,60141568,1229230080,9.010,0.530,90.460,0,0,115595024,6252720
8073838592,90191986688,60141568,1229234176,8.761,1.060,90.179,0,0,107851400,5586878
8093892608,90171920384,60149760,1229238272,9.617,1.174,89.209,0,0,118338472,5364908
8169304064,90096496640,60157952,1229242368,10.377,1.138,88.485,0,0,118353726,5471942
8220786688,90045009920,60157952,1229246464,9.022,1.117,89.860,0,0,118621278,5433456
8298569728,89967222784,60157952,1229250560,9.933,1.558,88.509,0,0,116854026,5121158
8326524928,89939259392,60157952,1229258752,9.902,0.671,89.427,0,0,113609432,4656226
8407547904,89858224128,60166144,1229262848,9.174,1.751,89.074,0,0,107167796,4935674
8461504512,89804259328,60174336,1229262848,8.077,0.978,90.945,0,0,111172502,5991562
8515600384,89750155264,60174336,1229271040,8.921,0.923,90.157,0,0,115817468,5524718
8597655552,89668096000,60174336,1229275136,8.800,1.170,90.031,0,0,115880852,5064604
8654647296,89611100160,60174336,1229279232,7.153,1.030,91.817,0,0,112847224,4755384
8707043328,89558691840,60182528,1229283328,7.896,0.949,91.155,0,0,111688672,4886360
8790835200,89474883584,60190720,1229291520,8.499,1.370,90.103,0.028,0,117486256,5566426
8845127680,89420591104,60190720,1229291520,8.229,1.199,90.572,0,0,119260107,5202004
8928256000,89337458688,60190720,1229295616,8.001,1.645,90.354,0,0,116459382,5138778
8986529792,89279176704,60190720,1229303808,8.245,0.897,90.858,0,0,107717019,4944384
9048838144,89216856064,60198912,1229307904,8.616,0.973,90.411,0,0,113878432,5191496
9106096128,89159553024,60207104,1229312000,7.135,0.644,92.222,0,0,113338574,4904220
9166442496,89099206656,60207104,1229312000,9.423,1.171,89.406,0,0,122329056,5796486
9251803136,89013837824,60207104,1229320192,8.585,0.979,90.436,0,0,117094212,4292160
9311985664,88953651200,60207104,1229324288,7.637,1.282,91.081,0,0,112530994,5237460
9367666688,88897966080,60207104,1229328384,7.958,0.807,91.235,0,0,112311146,5288490
9407242240,88858365952,60223488,1229336576,9.362,0.864,89.774,0,0,113833546,6836210
9461493760,88804110336,60223488,1229340672,8.882,0.813,90.305,0,0,117689914,4696006
9524170752,88741429248,60223488,1229344768,8.599,0.840,90.560,0,0,114238768,5721644
9586520064,88679079936,60223488,1229344768,7.570,1.257,91.173,0,0,113990436,4906370
9645445120,88620146688,60223488,1229352960,8.119,1.283,90.597,0,0,120257796,5250864
9711812608,88553758720,60239872,1229357056,9.114,0.978,89.908,0,0,111930040,5301748
9775161344,88490405888,60239872,1229361152,8.042,0.949,91.008,0,0,111264744,6202054
9846349824,88419209216,60239872,1229369344,9.124,1.446,89.430,0,0,110767044,5042696
9907482624,88358064128,60239872,1229377536,7.111,1.283,91.606,0,0,117072334,5136094
9972695040,88292851712,60239872,1229377536,7.935,0.922,91.143,0,0,122264394,5043016
10038751232,88226775040,60256256,1229381632,8.655,1.359,89.986,0,0,111830766,5327226
10107117568,88158400512,60256256,1229389824,7.623,0.953,91.424,0,0,109650720,4431340
10164649984,88100864000,60256256,1229393920,7.626,1.225,91.149,0,0,112901170,4405254
10230808576,88034701312,60256256,1229398016,7.340,1.284,91.376,0,0,113129258,5350658
10305150976,87960354816,60256256,1229402112,7.833,1.806,90.361,0,0,121210798,4732782
10375876608,87889604608,60272640,1229410304,9.480,1.140,89.380,0,0,115244410,6093298
10414985216,87850491904,60272640,1229414400,8.245,0.811,90.945,0,0,119729800,5669686
10484133888,87781335040,60272640,1229422592,9.268,1.475,89.257,0,0,116867258,6201002
10552283136,87713181696,60272640,1229426688,7.606,0.951,91.443,0,0,116620310,5151246
10620227584,87645229056,60272640,1229430784,9.398,1.171,89.431,0,0,121556786,6399832
10657329152,87608098816,60293120,1229438976,8.673,0.725,90.602,0,0,108063452,5610150
10721341440,87544082432,60293120,1229443072,8.517,1.503,89.981,0,0,113992616,5595040
10798051328,87467372544,60293120,1229443072,8.403,1.312,90.285,0,0,117210090,6518332
10870620160,87394795520,60293120,1229451264,9.099,1.456,89.446,0,0,120245641,6016258
10945740800,87319670784,60293120,1229455360,9.050,1.289,89.661,0,0,116314778,5840312
10976808960,87288582144,60309504,1229459456,7.183,0.950,91.839,0.028,0,115641222,5926994
11050663936,87214718976,60309504,1229467648,8.445,1.342,90.213,0,0,110192050,5710744
11126095872,87139287040,60309504,1229467648,8.164,1.755,90.081,0,0,122518246,5248346
11202666496,87062704128,60309504,1229479936,9.213,1.176,89.611,0,0,116464428,7804640
11258540032,87006826496,60309504,1229484032,9.431,1.172,89.397,0,0,120659998,5115634
11295453184,86969901056,60325888,1229479936,8.745,0.671,90.584,0,0,118365544,5422590
11375742976,86889598976,60325888,1229492224,8.722,1.611,89.667,0,0,114634322,5773526
11452436480,86812897280,60325888,1229500416,7.999,1.394,90.608,0,0,114511468,4364048
11487625216,86777704448,60325888,1229504512,7.157,0.919,91.924,0,0,115708922,5682922
11568951296,86696378368,60325888,1229504512,8.037,1.363,90.601,0,0,117102058,4922638
11645128704,86620106752,60342272,1229508608,7.932,1.559,90.509,0,0,112161610,4125736
11684528128,86580699136,60342272,1229516800,8.459,0.751,90.790,0,0,110926258,5057346
11760209920,86505013248,60342272,1229520896,7.361,1.427,91.212,0,0,119403170,5159328
11836096512,86428983296,60342272,1229660160,7.471,1.422,91.107,0,0,116955194,5756024
11877257216,86387818496,60342272,1229664256,8.944,0.917,90.139,0,0,117411972,4438806
11955740672,86309330944,60342272,1229668352,8.017,1.536,90.447,0,0,118215798,4869072
12002312192,86262738944,60358656,1229672448,8.967,0.888,90.144,0,0,115052924,6331174
12083412992,86181634048,60358656,1229676544,9.451,1.524,89.024,0,0,120319832,5932538
12164935680,86100103168,60358656,1229684736,6.428,0.922,92.650,0,0,108337142,4690836
12196794368,86068240384,60358656,1229688832,7.374,1.425,91.201,0,0,113273780,4595566
12258050048,86006980608,60358656,1229692928,8.593,1.363,90.044,0,0,120049810,5543152
12298297344,85966725120,60366848,1229692928,8.391,1.087,90.521,0,0,110910978,5355028
12382375936,85882638336,60366848,1229701120,8.607,1.560,89.833,0,0,114217092,5889474
12426133504,85838876672,60366848,1229705216,6.510,0.978,92.512,0,0,112910680,5470256
12506898432,85758107648,60366848,1229709312,8.527,1.094,90.379,0,0,115993522,4967240
12551323648,85713674240,60366848,1229717504,8.161,1.118,90.721,0,0,118337268,5535122
12638408704,85626568704,60383232,1229721600,8.261,1.264,90.475,0,0,115069226,5787010
12679086080,85585891328,60383232,1229721600,8.270,0.531,91.199,0,0,114479546,5691214
12764299264,85500669952,60383232,1229729792,8.738,1.312,89.950,0,0,122008683,5369234
12809859072,85455106048,60383232,1229733888,8.312,0.644,91.044,0,0,107443804,5797072
12896927744,85367992320,60383232,1229737984,8.852,1.508,89.640,0,0,110893042,6212128
12934680576,85330214912,60399616,1229746176,7.439,0.724,91.836,0,0,115393780,5330484
13025566720,85239324672,60399616,1229750272,7.817,1.513,90.670,0,0,120085832,5180728
13072420864,85192470528,60399616,1229750272,9.093,1.060,89.847,0,0,113117656,5924594
13085847552,85178953728,60399616,1229758464,7.117,0.698,92.185,0,0,111069566,5711680
13177544704,85087252480,60399616,1229762560,9.320,1.914,88.766,0,0,117286126,5900016
13224337408,85040447488,60407808,1229766656,8.642,0.836,90.521,0,0,115865998,5819306
13312892928,84951875584,60416000,1229774848,8.788,1.064,90.148,0,0,114663410,5526964
13354905600,84909850624,60424192,1229778944,6.422,0.757,92.821,0,0,116214832,4868994
13445869568,84818886656,60424192,1229778944,8.896,1.394,89.710,0,0,119215568,5773268
13494198272,84770545664,60424192,1229791232,9.468,1.225,89.307,0,0,120123520,6018394
13530263552,84734472192,60424192,1229795328,7.895,0.751,91.354,0,0,115651358,5749286
13624963072,84639764480,60424192,1229803520,9.025,1.588,89.387,0,0,116803070,6812538
13671747584,84592967680,60432384,1229807616,8.997,0.866,90.137,0,0,122258728,5207392
13763760128,84500955136,60432384,1229807616,8.986,0.871,90.143,0,0,117947992,5395624
13794938880,84469772288,60432384,1229811712,6.458,0.895,92.647,0,0,114264350,5571684
13846528000,84418166784,60440576,1229819904,9.086,1.059,89.827,0.028,0,116806908,4923464
13942153216,84322537472,60440576,1229824000,7.854,1.705,90.442,0,0,113216226,4760902
13986037760,84278648832,60440576,1229828096,5.881,0.924,93.195,0,0,113817064,4197138
14035615744,84229058560,60448768,1229832192,6.777,1.036,92.187,0,0,108486228,4462672
14131769344,84132900864,60448768,1229836288,9.081,1.565,89.355,0,0,118463090,4318610
14171140096,84093526016,60448768,1229840384,6.816,0.782,92.402,0,0,117946498,5376906
14228152320,84036501504,60456960,1229844480,8.961,0.838,90.201,0,0,122879682,5294172
14318018560,83946631168,60456960,1229848576,8.056,1.472,90.472,0,0,116426848,5153856
14367092736,83897540608,60465152,1229856768,7.205,1.033,91.762,0,0,117082966,5046338
14417039360,83847589888,60465152,1229860864,8.501,1.087,90.412,0,0,115334150,5277298
14514257920,83750371328,60465152,1229860864,8.187,1.587,90.226,0,0,117966006,5254686
14565920768,83698704384,60465152,1229864960,7.464,1.062,91.473,0,0,120594218,4745728
14614663168,83649953792,60465152,1229873152,8.429,0.670,90.901,0,0,112452517,4707568
14663659520,83600945152,60473344,1229877248,6.444,1.172,92.385,0,0,114414314,4642558
14766551040,83498049536,60473344,1229881344,8.489,1.257,90.254,0,0,122888722,5320904
14815084544,83449511936,60473344,1229885440,8.846,1.137,90.017,0,0,114204676,5831870
14849236992,83415343104,60481536,1229893632,8.163,0.839,90.998,0,0,115088844,5904486
14903832576,83360743424,60481536,1229897728,9.198,0.727,90.075,0,0,120026990,5578774
15005597696,83258970112,60489728,1229897728,8.134,2.221,89.645,0,0,118859432,4937764
15050727424,83213832192,60489728,1229905920,7.454,0.865,91.681,0,0,113385626,4710936
15105843200,83158712320,60489728,1229910016,7.594,0.865,91.541,0,0,111135114,5062960
15154860032,83109679104,60497920,1229914112,6.532,0.981,92.487,0,0,115495036,4963398
15265177600,82999345152,60506112,1229918208,9.911,1.535,88.554,0,0,115130488,6459266
15318384640,82946125824,60506112,1229930496,9.254,0.978,89.768,0,0,105597584,5464132
15369482240,82895028224,60506112,1229930496,7.241,0.561,92.198,0,0,86905014,5673552
15371964416,82892537856,60506112,1229938688,7.292,0.278,92.430,0,0,75386128,4820260
15425908736,82838581248,60514304,1229938688,8.157,0.807,91.036,0,0,62163036,4625594
15477776384,82786705408,60522496,1229938688,5.424,0.946,93.630,0,0,45873530,3797400
15480188928,82784280576,60522496,1229950976,6.271,0.195,93.534,0,0,32933676,4340796
15478886400,82785583104,60522496,1229950976,5.171,0.139,94.690,0,0,22719992,3696454
15481843712,82782625792,60522496,1229950976,5.810,0.111,94.078,0,0,4051200,3412132
15482654720,82781810688,60522496,1229955072,4.389,0.083,95.528,0,0,47264,3469464
15484473344,82779975680,60538880,1229955072,5.699,0.056,94.245,0,0,44430,3479534
15535030272,82729418752,60538880,1229955072,6.353,0.362,93.285,0,0,49208,3315828
15535509504,82728935424,60538880,1229959168,4.557,0.083,95.360,0,0,42984,3567412
15535898624,82728546304,60538880,1229959168,4.256,0.028,95.716,0,0,36934,2572676
15538315264,82726129664,60538880,1229959168,5.033,0.028,94.939,0,0,59826,4242108
15541141504,82723291136,60547072,1229963264,4.953,0.056,94.992,0,0,52382,2905352
15541297152,82723135488,60547072,1229963264,3.837,0.056,96.108,0,0,49244,2498886
15546138624,82718294016,60547072,1229963264,5.444,0.083,94.472,0,0,45630,2832156
15547809792,82716618752,60547072,1229967360,4.558,0.056,95.386,0,0,57996,3729914
15550201856,82714226688,60547072,1229967360,4.467,0.028,95.505,0,0,33836,2325984
15551598592,82712809472,60563456,1229971456,4.775,0.056,95.169,0,0,46099,3207550
15553425408,82710978560,60563456,1229975552,6.098,0.083,93.819,0,0,49840,3965132
15554011136,82710392832,60563456,1229975552,4.860,0.028,95.112,0,0,79648,3657276
15555272704,82709131264,60563456,1229975552,4.500,0.028,95.472,0,0,55540,2918802
15557976064,82706423808,60563456,1229979648,5.377,0,94.623,0,0,36176,2800368
15558422528,82705969152,60571648,1229979648,4.156,0.055,95.788,0,0,41200,2960446
15562715136,82701676544,60571648,1229979648,5.552,0.055,94.392,0,0,40752,2916362
15563100160,82701287424,60571648,1229983744,4.218,0.055,95.727,0,0,42926,3039964
15563489280,82700898304,60571648,1229983744,4.513,0.111,95.377,0,0,25416,1917134
15563669504,82700709888,60579840,1229983744,4.730,0.055,95.214,0,0,14568,1325506
1555296256,96709074944,60588032,1229983744,0.500,0.111,99.389,0,0,5428,459204
1546743808,96717848576,60588032,1229762560,0.028,0.028,99.944,0,0,1052,0
1565437952,96698355712,60588032,1230028800,0.611,0.222,99.166,0,0,401323,23248
