172.16.66.55 : 15.13 10.31 10.30 10.31 10.27 10.27 10.28 10.27 10.32 10.29
172.16.66.56 : 20.06 10.25 10.25 10.26 10.21 10.21 10.28 - 10.19 10.26
172.16.66.57 : 2.87 0.23 0.24 0.22 0.20 0.22 0.23 0.22 0.21 0.22
172.16.66.58 : 4.36 0.21 0.20 0.20 0.20 0.22 0.20 0.23 0.20 0.22
172.16.66.59 : 3.36 0.22 0.22 0.23 0.22 0.22 0.23 0.22 0.22 0.23
172.16.66.6  : 1.04 0.19 0.18 0.17 0.17 0.18 0.18 0.19 0.18 0.18
172.16.66.60 : 0.17 0.24 0.23 0.23 0.22 0.20 0.20 0.23 0.22 0.23
172.16.66.61 : 3.63 0.17 0.23 0.23 0.24 0.23 0.23 0.24 0.22 0.23
172.16.66.62 : 0.21 0.24 0.21 0.22 0.23 0.23 0.24 0.20 0.23 0.22
172.16.66.64 : 0.24 0.24 0.23 0.22 0.14 0.23 0.23 0.22 0.22 0.22
172.16.66.65 : 0.14 0.21 0.08 0.13 0.21 0.13 0.08 0.18 0.08 0.08
172.16.66.66 : 0.21 0.22 0.24 0.16 0.21 0.24 0.22 0.22 0.23 0.16
172.16.66.67 : 0.04 0.03 0.03 0.03 0.03 0.03 0.03 0.03 0.03 0.03
172.16.66.69 : 0.25 0.22 0.23 0.20 0.24 0.20 0.23 0.23 0.22 0.23
172.16.66.7  : 11.10 10.40 10.39 10.38 10.40 - 10.42 - 10.41 10.36
172.16.66.70 : 11.15 10.37 10.40 10.36 10.37 10.40 10.40 10.41 - 10.40
172.16.66.71 : 11.12 10.27 10.36 10.32 10.27 10.36 10.32 10.36 10.34 10.36
172.16.66.72 : 11.13 10.37 10.35 10.40 10.37 10.37 10.37 10.38 10.35 10.39
172.16.66.73 : 11.17 - 10.36 10.37 10.36 10.37 10.35 10.35 10.33 10.35
172.16.66.74 : 10.72 10.35 10.37 10.34 10.36 10.37 10.36 10.35 10.34 10.35
172.16.66.75 : 11.00 10.33 10.32 10.34 10.36 10.30 10.35 10.34 10.36 10.35
172.16.66.76 : - 10.26 10.26 10.24 10.27 10.26 10.27 10.26 10.25 10.27
172.16.66.77 : 11.14 10.39 10.40 10.32 10.41 10.27 10.36 10.41 10.37 10.41
172.16.66.78 : 10.67 10.30 10.29 10.29 10.30 10.29 10.29 10.27 10.29 10.31
172.16.66.79 : 11.05 10.32 10.31 10.27 10.30 10.36 10.33 10.35 10.35 10.40
172.16.66.8  : 11.11 10.37 10.36 10.36 10.33 10.35 10.36 10.34 10.35 10.36
172.16.66.80 : 11.08 4.31 4.32 4.33 4.28 4.31 4.32 4.31 4.21 4.31

      27 targets
      27 alive
       0 unreachable
       0 unknown addresses

       5 timeouts (waiting for response)
     270 ICMP Echos sent
     264 ICMP Echo Replies received
       0 other ICMP received

 0.03 ms (min round trip time)
 5.65 ms (avg round trip time)
 20.0 ms (max round trip time)
       10.225 sec (elapsed real time)

