"Dstat 0.7.3 CSV output"
"Author:","Dag Wieers <dag@wieers.com>",,,,"URL:","http://dag.wieers.com/home-made/dstat/"
"Host:","gros-50.nancy.grid5000.fr",,,,"User:","root"
"Cmdline:","dstat -m -c -n -o dstat.csv",,,,"Date:","24 May 2020 21:38:16 CEST"
"memory usage",,,,"total cpu usage",,,,,"net/total",
"used","free","buff","cach","usr","sys","idl","wai","stl","recv","send"
3067891712,87457148928,68247552,8732733440,0.276,0.125,99.535,0.064,0,0,0
3063967744,87460929536,68280320,8732868608,0.666,0.527,98.445,0.361,0,397362,30794
3074064384,87450566656,68280320,8733130752,0.250,0.139,99.611,0,0,393732,10632
3059499008,87464931328,68292608,8733319168,0.946,0.640,98.414,0,0,393390,22392
3058540544,87466336256,68292608,8732872704,0.028,0.028,99.944,0,0,3516,1164
3056201728,87468154880,68308992,8733331456,0.723,0.389,98.888,0,0,396923,29824
3057037312,87467720704,68337664,8732901376,0.807,0.668,98.526,0,0,562856,34894
3099541504,87424733184,68354048,8733356032,1.029,0.556,98.415,0,0,770428,29828
3059625984,87465082880,68366336,8732909568,0.333,0.194,99.472,0,0,5356,5168
3060207616,87464443904,68366336,8732909568,1.139,0.194,98.666,0,0,232298,11392
3067432960,87457005568,68382720,8733110272,0.445,0.278,99.277,0,0,515132,27780
3067670528,87456755712,68395008,8733110272,0.028,0.028,99.944,0,0,8142,1568
3067920384,87456505856,68395008,8733110272,0.028,0.028,99.944,0,0,16886,4776
3067920384,87456505856,68395008,8733110272,0,0.028,99.972,0,0,17914,1568
3067908096,87456505856,68407296,8733110272,0.028,0,99.972,0,0,18542,1568
3067899904,87456514048,68407296,8733110272,0.056,0.056,99.889,0,0,14514,2384
3067891712,87456514048,68415488,8733110272,0.028,0,99.972,0,0,9902,1568
3067891712,87456514048,68415488,8733110272,0,0.028,99.972,0,0,8690,1568
3067891712,87456514048,68415488,8733110272,0.056,0,99.944,0,0,5418,1568
3060318208,87464087552,68415488,8733110272,0.250,0.083,99.666,0,0,177116,18112
3060068352,87464509440,68427776,8732925952,0.028,0.028,99.917,0.028,0,2247,662
3060047872,87464509440,68448256,8732925952,0.056,0,99.944,0,0,2280,0
3060047872,87464509440,68448256,8732925952,0,0.028,99.972,0,0,3380,180
3060047872,87464509440,68448256,8732925952,0.028,0,99.972,0,0,3800,0
3060047872,87464509440,68448256,8732925952,0,0.028,99.972,0,0,6190,0
3062140928,87462313984,68456448,8732930048,0.893,0.223,98.884,0,0,1465880,687293684
3061108736,87463329792,68472832,8732930048,0.056,0.028,99.917,0,0,29800,50980
3061108736,87463329792,68472832,8732930048,0.083,0.083,99.833,0,0,33782,49216
3061108736,87463329792,68472832,8732930048,0.111,0.083,99.806,0,0,31482,49660
3061108736,87463329792,68472832,8732930048,0.056,0.056,99.889,0,0,37322,49348
3061137408,87463297024,68481024,8732925952,0.056,0.028,99.917,0,0,47736,55408
3061829632,87462006784,68497408,8733491200,0.083,0.028,99.889,0,0,2583278,2616458
3056070656,87454732288,68505600,8746147840,0.529,0.445,98.999,0.028,0,24942414,25152961
3056304128,87433265152,68505600,8766889984,0.778,0.389,98.834,0,0,44141742,43203951
3055202304,87412330496,68505600,8788287488,1.224,0.278,98.498,0,0,43954350,44405650
3054538752,87389573120,68505600,8811130880,0.418,0.139,99.443,0,0,46971924,29671714
3054989312,87365267456,68521984,8834224128,0.223,0.083,99.694,0,0,46532328,450555
3054276608,87343620096,68530176,8856158208,0.557,0.139,99.053,0.251,0,46016140,107071027
3053273088,87321653248,68530176,8878411776,0.334,0.195,99.471,0,0,46918880,38670480
3053359104,87297830912,68530176,8901439488,0.389,0.167,99.444,0,0,45825511,12781892
3053072384,87276138496,68530176,8922816512,0.223,0.139,99.638,0,0,44564370,724654
3053453312,87253815296,68538368,8944173056,0.362,0.195,99.444,0,0,43731470,114881600
3053338624,87231057920,68538368,8966373376,0.250,0.167,98.942,0.640,0,45426782,1028308
3052945408,87209574400,68546560,8987664384,0.389,0.334,99.249,0.028,0,44904812,105344864
3053445120,87191236608,68554752,9005051904,0.362,0.223,99.416,0,0,35101598,29878124
3053277184,87167655936,68554752,9028104192,0.473,0.250,99.277,0,0,47619628,30302636
3053060096,87147450368,68571136,9047846912,0.223,0.139,99.638,0,0,40498890,18510534
3053215744,87125499904,68571136,9069109248,0.278,0.167,99.555,0,0,43907094,13869448
3057418240,87100608512,68575232,9088970752,0.279,0.223,99.499,0,0,41122468,7874834
3054354432,87080030208,68575232,9111871488,0.362,0.056,99.583,0,0,46382594,2554261
3054510080,87050883072,68575232,9139970048,0.613,0.334,99.053,0,0,58483293,204972323
3053821952,87028916224,68587520,9162055680,0.418,0.223,99.360,0,0,46420446,45949474
3053072384,87007723520,68599808,9183391744,1.782,0.334,97.884,0,0,44910216,44715592
3053006848,86984175616,68599808,9206349824,0.307,0.139,99.554,0,0,47040344,47249464
3053248512,86961160192,68599808,9228525568,0.778,0.361,98.860,0,0,44851366,46039698
3052785664,86938177536,68599808,9251426304,0.750,0.222,99.027,0,0,47236693,47606223
3052101632,86915919872,68608000,9273626624,0.223,0.279,99.498,0,0,46423263,45853861
3051630592,86893903872,68608000,9295638528,0.501,0.251,99.248,0,0,45136324,48737165
3050315776,86871404544,68616192,9318686720,0.974,0.250,98.775,0,0,47735484,103658245
3051290624,86848647168,68616192,9339990016,0.974,0.278,98.747,0,0,44888642,100936070
3050389504,86826663936,68616192,9362178048,0.335,0.279,99.387,0,0,46574222,95854526
3051368448,86802100224,68632576,9385099264,0.529,0.195,99.276,0,0,46772800,84340730
3050954752,86778277888,68632576,9408765952,0.557,0.195,99.248,0,0,48616596,79679710
3050438656,86755811328,68632576,9431048192,0.362,0.223,99.136,0.279,0,46385760,73628988
3050725376,86734311424,68640768,9451622400,0.418,0.167,99.415,0,0,42006896,70407290
3049787392,86713376768,68640768,9472933888,0.390,0.139,99.470,0,0,45322376,73272672
3050070016,86691119104,68657152,9494282240,0.418,0.223,99.359,0,0,43476976,70398672
3048570880,86668894208,68657152,9517322240,0.279,0.195,99.526,0,0,47741376,75425436
3048677376,86645620736,68661248,9540059136,0.252,0.224,98.463,1.062,0,46614206,76864833
3050590208,86621335552,68673536,9561640960,0.501,0.529,96.994,1.976,0,44334746,73337057
3051393024,86598344704,68681728,9583497216,0.556,0.333,99.111,0,0,45864262,74746270
3050586112,86575853568,68689920,9605926912,0.473,0.278,99.249,0,0,45766468,74551972
3050729472,86552297472,68689920,9628778496,0.279,0.307,99.415,0,0,47375816,76522754
3049373696,86529523712,68689920,9652224000,0.528,0.361,99.111,0,0,47853134,76142408
3049811968,86507790336,68689920,9672876032,2.369,0.362,97.269,0,0,43133700,69213220
3049500672,86484484096,68689920,9695830016,0.473,0.139,99.387,0,0,47030762,77533356
3049730048,86466420736,68706304,9713217536,0.528,0.250,99.222,0,0,36401992,64714024
3049431040,86446518272,68706304,9732960256,0.279,0.391,99.330,0,0,40044538,69285534
3049848832,86423179264,68706304,9755156480,0.251,0.279,99.470,0,0,47005300,74242200
3049426944,86400438272,68706304,9777876992,0.529,0.334,99.137,0,0,47570550,75604466
3048181760,86379270144,68706304,9799491584,1.226,0.223,98.551,0,0,42768623,72497964
3047170048,86356738048,68714496,9822433280,0.251,0.251,99.498,0,0,47872366,76714976
3047047168,86334238720,68722688,9844473856,0.446,0.167,99.387,0,0,46554006,74993300
3047436288,86309416960,68722688,9868214272,0.279,0.251,99.470,0,0,48420374,76166648
3046883328,86287192064,68722688,9890373632,0.362,0.223,99.415,0,0,46621470,74918065
3046248448,86263402496,68722688,9914159104,0.390,0.223,99.387,0,0,48012982,76904103
3046338560,86240337920,68739072,9936388096,0.334,0.389,99.277,0,0,46912110,73684389
3046109184,86216306688,68739072,9960050688,0.307,0.195,99.498,0,0,48282006,77441648
3047047168,86191226880,68747264,9983660032,0.418,0.223,99.360,0,0,48783210,79026554
3046707200,86167695360,68747264,10006753280,0.418,0.139,99.443,0,0,48301450,76526740
3046948864,86144905216,68755456,10028781568,0.446,0.278,99.276,0,0,46469270,74089340
3047092224,86120308736,68763648,10052538368,0.390,0.223,99.387,0,0,48295618,78395064
3045756928,86099632128,68763648,10073948160,0.445,0.306,99.249,0,0,44605732,72478851
3046522880,86076100608,68763648,10096078848,0.474,0.251,99.276,0,0,44816166,73899412
3046850560,86053601280,68771840,10117562368,1.950,0.251,97.799,0,0,44721026,72158100
3046326272,86031327232,68775936,10139717632,0.418,0.279,98.941,0.362,0,46628308,75248134
3045888000,86009085952,68792320,10161790976,0.307,0.251,99.442,0,0,45502058,74116102
3046543360,85986603008,68792320,10183102464,0.695,0.333,98.972,0,0,44595970,72705790
3046199296,85962530816,68792320,10206863360,0.362,0.251,99.387,0,0,48016928,78315276
3046260736,85939216384,68792320,10229637120,0.390,0.251,99.359,0,0,47941008,76501104
3046772736,85915508736,68804608,10251984896,1.282,0.362,97.965,0.390,0,45359510,74390840
3046563840,85892235264,68825088,10274869248,0.585,0.362,96.574,2.479,0,47737986,76355050
3047165952,85868703744,68829184,10297110528,0.390,0.390,98.692,0.529,0,46561878,75512622
3047141376,85845929984,68829184,10319310848,0.279,0.195,99.526,0,0,45242540,74245122
3047256064,85827784704,68829184,10336751616,0.417,0.278,99.305,0,0,36616184,65404270
3046473728,85806059520,68829184,10358759424,0.418,0.251,99.331,0,0,45830282,75602990
3046387712,85784059904,68845568,10380156928,0.279,0.279,99.443,0,0,44154562,72338856
3046604800,85761060864,68845568,10402336768,0.445,0.223,99.332,0,0,45797492,73361906
3047673856,85735415808,68845568,10426339328,0.334,0.195,99.471,0,0,40679092,70774800
3046412288,85712625664,68845568,10449883136,0.390,0.195,99.415,0,0,48179854,77370508
3047731200,85687320576,68845568,10473017344,0.307,0.195,99.498,0,0,48241807,74650510
3047706624,85663981568,68853760,10495815680,0.390,0.223,99.387,0,0,47872930,70728082
3047899136,85640724480,68861952,10518142976,0.251,0.307,99.443,0,0,44861402,74581004
3047993344,85617160192,68861952,10541023232,0.362,0.278,99.360,0,0,47078136,75111501
3048804352,85595467776,68861952,10561449984,0.334,0.251,99.415,0,0,43503924,71432777
3047780352,85577596928,68861952,10579726336,2.114,0.278,97.608,0,0,37636318,65915954
3047743488,85557243904,68878336,10599559168,0.390,0.167,99.443,0,0,40308360,69385484
3047305216,85533954048,68878336,10622558208,0.639,0.195,99.166,0,0,48634852,76999758
3047108608,85514858496,68886528,10641453056,0.695,0.223,99.082,0,0,38297572,67321132
3046531072,85493374976,68886528,10662846464,0.390,0.334,99.276,0,0,44648276,72577802
3047387136,85469843456,68886528,10684944384,0.418,0.279,99.304,0,0,45289382,74108880
3047030784,85448118272,68902912,10706370560,1.197,0.390,98.413,0,0,45214690,74598804
3047067648,85425360896,68902912,10728509440,0.335,0.139,99.526,0,0,46144022,75733274
3047550976,85400264704,68902912,10752339968,0.473,0.223,99.304,0,0,48611278,78058224
3047735296,85375950848,68911104,10775920640,0.556,0.334,99.110,0,0,47966366,78802994
3047505920,85352435712,68911104,10798968832,0.335,0.251,99.414,0,0,48062598,77193368
3047497728,85331193856,68919296,10819690496,0.418,0.223,99.360,0,0,42347166,70376888
3047763968,85309194240,68919296,10840825856,0.417,0.334,98.915,0.334,0,44415444,70944606
3048275968,85284098048,68919296,10864640000,0.362,0.278,99.360,0,0,48577918,78577768
3048329216,85260566528,68919296,10887524352,0.556,0.278,99.166,0,0,48372276,73617124
3047923712,85239857152,68927488,10908078080,0.528,0.250,99.222,0,0,43442672,73025580
3048853504,85216841728,68943872,10929532928,0.279,0.223,99.498,0,0,43808546,72414994
3049295872,85192794112,68943872,10952458240,0.390,0.223,99.387,0,0,46125276,76804476
3048886272,85170552832,68960256,10974539776,0.418,0.307,97.043,2.232,0,47304784,75422084
3048153088,85150117888,68968448,10995134464,0.279,0.279,98.241,1.201,0,41724122,71275750
3048488960,85127618560,68968448,11016617984,0.390,0.251,99.360,0,0,44956304,73659302
3047874560,85106393088,68993024,11037884416,2.033,0.251,97.716,0,0,44386094,72634810
3049140224,85080780800,68993024,11061575680,0.501,0.223,99.276,0,0,47560542,77709864
3048534016,85059346432,68993024,11082993664,0.529,0.223,99.249,0,0,44437668,72947870
3048677376,85036572672,68993024,11105091584,0.335,0.168,99.497,0,0,45889160,74721856
3049562112,85012783104,68993024,11127312384,0.418,0.279,99.303,0,0,46323031,74326232
3049480192,84990025728,69001216,11149484032,0.584,0.195,99.194,0.028,0,46556976,76926362
3049353216,84965978112,69009408,11173109760,1.199,0.223,98.577,0,0,47632724,77584458
3049148416,84942430208,69009408,11196149760,0.418,0.306,99.276,0,0,47818388,77513834
3048988672,84919689216,69009408,11218366464,0.362,0.306,99.332,0,0,46885664,75959116
3050160128,84895850496,69009408,11240452096,0.445,0.223,99.332,0,0,45800386,75173518
3049922560,84874108928,69025792,11261800448,0.389,0.334,99.277,0,0,43827868,73230666
3049435136,84851900416,69025792,11283914752,0.362,0.306,99.331,0,0,46423944,75033139
3049549824,84827303936,69033984,11307716608,0.390,0.334,99.276,0,0,48144450,77659313
3048558592,84804804608,69033984,11330592768,0.334,0.223,99.443,0,0,47533222,75905648
3049172992,84779749376,69042176,11354353664,0.529,0.251,99.220,0,0,48598550,77956270
3049549824,84758216704,69050368,11374891008,0.445,0.306,99.249,0,0,42612230,70791052
3049775104,84736733184,69050368,11395518464,0.500,0.278,99.222,0,0,43041378,70116988
3049857024,84714717184,69050368,11416891392,0.446,0.251,99.303,0,0,43460844,71785343
3049324544,84695797760,69058560,11435823104,0.390,0.195,99.415,0,0,40426190,66120751
3049291776,84673798144,69058560,11457187840,0.390,0.279,99.331,0,0,43278446,72953680
3050737664,84648718336,69066752,11480178688,0.391,0.223,99.386,0,0,47813352,76178502
3050741760,84627492864,69066752,11500806144,2.005,0.390,97.605,0,0,42871612,71222100
3050381312,84600623104,69066752,11527675904,0.446,0.223,99.332,0,0,47477850,77073594
3050266624,84577607680,69066752,11550023680,0.418,0.223,99.359,0,0,46186384,72509018
3051134976,84554817536,69074944,11571318784,0.585,0.279,98.802,0.334,0,44517612,73662522
3051114496,84533141504,69091328,11592531968,0.362,0.195,99.442,0,0,42793622,73322476
3051159552,84510052352,69091328,11614818304,1.115,0.362,98.522,0,0,45932090,74325054
3051061248,84487278592,69091328,11637039104,0.251,0.334,99.415,0,0,46328310,74769962
3050930176,84463714304,69091328,11660009472,0.335,0.167,99.498,0,0,47163074,77380020
3050700800,84441231360,69095424,11682136064,0.529,0.362,98.136,0.974,0,45904190,75134488
3050704896,84421054464,69124096,11701837824,0.335,0.418,96.709,2.538,0,41198422,70100762
3050291200,84399329280,69124096,11723300864,0.473,0.250,99.277,0,0,43613038,74168374
3051692032,84375040000,69124096,11745509376,0.362,0.195,99.442,0,0,46173406,75270573
3051483136,84351733760,69124096,11768393728,0.556,0.222,99.221,0,0,48099290,76379408
3051307008,84329250816,69124096,11790487552,0.334,0.279,99.387,0,0,45226595,76379772
3051433984,84306268160,69132288,11812712448,0.418,0.278,99.304,0,0,46692202,75001554
3051573248,84283236352,69140480,11834925056,0.362,0.195,99.442,0,0,44476442,72299212
3050377216,84260995072,69140480,11857764352,0.390,0.223,99.387,0,0,48164564,76733720
3051724800,84236914688,69140480,11879895040,0.391,0.140,99.470,0,0,46135170,74055084
3051339776,84214358016,69140480,11902181376,0.363,0.279,99.359,0,0,45124666,73662622
3051343872,84190842880,69148672,11925090304,0.529,0.251,99.220,0,0,47635610,75613428
3049779200,84169875456,69148672,11947098112,1.865,0.390,97.746,0,0,46719996,74459016
3050930176,84144263168,69156864,11970838528,0.362,0.279,99.359,0,0,48684572,75691652
3050799104,84121006080,69156864,11993690112,0.307,0.251,99.442,0,0,46337522,69180181
3051061248,84097716224,69156864,12016001024,1.114,0.279,98.607,0,0,46680746,75303909
3051638784,84075991040,69173248,12036558848,0.474,0.195,99.331,0,0,42330108,68802508
3052068864,84051959808,69173248,12059496448,0.390,0.279,99.331,0,0,47727568,74511616
3051761664,84030992384,69173248,12080132096,1.308,0.362,98.331,0,0,42402230,72117862
3052621824,84006686720,69181440,12103016448,0.390,0.223,99.387,0,0,48244230,75373940
3052101632,83985235968,69181440,12124385280,0.529,0.223,99.248,0,0,44382892,71604818
3051724800,83962994688,69189632,12146438144,0.445,0.278,99.276,0,0,44665946,74171184
3052011520,83938914304,69189632,12169494528,0.418,0.334,99.248,0,0,47735668,75511616
3052941312,83914317824,69189632,12192489472,0.557,0.195,99.249,0,0,47744222,75902028
3050741760,83894673408,69189632,12213809152,0.362,0.195,99.443,0,0,44432638,72703980
3051511808,83871158272,69197824,12235927552,0.445,0.278,99.277,0,0,45214406,72664554
3051552768,83850706944,69214208,12255723520,0.362,0.251,99.387,0,0,41586468,69450066
3051507712,83826384896,69218304,12279455744,0.528,0.389,98.749,0.334,0,48084572,75677409
3051884544,83803078656,69218304,12301692928,0.390,0.251,99.359,0,0,45715414,75679588
3051249664,83780370432,69218304,12324544512,0.584,0.222,99.194,0,0,48323976,76575980
3051229184,83756048384,69218304,12348207104,0.446,0.279,99.276,0,0,48149774,77609273
3051524096,83733532672,69242880,12369686528,0.529,0.223,99.249,0,0,45108482,72629239
3052535808,83708952576,69242880,12392636416,0.251,0.251,99.163,0.335,0,47719332,76180078
3052691456,83688550400,69259264,12412383232,2.116,0.612,94.850,2.422,0,40811286,66036980
3053232128,83664162816,69267456,12435443712,0.417,0.334,98.553,0.696,0,47062780,76861162
3053461504,83640389632,69267456,12458360832,0.418,0.223,99.359,0,0,48420745,75558848
3052703744,83619471360,69275648,12479586304,0.446,0.279,99.275,0,0,43505644,72626215
3052654592,83595649024,69283840,12502691840,0.501,0.306,99.193,0,0,47932414,76677678
3052883968,83572117504,69283840,12525461504,0.418,0.195,99.387,0,0,47543326,75860408
3053539328,83550842880,69283840,12545359872,1.336,0.250,98.414,0,0,40626330,69237836
3052879872,83528859648,69283840,12567465984,0.474,0.279,99.248,0,0,46146596,74187894
3053387776,83504553984,69292032,12590510080,0.362,0.251,99.387,0,0,47722004,74200522
3053146112,83482312704,69292032,12612513792,0.363,0.167,99.470,0,0,44895890,74672046
3053314048,83460120576,69300224,12633944064,0.473,0.250,99.276,0,0,44362918,72351096
3053322240,83438137344,69308416,12655276032,0.390,0.167,99.443,0,0,43218572,73575852
3053219840,83417944064,69324800,12675022848,0.529,0.223,99.248,0,0,42269364,69444692
3053166592,83395186688,69332992,12697223168,0.362,0.223,99.415,0,0,44602070,71651221
3053940736,83373236224,69332992,12717813760,0.418,0.223,99.360,0,0,43513548,69591770
3054075904,83349655552,69332992,12740648960,0.445,0.278,99.276,0,0,46751170,78070764
3053932544,83327172608,69341184,12762714112,0.473,0.250,99.277,0,0,46805052,74700176
3053932544,83306496000,69341184,12782690304,0.362,0.223,99.415,0,0,39791064,69997071
3054108672,83284205568,69349376,12804120576,0.667,0.250,99.083,0,0,44800550,73205325
3053862912,83266641920,69349376,12821491712,0.335,0.139,99.526,0,0,36656626,63833872
3054026752,83243917312,69349376,12843544576,0.362,0.195,99.443,0,0,45795766,74669874
3055325184,83219095552,69349376,12866449408,2.060,0.306,97.634,0,0,46406100,75805266
3054731264,83195805696,69357568,12889550848,0.306,0.306,99.387,0,0,48241548,77098540
3053604864,83173580800,69365760,12912394240,0.529,0.334,99.138,0,0,47893096,76276580
3054612480,83148001280,69365760,12936200192,0.613,0.279,99.109,0,0,48439394,77323342
3054186496,83124953088,69365760,12959064064,0.446,0.251,99.304,0,0,47832178,75968158
3054850048,83100905472,69365760,12981944320,0.612,0.195,99.194,0,0,47137586,75245868
3054784512,83079421952,69365760,13002702848,1.531,0.223,97.884,0.362,0,42806012,72038936
3054395392,83057156096,69382144,13024788480,0.417,0.278,99.304,0,0,45583960,74425148
3054608384,83035140096,69382144,13046042624,0.418,0.251,99.332,0,0,44546608,71901320
3054665728,83011366912,69382144,13069041664,0.528,0.306,99.166,0,0,46595185,76654692
3054891008,82987819008,69382144,13091868672,0.418,0.167,99.415,0,0,47836350,76422930
3054678016,82965045248,69394432,13114146816,0.612,0.389,97.497,1.502,0,45760323,75219972
3053953024,82941997056,69423104,13137149952,0.363,0.391,97.266,1.980,0,48290622,76628686
3054002176,82917675008,69431296,13160833024,0.418,0.251,99.331,0,0,47851758,78470512
3054223360,82895433728,69431296,13182222336,0.390,0.278,99.332,0,0,44464356,73513260
3054653440,82871369728,69431296,13205192704,0.334,0.251,99.415,0,0,48168248,76491518
3054542848,82848628736,69431296,13227388928,0.306,0.390,99.304,0,0,44959068,74623284
3055165440,82825355264,69439488,13249454080,0.473,0.167,99.360,0,0,46755768,75596848
3055341568,82802323456,69439488,13271650304,0.501,0.250,99.249,0,0,46046490,74110368
3055345664,82779840512,69447680,13293649920,0.362,0.306,99.331,0,0,44879636,75623162
3054743552,82758131712,69447680,13315211264,1.673,0.223,98.104,0,0,44785076,73270982
3055337472,82733293568,69447680,13338857472,0.418,0.195,99.387,0,0,48150032,76649067
3055513600,82709762048,69464064,13361680384,0.446,0.279,99.276,0,0,47527182,76752779
3055480832,82688294912,69464064,13382430720,0.695,0.223,99.082,0,0,43939604,72898278
3055529984,82663989248,69464064,13406126080,0.529,0.195,99.277,0,0,48859806,77075536
3055546368,82641989632,69472256,13427466240,0.529,0.195,99.277,0,0,43167440,72224178
3055276032,82620063744,69472256,13448908800,0.391,0.196,99.413,0,0,45299134,71636982
3055276032,82598080512,69488640,13470273536,0.975,0.334,98.690,0,0,44105664,74000276
3055079424,82576371712,69488640,13491634176,0.363,0.223,99.414,0,0,43243520,71884321
3054669824,82554888192,69488640,13512949760,0.390,0.223,99.387,0,0,44244668,73247575
3053928448,82533953536,69488640,13534175232,0.390,0.279,99.331,0,0,44339002,73379666
3054632960,82511196160,69496832,13555580928,0.251,0.223,99.526,0,0,44813882,73287766
3054137344,82487681024,69513216,13578850304,0.445,0.278,99.276,0,0,48203365,76156700
3054764032,82462842880,69513216,13602390016,0.334,0.279,99.387,0,0,47646893,76261071
3054911488,82440826880,69513216,13623676928,0.390,0.223,99.387,0,0,45002354,69927549
3054514176,82419118080,69513216,13645099008,0.445,0.223,99.332,0,0,43500332,73907858
3054510080,82395602944,69513216,13668012032,0.362,0.251,99.387,0,0,48125404,77251294
3054227456,82374103040,69537792,13689274368,0.306,0.306,99.387,0,0,44818330,74089966
3055378432,82348265472,69537792,13713166336,0.334,0.390,98.942,0.334,0,47764738,78162086
3055067136,82325008384,69537792,13736079360,0.445,0.278,99.276,0,0,47672052,75471766
3054231552,82302267392,69537792,13759029248,0.390,0.195,99.415,0,0,47534304,74601276
3054014464,82280783872,69537792,13780262912,0.445,0.306,99.249,0,0,44452927,73019518
3054239744,82257784832,69554176,13802418176,0.418,0.167,99.414,0,0,45522468,72224956
3053817856,82236043264,69566464,13823873024,2.173,0.362,97.186,0.279,0,44754308,71671748
3054256128,82215591936,69574656,13843484672,0.446,0.446,96.656,2.453,0,41096476,69908906
3054530560,82192318464,69578752,13865766912,0.529,0.306,98.469,0.696,0,44803764,75174652
3054084096,82169819136,69578752,13888012288,1.143,0.279,98.578,0,0,46484570,75849894
3053756416,82149126144,69595136,13908516864,0.390,0.223,99.388,0,0,42793724,69936084
3053674496,82125594624,69595136,13931474944,0.529,0.223,99.249,0,0,47661076,76306170
3054018560,82101547008,69603328,13954453504,0.418,0.223,99.360,0,0,47619002,75784144
3054653440,82077515776,69603328,13977341952,0.335,0.139,99.526,0,0,46205794,64632379
3054145536,82058371072,69611520,13996388352,0.472,0.361,99.167,0,0,40554716,39419675
3054297088,82034565120,69619712,14019338240,0.418,0.278,99.304,0,0,47008246,47530862
3053281280,82012856320,69619712,14041464832,0.334,0.195,99.471,0,0,45413886,45938640
3052425216,81990873088,69619712,14063652864,0.390,0.250,99.360,0,0,46456450,45958404
3068596224,81950674944,69627904,14086795264,0.668,0.334,98.998,0,0,47996940,47663426
