"Dstat 0.7.3 CSV output"
"Author:","Dag Wieers <dag@wieers.com>",,,,"URL:","http://dag.wieers.com/home-made/dstat/"
"Host:","grisou-45.nancy.grid5000.fr",,,,"User:","root"
"Cmdline:","dstat -m -c -n -o dstat.csv",,,,"Date:","24 May 2020 18:19:52 CEST"
"memory usage",,,,"total cpu usage",,,,,"net/total",
"used","free","buff","cach","usr","sys","idl","wai","stl","recv","send"
997756928,133066747904,48713728,722178048,0.758,0.225,98.895,0.122,0,0,0
1009938432,133054402560,48713728,722341888,0.811,0.218,98.067,0.904,0,388426,15520
1002708992,133061873664,48713728,722083840,0.904,0.468,98.628,0,0,387276,26552
991457280,133073125376,48713728,722083840,0.874,0.531,98.596,0,0,5276,15594
990982144,133073600512,48713728,722083840,0,0,100,0,0,1176,662
991215616,133073076224,48738304,722345984,0.937,0.656,98.282,0.125,0,387352,26366
991223808,133073326080,48738304,722087936,0,0,99.124,0.876,0,1338,0
990965760,133073584128,48738304,722087936,0,0,100,0,0,2002,0
990433280,133074116608,48738304,722087936,0,0,100,0,0,874,0
990384128,133074165760,48738304,722087936,0,0,100,0,0,1260,0
990371840,133074165760,48750592,722087936,0,0,99.969,0.031,0,1204,0
990101504,133074423808,48762880,722087936,0,0,99.938,0.062,0,4650,0
990093312,133074432000,48762880,722087936,0,0,100,0,0,3632,550
989835264,133074690048,48762880,722087936,0,0,100,0,0,1656,476
989507584,133075017728,48762880,722087936,0,0,100,0,0,858,148
989507584,133075017728,48762880,722087936,0,0,100,0,0,3958,0
988979200,133075537920,48771072,722087936,0,0,99.969,0.031,0,1550,2968
988979200,133075537920,48771072,722087936,0,0,100,0,0,1408,496
988721152,133075795968,48771072,722087936,0,0,100,0,0,1654,0
989569024,133074685952,48771072,722345984,1.154,0.686,98.160,0,0,391454,30122
987680768,133076832256,48771072,722087936,0,0,100,0,0,1272,148
993546240,133070925824,48771072,722104320,0.250,0.250,99.500,0,0,170492,11768
1002598400,133061373952,48783360,722550784,1.061,0.437,98.439,0.062,0,388616,16654
991596544,133072822272,48783360,722104320,0.094,0.125,99.781,0,0,4298,14380
1003708416,133060251648,48795648,722550784,0.656,0.125,99.125,0.094,0,383344,11158
989982720,133074423808,48795648,722104320,0.375,0.500,99.125,0,0,11248,15044
1002512384,133061443584,48795648,722550784,0.656,0.156,99.188,0,0,383544,11158
992735232,133071663104,48795648,722108416,0.313,0.469,99.218,0,0,5036,15408
992448512,133071937536,48807936,722108416,0,0.031,99.906,0.062,0,6880,148
992190464,133072195584,48820224,722096128,0,0,99.969,0.031,0,8176,84
993542144,133070798848,48820224,722108416,1.810,0.187,98.002,0,0,223618,11580
993574912,133070766080,48820224,722108416,0.031,0,99.969,0,0,3322,2668
993153024,133071187968,48820224,722108416,0,0.031,99.531,0.437,0,7166,84
993992704,133070348288,48820224,722108416,0.031,0.031,99.937,0,0,166564,5452
992653312,133071663104,48832512,722116608,0.500,0.062,99.375,0.062,0,223260,12600
1000591360,133063532544,48844800,722300928,0.281,0.062,99.594,0.062,0,275166,23688
999469056,133064654848,48844800,722300928,0,0,100,0,0,9854,13450
999202816,133064921088,48844800,722300928,0,0,100,0,0,10620,13328
999145472,133064978432,48844800,722300928,0,0.031,99.969,0,0,10456,13328
998612992,133065498624,48857088,722300928,0,0,99.937,0.063,0,10638,13412
998096896,133066014720,48865280,722292736,0,0,99.969,0.031,0,16382,17612
998088704,133066014720,48865280,722300928,0,0,100,0,0,13634,13328
998088704,133066014720,48865280,722300928,0,0,99.781,0.219,0,13364,13328
998064128,133066039296,48865280,722300928,0,0,99.906,0.094,0,14128,13328
990388224,133073715200,48865280,722300928,0.031,0.031,99.937,0,0,13234,14192
989995008,133074280448,48877568,722116608,0,0,99.938,0.062,0,784,84
990027776,133074247680,48877568,722116608,0.281,0.094,99.625,0,0,173990,15432
990019584,133074255872,48877568,722116608,0,0,100,0,0,1370,0
989999104,133074276352,48877568,722116608,0,0,99.688,0.312,0,1160,0
989999104,133074276352,48877568,722116608,0,0,100,0,0,1098,0
989986816,133074276352,48902144,722104320,0,0,99.906,0.094,0,6734,0
989573120,133074677760,48902144,722116608,0,0,100,0,0,1552,0
989573120,133074677760,48902144,722116608,0,0,100,0,0,686,0
989310976,133074935808,48902144,722120704,0,0,99.938,0.062,0,1370,0
989310976,133074935808,48902144,722120704,0,0,100,0,0,1296,662
989302784,133074944000,48902144,722120704,0,0,100,0,0,1144,432
989294592,133074944000,48910336,722120704,0,0,99.969,0.031,0,10652,2364
1000308736,133063663616,48910336,722382848,0.842,0.218,98.939,0,0,392746,14886
989638656,133074145280,48910336,722571264,0.344,0.438,98.811,0.407,0,6526,14584
987758592,133076471808,48910336,722124800,0.031,0,99.969,0,0,2524,1332
987758592,133076471808,48910336,722124800,0,0,100,0,0,4400,0
987217920,133077012480,48910336,722124800,0,0,100,0,0,5806,0
987197440,133077020672,48922624,722124800,0,0,99.938,0.062,0,2800,168
986902528,133077303296,48934912,722124800,0,0,99.937,0.063,0,1542,168
986644480,133077561344,48934912,722124800,0,0,100,0,0,1264,0
986644480,133077561344,48934912,722124800,0,0,100,0,0,738,0
986644480,133077561344,48934912,722124800,0,0,100,0,0,1332,0
986386432,133077819392,48934912,722124800,0,0,100,0,0,3654,0
986378240,133077819392,48943104,722124800,0,0,99.969,0.031,0,1820,0
986120192,133078077440,48943104,722124800,0,0,100,0,0,2776,0
1386352640,132677623808,48943104,722313216,4.445,1.368,94.187,0,0,1004402,41750
4289396736,129773801472,48943104,723038208,29.875,12.118,58.006,0,0,1651648,66128
7648735232,126412599296,48943104,724664320,36.375,13.609,49.953,0.062,0,1325316,55848
10503241728,123556384768,48943104,726282240,33.645,11.631,54.443,0.281,0,1325708,58028
13650161664,120407830528,49012736,727756800,37.931,14.352,46.785,0.932,0,1327998,57172
16778428416,117278007296,49025024,729120768,39.051,14.483,46.309,0.157,0,1647338,62308
19763298304,114291638272,49029120,730521600,35.202,14.263,50.378,0.157,0,1359392,4154402
22767460352,111285919744,49037312,731922432,45.220,12.818,41.806,0.155,0,1520806,22811682
25874128896,108177350656,49041408,733569024,43.560,14.792,41.523,0.125,0,1706740,44636608
28767191040,105282641920,49065984,734994432,40.932,13.193,45.686,0.189,0,1560652,62899809
30569537536,103480299520,49065984,734990336,33.302,8.559,58.014,0.124,0,731162,84938220
30709940224,103339802624,49078272,735055872,13.759,1.345,84.490,0.407,0,849376,107032261
30902960128,103146700800,49078272,735133696,17.747,2.048,79.957,0.248,0,1009678,126588732
31066374144,102983208960,49078272,735211520,17.986,2.659,78.886,0.469,0,1188650,148788580
31260635136,102788804608,49086464,735309824,21.406,2.950,74.011,1.632,0,1391232,170803477
31452127232,102597177344,49086464,735440896,22.600,2.896,74.158,0.346,0,1515512,189220411
31633379328,102415851520,49086464,735514624,22.753,3.576,72.911,0.759,0,1605554,202130969
31731834880,102317244416,49086464,735666176,22.359,2.779,74.336,0.525,0,1592246,202073026
31850741760,102198218752,49086464,735784960,19.166,3.105,77.164,0.565,0,1569134,201984774
31962308608,102086529024,49102848,735883264,16.824,2.888,77.935,2.354,0,1526698,202028188
32034660352,102013747200,49197056,736206848,18.462,3.736,56.766,21.036,0,1544828,202051763
32024203264,102023950336,49197056,736460800,14.446,2.740,82.192,0.623,0,1543202,202035487
32041787392,102006231040,49197056,736595968,11,2.656,85.781,0.562,0,1508318,202137110
32037994496,102009905152,49201152,736706560,10.733,2.184,86.771,0.312,0,1492024,202060214
32035979264,102011781120,49205248,736837632,10.131,2.672,86.638,0.559,0,1459634,202261405
32060936192,101986701312,49213440,736952320,9.008,2.565,87.582,0.845,0,1485088,201988642
32104914944,101942599680,49213440,737075200,8.960,2.506,88.127,0.407,0,1503756,202137702
32135389184,101912014848,49213440,737177600,8.433,2.633,88.495,0.439,0,1478352,202041199
32139816960,101907447808,49213440,737316864,7.448,2.493,89.685,0.374,0,1465056,202125175
32147640320,101899497472,49221632,737435648,6.973,2.595,89.744,0.688,0,1488222,202214443
32151412736,101895614464,49221632,737546240,6.813,1.947,90.989,0.251,0,1500916,202093963
32160808960,101886091264,49221632,737673216,8.453,2.348,88.134,1.064,0,1504976,202025919
32180985856,101865779200,49221632,737808384,7.532,2.049,90.104,0.315,0,1434608,202358518
32197017600,101849636864,49225728,737910784,6.805,2.331,90.584,0.280,0,1483490,202070022
32219181056,101827342336,49229824,738033664,6.961,2.142,90.362,0.535,0,1534718,202038373
32220127232,101826265088,49229824,738164736,5.754,1.834,92.128,0.285,0,1434396,202266492
32240590848,101805686784,49229824,738279424,7.109,2.036,85.907,4.948,0,1468300,202112768
32265175040,101780959232,49229824,738422784,7.093,2.301,88.052,2.554,0,1480624,201900590
32268795904,101777235968,49229824,738521088,6.358,1.754,91.607,0.282,0,1485486,202083343
32302120960,101743755264,49238016,738656256,7.466,2.312,89.566,0.656,0,1488358,202129788
32313729024,101732024320,49238016,738775040,9.281,3.688,86.750,0.281,0,1528294,202024504
32320618496,101725020160,49238016,738885632,6.486,1.889,91.373,0.252,0,1531372,202075174
32330452992,101715099648,49246208,738963456,7.321,2.586,89.688,0.405,0,1504762,202029574
32348528640,101696708608,49246208,739278848,6.997,3.012,89.708,0.282,0,1499496,202131510
32374988800,101670117376,49254400,739393536,6.717,2.405,90.472,0.406,0,1527098,202124392
32385658880,101659340800,49254400,739500032,7.391,2.443,89.884,0.282,0,1459578,202152769
32399511552,101645352960,49254400,739622912,6.309,2.311,91.068,0.312,0,1507332,202288585
32412459008,101632274432,49254400,739749888,6.118,2.298,89.161,2.422,0,1494536,202108937
32437477376,101607153664,49258496,739848192,5.630,2.315,91.774,0.282,0,1461768,202259187
32449327104,101595160576,49262592,739983360,5.987,2.370,91.113,0.530,0,1507546,202006079
32459161600,101585190912,49262592,740114432,5.779,2.249,91.628,0.344,0,1514024,201926690
32459259904,101584965632,49262592,740237312,5.484,1.943,92.259,0.313,0,1498088,202114591
32464134144,101579935744,49262592,740352000,5.280,2.124,91.190,1.406,0,1524310,202299303
32466657280,101577224192,49262592,740470784,5.984,2.171,91.566,0.279,0,1500190,202063936
32466337792,101577408512,49270784,740593664,5.164,1.826,92.569,0.441,0,1391166,202217841
32470446080,101573181440,49270784,740708352,4.763,1.861,93.028,0.347,0,1431890,202090089
32475660288,101567815680,49270784,740827136,6.654,2.031,91.034,0.281,0,1464868,202362119
32479117312,101564293120,49278976,740941824,5.660,2.408,91.057,0.876,0,1489426,201790812
32492470272,101550796800,49283072,741072896,5.973,2.259,90.003,1.764,0,1481528,202250050
32495251456,101547892736,49287168,741191680,5.099,1.700,91.942,1.259,0,1498078,202076372
32493920256,101549117440,49287168,741294080,6.872,2.134,90.524,0.471,0,1507332,202016685
32493879296,101549015040,49287168,741437440,7.601,1.633,90.484,0.283,0,1454142,201966727
32500396032,101542354944,49287168,741556224,8.406,2.210,89.103,0.280,0,1510756,202408268
32522465280,101520019456,49295360,741814272,8.471,2.032,87.434,2.063,0,1495684,201640721
32529006592,101513326592,49303552,741945344,7.249,1.709,90.598,0.443,0,1496830,202031604
32532914176,101509328896,49303552,742035456,9.805,2.289,87.535,0.371,0,1501164,202300081
32535171072,101506904064,49303552,742162432,7.888,2.043,89.723,0.346,0,1524207,202074763
32537534464,101504421888,49303552,742281216,8.260,1.797,89.596,0.347,0,1541346,202311030
32538804224,101503016960,49311744,742408192,8.597,2.196,87.480,1.726,0,1506402,201960799
32536424448,101505257472,49319936,742531072,8.780,2.117,88.512,0.592,0,1522370,202391481
32551211008,101490343936,49319936,742653952,7.482,2.043,90.192,0.283,0,1501358,201980084
32571740160,101469700096,49319936,742768640,8.600,1.820,89.328,0.251,0,1515614,202168871
32589443072,101451862016,49319936,742899712,9.876,2.391,87.391,0.342,0,1535254,202183499
32598560768,101442600960,49328128,743030784,9.592,2.290,85.056,3.063,0,1511918,202158851
32615022592,101426032640,49336320,743129088,9.253,2.094,87.621,1.032,0,1483122,202282244
32633171968,101407744000,49336320,743264256,9.715,2.225,87.684,0.376,0,1490574,202053550
32644714496,101396082688,49336320,743374848,9.649,1.817,88.221,0.313,0,1483376,202254914
32659423232,101381246976,49336320,743501824,10.750,2.169,86.741,0.341,0,1524390,202256698
32676601856,101363953664,49344512,743604224,10.652,2.174,86.025,1.149,0,1495022,201901121
32690749440,101349646336,49352704,743751680,9.733,2.480,83.013,4.774,0,1486920,202217257
32696164352,101344149504,49352704,743833600,7.795,2.089,89.804,0.312,0,1514384,202192154
32741498880,101298659328,49352704,743981056,10.666,1.799,87.157,0.379,0,1487540,202321429
32789422080,101250613248,49352704,744099840,11.139,2.573,85.974,0.314,0,1540386,201863766
32838524928,101201231872,49352704,744374272,9.459,2.209,88.052,0.280,0,1499330,202220553
32907395072,101132263424,49360896,744460288,10.220,1.730,85.660,2.390,0,1459528,201716743
32982614016,101056909312,49369088,744583168,12.383,2.464,84.779,0.374,0,1489572,202223568
33047445504,100991942656,49369088,744714240,10.208,2.265,87.248,0.279,0,1488178,202035039
33127411712,100911833088,49369088,744857600,12.628,2.519,84.541,0.311,0,1530268,202072297
33180921856,100858208256,49369088,744964096,11.087,2.453,86.211,0.248,0,1478478,202334976
33214582784,100824408064,49377280,745091072,9.017,1.885,87.150,1.948,0,1481680,201920765
33262559232,100776321024,49385472,745189376,10.118,2.475,87.067,0.340,0,1507498,202339855
33257234432,100781486080,49385472,745349120,4.843,1.635,93.270,0.252,0,1503716,202088404
33257803776,100780855296,49385472,745410560,4.856,1.974,92.888,0.282,0,1477424,202041841
33257070592,100781453312,49385472,745545728,4.947,2.054,92.688,0.311,0,1477458,202078710
33259753472,100778614784,49393664,745684992,5.798,1.849,90.849,1.504,0,1509620,202118382
33258835968,100779397120,49401856,745811968,6.720,3.035,89.780,0.465,0,1479448,202142241
33261096960,100777009152,49401856,745938944,4.361,1.914,93.505,0.220,0,1486146,202263564
33264365568,100773621760,49401856,746057728,5.391,1.839,92.490,0.280,0,1487252,202226320
33261236224,100776620032,49401856,746188800,3.994,1.855,93.836,0.314,0,1467526,201914602
33265115136,100772622336,49410048,746299392,5.811,1.937,91.284,0.968,0,1483466,202187889
33267687424,100769943552,49410048,746397696,5.099,1.533,91.867,1.501,0,1482814,202204451
33267388416,100770107392,49418240,746520576,3.959,1.634,93.999,0.408,0,1458388,202058224
33269157888,100768169984,49418240,746676224,5.072,2.209,92.377,0.342,0,1442352,202161838
33270005760,100767203328,49418240,746790912,4.345,1.813,93.592,0.250,0,1447212,201874392
33270243328,100766846976,49426432,746893312,4.271,1.476,93.907,0.345,0,1431904,202273941
33270149120,100766797824,49426432,747032576,4.189,1.938,92.779,1.094,0,1478254,202134014
33269985280,100766863360,49426432,747126784,4.086,2.059,93.575,0.281,0,1498108,202320198
33270673408,100766023680,49434624,747261952,4.113,1.633,93.940,0.314,0,1477306,202091589
33271242752,100765351936,49434624,747364352,4.598,2.175,92.886,0.342,0,1489974,202152408
33272713216,100763734016,49442816,747499520,4.333,1.821,93.438,0.408,0,1477300,202208419
33271300096,100765024256,49442816,747622400,3.666,1.707,92.794,1.833,0,1458740,202148995
33273069568,100763115520,49442816,747757568,4.701,1.818,93.200,0.282,0,1462962,201838540
33272406016,100763668480,49451008,747859968,4.139,1.725,93.791,0.345,0,1473136,202386175
33271353344,100764536832,49451008,748040192,4.426,1.507,93.785,0.282,0,1448380,202295373
33271304192,100764442624,49459200,748171264,4.514,2.491,92.528,0.467,0,1426960,202004991
33271275520,100764315648,49459200,748322816,4.626,1.876,92.404,1.094,0,1463630,202065056
33271767040,100763701248,49459200,748441600,4.190,1.939,93.558,0.313,0,1449654,202018829
33271529472,100763811840,49459200,748564480,4.249,1.920,93.579,0.252,0,1483942,202047309
33272180736,100762910720,49459200,748810240,4.294,1.929,93.559,0.218,0,1459196,202078411
33273569280,100761362432,49467392,748957696,4.371,2.029,93.163,0.437,0,1457426,202243245
33272688640,100762148864,49467392,749051904,4.407,1.986,92.706,0.900,0,1481408,202171750
33274413056,100760264704,49475584,749199360,4.550,2.259,91.622,1.569,0,1469114,201637697
33273454592,100761104384,49475584,749318144,4.167,1.723,93.828,0.282,0,1469572,202152132
33273659392,100760764416,49475584,749449216,4.409,1.782,93.496,0.313,0,1481192,202270857
33273634816,100760645632,49483776,749580288,4.372,1.999,93.161,0.468,0,1468266,202031951
33272868864,100761313280,49483776,749678592,4.100,1.534,94.053,0.313,0,1506016,202163513
33273978880,100760055808,49496064,749813760,5.014,2.228,91.643,1.114,0,1473700,202044136
33274146816,100759752704,49496064,749948928,4.618,1.872,93.198,0.312,0,1467690,202075038
33276076032,100757704704,49496064,750055424,5.461,2.110,92.119,0.310,0,1503262,202258416
33276223488,100757348352,49504256,750252032,4.891,2.118,92.430,0.561,0,1485832,202119563
33277829120,100755603456,49504256,750387200,4.696,2.379,92.580,0.344,0,1478132,201986205
33279090688,100754219008,49512448,750501888,5.177,2.170,89.988,2.666,0,1424018,202091396
33278582784,100754604032,49512448,750624768,4.534,1.907,93.277,0.281,0,1474482,202286747
33279160320,100753891328,49512448,750755840,4.463,2.185,93.071,0.281,0,1486438,202078604
33279385600,100753539072,49520640,750870528,4.336,1.885,93.245,0.534,0,1462346,201904734
33279279104,100753379328,49520640,751136768,4.511,1.629,93.609,0.251,0,1491284,202474748
33275994112,100756504576,49528832,751288320,4.395,1.901,85.256,8.448,0,1401152,196699456
33277587456,100754796544,49528832,751394816,5.271,2.109,92.403,0.217,0,1475190,202073957
33275883520,100756369408,49528832,751521792,4.165,2.004,93.580,0.251,0,1484464,202076123
33276776448,100755349504,49537024,751640576,4.757,1.878,92.989,0.376,0,1494360,202403865
33276096512,100755705856,49537024,751906816,3.935,2.030,93.848,0.187,0,1482884,202091798
33276239872,100755447808,49545216,752009216,4.571,2.332,92.444,0.653,0,1478806,202053819
33276526592,100755030016,49553408,752128000,3.570,1.422,92.354,2.654,0,1470720,202036446
33277050880,100754350080,49553408,752279552,4.203,1.945,93.601,0.251,0,1448032,201973884
33277124608,100754157568,49561600,752390144,4.030,1.843,93.877,0.250,0,1435716,202399400
33276932096,100754223104,49561600,752517120,3.979,1.880,93.828,0.313,0,1440448,201951766
33275785216,100755189760,49561600,752652288,3.761,1.880,94.140,0.219,0,1436790,202124141
33276268544,100754599936,49569792,752750592,4.450,2.037,90.881,2.632,0,1434158,200942518
33276583936,100754116608,49569792,752910336,4.195,1.659,93.895,0.250,0,1468604,201789128
33276973056,100753633280,49577984,752992256,4.823,1.805,93.030,0.342,0,1448664,202217807
33277485056,100752953344,49577984,753156096,4.334,1.570,93.813,0.283,0,1485286,202179776
33277620224,100752711680,49577984,753258496,4.413,1.878,93.396,0.313,0,1471890,202129715
33277227008,100752936960,49590272,753405952,4.713,1.922,90.419,2.946,0,1493302,202219853
33278525440,100751515648,49598464,753520640,4.674,2.181,92.646,0.499,0,1465320,202120023
33279299584,100750614528,49606656,753635328,4.877,2.144,92.420,0.559,0,1529294,202152143
33279676416,100750098432,49606656,753766400,4.040,1.879,93.768,0.313,0,1483934,202398987
33280049152,100749582336,49606656,753905664,4.082,1.664,93.909,0.345,0,1451712,201709308
33279746048,100749774848,49606656,754012160,4.386,1.629,93.264,0.721,0,1430142,202281146
33280045056,100749324288,49614848,754151424,4.428,2.276,92.891,0.405,0,1489892,202370289
33280294912,100748926976,49623040,754278400,4.633,2.083,92.848,0.435,0,1441330,201894120
33280188416,100748906496,49623040,754401280,3.777,1.511,94.460,0.252,0,1465350,202325389
33280970752,100748001280,49623040,754524160,4.384,2.114,93.252,0.249,0,1460204,201834902
33280106496,100748615680,49623040,754765824,4.375,2.062,92.625,0.938,0,1465216,202256829
33280315392,100748259328,49631232,754900992,4.095,1.938,92.685,1.282,0,1467916,202147794
33280905216,100747517952,49639424,755036160,4.064,2.063,93.342,0.531,0,1477248,202246007
33282187264,100746108928,49639424,755163136,4.602,2.083,93.035,0.280,0,1441950,201987723
33282486272,100745691136,49639424,755277824,4.165,1.879,93.705,0.251,0,1438292,202389879
33282711552,100745355264,49639424,755388416,4.090,2.029,93.600,0.281,0,1451638,202050666
33281118208,100746809344,49639424,755527680,3.944,1.847,93.678,0.532,0,1484796,202250536
33281261568,100746518528,49655808,755654656,4.512,2.116,92.750,0.622,0,1478326,202273641
33282330624,100745322496,49655808,755781632,3.798,1.758,94.162,0.282,0,1487796,202106789
33282052096,100745486336,49655808,755896320,4.075,1.850,93.636,0.439,0,1503360,202131191
33282531328,100744871936,49655808,756027392,4.024,1.855,93.744,0.377,0,1453844,202054938
33283485696,100743774208,49655808,756166656,4.837,1.891,93.054,0.217,0,1466992,202328375
33283325952,100743806976,49672192,756273152,4.029,1.574,93.673,0.724,0,1462954,202074547
33283424256,100743565312,49672192,756412416,4.524,1.841,93.354,0.281,0,1457768,202200449
33283768320,100743049216,49672192,756584448,4.506,2.685,92.531,0.278,0,1483650,202170002
33284595712,100742123520,49672192,756678656,4.533,2.204,92.952,0.310,0,1405780,202096315
33284620288,100741967872,49672192,756801536,3.822,1.974,91.322,2.882,0,1497466,201927097
33284042752,100742422528,49680384,756912128,4.026,2.060,93.602,0.312,0,1501482,202198339
33284247552,100742066176,49688576,757055488,4.361,2.118,93.178,0.343,0,1725046,202238825
33284091904,100742094848,49688576,757182464,4.494,1.623,93.571,0.312,0,1486972,202115947
33284534272,100741353472,49688576,757448704,3.770,1.979,93.874,0.377,0,1489218,202094779
33284681728,100741095424,49688576,757555200,3.616,1.855,93.836,0.692,0,1486776,202052809
33284812800,100740804608,49696768,757698560,4.223,1.845,93.525,0.407,0,1446588,202192264
33284902912,100740579328,49704960,757821440,4.603,2.410,92.648,0.340,0,1459036,202159069
33284632576,100740640768,49704960,757952512,4.332,1.963,93.456,0.249,0,1480774,202256124
33286029312,100739125248,49704960,758071296,3.984,1.725,94.009,0.282,0,1472548,201961278
33285726208,100739317760,49704960,758181888,3.884,1.831,93.969,0.316,0,1464446,202038348
33285480448,100739416064,49713152,758321152,3.930,2.121,88.989,4.959,0,1463566,202044135
33286184960,100738576384,49713152,758448128,4.225,2.034,93.302,0.438,0,1467948,202321535
33286774784,100737835008,49721344,758579200,4.960,2.139,92.560,0.341,0,1484424,202206664
33286070272,100738416640,49721344,758697984,4.156,1.812,93.719,0.312,0,1484480,202022295
33287131136,100737253376,49721344,758800384,4.283,1.657,93.811,0.250,0,1477130,202317609
33286381568,100737835008,49729536,758956032,4.349,2.175,92.637,0.839,0,1477940,202083752
33287380992,100736720896,49729536,759062528,4.585,2.200,92.968,0.248,0,1455704,202335164
33287090176,100736847872,49737728,759218176,3.956,1.633,94.035,0.377,0,1478360,202095618
33287880704,100735946752,49737728,759328768,3.959,1.665,94.094,0.283,0,1487372,202059489
33288654848,100734914560,49737728,759582720,4.169,1.944,93.605,0.282,0,1474882,202288727
33288163328,100735270912,49745920,759709696,4.480,1.898,90.759,2.862,0,1435156,202198895
33288040448,100735270912,49745920,759832576,4.372,2.326,93.054,0.248,0,1469672,202209446
33288220672,100734947328,49745920,759963648,4.300,2.119,93.362,0.218,0,1465202,201918378
33287290880,100735721472,49754112,760098816,4.480,1.991,93.124,0.404,0,1495810,202237421
33288159232,100734754816,49754112,760197120,4.277,1.842,93.600,0.281,0,1467240,201908605
33287352320,100735430656,49762304,760320000,4.164,1.534,93.519,0.783,0,1471272,202288605
33287581696,100735078400,49762304,760442880,4.171,1.725,93.823,0.282,0,1484108,202158522
33286991872,100735528960,49762304,760561664,4.935,1.707,93.110,0.248,0,1475424,202172113
33287553024,100734820352,49762304,760709120,3.565,1.640,94.574,0.221,0,1425908,202070822
33287245824,100735012864,49762304,760819712,3.772,1.635,94.279,0.314,0,1500496,202006250
33287278592,100734853120,49778688,760930304,3.949,1.630,93.858,0.564,0,1493070,202254393
33287221248,100734754816,49778688,761081856,4.061,2.031,91.565,2.343,0,1450712,202060197
33287684096,100734173184,49778688,761200640,4.137,1.880,93.701,0.282,0,1490964,202177581
33287262208,100734464000,49778688,761323520,4.317,2.174,93.230,0.280,0,1466536,202255301
33287438336,100734173184,49778688,761430016,4.353,2.083,93.315,0.249,0,1498758,202078416
33287806976,100733657088,49786880,761569280,4.863,1.683,92.862,0.592,0,1452246,202089589
33289736192,100731592704,49795072,761696256,4.108,1.756,93.415,0.721,0,1489538,202029723
33287749632,100733431808,49795072,761835520,4.010,1.817,93.954,0.219,0,1490398,202188653
33288171520,100732895232,49795072,761946112,4.177,2.057,93.610,0.156,0,1460444,202027817
33288892416,100732043264,49795072,762077184,3.920,1.850,93.917,0.314,0,1473452,202114337
33289072640,100731719680,49803264,762208256,3.700,1.850,93.854,0.596,0,1483176,202289240
33288908800,100731756544,49803264,762331136,4.313,2.172,90.816,2.699,0,1499862,202321669
33289236480,100731142144,49811456,762605568,4.403,2.233,92.992,0.372,0,1512666,202144400
33289547776,100730724352,49811456,762707968,3.698,1.454,94.501,0.348,0,1445286,201948764
33290428416,100729712640,49811456,762839040,4.121,1.936,93.662,0.281,0,1461068,202094718
33293156352,100726849536,49819648,762961920,4.213,1.998,93.134,0.655,0,1483702,202104409
31661662208,102358216704,49819648,763088896,4.332,2.057,92.241,1.371,0,1465838,201030119
28423077888,105596923904,49819648,762961920,3.765,1.537,94.446,0.251,0,1363396,182324779
24498671616,109522300928,49827840,761982976,4.193,1.957,93.447,0.404,0,1188772,158492841
21284909056,112736886784,49827840,761159680,3.844,1.643,94.358,0.155,0,1017056,137873391
17953292288,116069277696,49840128,760373248,2.763,1.036,95.981,0.220,0,880358,116233809
14748561408,119275036672,49840128,759336960,2.591,1.280,95.755,0.375,0,715376,95098730
11643113472,122381324288,49840128,758497280,2.099,0.721,95.959,1.222,0,523578,73879555
7590412288,126434865152,49840128,757653504,1.656,0.719,97.375,0.250,0,350040,52573628
5148676096,128877240320,49848320,757006336,0.846,0.533,98.433,0.188,0,200566,32555890
1133305856,132893691904,49860608,755908608,0.501,0.407,98.967,0.125,0,79098,12895638
1040695296,132987187200,49860608,755023872,0.125,0.062,99.813,0,0,692,132
1031852032,132996251648,49860608,754802688,0,0.031,99.594,0.375,0,1808,0
1031593984,132996509696,49860608,754802688,0,0,100,0,0,586,0
1030819840,132997283840,49860608,754802688,0,0,100,0,0,528,0
1030549504,132997488640,49872896,754790400,0.031,0,99.812,0.156,0,27974,4268
1029967872,132998025216,49872896,754802688,0,0,100,0,0,16510,0
1029709824,132998283264,49876992,754798592,0,0,99.937,0.063,0,1742,132
1029443584,132998541312,49881088,754802688,0,0,99.938,0.062,0,1158,0
1028661248,132999323648,49881088,754802688,0,0,100,0,0,5164,0
1028661248,132999323648,49881088,754802688,0,0,100,0,0,1548,634
1028136960,132999839744,49889280,754802688,0,0,99.875,0.125,0,1784,1174
1027362816,133000613888,49889280,754802688,0,0,100,0,0,904,2328
1027362816,133000613888,49889280,754802688,0,0,100,0,0,692,0
1026838528,133001138176,49889280,754802688,0,0,100,0,0,934,0
1026322432,133001654272,49889280,754802688,0,0,100,0,0,740,0
1026322432,133001654272,49889280,754802688,0,0,100,0,0,1310,476
1026314240,133001654272,49897472,754802688,0,0,99.906,0.094,0,866,148
1025953792,133002014720,49897472,754802688,0,0,100,0,0,692,0
1024913408,133003055104,49897472,754802688,0,0,100,0,0,1220,148
1024913408,133003055104,49897472,754802688,0,0,100,0,0,692,0
1024913408,133003055104,49897472,754802688,0,0,100,0,0,346,0
1024913408,133003055104,49897472,754802688,0,0,100,0,0,752,0
1024905216,133003055104,49905664,754802688,0,0,99.906,0.094,0,346,148
1024647168,133003313152,49905664,754802688,0,0,100,0,0,1280,0
1024647168,133003313152,49905664,754802688,0,0,100,0,0,346,0
1024647168,133003313152,49905664,754802688,0,0,100,0,0,346,0
1024647168,133003313152,49905664,754802688,0,0,99.844,0.156,0,580,0
1024389120,133003571200,49905664,754802688,0,0.031,99.562,0.406,0,874,0
1024380928,133003571200,49913856,754802688,0,0,99.938,0.062,0,3786,0
1024122880,133003829248,49913856,754802688,0,0,100,0,0,7208,1100
1024122880,133003829248,49913856,754802688,0,0,100,0,0,712,738
1023897600,133003980800,49913856,754802688,0,0,100,0,0,300,6244
1023639552,133004238848,49913856,754802688,0,0,100,0,0,806,458
1023381504,133004496896,49913856,754802688,0,0,100,0,0,376,132
1022857216,133005012992,49922048,754802688,0,0,99.969,0.031,0,632,638
1027334144,132998549504,49922048,755257344,1.252,0.689,98.059,0,0,402782,45990
1026289664,132999073792,49922048,754810880,0,0.031,99.969,0,0,1770,1164
