"Dstat 0.7.3 CSV output"
"Author:","Dag Wieers <dag@wieers.com>",,,,"URL:","http://dag.wieers.com/home-made/dstat/"
"Host:","parasilo-6.rennes.grid5000.fr",,,,"User:","root"
"Cmdline:","dstat -m -c -n -o dstat.csv",,,,"Date:","23 Jun 2020 00:00:43 CEST"
"memory usage",,,,"total cpu usage",,,,,"net/total",
"used","free","buff","cach","usr","sys","idl","wai","stl","recv","send"
843857920,133226856448,49074176,701444096,1.272,0.302,98.202,0.224,0,0,0
849113088,133221249024,49074176,701784064,1.153,0.561,98.287,0,0,391090,31652
875880448,133194436608,49074176,701784064,0.657,0.282,99.061,0,0,388620,18252
866951168,133203320832,49074176,701784064,0.968,0.593,98.439,0,0,391632,21152
838844416,133231869952,49074176,701341696,0.375,0.156,99.469,0,0,3484,4380
838537216,133232152576,49098752,701341696,0.062,0,99.875,0.062,0,804,1180
838447104,133232242688,49098752,701341696,0,0.031,99.969,0,0,234,0
838447104,133232242688,49098752,701341696,0,0,100,0,0,106,0
838438912,133232250880,49098752,701341696,0,0,100,0,0,234,0
838438912,133232250880,49098752,701341696,0,0,100,0,0,106,0
840523776,133230166016,49102848,701337600,0.094,0.062,99.813,0.031,0,385024,13924
839483392,133231026176,49106944,701345792,0.907,0.438,98.623,0.031,0,6470,8532
839475200,133231034368,49106944,701345792,0,0,100,0,0,0,0
854528000,133215494144,49106944,701796352,0.751,0.626,98.624,0,0,555256,27404
845094912,133225357312,49106944,701349888,0.437,0.406,99.157,0,0,3440,14468
865538048,133204467712,49106944,701796352,0.625,0.156,99.219,0,0,386898,17944
860454912,133209698304,49131520,701607936,0.813,0.469,98.624,0.094,0,387182,18308
846483456,133223927808,49131520,701349888,0.406,0.406,99.188,0,0,3312,6196
846811136,133223522304,49168384,701358080,1.624,0.312,97.595,0.469,0,225004,14048
847187968,133223145472,49168384,701358080,0,0,100,0,0,1962,2668
846626816,133223706624,49168384,701358080,0.468,0.156,99.375,0,0,343310,15928
854261760,133215870976,49180672,701546496,0.250,0.188,99.468,0.094,0,173208,14852
854253568,133215879168,49180672,701546496,0.031,0.031,99.938,0,0,5096,5488
853991424,133216141312,49180672,701546496,0,0,100,0,0,4838,5292
853430272,133216690176,49192960,701546496,0.031,0.031,99.906,0.031,0,5148,5292
853172224,133216948224,49192960,701546496,0,0,99.906,0.094,0,5386,5292
853164032,133216948224,49201152,701546496,0,0.031,99.906,0.062,0,8064,7840
853164032,133216948224,49201152,701546496,0,0,100,0,0,5020,5292
853164032,133216948224,49201152,701546496,0,0,100,0,0,5096,5488
853164032,133216948224,49201152,701546496,0.031,0,99.969,0,0,5202,5488
853155840,133216948224,49209344,701546496,0,0.031,99.938,0.031,0,5484,5488
845590528,133224697856,49209344,701362176,0.250,0.125,99.343,0.282,0,174562,17212
845316096,133224972288,49209344,701362176,0.031,0.031,99.938,0,0,288,0
844800000,133225488384,49209344,701362176,0,0,100,0,0,288,0
844800000,133225488384,49209344,701362176,0,0,100,0,0,234,0
845058048,133225230336,49209344,701362176,0,0,100,0,0,106,228
845111296,133225164800,49221632,701362176,0.031,0,99.563,0.406,0,212,168
845111296,133225164800,49233920,701349888,0,0,99.969,0.031,0,106,0
845099008,133225164800,49233920,701362176,0,0,100,0,0,234,0
855695360,133214117888,49233920,701808640,0.563,0.125,99.312,0,0,388112,15932
841625600,133228630016,49233920,701366272,0.531,0.313,99.156,0,0,3626,15060
841625600,133228630016,49233920,701366272,0,0,100,0,0,340,0
841539584,133228703744,49246208,701366272,0,0,99.938,0.062,0,182,0
841539584,133228703744,49246208,701366272,0.031,0.031,99.938,0,0,280,0
841539584,133228703744,49246208,701366272,0,0,100,0,0,0,0
841269248,133228961792,49258496,701366272,0,0,100,0,0,318,168
841011200,133229219840,49258496,701366272,0,0,100,0,0,0,0
841003008,133229228032,49258496,701366272,0,0,100,0,0,106,0
840978432,133229244416,49266688,701366272,0,0.031,99.906,0.062,0,318,662
840507392,133229715456,49266688,701366272,0.031,0,99.969,0,0,106,0
887922688,133182926848,49266688,700665856,0.999,0.468,98.532,0,0,660346,29622
3294564352,130774286336,49266688,701870080,22.236,8.588,69.176,0,0,1332222,67076
6357155840,127709691904,49266688,703225856,33.021,14.558,52.421,0,0,1331884,65244
9227845632,124837343232,49266688,704667648,32.373,11.994,55.601,0.032,0,1332996,66672
12100468736,121962975232,49274880,706158592,32.772,11.911,55.223,0.094,0,1331986,66867
15069917184,118992048128,49291264,707432448,33.718,12.800,53.325,0.156,0,1334362,72579
17906552832,116154142720,49291264,708587520,34.804,13.584,49.922,1.690,0,1334126,160905
20741619712,113317617664,49299456,709914624,34.977,12.637,51.388,0.998,0,1354856,1225815
23563370496,110494609408,49303552,711045120,35.408,11.979,52.458,0.156,0,1386450,2970368
26521337856,107534675968,49315840,712843264,40.075,12.414,47.293,0.218,0,1247616,4731480
29509459968,104545226752,49319936,714092544,41.381,13.815,44.521,0.283,0,920028,4469763
30783303680,103271317504,49332224,714113024,23.952,5.592,70.053,0.404,0,104396,4989828
30966362112,103087919104,49430528,714354688,13.400,1.153,82.985,2.462,0,134112,7513851
31122993152,102931214336,49430528,714428416,14.370,1.151,83.950,0.529,0,171772,10389948
31343665152,102710460416,49438720,714502144,16.813,1.691,80.808,0.689,0,200364,10667386
31501357056,102552690688,49438720,714579968,16.517,1.425,81.531,0.527,0,183478,8739338
31648645120,102405296128,49438720,714686464,18.328,1.604,79.636,0.432,0,182926,8988500
31755386880,102298456064,49438720,714776576,17.097,1.931,80.318,0.654,0,169692,7896438
31858499584,102195249152,49446912,714862592,16.254,2.043,81.176,0.526,0,168338,7848384
31964250112,102089408512,49455104,714944512,16.004,1.665,81.776,0.555,0,151506,6922692
32055173120,101998342144,49455104,715083776,14.994,1.621,82.855,0.530,0,151150,6960836
32091308032,101962018816,49455104,715272192,13.385,1.997,83.994,0.624,0,143226,6419746
32042434560,102010748928,49455104,715411456,8.333,1.373,88.764,1.529,0,136724,6233686
32029151232,102023954432,49455104,715489280,6.499,1.256,91.240,1.005,0,144406,6564334
31979646976,102073356288,49463296,715583488,8.336,1.456,89.526,0.682,0,141372,6307448
31948238848,102104637440,49463296,715706368,7.623,1.343,90.597,0.437,0,131190,6156134
31948009472,102104776704,49463296,715784192,7.642,1.404,90.455,0.499,0,145528,6679564
31940157440,102112518144,49463296,715894784,6.780,1.099,91.588,0.534,0,142380,6421046
31954305024,102098104320,49528832,716087296,6.205,1.179,83.525,9.091,0,135096,6001814
31959478272,102092730368,49537024,716275712,9.001,1.552,88.796,0.652,0,141988,6563484
31959035904,102093086720,49537024,716361728,5.619,1.708,92.145,0.528,0,135084,6177486
31957319680,102094712832,49537024,716451840,6.516,0.877,92.137,0.470,0,137856,6399474
31961292800,102090612736,49537024,716574720,6.931,1.423,91.120,0.526,0,142862,6424972
31935008768,102116806656,49537024,716656640,5.770,1.404,92.296,0.530,0,141052,6481408
31934681088,102117007360,49553408,716763136,6.746,1.506,91.183,0.565,0,139962,6251434
31933198336,102118404096,49553408,716849152,6.244,1.180,92.109,0.466,0,140860,6289084
31938965504,102112505856,49553408,716972032,7.112,1.242,91.273,0.373,0,148308,6972036
31939022848,102112366592,49553408,717053952,4.842,0.906,93.783,0.469,0,155668,7188162
31943454720,102107803648,49553408,717185024,6.107,1.395,91.723,0.775,0,153316,6864964
31947804672,102103343104,49561600,717283328,7.435,1.487,85.316,5.762,0,148530,6589420
31955181568,102095872000,49561600,717365248,6.943,1.494,91.252,0.311,0,148260,6740348
31955832832,102095114240,49561600,717471744,5.547,0.971,93.074,0.407,0,153774,7112738
31955578880,102095269888,49561600,717570048,4.039,0.939,94.771,0.250,0,155588,7193868
31958732800,102091890688,49561600,717795328,6.883,1.526,91.093,0.498,0,144708,6498784
31960195072,102090305536,49569792,717910016,4.972,0.813,91.370,2.846,0,135616,6249588
31963824128,102086598656,49569792,717987840,6.056,1.056,92.578,0.311,0,139840,6497802
31964471296,102085840896,49569792,718090240,6.925,1.056,91.708,0.311,0,156444,6973306
31966154752,102084050944,49569792,718188544,5.178,0.998,93.450,0.374,0,147596,6727570
31975600128,102074499072,49569792,718286848,6.114,1.185,92.389,0.312,0,138104,6255044
31975985152,102073982976,49577984,718401536,3.879,0.688,94.401,1.032,0,139772,6363086
31977177088,102072692736,49586176,718491648,6.137,0.935,92.461,0.467,0,143346,6535256
31980720128,102069055488,49586176,718585856,4.981,1.128,93.546,0.345,0,149138,6802868
31979700224,102069981184,49586176,718671872,3.674,1.014,95.027,0.285,0,157284,7131272
31981436928,102068142080,49586176,718774272,6.268,0.752,92.698,0.282,0,148358,6792308
31984357376,102065106944,49594368,718876672,5.107,0.841,93.678,0.374,0,147648,6736470
31984844800,102064525312,49594368,718970880,5.503,0.912,91.730,1.855,0,149556,6798332
31985299456,102063951872,49594368,719089664,5.095,0.875,93.779,0.250,0,150926,6769622
32010838016,102038319104,49594368,719183872,4.925,1.349,93.476,0.251,0,141848,6477042
31989313536,102059839488,49594368,719278080,5.245,1.256,93.090,0.408,0,136516,6066306
31994138624,102054895616,49602560,719388672,6.002,1.375,92.154,0.469,0,147680,6844648
32021364736,102027567104,49610752,719478784,7.721,1.432,89.103,1.743,0,140414,6512394
31997992960,102050811904,49610752,719572992,6.516,1.253,91.949,0.282,0,151946,6952352
31996928000,102051643392,49610752,719802368,7.449,0.908,91.299,0.344,0,137800,6079444
31999315968,102049148928,49610752,719908864,7.919,1.149,90.559,0.373,0,130306,5969002
32003616768,102044721152,49618944,720019456,8.050,1.548,89.721,0.681,0,148254,6900038
32004947968,102043303936,49618944,720097280,7.192,0.938,88.806,3.064,0,154970,6998124
32005636096,102042521600,49618944,720191488,6.844,1.332,91.329,0.496,0,151944,7162642
32007680000,102040375296,49618944,720293888,7.621,1.182,90.607,0.591,0,160086,7364932
32009519104,102038441984,49618944,720388096,7.728,1.309,90.527,0.436,0,140826,6428222
32010846208,102037020672,49627136,720470016,6.527,0.874,91.755,0.843,0,137966,6320772
32013955072,102033801216,49627136,720576512,6.049,1.185,92.392,0.374,0,139884,6430146
32036655104,102010966016,49635328,720699392,8.339,0.968,89.319,1.374,0,147692,6785650
32061464576,101986070528,49635328,720781312,8.705,1.061,89.766,0.468,0,147174,6476862
32100769792,101946646528,49635328,720887808,8.247,1.160,90.154,0.439,0,147644,6843176
32163569664,101883748352,49643520,720973824,9.579,0.998,88.799,0.624,0,153110,6923706
32198561792,101848649728,49643520,721080320,8.284,1.059,90.283,0.374,0,145916,6676598
32260239360,101786869760,49643520,721182720,9.289,0.935,88.840,0.935,0,153950,7032386
32316157952,101730856960,49643520,721276928,8.823,0.963,89.842,0.373,0,155600,7091082
32332509184,101714395136,49643520,721383424,7.981,1.127,90.579,0.313,0,157218,7172108
32355991552,101690834944,49651712,721453056,10.606,0.804,88.002,0.588,0,148350,6702760
32376328192,101670379520,49651712,721571840,8.552,1.217,89.856,0.375,0,142344,6446296
32411840512,101634785280,49651712,721653760,7.043,1.215,91.399,0.343,0,138746,6270364
32405143552,101641363456,49659904,721760256,5.286,0.808,93.439,0.466,0,129188,5839690
32405401600,101640871936,49659904,721993728,5.070,0.902,93.624,0.404,0,142914,6473728
32397471744,101648711680,49668096,722075648,5.477,0.689,93.333,0.501,0,142924,6640716
32386355200,101659668480,49668096,722190336,5.453,0.815,93.356,0.376,0,150862,6917290
32386580480,101659353088,49668096,722276352,4.934,0.691,93.023,1.351,0,149008,6828592
32381693952,101664133120,49668096,722382848,5.097,0.844,93.715,0.344,0,161072,7145596
32378073088,101667643392,49668096,722493440,6.733,0.935,91.958,0.374,0,430712,7008342
32378896384,101666742272,49676288,722563072,5.807,0.781,92.975,0.437,0,144290,6671130
32376250368,101669257216,49676288,722685952,4.488,0.942,94.225,0.345,0,153502,6991860
32376213504,101669199872,49676288,722780160,5.508,0.630,93.547,0.315,0,147710,6654280
32379400192,101665927168,49676288,722866176,5.319,1.244,89.300,4.137,0,152282,6825546
32379838464,101665386496,49676288,722964480,4.722,1.063,93.809,0.407,0,138240,6224280
32380243968,101664870400,49684480,723062784,4.349,0.851,94.327,0.473,0,146326,6651386
32381616128,101663387648,49684480,723173376,5.162,0.777,93.812,0.249,0,151274,6939308
32380633088,101664288768,49684480,723251200,5.055,0.686,94.009,0.250,0,149116,6734886
32380420096,101664382976,49684480,723369984,6.056,1.118,92.516,0.311,0,136460,6172300
32380645376,101664063488,49692672,723451904,4.872,0.812,93.879,0.437,0,144452,6571926
32382271488,101662318592,49700864,723562496,5.575,0.940,92.922,0.564,0,139876,6452456
32382849024,101661642752,49700864,723656704,4.078,0.721,94.981,0.220,0,143024,6555518
32381284352,101663096832,49700864,723763200,4.554,0.722,94.378,0.345,0,142114,6436008
32382328832,101661937664,49700864,723873792,5.827,0.810,91.493,1.870,0,140244,6303184
32382193664,101661966336,49700864,723976192,3.035,0.854,95.700,0.411,0,132870,5991486
32383426560,101660643328,49709056,724058112,6.322,0.845,92.426,0.407,0,142164,6537164
32383979520,101659836416,49709056,724307968,3.206,0.660,95.820,0.314,0,151104,6854598
32384319488,101659418624,49709056,724385792,5.512,0.971,93.173,0.345,0,152788,6854282
32385323008,101658292224,49709056,724500480,5.706,0.935,92.953,0.405,0,147916,6798400
32386871296,101656641536,49709056,724594688,5.722,0.907,92.058,1.313,0,159310,7200588
32386592768,101656805376,49717248,724701184,4.908,0.844,93.560,0.688,0,151236,6885278
32386985984,101656322048,49717248,724787200,5.028,0.656,93.910,0.406,0,142606,6439396
32386691072,101656514560,49717248,724889600,7.392,0.780,91.516,0.312,0,138974,6161832
32388218880,101654867968,49717248,725004288,3.814,0.907,94.905,0.375,0,137542,6102440
32388976640,101653905408,49717248,725209088,4.790,0.657,93.143,1.409,0,141184,6540210
32389550080,101653192704,49733632,725327872,4.673,0.663,94.190,0.474,0,151976,7041498
32390782976,101651873792,49733632,725413888,5.367,0.842,93.448,0.343,0,155868,7151504
32390811648,101651742720,49733632,725512192,6.277,0.812,92.473,0.437,0,148838,6929554
32391131136,101651300352,49733632,725635072,4.841,0.937,93.879,0.344,0,148290,6679026
32390402048,101651939328,49733632,725725184,4.426,0.879,93.409,1.287,0,143240,6583950
32392024064,101650190336,49741824,725835776,3.288,0.846,95.459,0.407,0,158584,7108138
32392798208,101649317888,49741824,725934080,6.228,1.064,92.426,0.282,0,145100,6710242
32394543104,101647482880,49741824,726020096,5.258,0.845,93.490,0.407,0,151292,6941276
32395382784,101646512128,49741824,726147072,5.273,0.811,93.604,0.312,0,150740,6865980
32398336000,101643481088,49741824,726224896,4.220,0.945,94.520,0.315,0,137286,6326858
32398348288,101643329536,49758208,726343680,4.417,0.815,94.330,0.439,0,146710,6748622
32400039936,101641547776,49758208,726433792,4.942,1.189,93.431,0.438,0,148080,6602610
32402100224,101639385088,49758208,726532096,5.070,0.908,93.709,0.313,0,140238,6307218
32402870272,101638463488,49758208,726638592,3.845,0.536,95.336,0.284,0,139206,6246378
32405409792,101635817472,49758208,726740992,5.303,0.816,93.505,0.377,0,140890,6413464
32408158208,101632950272,49766400,726851584,6.273,0.968,91.386,1.373,0,137798,6170914
32409100288,101631913984,49766400,726937600,3.692,0.663,95.298,0.347,0,140828,6507340
32410243072,101630656512,49766400,727052288,4.759,0.657,94.239,0.344,0,149602,6903882
32411873280,101628928000,49766400,727146496,5.486,1.003,93.166,0.345,0,144640,6656578
32412553216,101628153856,49766400,727240704,4.341,0.750,94.566,0.344,0,151940,7132248
32412426240,101628157952,49774592,727351296,4.921,1.090,88.789,5.201,0,155136,6947988
32414728192,101625606144,49774592,727597056,6.364,1.025,92.269,0.342,0,142230,6534336
32416256000,101623992320,49774592,727683072,4.084,0.785,94.816,0.314,0,147038,6670780
32413487104,101626638336,49774592,727805952,5.987,0.935,92.797,0.281,0,150206,6664274
32413069312,101626953728,49774592,727891968,5.659,1.119,92.879,0.342,0,147420,6569626
32413802496,101626118144,49782784,727982080,4.440,0.938,94.184,0.438,0,142516,6443202
32415219712,101624561664,49790976,728113152,3.937,0.819,93.260,1.984,0,144156,6728830
32415961088,101623726080,49790976,728203264,4.207,0.841,94.422,0.530,0,145320,6585970
32416698368,101622886400,49790976,728301568,4.037,0.725,94.986,0.252,0,150624,6917044
32416534528,101622956032,49790976,728391680,4.980,1.002,93.642,0.376,0,146402,6845878
32418508800,101620858880,49799168,728502272,4.922,0.784,93.824,0.470,0,156244,7147602
32418607104,101620670464,49799168,728592384,4.474,1.189,92.866,1.471,0,156752,7293368
32418988032,101620183040,49799168,728698880,3.905,0.781,95.033,0.281,0,154668,6967888
32418942976,101620101120,49799168,728817664,3.923,0.691,95.198,0.188,0,138760,6276702
32418840576,101620101120,49799168,728920064,5.654,1.031,93.096,0.219,0,136564,6257878
32420790272,101618040832,49807360,729022464,5.415,0.903,93.153,0.529,0,147546,6734228
32421224448,101617496064,49807360,729128960,5.250,0.656,92.562,1.531,0,134846,6099456
32423235584,101615390720,49815552,729214976,4.189,0.882,94.551,0.378,0,147038,6702322
32422346752,101616164864,49815552,729321472,3.740,0.723,95.192,0.346,0,150588,6853172
32423403520,101615009792,49815552,729419776,6.150,0.999,92.663,0.187,0,143662,6463202
32423870464,101614428160,49823744,729526272,3.896,0.723,94.785,0.597,0,144562,6649228
32424386560,101613813760,49823744,729624576,2.987,0.723,96.069,0.220,0,143720,6355136
32426205184,101611880448,49827840,729731072,5.592,1.437,89.566,3.405,0,139762,6176120
32425922560,101612072960,49827840,729817088,4.376,0.813,94.561,0.250,0,144252,6633194
32426610688,101611106304,49827840,730091520,4.165,0.752,94.707,0.376,0,151768,6983154
32426729472,101610909696,49836032,730161152,3.969,0.719,94.969,0.344,0,143932,6467936
32427237376,101610295296,49836032,730267648,4.442,1.063,94.245,0.250,0,145708,6554202
32426799104,101610631168,49844224,730353664,3.596,0.938,94.059,1.407,0,141558,6537572
32427667456,101609652224,49844224,730464256,5.778,1.156,92.848,0.219,0,143280,6653752
32428650496,101608550400,49844224,730578944,5.963,1.149,92.609,0.280,0,145970,6628698
32428433408,101608669184,49852416,730669056,3.743,0.975,94.967,0.315,0,145130,6551820
32431407104,101605584896,49852416,730779648,4.885,0.819,94.012,0.284,0,146500,6745510
32431894528,101605007360,49852416,730869760,3.259,0.783,95.268,0.689,0,145236,6600060
32431890432,101604909056,49852416,730963968,5.268,0.941,92.850,0.941,0,152046,7048346
32431796224,101604880384,49852416,731078656,4.593,0.776,94.289,0.341,0,151224,6766062
32431562752,101605007360,49860608,731172864,3.580,0.691,95.226,0.503,0,135892,6081266
32432181248,101604265984,49860608,731295744,4.814,0.787,94.116,0.283,0,130638,6034718
32431927296,101604421632,49860608,731394048,3.936,0.756,94.836,0.472,0,133900,6029106
32431587328,101604651008,49868800,731492352,5.399,1.024,92.988,0.590,0,136040,6232754
32432742400,101603418112,49868800,731570176,3.715,0.718,95.130,0.437,0,147002,6824144
32432029696,101604003840,49876992,731688960,4.838,0.905,93.414,0.843,0,144104,6438562
32434008064,101601910784,49876992,731787264,4.403,0.818,94.403,0.377,0,137862,6354938
32434954240,101600849920,49876992,731901952,4.602,0.877,94.208,0.313,0,144558,6549688
32435384320,101600325632,49876992,731992064,5.571,0.751,92.269,1.408,0,139372,6478166
32434954240,101600649216,49885184,732090368,4.537,0.876,94.180,0.407,0,147106,6813276
32438960128,101596393472,49893376,732323840,5.221,1.025,93.226,0.528,0,156706,7137374
32438874112,101596368896,49893376,732434432,4.763,0.872,93.960,0.405,0,152302,6891544
32446484480,101588660224,49893376,732532736,4.923,1.003,93.666,0.408,0,155166,7126848
32446586880,101588463616,49893376,732622848,4.117,0.842,90.580,4.460,0,140252,6321852
32453242880,101581676544,49893376,732749824,5.168,0.841,93.711,0.280,0,136406,6046712
32460951552,101573865472,49901568,732844032,5.559,1.087,92.236,1.118,0,138332,6360100
32461336576,101573390336,49901568,732925952,5.042,0.716,93.931,0.311,0,137676,6342224
32462327808,101572288512,49901568,733036544,5.563,0.723,93.432,0.283,0,147358,6567442
32472432640,101562093568,49901568,733126656,2.925,0.944,95.879,0.252,0,150658,6935392
32472104960,101562290176,49909760,733245440,5.516,0.717,91.867,1.901,0,147992,6785950
32480391168,101553897472,49917952,733343744,5.225,0.845,93.586,0.344,0,147278,6700898
32481128448,101553061888,49917952,733437952,4.336,0.842,94.479,0.343,0,151882,6902090
32481910784,101552156672,49917952,733560832,4.551,0.816,94.225,0.408,0,145046,6489562
32482988032,101550997504,49917952,733638656,4.193,0.776,94.658,0.373,0,136346,6316732
32483262464,101550604288,49917952,733749248,4.750,0.875,93.188,1.188,0,135274,6053428
32483938304,101549797376,49926144,733863936,4.058,0.661,94.904,0.377,0,128590,5871948
32485109760,101548408832,49926144,734081024,4.299,0.941,94.415,0.345,0,140332,6219364
32483934208,101549477888,49926144,734179328,4.698,0.902,94.088,0.311,0,136844,6231358
32483811328,101549506560,49926144,734273536,3.779,0.999,94.816,0.406,0,144958,6611918
32485584896,101547606016,49926144,734396416,4.780,0.818,93.176,1.226,0,141922,6463044
32486166528,101546905600,49942528,734494720,4.880,0.913,93.734,0.472,0,142390,6389304
32486690816,101546283008,49942528,734593024,5.910,0.786,93.084,0.220,0,139100,6138658
32487542784,101545316352,49942528,734703616,4.592,0.812,94.221,0.375,0,139544,6212844
32488165376,101544603648,49942528,734789632,4.221,0.876,94.559,0.344,0,148714,6816302
32485982208,101546663936,49942528,734912512,5.169,1.159,88.910,4.762,0,143036,6530502
32485859328,101546672128,49950720,735019008,3.790,0.752,94.801,0.658,0,146854,6774166
32488910848,101543534592,49950720,735105024,4.678,0.848,94.066,0.408,0,165580,7543856
32490303488,101542019072,49950720,735215616,5.936,1.093,92.502,0.469,0,158728,7202360
32490164224,101542055936,49950720,735313920,4.686,0.881,94.088,0.346,0,157526,7258732
32491917312,101540110336,49950720,735387648,4.506,0.901,94.189,0.404,0,154868,6497816
32490942464,101540892672,49967104,735526912,4.669,0.877,93.325,1.128,0,134664,6099006
32490835968,101540904960,49967104,735621120,4.474,0.751,94.493,0.282,0,155526,7293254
32492314624,101539319808,49967104,735723520,4.190,0.907,94.559,0.344,0,155184,7081006
32492580864,101538893824,49967104,735879168,4.751,0.850,94.210,0.189,0,144586,6578378
32491524096,101539868672,49967104,735961088,4.160,0.938,94.526,0.375,0,142850,6301198
32491626496,101539643392,49975296,736071680,5.851,0.871,92.250,1.027,0,144844,6533092
32491765760,101539282944,49975296,736292864,3.361,0.691,95.634,0.314,0,142298,6528568
32492941312,101538004992,49975296,736395264,4.023,0.817,94.846,0.314,0,143116,6662978
32491896832,101538934784,49975296,736505856,4.841,0.999,93.941,0.219,0,152644,6903226
32492908544,101537841152,49975296,736587776,4.089,0.786,94.904,0.220,0,151314,6980944
32493875200,101536747520,49983488,736706560,3.415,1.284,93.828,1.472,0,150880,6903832
32494526464,101535989760,49991680,736804864,4.070,0.845,94.740,0.344,0,150262,6925164
32494546944,101535866880,49991680,736903168,5.660,0.813,93.277,0.250,0,135512,6102906
32495996928,101534285824,49991680,737030144,3.182,0.756,95.841,0.221,0,134746,6120422
32497569792,101532639232,49991680,737099776,5.038,1.033,93.742,0.188,0,149448,6813070
32498425856,101531652096,49999872,737218560,3.389,0.502,95.733,0.377,0,149566,6724076
32500400128,101529575424,49999872,737312768,6.011,0.751,89.574,3.663,0,147930,6608654
28667977728,105361907712,49999872,737402880,5.053,0.998,93.762,0.187,0,141446,6430092
25512046592,108518617088,49999872,736624640,4.344,1.062,94.375,0.219,0,133650,6163964
22314680320,111717023744,49999872,735584256,3.775,0.686,95.382,0.156,0,123064,5544978
19226660864,114805846016,50012160,734769152,2.602,0.627,96.458,0.313,0,92700,4209594
16066174976,117967155200,50020352,733937664,4.080,1.059,93.335,1.526,0,80412,3693220
12913602560,121120145408,50020352,733519872,2.155,0.593,97.127,0.125,0,65214,3086382
9718112256,124316692480,50020352,732463104,1.195,0.409,98.365,0.031,0,56968,2527348
7344500736,126690955264,50020352,731811840,1.683,0.499,97.725,0.093,0,37008,1689882
4058787840,129977606144,50032640,730861568,0.815,0.407,98.653,0.125,0,26502,1186404
925716480,133111562240,50032640,729976832,0.251,0.251,99.123,0.376,0,11908,465792
890871808,133147291648,50032640,729092096,0.094,0.062,99.844,0,0,706,486
890814464,133147348992,50032640,729092096,0,0,100,0,0,106,0
890814464,133147348992,50032640,729092096,0,0.031,99.969,0,0,0,0
890802176,133147348992,50044928,729092096,0,0.031,99.906,0.062,0,404,264
890544128,133147607040,50044928,729092096,0,0,100,0,0,296,0
890540032,133147607040,50049024,729092096,0.031,0,99.938,0.031,0,692,132
890535936,133147607040,50049024,729096192,0,0.031,99.969,0,0,0,0
890535936,133147607040,50049024,729096192,0,0,100,0,0,106,0
890277888,133147865088,50049024,729096192,0,0,100,0,0,628,168
890011648,133148123136,50057216,729096192,0,0,99.969,0.031,0,706,3584
890011648,133148123136,50057216,729096192,0.031,0,99.969,0,0,446,168
889495552,133148639232,50057216,729096192,0.031,0,99.969,0,0,106,0
889237504,133148897280,50057216,729096192,0,0,100,0,0,0,0
889237504,133148897280,50057216,729096192,0,0.031,99.969,0,0,106,0
889237504,133148897280,50057216,729096192,0,0,100,0,0,182,0
889229312,133148897280,50065408,729096192,0,0,99.969,0.031,0,106,0
903598080,133134299136,50065408,729104384,0.907,0.188,98.906,0,0,392180,20418
