"Dstat 0.7.3 CSV output"
"Author:","Dag Wieers <dag@wieers.com>",,,,"URL:","http://dag.wieers.com/home-made/dstat/"
"Host:","gros-58.nancy.grid5000.fr",,,,"User:","root"
"Cmdline:","dstat -m -c -n -o dstat.csv",,,,"Date:","23 May 2020 20:22:09 CEST"
"memory usage",,,,"total cpu usage",,,,,"net/total",
"used","free","buff","cach","usr","sys","idl","wai","stl","recv","send"
1543790592,96725483520,58712064,1229316096,3.658,0.382,95.941,0.020,0,0,0
1550274560,96718671872,58712064,1229668352,0.639,0.306,99.055,0,0,391232,17290
1537495040,96731897856,58712064,1229221888,0.056,0.083,99.861,0,0,3186,13076
1536692224,96732221440,58740736,1229668352,0.501,0.528,98.971,0,0,387090,17674
1534140416,96735219712,58740736,1229221888,0.056,0.028,99.917,0,0,1340,1236
1529585664,96739713024,58753024,1229225984,0.640,0.362,98.971,0.028,0,385350,15566
1529552896,96739745792,58753024,1229225984,0,0.028,99.972,0,0,1050,652
1529552896,96739745792,58753024,1229225984,0,0.056,99.944,0,0,8868,0
1529544704,96739753984,58753024,1229225984,0.028,0.028,99.944,0,0,6362,0
1529532416,96739753984,58765312,1229225984,0.028,0.028,99.944,0,0,8260,0
1529520128,96739753984,58777600,1229225984,0,0.028,99.972,0,0,14718,0
1532678144,96736591872,58777600,1229225984,0.723,0.417,98.860,0,0,402272,22230
1535221760,96734027776,58777600,1229246464,0.250,0.445,99.304,0,0,556824,23512
1533173760,96736002048,58777600,1229246464,0.668,0.417,98.915,0,0,393354,28542
1536753664,96732418048,58777600,1229246464,0.528,0.389,99.083,0,0,8968,6266
1550368768,96718336000,58789888,1229692928,0.501,0.195,99.304,0,0,385638,15254
1530961920,96738172928,58802176,1229250560,0.194,0.167,99.639,0,0,25752,4246
1530953728,96738181120,58802176,1229250560,0,0,100,0,0,4464,0
1531879424,96737247232,58802176,1229250560,1.084,0.195,98.721,0,0,226380,11656
1532235776,96736890880,58802176,1229250560,0.028,0.028,99.944,0,0,2872,2668
1532276736,96736845824,58814464,1229242368,0.306,0.139,99.555,0,0,344669,15680
1539571712,96729350144,58818560,1229438976,0.167,0.362,99.471,0,0,176782,18160
1539551232,96729358336,58818560,1229451264,0.028,0,99.972,0,0,9956,10192
1539551232,96729358336,58818560,1229451264,0,0.028,99.972,0,0,11154,10854
1539522560,96729374720,58830848,1229451264,0.028,0,99.972,0,0,10426,9996
1539522560,96729374720,58830848,1229451264,0,0.056,99.944,0,0,10252,10192
1539514368,96729374720,58839040,1229451264,0,0,100,0,0,15474,15496
1539514368,96729374720,58839040,1229451264,0.028,0.028,99.944,0,0,10902,9996
1539514368,96729374720,58839040,1229451264,0.028,0,99.972,0,0,9538,10294
1539514368,96729374720,58839040,1229451264,0,0.028,99.972,0,0,10830,9898
1539514368,96729374720,58839040,1229451264,0.028,0.056,99.917,0,0,9998,9898
1535447040,96733626368,58839040,1229266944,0.195,0.056,99.750,0,0,170358,11408
1533689856,96735367168,58851328,1229271040,0.028,0.083,99.889,0,0,8460,5084
1533689856,96735367168,58851328,1229271040,0.028,0.028,99.944,0,0,4952,0
1533689856,96735367168,58851328,1229271040,0,0,100,0,0,3090,0
1533681664,96735375360,58851328,1229271040,0.028,0,99.972,0,0,5182,264
1542565888,96726020096,58863616,1229721600,0.529,0.334,99.138,0,0,391898,17874
1530232832,96738787328,58875904,1229275136,0.167,0.083,99.750,0,0,12024,13124
1587671040,96681046016,58875904,1229578240,1.113,0.223,98.664,0,0,336552,13296
1687580672,96581947392,58875904,1228824576,0.751,0.056,99.194,0,0,4624,680
1687580672,96581947392,58875904,1228824576,0,0.028,99.972,0,0,3334,102
1687580672,96581947392,58875904,1228824576,0.028,0,99.972,0,0,1568,306
1687818240,96581640192,58900480,1228824576,0.028,0.028,99.944,0,0,2906,1680
1687810048,96581648384,58900480,1228824576,0.388,0,99.612,0,0,5708,2248
1784082432,96485376000,58900480,1228824576,3.229,0.056,96.715,0,0,3534,2092
1833791488,96435662848,58900480,1228828672,2.948,0,97.052,0,0,3636,2100
1869967360,96399486976,58900480,1228828672,2.836,0.028,97.136,0,0,5190,3388
1971449856,96297906176,58916864,1228836864,5.222,0.278,94.472,0.028,0,5510956,81295
2174357504,96094957568,58916864,1228836864,9.073,0.444,90.483,0,0,18256462,820078
2433114112,95836078080,58916864,1228836864,8.737,0.556,90.707,0,0,30342130,1287199
2464215040,95804928000,58916864,1228845056,7.478,0.778,91.743,0,0,48127465,1805861
2497044480,95772094464,58916864,1228849152,7.380,0.752,91.869,0,0,60463340,2194886
2537238528,95731879936,58933248,1228853248,7.729,1.140,91.131,0,0,77394308,2743779
2566909952,95702204416,58933248,1228857344,9.326,0.640,90.033,0,0,90013188,3162061
2630144000,95638966272,58933248,1228861440,8.898,1.287,89.815,0,0,105075626,3652634
2669817856,95599292416,58933248,1228861440,8.564,0.756,90.680,0,0,118257630,3980606
2744733696,95524372480,58933248,1228865536,9.035,1.311,89.654,0,0,119847860,4143969
2797449216,95471644672,58941440,1228869632,8.554,1.588,89.858,0,0,120110782,4256566
2789949440,95479144448,58941440,1228869632,8.713,0.503,90.785,0,0,120084742,4215660
2819788800,95449288704,58949632,1228877824,8.893,0.503,90.604,0,0,119694548,4262690
2824617984,95444455424,58949632,1228881920,8.857,0.671,90.472,0,0,117368508,4493764
2838249472,95430819840,58949632,1228886016,8.701,0.390,90.909,0,0,113331504,4230740
2843750400,95425310720,58957824,1228886016,8.708,0.447,90.846,0,0,117497470,4316998
2849288192,95419772928,58957824,1228886016,8.394,0.421,91.185,0,0,117702630,4224538
2853769216,95415271424,58966016,1228898304,8.964,0.585,90.451,0,0,113713062,4958126
2855825408,95413211136,58966016,1228902400,9.081,0.447,90.472,0,0,112130728,4864210
2860032000,95409004544,58966016,1228902400,9.730,0.500,89.769,0,0,117947976,4544846
3005616128,95263408128,58974208,1228906496,9.994,0.726,89.280,0,0,111263468,4760922
3356647424,94912372736,58974208,1228910592,9.187,1.089,89.724,0,0,114278554,4651604
3411435520,94857568256,58982400,1228918784,9.045,1.252,89.702,0,0,122750136,4870055
4076019712,94192984064,58982400,1228918784,8.336,0.643,91.021,0,0,114729718,5115973
4166262784,94102736896,58982400,1228922880,8.590,1.931,89.480,0,0,114903652,4934382
4234129408,94034857984,58990592,1228926976,8.547,0.863,90.590,0,0,110316662,5002344
4259450880,94009528320,58990592,1228935168,8.942,1.003,90.056,0,0,117064318,4778650
4827176960,93441798144,58990592,1228939264,8.296,0.698,91.006,0,0,121929618,5199948
4830928896,93438038016,58998784,1228939264,8.642,0.446,90.912,0,0,113902044,5227192
4884549632,93384404992,58998784,1228947456,9.149,1.283,89.568,0,0,115258818,5247464
4891455488,93377486848,59006976,1228951552,9.073,0.447,90.480,0,0,116737324,4777536
4906676224,93362262016,59006976,1228955648,8.336,0.783,90.881,0,0,115486284,4882984
4930048000,93338886144,59006976,1228959744,8.949,0.641,90.410,0,0,121154014,5175240
4929888256,93339033600,59015168,1228963840,8.447,0.418,91.135,0,0,108583539,3938464
4932812800,93336088576,59015168,1228967936,8.101,0.419,91.480,0,0,109915176,5241118
4943962112,93324926976,59023360,1228972032,9.071,0.419,90.511,0,0,119258838,5651352
4936527872,93332361216,59023360,1228972032,8.629,0.447,90.924,0,0,117390240,5382460
4937547776,93331329024,59023360,1228984320,8.429,0.532,91.039,0,0,113018668,4901748
4939845632,93329018880,59031552,1228988416,8.480,0.476,91.044,0,0,118474188,5406152
4941746176,93327114240,59031552,1228992512,8.506,0.337,91.157,0,0,120025816,6248110
4943310848,93325533184,59039744,1229000704,8.345,0.474,91.181,0,0,111522816,4839066
4946825216,93322018816,59039744,1229000704,8.319,0.560,91.120,0,0,112733540,5552422
4949540864,93319299072,59039744,1229004800,8.974,0.308,90.718,0,0,117566044,5558748
4953235456,93315592192,59047936,1229008896,8.997,0.474,90.501,0.028,0,120394678,5553348
4960849920,93307969536,59047936,1229017088,9.919,0.446,89.635,0,0,122155802,5226746
4964302848,93304504320,59056128,1229021184,8.741,0.475,90.785,0,0,113047708,8321378
4971012096,93297786880,59056128,1229029376,9.586,0.503,89.911,0,0,119075510,5598618
4977512448,93291282432,59056128,1229033472,8.773,0.503,90.724,0,0,116765754,4807376
4975824896,93292957696,59064320,1229037568,9.548,0.447,90.006,0,0,118404358,5457206
4981624832,93287153664,59064320,1229041664,9.864,0.445,89.692,0,0,119248756,4244362
4984840192,93283921920,59072512,1229049856,9.748,0.720,89.532,0,0,110897706,4922256
4974465024,93294288896,59072512,1229053952,9.889,0.529,89.582,0,0,113701268,3944752
4976599040,93292146688,59072512,1229062144,9.433,0.642,89.925,0,0,126394408,5430782
4980133888,93288599552,59080704,1229066240,9.406,0.560,90.034,0,0,117371014,5770582
4982611968,93286117376,59080704,1229070336,9.397,0.477,90.126,0,0,116713728,5434432
4981268480,93287448576,59088896,1229074432,9.060,0.531,90.408,0,0,117272596,5373636
5116542976,93152169984,59088896,1229078528,9.678,0.979,89.343,0,0,113467600,5966296
5349408768,92919296000,59088896,1229086720,9.025,1.233,89.742,0,0,111746384,5388198
5350821888,92917870592,59097088,1229090816,9.037,0.588,90.375,0,0,119411370,5053780
5355646976,92913172480,59097088,1229086720,8.748,0.671,90.581,0,0,113148712,4849126
5903904768,92364873728,59105280,1229086720,9.022,2.129,88.848,0,0,118408130,4361400
6013022208,92255748096,59105280,1229094912,8.261,1.842,89.897,0,0,116866136,4777398
6104657920,92164112384,59105280,1229094912,8.592,1.763,89.645,0,0,111346356,4277278
6455336960,91813416960,59113472,1229103104,10.109,0.977,88.914,0,0,111832303,5451208
7186862080,91081887744,59113472,1229107200,9.167,2.480,88.353,0,0,116879380,6074092
7189442560,91079294976,59121664,1229111296,8.954,0.502,90.544,0,0,116073056,6029918
7409713152,90859016192,59121664,1229119488,8.476,2.937,88.587,0,0,107734386,5291556
7437860864,90830864384,59121664,1229123584,8.026,1.202,90.772,0,0,115517824,5112976
7444750336,90823962624,59129856,1229127680,8.898,0.697,90.404,0,0,115762846,5499616
7445000192,90823708672,59129856,1229131776,8.173,0.558,91.269,0,0,115486912,5340296
7446953984,90821742592,59138048,1229135872,8.410,0.447,91.143,0,0,112804608,5467314
7454007296,90814681088,59138048,1229144064,9.104,0.476,90.420,0,0,113957952,6573528
7500623872,90768060416,59138048,1229148160,8.720,0.950,90.330,0,0,117094868,6524440
7499919360,90768756736,59138048,1229156352,7.776,0.476,91.748,0,0,109012344,5008782
7582617600,90686046208,59146240,1229160448,9.035,1.534,89.431,0,0,109007462,5427154
7642157056,90626494464,59154432,1229164544,9.744,1.503,88.753,0,0,113004202,4518646
7647641600,90621009920,59154432,1229164544,9.299,0.391,90.310,0,0,115058638,5175150
7650299904,90618343424,59154432,1229172736,8.765,0.473,90.762,0,0,119825990,6019508
7654002688,90614636544,59154432,1229176832,8.860,0.503,90.637,0,0,117932620,4495370
7652253696,90616373248,59162624,1229180928,8.315,0.392,91.293,0,0,118049176,6031196
7655288832,90613321728,59170816,1229189120,8.685,0.419,90.896,0,0,114095866,5647494
7656554496,90612051968,59170816,1229193216,8.389,0.418,91.193,0,0,108576240,4653574
7655145472,90613456896,59170816,1229197312,8.807,0.334,90.858,0,0,104365874,5434810
7657713664,90610888704,59170816,1229197312,8.073,0.559,91.369,0,0,114016228,5020232
7656726528,90611863552,59179008,1229201408,9.035,0.446,90.491,0.028,0,122693242,4851656
7718993920,90549579776,59187200,1229209600,10.245,1.503,88.252,0,0,124786718,5623402
7744065536,90524504064,59187200,1229213696,9.111,0.866,90.022,0,0,123936594,5391956
7734808576,90533756928,59187200,1229217792,8.760,0.504,90.736,0,0,114300378,6155796
7737040896,90531520512,59187200,1229221888,9.894,0.447,89.659,0,0,114538746,5079982
7738470400,90530078720,59195392,1229225984,9.223,0.446,90.332,0,0,113074190,5307990
7737806848,90530734080,59203584,1229225984,8.773,0.475,90.752,0,0,108367358,5487500
7739105280,90529423360,59203584,1229238272,9.905,0.417,89.677,0,0,111359986,5612142
7738949632,90529574912,59203584,1229242368,9.337,0.362,90.301,0,0,115497630,4603622
7740760064,90527756288,59203584,1229246464,9.243,0.445,90.312,0,0,112637778,5604320
7740919808,90527584256,59211776,1229250560,9.462,0.532,90.006,0,0,122281797,6295008
7742078976,90526408704,59219968,1229254656,8.941,0.447,90.612,0,0,113088088,5475076
7743221760,90525261824,59219968,1229258752,9.588,0.641,89.771,0,0,116183186,6181092
7743025152,90525450240,59219968,1229266944,9.682,0.502,89.816,0,0,116382382,4897978
7741939712,90526531584,59219968,1229271040,9.172,0.390,90.438,0,0,112444300,6097962
7744614400,90523848704,59228160,1229271040,9.813,0.363,89.824,0,0,115929186,5200392
7776358400,90492080128,59236352,1229287424,9.068,1.032,89.900,0,0,118468774,5913698
7824990208,90443448320,59236352,1229287424,9.245,1.003,89.752,0,0,116657560,5248128
7893741568,90374692864,59236352,1229291520,9.137,1.593,89.271,0,0,112485446,4335292
7962693632,90305736704,59236352,1229295616,9.124,1.339,89.537,0,0,115338524,5434976
8011100160,90257313792,59244544,1229303808,8.783,1.231,89.986,0,0,113365790,6132320
8087060480,90181341184,59252736,1229307904,10.120,1.282,88.598,0,0,116256882,5499132
8162500608,90105901056,59252736,1229307904,9.213,1.480,89.308,0,0,121691394,6212784
8211382272,90057011200,59252736,1229316096,8.964,1.257,89.779,0,0,115893238,5940282
8293343232,89975046144,59252736,1229320192,10.076,1.259,88.665,0,0,121668688,5082412
8348184576,89920192512,59260928,1229324288,9.798,0.870,89.332,0,0,116351448,5394810
8421113856,89847246848,59269120,1229332480,9.802,1.309,88.889,0,0,116946266,4990538
8467910656,89800450048,59269120,1229332480,9.099,1.144,89.757,0,0,116211096,5400362
8529076224,89739284480,59269120,1229332480,9.752,1.616,88.632,0,0,115118878,5377778
8578265088,89690083328,59269120,1229344768,9.354,1.336,89.310,0,0,120535510,5780906
8657162240,89611182080,59269120,1229348864,9.226,1.118,89.656,0,0,114169820,5475052
8714919936,89553403904,59285504,1229352960,8.919,1.310,89.771,0,0,114331994,4847388
8765161472,89503154176,59285504,1229361152,9.000,1.198,89.802,0,0,112410204,6326806
8846102528,89422213120,59285504,1229361152,9.653,1.259,89.088,0,0,114770128,4775518
8904130560,89364180992,59285504,1229365248,9.711,1.419,88.870,0,0,119491656,5194726
8961748992,89306554368,59285504,1229369344,8.929,1.641,89.430,0,0,113056586,5488122
9051136000,89217142784,59301888,1229377536,8.268,1.289,90.443,0,0,120603368,5379402
9108348928,89159925760,59301888,1229381632,8.652,1.284,90.064,0,0,119365732,5492702
9165393920,89102876672,59301888,1229385728,8.575,1.476,89.950,0,0,122525460,5775284
9226682368,89041580032,59301888,1229393920,7.381,1.582,91.038,0,0,116534988,5017148
9263636480,89004625920,59301888,1229393920,8.452,0.865,90.683,0,0,113392131,4682132
9349459968,88918781952,59318272,1229398016,9.179,1.725,89.068,0.028,0,115640990,5910346
9410609152,88857518080,59318272,1229406208,7.855,1.415,90.730,0,0,107754815,5242444
9470308352,88797810688,59318272,1229410304,8.857,1.118,90.025,0,0,119226212,5831246
9534844928,88733270016,59318272,1229414400,9.307,0.838,89.855,0,0,113187710,6221574
9597386752,88670724096,59318272,1229418496,8.076,1.365,90.560,0,0,115256964,5317464
9658454016,88609636352,59334656,1229422592,9.816,1.032,89.152,0,0,116425954,6051610
9721778176,88546308096,59334656,1229426688,7.988,1.392,90.621,0,0,114560056,4892484
9781411840,88486670336,59334656,1229430784,7.279,1.008,91.713,0,0,120598720,5047170
9848664064,88419409920,59334656,1229438976,7.264,1.670,91.066,0,0,118978620,4552236
9910460416,88357609472,59334656,1229443072,8.743,0.950,90.307,0,0,111274922,6802120
9972064256,88295985152,59351040,1229447168,9.267,1.637,89.095,0,0,113809898,5762872
10034962432,88233078784,59351040,1229455360,9.642,0.889,89.469,0,0,120693932,4643680
10100113408,88167927808,59351040,1229455360,8.186,0.673,91.141,0,0,116654132,5954440
10166001664,88102035456,59351040,1229459456,7.964,1.290,90.746,0,0,115967444,6212124
10210234368,88057798656,59351040,1229463552,8.780,1.195,90.025,0,0,107742032,5412760
10272022528,87995985920,59367424,1229471744,8.934,1.002,90.064,0,0,115797520,5750886
10337939456,87930060800,59367424,1229475840,8.733,1.395,89.872,0,0,112755302,5586494
10407092224,87860899840,59367424,1229484032,8.676,0.973,90.350,0,0,112778534,5058272
10473721856,87794266112,59367424,1229488128,7.669,1.120,91.212,0,0,111266074,5647652
10506694656,87761289216,59367424,1229492224,8.382,0.919,90.699,0,0,111445434,5184864
10574077952,87693881344,59383808,1229500416,9.083,1.397,89.519,0,0,116326984,6978842
10640715776,87627239424,59383808,1229504512,9.235,1.692,89.074,0,0,115981812,5882570
10705158144,87562792960,59383808,1229508608,8.782,1.394,89.824,0,0,112717220,5919372
10779885568,87488057344,59383808,1229516800,8.759,1.534,89.707,0,0,114884492,5344840
10852057088,87415877632,59383808,1229524992,7.501,1.092,91.408,0,0,116274936,4839228
10886656000,87381254144,59404288,1229529088,8.702,0.973,90.325,0,0,119960344,5634542
10958254080,87309651968,59404288,1229533184,7.808,1.255,90.937,0,0,114481276,5750376
11020480512,87247421440,59404288,1229537280,7.951,0.896,91.153,0,0,112909908,4485172
11092324352,87175573504,59404288,1229541376,8.489,1.312,90.198,0,0,113120896,4985632
11127861248,87140032512,59404288,1229545472,6.068,0.727,93.205,0,0,113871065,4905758
11201433600,87066443776,59412480,1229553664,8.575,1.341,90.084,0,0,116587076,4600764
11280769024,86987096064,59420672,1229557760,7.694,1.287,91.018,0,0,112051301,4690296
11318079488,86949781504,59420672,1229561856,7.495,0.947,91.558,0,0,111756092,5400892
11392499712,86875357184,59420672,1229565952,7.979,1.036,90.985,0,0,115239962,4883894
11471085568,86796767232,59420672,1229570048,8.728,1.673,89.598,0,0,115271176,5783704
11503964160,86763876352,59428864,1229574144,7.221,1.059,91.720,0,0,113901242,5116230
11584606208,86683222016,59437056,1229578240,7.944,1.231,90.825,0,0,120805424,5201716
11661250560,86606569472,59437056,1229586432,7.806,1.063,91.130,0,0,113214146,5352522
11707596800,86560219136,59437056,1229590528,8.128,0.841,91.031,0,0,112593334,4734124
11787939840,86479622144,59437056,1229844480,8.654,1.312,90.034,0,0,116447742,5505634
11866193920,86401609728,59445248,1229594624,8.199,1.562,90.240,0,0,122219688,5393184
11906252800,86361460736,59453440,1229602816,7.460,0.866,91.646,0.028,0,113006644,5284922
11962372096,86305337344,59453440,1229606912,8.531,1.059,90.410,0,0,113703840,6503122
12000133120,86267572224,59453440,1229611008,9.233,0.753,90.014,0,0,114936916,5025112
12081336320,86186360832,59453440,1229619200,8.865,1.561,89.573,0,0,116529950,5661662
12162048000,86105636864,59461632,1229623296,8.122,1.284,90.594,0,0,113913410,5489622
12202319872,86065348608,59469824,1229631488,7.707,0.782,91.511,0,0,113353632,4851422
12281020416,85986639872,59469824,1229639680,7.626,1.425,90.950,0,0,117337852,4529622
12324147200,85943508992,59469824,1229643776,7.776,1.031,91.193,0,0,117722546,5254022
12400275456,85867380736,59469824,1229643776,8.333,1.207,90.460,0,0,115929784,5975384
12444475392,85823164416,59478016,1229651968,8.405,0.810,90.785,0,0,113358606,5835358
12525944832,85741682688,59486208,1229656064,8.671,1.473,89.855,0,0,118693680,4600444
12566990848,85700632576,59486208,1229660160,7.129,0.978,91.893,0,0,116811824,4742896
12652236800,85615382528,59486208,1229664256,8.305,1.426,90.268,0,0,119373414,5841844
12695490560,85572120576,59486208,1229672448,8.444,1.139,90.417,0,0,116427840,6846542
12776321024,85491027968,59494400,1229926400,9.375,1.786,88.839,0,0,120061490,4956392
12851200000,85416390656,59502592,1229676544,8.066,1.758,90.176,0,0,121913304,5722316
12888772608,85378809856,59502592,1229684736,8.471,0.699,90.830,0,0,122782418,5444360
12973432832,85294145536,59502592,1229688832,8.623,1.725,89.652,0,0,113009606,6794738
13014151168,85253423104,59502592,1229692928,8.396,1.032,90.572,0,0,112168527,5307890
13063499776,85204062208,59510784,1229697024,8.622,1.088,90.290,0,0,114788406,5154044
13154136064,85113413632,59518976,1229701120,7.814,1.940,90.247,0,0,115786752,4489358
13197627392,85069918208,59518976,1229705216,7.572,0.729,91.699,0,0,114032738,5563692
13291307008,84976226304,59518976,1229713408,8.464,1.564,89.972,0,0,115390852,5274742
13333938176,84933591040,59518976,1229717504,7.667,1.004,91.330,0,0,111605968,4923368
13381844992,84885671936,59527168,1229721600,7.448,1.004,91.548,0,0,116739276,5311048
13470982144,84796522496,59535360,1229721600,7.753,1.483,90.764,0,0,114716622,4497336
13516455936,84751044608,59535360,1229725696,8.482,0.921,90.597,0,0,121448162,4981132
13613498368,84653993984,59535360,1229733888,7.990,1.921,90.089,0,0,113124218,4021492
13653942272,84613545984,59535360,1229737984,6.853,0.951,92.196,0,0,122713808,5096856
13702471680,84565004288,59543552,1229742080,8.052,1.142,90.805,0,0,110915052,4443930
13793472512,84473991168,59551744,1229746176,8.919,1.533,89.548,0,0,114050706,5731596
13822767104,84444688384,59551744,1229754368,6.873,0.950,92.177,0,0,108108184,5770020
13867581440,84399869952,59551744,1229758464,9.573,0.646,89.781,0,0,119460700,5376674
13959753728,84307693568,59551744,1229762560,8.030,1.639,90.331,0,0,118346662,4638822
14011125760,84256055296,59559936,1230020608,7.660,0.951,91.389,0,0,115186742,5530270
14059204608,84208222208,59559936,1229774848,8.270,0.925,90.805,0,0,116317352,4991964
14153728000,84113686528,59568128,1229778944,7.580,1.790,90.629,0,0,117519788,5038580
14205677568,84061728768,59568128,1229787136,7.679,0.977,91.343,0,0,116138756,5814136
14256832512,84010573824,59568128,1229787136,7.921,0.674,91.404,0,0,113587706,4392504
14347505664,83919888384,59576320,1229791232,9.629,1.535,88.836,0,0,119104272,5301666
14398558208,83868831744,59576320,1229795328,6.693,0.504,92.803,0,0,117722428,5506180
14450348032,83817025536,59584512,1229803520,9.013,1.446,89.541,0,0,118953900,4974768
14548652032,83718643712,59584512,1229807616,7.278,1.980,90.742,0,0,118505332,4603726
14595080192,83672215552,59584512,1229807616,7.201,0.953,91.846,0,0,116000446,4986894
14650200064,83617079296,59592704,1229815808,9.253,1.059,89.660,0.028,0,115156286,6590626
14780936192,83486339072,59592704,1229819904,7.973,1.966,90.061,0,0,122173870,5661884
14784909312,83482361856,59592704,1229824000,9.891,1.034,89.075,0,0,118502964,5876210
14832877568,83434385408,59592704,1229832192,9.396,0.867,89.737,0,0,118508684,6090168
14882795520,83384463360,59592704,1229836288,7.714,1.062,91.224,0,0,111950663,5245356
14985105408,83282149376,59600896,1229832192,7.817,1.177,91.006,0,0,118849094,4706338
15035199488,83231797248,59600896,1230090240,8.690,1.341,89.969,0,0,116008978,5703962
15087894528,83179335680,59609088,1229848576,7.791,1.452,90.757,0,0,112319678,6770756
15138295808,83128930304,59609088,1229852672,9.433,1.200,89.366,0,0,114952068,6800586
15254552576,83012661248,59609088,1229864960,8.359,1.750,89.892,0,0,120683220,5719424
15289974784,82977226752,59617280,1229864960,8.696,1.282,90.022,0,0,100522464,4065500
15345352704,82921844736,59617280,1229869056,6.234,0.978,92.787,0,0,93677616,4711970
15345876992,82921312256,59625472,1229869056,6.737,0.335,92.927,0,0,70570680,4383836
15392903168,82874277888,59625472,1229877248,6.924,0.667,92.408,0,0,53650580,4456222
15393415168,82873765888,59625472,1229877248,5.989,0.223,93.788,0,0,50973350,4027514
15450370048,82816798720,59633664,1229881344,5.498,1.027,93.474,0,0,29275986,3136682
15451557888,82815606784,59633664,1229885440,4.836,0.083,95.081,0,0,16418252,2992300
15452291072,82814865408,59641856,1229885440,5.791,0.028,94.181,0,0,3862684,2803936
15452323840,82814832640,59641856,1229885440,3.523,0.083,96.394,0,0,40746,2892122
15454679040,82812477440,59641856,1229885440,5.051,0.083,94.865,0,0,24048,2640960
15456284672,82810859520,59650048,1229889536,4.914,0,95.086,0,0,32736,2921610
15457476608,82809667584,59650048,1229889536,4.696,0.056,95.249,0,0,28306,2754022
15458893824,82808250368,59650048,1229889536,4.164,0.028,95.808,0,0,44152,3023902
15459565568,82807574528,59650048,1229893632,5.935,0.028,94.038,0,0,43654,4410356
15460823040,82806317056,59650048,1229893632,5.494,0.028,94.478,0,0,25966,2692740
15486988288,82780151808,59658240,1229885440,4.163,0.167,95.670,0,0,16706,1826558
15489073152,82778054656,59658240,1229897728,5.426,0.055,94.518,0,0,37734,3877378
15489781760,82777346048,59658240,1229897728,4.623,0.111,95.266,0,0,27994,2452154
15490002944,82776862720,59666432,1230151680,4.111,0.028,95.861,0,0,23962,1949914
15490998272,82776117248,59666432,1229901824,4.357,0.083,95.559,0,0,34790,3112238
15492988928,82774118400,59674624,1229901824,4.775,0.028,95.197,0,0,31166,2548650
15494209536,82772897792,59674624,1229901824,4.799,0.028,95.173,0,0,47034,4019558
15497785344,82769068032,59674624,1230155776,5.019,0.083,94.897,0,0,30132,3023836
15502778368,82764324864,59674624,1229905920,5.716,0.055,94.229,0,0,44680,3272808
15502680064,82764423168,59674624,1229905920,3.164,0.028,96.808,0,0,22965,1241382
15505907712,82761195520,59674624,1229905920,4.989,0.028,94.983,0,0,33120,3396598
15507247104,82759839744,59682816,1229914112,5.877,0.055,94.067,0,0,45698,3808658
15508602880,82758483968,59682816,1229914112,5.263,0.055,94.681,0,0,31074,2977232
15511572480,82755440640,59682816,1229914112,5.154,0.249,94.597,0,0,31534,3337402
15513763840,82752991232,59682816,1230172160,4.935,0.028,95.037,0,0,65824,3753432
15515111424,82751897600,59682816,1229918208,5.035,0.111,94.855,0,0,42684,2976968
15521333248,82745667584,59691008,1229918208,5.696,0,94.304,0,0,33866,2986976
15523815424,82743181312,59691008,1229922304,4.192,0.056,95.752,0,0,42682,3996320
15525998592,82740989952,59699200,1229922304,5.936,0,94.064,0,0,30802,2857564
15546814464,82719920128,59699200,1230176256,6.170,0.553,93.276,0,0,33064,3063422
15548899328,82718085120,59699200,1229926400,5.542,0.055,94.403,0,0,31118,3311186
15551692800,82715275264,59715584,1229926400,4.409,0.028,95.563,0,0,18496,2531142
1537310720,96729649152,59723776,1229926400,0.167,0.139,99.694,0,0,4254,377898
1529524224,96737648640,59731968,1229705216,0.028,0.056,99.917,0,0,1052,0
1547350016,96718950400,59731968,1230151680,0.555,0.167,99.278,0,0,399704,22760
