172.16.66.55 : 0.02 0.03 0.03 0.03 0.03 0.03 0.03 0.03 0.03 0.04
172.16.66.56 : 0.19 0.24 0.23 0.23 0.23 0.20 0.20 0.25 0.27 0.17
172.16.66.57 : 22.11 10.33 10.37 10.31 10.35 10.36 10.23 10.38 10.35 10.39
172.16.66.58 : 11.07 10.30 10.32 10.35 10.30 10.20 - 10.29 10.35 10.29
172.16.66.59 : 11.13 10.31 - 10.30 10.30 10.28 10.24 10.30 10.29 10.31
172.16.66.6  : 14.64 - 10.31 10.30 10.36 10.37 10.35 10.36 10.35 10.30
172.16.66.60 : 14.60 10.36 10.36 10.35 10.30 10.29 10.29 10.22 10.34 10.34
172.16.66.61 : 11.17 10.34 10.34 10.35 10.30 10.28 10.31 10.34 10.23 10.37
172.16.66.62 : 11.16 10.37 10.37 10.34 10.31 10.29 10.36 10.34 10.12 10.37
172.16.66.64 : 11.06 10.24 10.39 10.28 10.31 10.36 - 10.37 10.30 10.37
172.16.66.65 : 11.13 10.36 10.36 - 10.37 10.18 10.25 10.37 10.33 10.37
172.16.66.66 : 11.22 10.39 10.38 10.32 10.31 10.31 10.31 10.32 10.22 10.36
172.16.66.67 : 11.19 10.38 10.35 10.34 10.32 10.24 10.24 10.37 10.36 10.24
172.16.66.69 : 14.64 10.34 10.35 10.35 10.27 10.37 10.27 10.30 10.31 10.38
172.16.66.7  : 14.60 4.29 4.30 4.33 4.31 4.34 4.32 4.37 4.31 4.38
172.16.66.70 : 11.13 4.40 4.40 4.39 4.39 4.36 4.30 4.38 4.37 4.37
172.16.66.71 : 14.65 4.37 4.39 4.38 4.37 4.37 4.28 4.37 4.32 4.34
172.16.66.72 : 14.60 4.38 4.37 4.35 4.39 4.30 4.34 4.38 4.38 4.35
172.16.66.73 : 14.61 4.30 4.32 4.35 4.38 4.37 4.38 4.40 4.32 4.41
172.16.66.74 : 14.59 4.35 4.39 4.38 4.38 4.25 4.40 4.38 4.41 4.38
172.16.66.75 : 11.09 4.32 4.37 4.37 4.34 4.35 4.38 4.33 4.32 4.37
172.16.66.76 : 14.59 4.34 4.37 4.36 4.31 4.34 4.37 4.38 4.32 4.25
172.16.66.77 : 11.16 4.37 4.35 4.37 4.37 4.37 4.37 4.31 4.32 4.40
172.16.66.78 : 11.08 4.30 4.30 4.33 4.32 4.35 4.30 4.33 4.37 4.23
172.16.66.79 : 11.07 4.28 4.39 4.37 4.38 4.37 4.38 4.27 4.35 4.38
172.16.66.8  : 11.13 4.36 4.37 4.34 4.34 4.38 4.36 4.37 4.38 4.31
172.16.66.80 : 11.11 4.35 4.36 4.36 4.38 4.30 4.27 4.36 4.38 4.38

      27 targets
      27 alive
       0 unreachable
       0 unknown addresses

       5 timeouts (waiting for response)
     270 ICMP Echos sent
     265 ICMP Echo Replies received
       0 other ICMP received

 0.02 ms (min round trip time)
 7.15 ms (avg round trip time)
 22.1 ms (max round trip time)
       10.118 sec (elapsed real time)

