"Dstat 0.7.3 CSV output"
"Author:","Dag Wieers <dag@wieers.com>",,,,"URL:","http://dag.wieers.com/home-made/dstat/"
"Host:","grisou-30.nancy.grid5000.fr",,,,"User:","root"
"Cmdline:","dstat -m -c -n -o dstat.csv",,,,"Date:","24 May 2020 18:19:52 CEST"
"memory usage",,,,"total cpu usage",,,,,"net/total",
"used","free","buff","cach","usr","sys","idl","wai","stl","recv","send"
1168535552,132366127104,51728384,1219452928,0.703,0.105,99.068,0.124,0,0,0
1180971008,132353323008,51732480,1219817472,0.500,0.219,99.094,0.187,0,388592,15652
1175715840,132358991872,51765248,1219371008,0.687,0.656,98.251,0.406,0,388146,27446
1164341248,132370345984,51773440,1219375104,0.843,0.718,98.408,0.031,0,5260,15930
1164062720,132370612224,51785728,1219375104,0,0,99.938,0.062,0,854,2380
1170726912,132363939840,51785728,1219375104,1.001,0.688,98.311,0,0,386652,27022
1170116608,132364550144,51785728,1219375104,0,0.031,97.810,2.158,0,2026,0
1169326080,132365340672,51785728,1219375104,0.031,0,99.938,0.031,0,1238,0
1169305600,132365348864,51798016,1219375104,0,0,99.937,0.063,0,1626,0
1169039360,132365615104,51798016,1219375104,0,0.031,99.969,0,0,1248,148
1169027072,132365615104,51810304,1219375104,0,0,99.969,0.031,0,1200,0
1168760832,132365881344,51810304,1219375104,0.031,0,99.969,0,0,4922,264
1168760832,132365881344,51810304,1219375104,0,0,100,0,0,2126,550
1168490496,132366147584,51810304,1219379200,0.031,0,99.969,0,0,2356,0
1168224256,132366405632,51818496,1219379200,0,0,99.937,0.063,0,854,0
1168224256,132366405632,51818496,1219379200,0,0,100,0,0,3946,0
1168019456,132366610432,51818496,1219379200,0,0,100,0,0,1200,0
1167761408,132366868480,51818496,1219379200,0.031,0,99.969,0,0,1396,0
1167245312,132367384576,51818496,1219379200,0,0,100,0,0,1650,148
1168859136,132365312000,51818496,1219829760,1.062,0.812,98.126,0,0,390710,29278
1166839808,132367769600,51826688,1219383296,0.031,0,99.937,0.031,0,2168,1164
1168506880,132366090240,51826688,1219395584,0.251,0.658,99.091,0,0,170642,12052
1176121344,132358000640,51843072,1219850240,0.750,0.438,98.780,0.031,0,388616,16670
1167671296,132366893056,51843072,1219407872,0.219,0.250,99.531,0,0,3850,14028
1180610560,132353490944,51855360,1219854336,0.749,0.125,99.064,0.062,0,383650,11126
1176596480,132357492736,51867648,1219854336,0.031,0,99.937,0.031,0,7516,220
1177092096,132356968448,51884032,1219862528,1.062,0.656,98.250,0.031,0,387264,26802
1166487552,132368019456,51884032,1219416064,0.531,0.500,98.563,0.406,0,4624,15876
1166446592,132368060416,51884032,1219416064,0.031,0,99.969,0,0,7222,0
1166495744,132368011264,51884032,1219416064,0,0.031,99.969,0,0,9540,2584
1168056320,132366385152,51908608,1219416064,1.841,0.281,97.785,0.094,0,221986,8568
1167622144,132366819328,51908608,1219416064,0.031,0,99.969,0,0,3310,2652
1167065088,132367376384,51908608,1219416064,0.031,0,99.969,0,0,7060,0
1174917120,132359430144,51924992,1219489792,0.375,0.094,99.250,0.281,0,341390,12688
1166290944,132368113664,51924992,1219432448,0.125,0.125,99.750,0,0,167716,8988
1174048768,132360126464,51965952,1219620864,0.188,0.439,99.279,0.094,0,154896,18824
1174028288,132360134656,51965952,1219633152,0.031,0,99.969,0,0,10364,13328
1173762048,132360400896,51965952,1219633152,0,0.063,99.937,0,0,10784,13328
1173237760,132360925184,51970048,1219629056,0,0.031,99.531,0.438,0,10620,13328
1172709376,132361441280,51970048,1219641344,0,0.031,99.969,0,0,10688,13328
1172692992,132361449472,51978240,1219641344,0.062,0.031,99.844,0.062,0,17338,18400
1172426752,132361707520,51986432,1219641344,0.031,0.031,99.906,0.031,0,13738,13328
1172168704,132361965568,51986432,1219641344,0,0,100,0,0,13594,13328
1171394560,132362739712,51986432,1219641344,0,0.031,99.969,0,0,13292,13230
1170870272,132363264000,51986432,1219641344,0.031,0.031,99.938,0,0,13366,15080
1164144640,132370173952,51986432,1219457024,0.062,0.062,99.875,0,0,5398,6344
1164046336,132370272256,51986432,1219457024,0.250,0.063,99.687,0,0,170288,11724
1163243520,132371062784,51998720,1219457024,0,0,99.969,0.031,0,1708,0
1162985472,132371320832,51998720,1219457024,0.031,0,99.969,0,0,1156,0
1162985472,132371320832,51998720,1219457024,0,0,100,0,0,1398,0
1162981376,132371320832,51998720,1219461120,0.031,0,99.969,0,0,6730,0
1162194944,132372094976,52011008,1219461120,0,0.031,99.938,0.031,0,1544,0
1161678848,132372611072,52011008,1219461120,0,0,100,0,0,682,0
1174253568,132359557120,52035584,1219915776,1.031,0.719,98.156,0.094,0,388752,16654
1163079680,132371169280,52035584,1219469312,0.094,0,99.906,0,0,3018,14124
1163071488,132371177472,52035584,1219469312,0,0,100,0,0,1358,0
1316548608,132217376768,52035584,1219784704,3.060,0.343,96.597,0,0,345172,17590
1317871616,132216295424,52035584,1219522560,0.031,0.031,99.938,0,0,10652,0
1317720064,132216434688,52047872,1219522560,0,0,99.969,0.031,0,3680,168
1317191680,132216950784,52060160,1219522560,0.031,0,99.906,0.062,0,1852,0
1317212160,132216918016,52064256,1219530752,0.031,0.031,99.750,0.188,0,1120,0
1357467648,132176658432,52064256,1219534848,2.494,0.187,97.319,0,0,8104,0
1396215808,132137910272,52064256,1219534848,3.284,0.031,96.684,0,0,3460,0
1454608384,132079509504,52072448,1219534848,3.737,0.093,96.138,0.031,0,1160,0
1507618816,132026499072,52072448,1219534848,3.641,0.156,96.203,0,0,1920,476
1536970752,131997138944,52080640,1219534848,3.220,0.094,96.655,0.031,0,508,368
1570783232,131963326464,52080640,1219534848,3.190,0.031,96.778,0,0,1430,0
1623728128,131910381568,52080640,1219534848,3.431,0.062,96.507,0,0,2160,148
1684312064,131849789440,52088832,1219534848,3.188,0.125,96.655,0.031,0,2458,264
1727594496,131806507008,52088832,1219534848,3.337,0.125,96.538,0,0,3196,168
1756729344,131777372160,52088832,1219534848,3.251,0.031,96.718,0,0,7110,0
1794486272,131739574272,52088832,1219534848,3.489,0.062,96.449,0,0,2620,568
1852203008,131681853440,52088832,1219538944,3.468,0.094,96.439,0,0,5094,1860
1887858688,131646197760,52088832,1219538944,3.589,0.187,96.223,0,0,3422,2184
1887850496,131646197760,52097024,1219538944,3.098,0.031,96.809,0.063,0,5878,1680
1889431552,131644616704,52097024,1219538944,3.158,0,96.842,0,0,2602,1260
1899864064,131634130944,52105216,1219543040,4.194,0.063,95.712,0.031,0,1053084,11038
1957748736,131576119296,52105216,1219547136,11.357,0.311,88.332,0,0,15365960,287448
1969823744,131564003328,52105216,1219547136,10.920,0.437,88.643,0,0,37052732,717772
2032803840,131500937216,52113408,1219551232,9.153,0.719,90.097,0.031,0,57393656,1028908
2122043392,131411615744,52113408,1219551232,9.368,1.276,89.356,0,0,78178843,1337514
2192515072,131341103104,52113408,1219551232,10.498,1.402,88.100,0,0,99097175,1556036
2276560896,131257049088,52121600,1219551232,12.679,1.554,85.705,0.062,0,122019315,1817872
2318516224,131215093760,52121600,1219551232,12.060,1.295,86.644,0,0,141910192,2117300
2395164672,131138437120,52129792,1219551232,12.040,2.027,85.933,0,0,161456533,2334040
2405191680,131128410112,52129792,1219551232,12.149,0.750,87.071,0.031,0,181797359,2535252
2458193920,131075407872,52129792,1219551232,14.042,1.305,84.654,0,0,199607440,2846988
2698928128,130834673664,52129792,1219551232,12.508,1.058,86.403,0.031,0,201354123,2769960
2817564672,130716037120,52129792,1219551232,12.547,1.126,86.327,0,0,201432361,2831974
3019661312,130513928192,52137984,1219555328,12.500,0.935,86.534,0.031,0,201234528,2906638
3321913344,130211672064,52137984,1219559424,12.277,1.468,86.223,0.031,0,201425737,2875514
3371126784,130162458624,52137984,1219559424,12.531,0.688,86.781,0,0,201360379,2918814
3534151680,129999433728,52137984,1219559424,13.019,1.030,85.951,0,0,201182241,2935860
3794239488,129739345920,52137984,1219559424,11.899,0.906,87.196,0,0,201404179,2975146
3830054912,129703518208,52146176,1219563520,14.281,1.281,84.406,0.031,0,201436819,3022616
4319518720,129214054400,52146176,1219563520,13.227,1.257,85.517,0,0,201306550,3079582
4330766336,129202798592,52154368,1219563520,12.321,0.840,86.590,0.249,0,201382092,3127664
4354850816,129178710016,52154368,1219567616,13.780,1.210,85.009,0,0,201154134,3151480
4870836224,128662724608,52154368,1219567616,11.636,1.439,86.925,0,0,201120602,3157910
4922568704,128610979840,52162560,1219567616,11.987,0.814,87.167,0.031,0,201555902,3199220
4934651904,128598892544,52162560,1219571712,12.675,0.901,86.424,0,0,201122863,3262904
4966764544,128566775808,52162560,1219575808,13.182,1.210,85.608,0,0,201502915,3213052
5008977920,128524562432,52162560,1219575808,13.306,1.148,85.546,0,0,201312678,3258634
5651251200,127882285056,52162560,1219579904,12.189,1.182,86.629,0,0,201330270,3349518
5659791360,127873736704,52170752,1219579904,11.732,0.780,87.457,0.031,0,201182347,3385510
5685129216,127848398848,52170752,1219579904,14.036,1.313,84.651,0,0,201600577,3449118
5700640768,127832883200,52170752,1219584000,12.883,1.115,85.971,0.031,0,201332911,3416300
5724372992,127809150976,52170752,1219584000,13.011,1.217,85.772,0,0,201103351,3396578
5741572096,127791947776,52170752,1219588096,13.847,0.776,85.377,0,0,201473336,3448628
5758009344,127775502336,52178944,1219588096,12.888,0.839,86.242,0.031,0,201260923,3444832
5770739712,127762767872,52178944,1219592192,12.261,1.035,86.704,0,0,201491067,3383480
5788803072,127744565248,52187136,1219723264,12.984,1.030,85.924,0.062,0,201346317,3509060
5804253184,127729115136,52187136,1219723264,13.165,1.089,85.745,0,0,201516991,3539808
5826269184,127707099136,52187136,1219723264,12.943,1.003,86.023,0.031,0,201162929,3668604
5844697088,127688654848,52195328,1219731456,13.156,1.094,85.719,0.031,0,201430570,3650084
5861105664,127672246272,52195328,1219731456,12.578,0.721,86.700,0,0,201279913,3608518
5878005760,127655346176,52195328,1219731456,13.649,1.028,85.323,0,0,201124516,3641024
5956689920,127576662016,52195328,1219731456,14.135,0.932,84.933,0,0,201412867,3671340
6608056320,126925287424,52195328,1219739648,11.478,2.152,86.369,0,0,201172798,3722142
6696366080,126836969472,52203520,1219739648,13.120,1.830,84.988,0.062,0,201334674,3706352
6720151552,126813151232,52203520,1219739648,13.974,1.123,84.903,0,0,201336749,3536156
6743429120,126789873664,52203520,1219739648,13.840,1.590,84.102,0.468,0,201100293,3786904
7276007424,126257258496,52203520,1219743744,12.957,1.311,85.732,0,0,201372995,3796844
7798267904,125735059456,52203520,1219739648,12.764,2.360,84.876,0,0,201306750,3811092
7926005760,125607313408,52211712,1219739648,12.547,2.065,85.325,0.063,0,201546036,3859044
7935369216,125597949952,52211712,1219739648,12.968,0.774,86.258,0,0,201324937,3808240
7949099008,125584216064,52211712,1219743744,13.646,0.689,85.665,0,0,201436987,3899568
7993765888,125539536896,52219904,1219747840,12.933,1.031,85.973,0.062,0,201301970,3929124
8025800704,125507502080,52219904,1219747840,11.896,0.910,87.194,0,0,201313568,3988904
8044503040,125488791552,52228096,1219747840,14.796,0.878,84.295,0.031,0,201227340,4067090
8052072448,125481222144,52228096,1219747840,13.826,1.436,84.738,0,0,201194244,4001274
8061321216,125471969280,52228096,1219751936,13.582,1.506,84.912,0,0,201116484,3938868
8080625664,125452664832,52228096,1219751936,12.708,0.941,86.351,0,0,201541405,4042528
8098476032,125434802176,52228096,1219760128,12.912,0.911,86.177,0,0,201331433,4010776
8116641792,125416636416,52236288,1219751936,13.650,0.871,85.448,0.031,0,201394228,4079064
8128212992,125405057024,52236288,1219760128,13.682,0.840,85.479,0,0,201378315,4134068
8134451200,125398814720,52236288,1219764224,14.433,0.845,84.721,0,0,201187225,4143110
8149544960,125383720960,52236288,1219764224,14.646,0.964,84.391,0,0,201455663,4152194
8170090496,125363171328,52236288,1219768320,14.246,0.962,84.792,0,0,201288700,4127290
8181137408,125352112128,52244480,1219772416,14.946,1.023,84,0.031,0,201510255,4180878
8193241088,125340008448,52244480,1219772416,14.601,0.870,84.529,0,0,201198478,4237934
8203833344,125329416192,52244480,1219772416,13.773,0.937,85.290,0,0,201193569,4203086
8215949312,125317300224,52244480,1219772416,15.222,0.808,83.970,0,0,201593457,4215392
8230154240,125303087104,52244480,1219780608,15.351,0.839,83.810,0,0,201537427,4224652
8255733760,125277499392,52252672,1219780608,15.274,0.904,83.791,0.031,0,200908776,4135734
8360960000,125172273152,52252672,1219780608,13.956,1.869,84.174,0,0,201406220,4221558
8975994880,124557238272,52252672,1219780608,12.823,2.023,85.154,0,0,201242442,4328364
9029586944,124503642112,52252672,1219784704,12.578,1.317,86.104,0,0,201194954,4344455
9046843392,124486377472,52252672,1219792896,14.371,0.781,84.848,0,0,199666149,4240710
9064103936,124469108736,52260864,1219792896,13.963,1.300,84.706,0.031,0,201516292,4296034
9124388864,124408819712,52260864,1219796992,14.348,1.859,83.793,0,0,201208685,4323899
9237409792,124295798784,52260864,1219796992,13.267,2.972,83.761,0,0,201386386,4292140
9331994624,124201209856,52260864,1219801088,13.304,1.655,85.041,0,0,201440275,4420546
9420648448,124112539648,52260864,1219801088,13.961,2.088,83.951,0,0,201490799,4361968
9570664448,123962511360,52269056,1219805184,19.395,1.964,78.609,0.031,0,201063963,4400192
9692176384,123840999424,52269056,1219805184,13.576,2.451,83.972,0,0,201504665,4383970
9702727680,123830444032,52269056,1219809280,14.596,1.054,84.351,0,0,201246316,4546464
9711091712,123822075904,52269056,1219813376,13.938,0.781,85.094,0.188,0,201361360,4535842
9760935936,123772223488,52277248,1219813376,14.121,1.182,84.666,0.031,0,201320865,4565860
10155331584,123377819648,52285440,1219813376,13.876,2.027,84.035,0.062,0,201624548,4498148
10406068224,123127078912,52285440,1219817472,13.708,1.896,84.395,0,0,201178254,4524582
10418388992,123114754048,52285440,1219821568,14.410,0.967,84.623,0,0,201062814,4534850
10434994176,123098148864,52285440,1219821568,13.298,0.841,85.643,0.218,0,201442490,4520952
10446524416,123086618624,52285440,1219821568,14.134,0.909,84.958,0,0,201208093,4624090
10516672512,123016458240,52293632,1219825664,13.497,1.738,84.735,0.031,0,201237439,4639016
10620293120,122912837632,52293632,1219825664,14.365,2.017,83.618,0,0,201396699,4595200
10723024896,122810105856,52293632,1219825664,13.469,1.844,84.688,0,0,201739469,4574186
10824077312,122709045248,52293632,1219833856,14.308,1.714,83.978,0,0,201184945,4629806
10927656960,122605457408,52301824,1219833856,13.798,1.940,84.230,0.031,0,201407794,4602644
11029692416,122503413760,52310016,1219833856,13.007,2.121,84.841,0.031,0,200853837,4654842
11054051328,122479050752,52310016,1219837952,15.526,2.031,82.443,0,0,201221934,4653354
11139272704,122393829376,52310016,1219837952,14.237,2.021,83.743,0,0,201345010,4724044
11260092416,122273005568,52310016,1219842048,14.545,1.971,83.453,0.031,0,201480292,4704770
11814109184,121718988800,52310016,1219842048,13.601,2.442,83.957,0,0,201170958,4684776
11835236352,121697849344,52318208,1219846144,13.891,0.808,85.270,0.031,0,201450222,4715516
11843891200,121689194496,52318208,1219846144,15.605,0.839,83.556,0,0,201433967,4810046
11850625024,121682460672,52318208,1219846144,13.709,0.720,85.571,0,0,200986429,4797728
11869818880,121663258624,52318208,1219854336,13.949,0.992,85.059,0,0,201722368,4782712
11934195712,121598881792,52318208,1219854336,15.294,1.796,82.910,0,0,201214289,4799604
12041928704,121491136512,52326400,1219858432,13.639,2.091,84.238,0.031,0,201506336,4810950
12112920576,121420144640,52326400,1219858432,13.209,2.025,84.766,0,0,201246632,4822242
12230434816,121302630400,52326400,1219858432,14.629,2.339,83.032,0,0,201452665,4792694
12308205568,121224855552,52326400,1219862528,13.277,1.640,85.084,0,0,201167238,4851524
12425777152,121107279872,52326400,1219866624,13.690,2.256,84.054,0,0,201462241,4816706
12517507072,121015541760,52334592,1219866624,12.399,2.741,84.766,0.093,0,201442200,4935733
12648083456,120884961280,52334592,1219870720,13.904,1.866,84.230,0,0,201272627,4835631
12740243456,120792797184,52334592,1219874816,14.312,2.080,83.608,0,0,201225200,4892164
12831952896,120701087744,52334592,1219874816,13.132,1.591,85.278,0,0,201778328,4861850
12962373632,120570621952,52334592,1219878912,13.313,2.271,84.417,0,0,201313574,4885590
13047922688,120485072896,52342784,1219870720,13.692,0.875,85.402,0.031,0,201339240,4877700
13178814464,120354172928,52342784,1219878912,14.286,1.629,84.085,0,0,201502140,4994166
13280468992,120252510208,52342784,1219887104,14.165,1.157,84.678,0,0,201237657,4974118
13377204224,120155774976,52342784,1219887104,13.552,1.283,85.164,0,0,201352199,5003566
13509947392,120023031808,52342784,1219887104,14.450,1.958,83.592,0,0,201358836,4933766
13613637632,119919325184,52350976,1219895296,13.296,1.966,84.707,0.031,0,201382351,4958674
13714804736,119818153984,52350976,1219899392,13.673,1.940,84.387,0,0,200525571,5006542
13813755904,119719202816,52350976,1219899392,13.704,1.709,84.587,0,0,201432385,4997146
13953429504,119579525120,52350976,1219903488,14.739,1.119,84.142,0,0,201329305,4955572
14057525248,119475421184,52359168,1219903488,15.291,1.837,82.529,0.343,0,201525340,4903286
14158102528,119374839808,52359168,1219907584,13.743,1.402,84.855,0,0,201091884,4970498
14235791360,119297138688,52367360,1219911680,13.943,1.341,84.685,0.031,0,201243309,5019442
14343081984,119189848064,52367360,1219911680,12.967,1.476,85.557,0,0,201575229,5075726
14448152576,119084773376,52367360,1219915776,13.404,1.683,84.913,0,0,201273934,5051538
14552584192,118980341760,52367360,1219915776,14.219,1.425,84.356,0,0,201281774,5038004
14657032192,118875889664,52367360,1219919872,13.892,1.856,84.251,0,0,201273864,5175508
14809198592,118723710976,52375552,1219923968,13.831,1.873,84.234,0.062,0,201534366,5220114
14908817408,118624092160,52375552,1219923968,14.272,1.823,83.905,0,0,201079018,5239070
15011340288,118521569280,52375552,1219923968,13.622,1.527,84.850,0,0,201566146,5197426
15109525504,118423379968,52375552,1219928064,14.059,1.306,84.635,0,0,201280038,5197134
15214456832,118318444544,52375552,1219932160,13.816,1.832,84.353,0,0,201144214,5218228
15328673792,118204215296,52383744,1219932160,14.374,1.397,84.135,0.093,0,201484801,5098854
15411417088,118121467904,52383744,1219936256,14.109,1.705,84.186,0,0,201173275,5146158
15521939456,118010945536,52383744,1219936256,13.725,1.650,84.625,0,0,201586266,5080808
15631601664,117901279232,52383744,1219940352,15.023,1.431,83.546,0,0,201274753,5230036
15742275584,117790601216,52383744,1219944448,14.547,1.733,83.720,0,0,201441635,5280961
15849652224,117683171328,52391936,1219948544,14.383,1.615,83.939,0.062,0,200990315,5267018
15960768512,117572014080,52391936,1219948544,13.649,2.026,84.325,0,0,201463989,5252500
16054562816,117478219776,52391936,1219948544,13.900,1.706,84.393,0,0,201633890,5199130
16139997184,117392781312,52391936,1219952640,13.956,0.997,85.047,0,0,200914861,5228952
16254566400,117278208000,52391936,1219956736,14.143,1.620,84.237,0,0,201348714,5251460
16366583808,117166182400,52400128,1219956736,13.957,1.772,84.209,0.062,0,201663557,5246928
16482816000,117049946112,52400128,1219960832,13.740,2.580,83.680,0,0,201438755,5363810
16599040000,116933722112,52400128,1219960832,13.964,1.503,84.534,0,0,201337939,5360062
16708476928,116824276992,52400128,1219969024,13.739,1.223,85.038,0,0,201260064,5379330
16819646464,116713103360,52404224,1219969024,12.835,2.025,85.140,0,0,201186550,5297148
16882991104,116649750528,52412416,1219969024,13.157,1.213,85.599,0.031,0,201445774,5463068
16995471360,116537266176,52412416,1219973120,13.153,1.605,85.242,0,0,201673134,5478134
17117376512,116415361024,52412416,1219973120,14.405,2.076,83.519,0,0,201142181,5461106
17237970944,116294762496,52412416,1219977216,13.994,2.286,83.719,0,0,201220407,5419584
17312092160,116220628992,52420608,1219981312,13.877,1.307,84.319,0.498,0,201680461,5427602
17433923584,116098789376,52428800,1219981312,15.690,1.860,82.326,0.124,0,201205482,5373844
17561919488,115970789376,52428800,1219985408,15.697,2.291,82.012,0,0,201286769,5396786
17685155840,115847548928,52428800,1219989504,13.514,1.841,84.644,0,0,201412005,5479566
17732587520,115800113152,52428800,1219993600,12.543,0.996,86.461,0,0,201299094,5562468
17850658816,115682041856,52428800,1219993600,13.844,1.375,84.781,0,0,201466575,5581264
17971605504,115561078784,52445184,1219993600,14.025,2.136,83.746,0.093,0,201199070,5617677
18097795072,115434885120,52445184,1219997696,13.645,1.380,84.975,0,0,201298006,5609100
18174271488,115358408704,52445184,1219997696,14.201,1.157,84.642,0,0,201525485,5630348
18305175552,115227496448,52445184,1220005888,14.250,1.406,84.344,0,0,201169484,5510490
18436177920,115096494080,52445184,1220005888,14.757,2.187,83.056,0,0,201539299,5561170
18506723328,115025936384,52453376,1220009984,11.924,1.121,86.924,0.031,0,201508722,5681534
18632802304,114899853312,52453376,1220014080,14.410,1.863,83.727,0,0,201143204,5658844
18741911552,114790744064,52453376,1220014080,14.237,1.861,83.902,0,0,201666123,5679080
18816081920,114716565504,52453376,1220022272,14.042,1.612,84.346,0,0,201264125,5689718
18945626112,114587021312,52453376,1220022272,14.157,1.777,84.066,0,0,201451829,5614264
19016658944,114515976192,52461568,1220026368,12.030,1.003,86.905,0.063,0,201327111,5725746
19155529728,114377019392,52461568,1220030464,13.634,2.361,84.005,0,0,201514719,5608922
19289583616,114242965504,52461568,1220030464,13.612,1.383,85.005,0,0,201000121,5670814
19363147776,114169393152,52461568,1220038656,13.967,1.099,84.934,0,0,201554102,5713188
19495534592,114037002240,52461568,1220042752,13.853,2.059,83.963,0.125,0,200542245,5706734
19565109248,113967419392,52469760,1220042752,11.643,1.189,87.136,0.031,0,202184557,5647226
19705298944,113827229696,52469760,1220042752,14.317,2.162,83.521,0,0,201316011,5647702
19777048576,113755475968,52469760,1220046848,13.793,1.191,85.016,0,0,201280778,5641632
19915751424,113616773120,52469760,1220046848,13.927,1.725,84.348,0,0,201519175,5607038
19987509248,113545003008,52477952,1220050944,11.490,1.565,86.631,0.313,0,201113799,5618318
20132466688,113400033280,52486144,1220055040,14.716,1.224,84.029,0.031,0,201263320,5532834
20211302400,113321197568,52486144,1220055040,14.044,1.126,84.830,0,0,201158684,5694714
20354342912,113178152960,52486144,1220059136,14.589,1.590,83.822,0,0,201391193,5626184
20441481216,113091010560,52486144,1220063232,11.974,1.154,86.872,0,0,201495014,5614020
20586139648,112946339840,52494336,1220067328,14.572,1.410,83.830,0.188,0,201423190,5685548
20667785216,112864686080,52502528,1220067328,14.401,1.683,83.728,0.187,0,201299010,5638458
20808773632,112723693568,52502528,1220071424,13.026,1.994,84.980,0,0,201387536,5687426
20886863872,112645599232,52502528,1220075520,13.636,1.494,84.869,0,0,201284626,5672128
20972064768,112560398336,52502528,1220075520,15.771,2.328,81.900,0,0,201527831,5611152
21115236352,112417222656,52502528,1220079616,14.692,1.938,83.370,0,0,201162794,5575812
21201436672,112331005952,52518912,1220079616,11.616,1.308,86.515,0.561,0,201078791,5369446
21352587264,112179851264,52518912,1220083712,14.581,2.634,82.785,0,0,201466171,5595252
21433729024,112098705408,52518912,1220087808,14.640,1.365,83.995,0,0,201198288,5585590
21507862528,112024567808,52518912,1220091904,12.103,1.618,86.279,0,0,201508559,5577954
21658935296,111873490944,52518912,1220091904,14.299,1.623,84.077,0,0,201236808,5668054
21743427584,111788982272,52535296,1220091904,14.446,1.059,83.966,0.529,0,201320538,5616206
21885612032,111646793728,52535296,1220096000,14.066,1.754,84.179,0,0,201405456,5632110
21955993600,111576412160,52535296,1220096000,12.110,1.124,86.767,0,0,201216778,5715484
22093344768,111439052800,52535296,1220104192,14.308,1.816,83.876,0,0,201563056,5686608
22175854592,111356542976,52535296,1220104192,14.272,1.706,84.021,0,0,201397245,5613894
22226096128,111306280960,52551680,1220108288,11.986,1.276,86.239,0.498,0,201246652,5696290
22382854144,111149522944,52551680,1220108288,14.706,1.439,83.855,0,0,201209315,5647706
22469468160,111062908928,52551680,1220108288,14.419,1.492,84.089,0,0,201356757,5640302
22543110144,110989262848,52551680,1220112384,12.080,1.245,86.675,0,0,201479607,5693790
22696796160,110835572736,52551680,1220116480,14.326,1.944,83.730,0,0,201138406,5649500
22784020480,110748327936,52568064,1220120576,14.054,1.249,84.229,0.468,0,201373766,5645560
22860980224,110671368192,52568064,1220120576,12.189,1.244,86.567,0,0,201588900,5669442
23018328064,110514020352,52568064,1220120576,14.348,2.298,83.354,0,0,200067371,5640662
23106822144,110425522176,52568064,1220124672,14.241,1.189,84.570,0,0,202484292,5609678
23185633280,110346711040,52568064,1220124672,12.391,1.588,86.021,0,0,201340660,5523830
23356080128,110176243712,52584448,1220128768,14.352,2.077,83.106,0.465,0,201330250,5658112
23448653824,110083665920,52584448,1220132864,14.263,1.339,84.397,0,0,201254936,5666648
23508738048,110023573504,52584448,1220141056,12.345,1.119,86.536,0,0,201458782,5675312
23595462656,109936848896,52584448,1220141056,14.317,1.123,84.560,0,0,201293030,5689468
23759990784,109772320768,52584448,1220141056,14.326,1.291,84.383,0,0,201340714,5661850
23841693696,109690597376,52600832,1220145152,12.194,1.365,86.007,0.434,0,201208233,5701210
23936671744,109595611136,52600832,1220153344,14.023,2.057,83.920,0,0,201686874,5661272
24021823488,109510455296,52600832,1220157440,12.068,1.275,86.656,0,0,201412443,5707086
24194170880,109338107904,52600832,1220157440,15.311,2.329,82.360,0,0,201547782,5655880
24289046528,109243228160,52600832,1220161536,14.286,1.727,83.987,0,0,201312684,5605640
24384557056,109147701248,52617216,1220161536,11.695,1.524,86.283,0.498,0,201276062,5358756
24476454912,109055795200,52617216,1220169728,14.844,1.688,83.469,0,0,188254161,5564280
24618033152,108914216960,52617216,1220169728,12.064,1.621,86.315,0,0,166153469,5430502
24686063616,108846182400,52617216,1220173824,14.499,1.521,83.980,0,0,145630290,5339150
24765140992,108767100928,52617216,1220177920,14.165,1.094,84.740,0,0,124531492,5111794
24836136960,108696084480,52637696,1220177920,12.041,0.840,86.683,0.436,0,102269092,4901294
24917696512,108614520832,52637696,1220182016,14.983,0.653,84.271,0.093,0,80730260,4739196
25058041856,108474171392,52637696,1220186112,13.534,1.610,84.856,0,0,59329462,4552050
25126961152,108405227520,52654080,1220190208,12.699,0.998,86.084,0.218,0,38436064,4362844
25179914240,108352274432,52654080,1220190208,14.103,0.686,85.211,0,0,18261560,4213014
25217748992,108314439680,52654080,1220190208,11.665,1.145,87.191,0,0,1841992,4089384
25255022592,108277145600,52670464,1220194304,13.898,0.654,85.323,0.125,0,22702,4100238
25370775552,108161392640,52670464,1220194304,14.321,1.491,84.188,0,0,23696,4089450
25397612544,108134551552,52670464,1220198400,11.315,1.057,87.628,0,0,18666,4106290
25432870912,108099293184,52670464,1220198400,14.192,0.560,85.247,0,0,28242,4095784
25437700096,108094234624,52670464,1220206592,11.642,0.900,87.457,0,0,53369,4095770
25565925376,107965988864,52686848,1220206592,14.518,1.904,82.985,0.593,0,22682,4086394
25597554688,107934359552,52686848,1220206592,14.392,1.489,84.119,0,0,22782,4116766
25634680832,107897229312,52686848,1220210688,11.704,0.624,87.672,0,0,21528,4098070
25677127680,107854782464,52686848,1220210688,13.733,1.155,85.112,0,0,25932,4092790
25691934720,107839971328,52686848,1220214784,11.385,0.717,87.898,0,0,25542,4097326
25735237632,107796652032,52703232,1220214784,14.250,0.871,84.568,0.311,0,19056,4085258
25862221824,107669663744,52703232,1220218880,13.021,2.020,84.960,0,0,18652,4084018
25894772736,107637112832,52703232,1220218880,12.131,0.597,87.272,0,0,23098,4089780
25921622016,107610259456,52703232,1220222976,14.050,1.246,84.704,0,0,23084,4110118
25946841088,107585036288,52703232,1220227072,11.132,0.998,87.870,0,0,20938,4087890
2536710144,130995150848,52719616,1220227072,9.369,1.156,89.288,0.187,0,12698,2359078
2528399360,131003674624,52719616,1220014080,0.031,0,99.969,0,0,866,0
2531520512,131000553472,52719616,1220014080,0,0.031,99.969,0,0,692,0
2531520512,131000553472,52719616,1220014080,0.031,0,99.969,0,0,874,2380
2531520512,131000553472,52719616,1220014080,0,0.031,99.969,0,0,346,2944
2531217408,131000844288,52740096,1220005888,0,0,99.688,0.312,0,752,0
2531184640,131000868864,52740096,1220014080,0.031,0,99.969,0,0,346,0
2531168256,131000885248,52740096,1220014080,0,0,100,0,0,934,0
2531168256,131000885248,52740096,1220014080,0.031,0,99.969,0,0,692,0
2531168256,131000885248,52740096,1220014080,0,0.031,99.969,0,0,346,0
2531168256,131000885248,52740096,1220014080,0,0,99.937,0.063,0,580,0
2531160064,131000885248,52756480,1220005888,0.031,0,99.906,0.062,0,874,0
2531151872,131000885248,52756480,1220014080,0.031,0.031,99.938,0,0,3862,432
2533048320,130998988800,52756480,1220014080,0,0.031,99.969,0,0,7076,550
2533048320,130998988800,52756480,1220014080,0.031,0,99.969,0,0,982,550
2532888576,130999148544,52756480,1220014080,0.281,0,99.719,0,0,226,0
2532888576,130999148544,52756480,1220014080,0.031,0,99.750,0.219,0,806,0
2532876288,130999148544,52764672,1220018176,0,0,99.969,0.031,0,242,0
2532876288,130999148544,52764672,1220018176,0.031,0,99.969,0,0,572,84
2586329088,130944094208,52764672,1220472832,1.221,0.564,98.215,0,0,401263,32280
2552852480,130977173504,52764672,1220026368,0.094,0.062,99.844,0,0,3192,15330
