"Dstat 0.7.3 CSV output"
"Author:","Dag Wieers <dag@wieers.com>",,,,"URL:","http://dag.wieers.com/home-made/dstat/"
"Host:","gros-109.nancy.grid5000.fr",,,,"User:","root"
"Cmdline:","dstat -m -c -n -o dstat.csv",,,,"Date:","24 May 2020 19:51:20 CEST"
"memory usage",,,,"total cpu usage",,,,,"net/total",
"used","free","buff","cach","usr","sys","idl","wai","stl","recv","send"
1512816640,96797175808,55394304,1203892224,0.511,0.071,99.416,0.002,0,0,0
1517019136,96792707072,55406592,1204142080,0.723,0.472,98.805,0,0,776717,41284
1506582528,96803278848,55406592,1204027392,0.528,0.361,99.111,0,0,9995,6160
1522221056,96787177472,55418880,1204473856,0.472,0.361,98.805,0.361,0,390746,13816
1503657984,96806187008,55418880,1204027392,0.222,0.139,99.639,0,0,13686,4156
1503641600,96806203392,55418880,1204027392,0.028,0,99.972,0,0,5863,0
1518915584,96790466560,55431168,1204473856,0.444,0.167,99.389,0,0,393488,15216
1506000896,96803823616,55431168,1204031488,0.333,0.333,99.334,0,0,10750,5644
1520418816,96789118976,55443456,1204301824,0.556,0.222,99.222,0,0,563510,26452
1519468544,96789876736,55443456,1204490240,0.779,0.612,98.610,0,0,390786,27496
1499459584,96810074112,55443456,1204301824,0.111,0.139,99.750,0,0,5558,3828
1501388800,96808394752,55443456,1204047872,0.612,0.445,98.944,0,0,387210,17268
1503780864,96805949440,55455744,1204047872,1.167,0.194,98.639,0,0,227150,13928
1512140800,96797380608,55472128,1204240384,0.528,0.111,99.361,0,0,511712,26400
1512132608,96797388800,55472128,1204240384,0.028,0.056,99.917,0,0,5610,4022
1512132608,96797388800,55472128,1204240384,0.028,0.056,99.917,0,0,7318,3920
1512116224,96797405184,55472128,1204240384,0,0.028,99.972,0,0,10322,4140
1512103936,96797405184,55484416,1204240384,0,0.028,99.972,0,0,9452,3920
1512091648,96797405184,55496704,1204240384,0.056,0.028,99.917,0,0,7052,4022
1512091648,96797405184,55496704,1204240384,0,0.028,99.972,0,0,9334,5858
1512091648,96797405184,55496704,1204240384,0,0.056,99.944,0,0,5671,3920
1512091648,96797405184,55496704,1204240384,0.028,0,99.972,0,0,9482,3920
1512058880,96797437952,55496704,1204240384,0.028,0.028,99.944,0,0,10158,3920
1503739904,96805941248,55496704,1204056064,0.028,0.028,99.944,0,0,7899,7600
1504493568,96805175296,55508992,1204056064,0.195,0.028,99.777,0,0,182594,13876
1504485376,96805183488,55508992,1204056064,0.056,0.028,99.917,0,0,5400,0
1504477184,96805191680,55508992,1204056064,0,0,100,0,0,12854,0
1504477184,96805191680,55508992,1204056064,0,0.028,99.972,0,0,7320,0
1517297664,96791949312,55521280,1204502528,0.334,0.195,99.472,0,0,398847,15218
1659219968,96650199040,55537664,1204269056,2.446,0.556,96.998,0,0,349900,28636
1662545920,96647139328,55537664,1204060160,0.028,0.028,99.944,0,0,15093,0
1662545920,96647098368,55537664,1204060160,0,0,100,0,0,13646,1680
1662545920,96647098368,55537664,1204060160,0.056,0,99.944,0,0,12816,2248
1662787584,96646840320,55549952,1204064256,0,0.028,99.944,0.028,0,6856,4752
1661739008,96647856128,55566336,1204072448,0.250,0.028,99.722,0,0,4908,2100
1661734912,96647856128,55566336,1204076544,2.778,0.028,97.194,0,0,6612,2100
1763950592,96545554432,55566336,1204080640,5.993,0.333,93.674,0,0,10472728,10479084
2032648192,96276815872,55566336,1204080640,10.086,0.195,89.719,0,0,35535082,34871352
2138927104,96170532864,55566336,1204084736,5.508,0.278,94.214,0,0,61677136,41153902
2208342016,96101093376,55582720,1204084736,6.203,1.057,92.740,0,0,88010045,45624752
2284666880,96024768512,55582720,1204084736,9.738,0.250,90.011,0,0,113833040,47260396
2436722688,95872712704,55582720,1204084736,7.052,1.110,91.838,0,0,139100122,47408620
2503868416,95805562880,55582720,1204088832,4.662,0.307,95.031,0,0,164162967,42125772
2660126720,95649304576,55582720,1204088832,8.011,1.085,90.904,0,0,189645272,47545480
2743914496,95565541376,55599104,1204088832,4.985,0.501,94.514,0,0,201443256,48389680
2828812288,95480639488,55599104,1204092928,4.962,0.474,94.564,0,0,201586356,49297268
2919485440,95389966336,55599104,1204092928,4.373,0.390,95.237,0,0,201318804,45401586
3009294336,95300157440,55599104,1204092928,4.132,0.419,95.449,0,0,201394930,44827066
3097935872,95211483136,55623680,1204101120,4.103,0.474,95.423,0,0,201497028,47379064
3183349760,95126056960,55631872,1204101120,4.129,0.530,95.340,0,0,201702433,46871046
3271045120,95038353408,55640064,1204101120,4.131,0.419,95.451,0,0,201650364,49791234
3359490048,94949904384,55640064,1204105216,4.022,0.475,95.503,0,0,201475296,47151268
3448782848,94860611584,55640064,1204105216,4.256,0.584,95.160,0,0,201540438,47280416
3537981440,94771412992,55640064,1204105216,4.046,0.474,95.480,0,0,201739171,46512092
3626024960,94683357184,55648256,1204105216,5.270,0.502,94.228,0,0,201457730,49171998
3715035136,94594342912,55648256,1204109312,5.247,0.502,94.251,0,0,201664938,48716924
3804078080,94505299968,55648256,1204109312,4.159,0.447,95.395,0,0,201813268,47030156
3892469760,94416908288,55648256,1204109312,4.162,0.335,95.503,0,0,201437558,49316340
3987566592,94321807360,55648256,1204113408,3.856,0.363,95.781,0,0,201807488,34830714
4078686208,94230679552,55656448,1204113408,4.050,0.419,95.531,0,0,201374626,46741738
4169187328,94140170240,55664640,1204113408,4.079,0.475,95.446,0,0,201524694,47973256
4258340864,94051016704,55664640,1204113408,4.067,0.669,95.265,0,0,201645068,47478336
4348006400,93961347072,55664640,1204117504,4.314,0.529,95.157,0,0,201283606,47661625
4436385792,93872967680,55664640,1204117504,4.159,0.502,95.339,0,0,201742844,48764100
4528496640,93780848640,55672832,1204117504,3.969,0.447,95.584,0,0,201678166,44308772
4618125312,93691207680,55681024,1204121600,4.124,0.613,95.263,0,0,201628926,46170650
4706594816,93602738176,55681024,1204121600,4.182,0.585,95.233,0,0,201499704,47215432
4794429440,93514903552,55681024,1204121600,4.324,0.418,95.258,0,0,201585352,49461054
4882051072,93427281920,55681024,1204121600,4.134,0.503,95.363,0,0,201640246,49264558
4970979328,93338341376,55689216,1204125696,4.049,0.419,95.532,0,0,201556060,45000674
5059555328,93249757184,55697408,1204125696,4.026,0.559,95.387,0.028,0,201552362,47428244
5147119616,93162192896,55697408,1204125696,4.045,0.530,95.425,0,0,201479264,48365610
5236428800,93072879616,55697408,1204129792,4.060,0.392,95.547,0,0,201468780,47578694
5325209600,92984098816,55697408,1204129792,4.077,0.503,95.420,0,0,201873938,48222242
5413769216,92895531008,55705600,1204129792,4.308,0.448,95.245,0,0,201576620,46772648
5502992384,92806299648,55713792,1204129792,4.160,0.475,95.366,0,0,201484210,49169594
5592670208,92716617728,55713792,1204133888,4.074,0.419,95.508,0,0,201903140,45963582
5681704960,92627582976,55713792,1204133888,4.293,0.390,95.316,0,0,201469062,47160858
5769453568,92539834368,55713792,1204133888,3.994,0.447,95.559,0,0,201568166,48768800
5857259520,92452007936,55721984,1204142080,4.287,0.557,95.156,0,0,201513942,48075042
5947953152,92361306112,55730176,1204142080,4.075,0.391,95.534,0,0,201464905,48234004
6034538496,92274720768,55730176,1204142080,4.106,0.447,95.447,0,0,201794580,50579316
6122598400,92186656768,55730176,1204146176,4.041,0.613,95.346,0,0,201378341,48878362
6210973696,92098281472,55730176,1204146176,4.055,0.391,95.554,0,0,201914791,48738392
6299869184,92009377792,55738368,1204146176,4.076,0.391,95.533,0,0,201321414,46633958
6386802688,91922444288,55738368,1204146176,4.106,0.503,95.391,0,0,201982390,50279600
6476230656,91833012224,55738368,1204150272,4.023,0.447,95.529,0,0,201525316,47746456
6564515840,91744727040,55738368,1204150272,4.025,0.503,95.472,0,0,201550505,49146720
6650146816,91659096064,55738368,1204150272,4.240,0.502,95.258,0,0,201529284,49346084
6737567744,91571662848,55746560,1204154368,4.097,0.613,95.290,0,0,201524862,47933446
6826057728,91483172864,55746560,1204154368,4.047,0.558,95.395,0,0,201619268,48507580
6911922176,91397308416,55746560,1204154368,3.941,0.447,95.612,0,0,201595775,48165162
7001300992,91307925504,55746560,1204158464,4.258,0.501,95.241,0,0,201503146,46988524
7090470912,91218755584,55746560,1204158464,4.206,0.557,95.237,0,0,201573668,47330564
7179988992,91129229312,55754752,1204158464,3.997,0.447,95.556,0,0,201650381,46245262
7269445632,91039764480,55762944,1204158464,4.012,0.613,95.375,0,0,201478810,46675656
7362453504,90946850816,55762944,1204154368,3.996,0.503,95.502,0,0,201869944,46944109
7450083328,90859216896,55762944,1204158464,3.996,0.503,95.502,0,0,201408902,49401562
7539236864,90770063360,55762944,1204158464,4.106,0.419,95.475,0,0,201666641,49402648
7627493376,90681794560,55771136,1204162560,4.053,0.363,95.584,0,0,201566841,48847924
7714209792,90595078144,55771136,1204162560,4.002,0.504,95.494,0,0,201662119,50139066
7805198336,90504048640,55779328,1204162560,4.312,0.612,95.076,0,0,201494728,48161680
7893020672,90416226304,55779328,1204162560,4.205,0.529,95.266,0,0,201531936,48595560
7982301184,90326941696,55779328,1204166656,4.019,0.558,95.423,0,0,201908510,48392178
8072622080,90236612608,55787520,1204166656,4.294,0.363,95.343,0,0,201373806,47208996
8162435072,90146799616,55787520,1204166656,4.345,0.418,95.237,0,0,201669270,46258426
8251936768,90057285632,55795712,1204170752,4.104,0.391,95.505,0,0,201641498,46279352
8344129536,89965092864,55795712,1204170752,4.152,0.557,95.291,0,0,201486420,46013494
8433770496,89875451904,55795712,1204170752,3.826,0.475,95.700,0,0,201516966,41026094
8526069760,89783144448,55803904,1204170752,3.829,0.503,95.668,0,0,201486628,41649902
8616722432,89692487680,55803904,1204174848,4.042,0.558,95.400,0,0,201552035,46577054
8706670592,89602531328,55812096,1204174848,3.858,0.503,95.639,0,0,201532354,45136810
8794845184,89514356736,55812096,1204174848,3.988,0.558,95.455,0,0,201529428,45317300
8885899264,89423298560,55812096,1204178944,4.177,0.501,95.322,0,0,201547560,44403567
8975216640,89333972992,55820288,1204178944,4.049,0.391,95.532,0.028,0,201394566,44604222
9065885696,89243303936,55820288,1204178944,4.051,0.391,95.557,0,0,201729232,48288898
9156067328,89153110016,55828480,1204178944,4.045,0.558,95.397,0,0,201371634,49276278
9242763264,89066409984,55828480,1204183040,4.078,0.447,95.475,0,0,201678346,49419106
9330974720,88978198528,55828480,1204183040,4.100,0.474,95.425,0,0,201483918,49540190
9420722176,88888438784,55836672,1204187136,4.183,0.502,95.315,0,0,201638482,47149122
9509347328,88799809536,55836672,1204191232,4.129,0.391,95.480,0,0,201579286,48978014
9598533632,88710615040,55844864,1204191232,4,0.364,95.636,0,0,200284414,48928174
9689907200,88619241472,55844864,1204191232,3.994,0.391,95.615,0,0,202573638,45813462
9778507776,88530636800,55844864,1204195328,4.053,0.363,95.584,0,0,201611312,45605810
9868062720,88441073664,55853056,1204195328,4.071,0.530,95.399,0,0,201359087,46823896
9956716544,88352419840,55853056,1204195328,3.920,0.448,95.631,0,0,201185305,47666934
10045521920,88263606272,55861248,1204195328,4.126,0.418,95.456,0,0,201912858,49451824
10136358912,88172765184,55861248,1204199424,3.830,0.531,95.639,0,0,201532628,44930478
10222129152,88086994944,55861248,1204199424,4.161,0.363,95.476,0,0,201408568,49255298
10314469376,87994646528,55869440,1204199424,3.801,0.419,95.780,0,0,201390894,40740294
10405924864,87903186944,55869440,1204203520,4.368,0.473,95.159,0,0,201778698,47270434
10495250432,87813853184,55877632,1204203520,3.964,0.530,95.505,0,0,201067454,45049780
10582876160,87726227456,55877632,1204203520,4.053,0.419,95.528,0,0,201925562,49941910
10670088192,87639015424,55877632,1204203520,4.045,0.474,95.481,0,0,201378434,48058420
10760777728,87548313600,55885824,1204207616,4.097,0.613,95.290,0,0,201539900,49611284
10848247808,87460843520,55885824,1204207616,4.098,0.502,95.400,0,0,201626210,48371742
10938396672,87370686464,55894016,1204207616,4.188,0.335,95.477,0,0,201412424,45559498
11026993152,87282085888,55894016,1204211712,3.997,0.391,95.612,0,0,201465756,48327012
11116302336,87192776704,55894016,1204211712,3.832,0.476,95.692,0,0,201382700,46591974
11205599232,87103471616,55902208,1204211712,4.184,0.418,95.397,0,0,201629452,49296212
11296600064,87012466688,55902208,1204215808,3.883,0.475,95.642,0,0,201368859,43464216
11386785792,86922280960,55902208,1204215808,4.049,0.391,95.560,0,0,201561976,46716002
11474620416,86834438144,55910400,1204215808,4.132,0.475,95.394,0,0,201401550,48882588
11562733568,86746324992,55910400,1204215808,4.100,0.418,95.481,0,0,201662230,48306470
11652489216,86656565248,55918592,1204211712,4.322,0.335,95.343,0,0,201333633,47658336
11740229632,86568812544,55918592,1204224000,4.566,0.557,94.878,0,0,201463842,49930348
11826892800,86482149376,55918592,1204224000,4.156,0.446,95.397,0,0,201646114,49832774
11915194368,86393835520,55926784,1204228096,4.127,0.474,95.399,0,0,201895706,48124374
12006445056,86302584832,55926784,1204228096,4.214,0.391,95.395,0,0,201297192,47337962
12096933888,86212083712,55934976,1204228096,4.183,0.446,95.371,0,0,201632274,43541262
12187484160,86121533440,55934976,1204228096,4.129,0.391,95.480,0,0,201470116,46308744
12282220544,86026792960,55934976,1204232192,4.419,0.389,95.192,0,0,201188846,39528270
12370251776,85938753536,55943168,1204232192,4.126,0.474,95.372,0.028,0,201374102,47461698
12457193472,85851811840,55943168,1204232192,4.184,0.446,95.370,0,0,201647290,49947540
12543893504,85765099520,55951360,1204236288,4.050,0.475,95.475,0,0,201593620,50738610
12635713536,85673279488,55951360,1204236288,4.183,0.390,95.427,0,0,201364758,42449730
12724973568,85584019456,55951360,1204236288,4.021,0.475,95.504,0,0,201445474,46610406
12813635584,85495349248,55959552,1204236288,4.103,0.502,95.395,0,0,201586804,48260428
12902957056,85406023680,55959552,1204240384,4.393,0.473,95.135,0,0,201498904,48587254
12993925120,85315047424,55967744,1204240384,4.159,0.363,95.479,0,0,201546450,47245020
13084774400,85224198144,55967744,1204240384,3.913,0.419,95.668,0,0,201475258,44673978
13175476224,85133492224,55967744,1204244480,4.078,0.363,95.559,0,0,201606087,46463524
13265420288,85043539968,55975936,1204244480,4.126,0.474,95.400,0,0,201226229,48069004
13354033152,84954927104,55975936,1204244480,4.053,0.447,95.500,0,0,201529608,47846110
13443981312,84864970752,55984128,1204244480,4.149,0.446,95.405,0,0,201614274,47199830
13532753920,84776194048,55984128,1204248576,4.103,0.419,95.479,0,0,201602892,46526668
13621964800,84686983168,55984128,1204248576,4.110,0.308,95.583,0,0,201539534,48140174
13713080320,84595859456,55992320,1204248576,4.126,0.446,95.428,0,0,201548832,46576906
13801033728,84507901952,55992320,1204252672,4.322,0.335,95.343,0,0,201525938,48061980
13889646592,84419280896,56000512,1204252672,4.127,0.418,95.455,0,0,201544026,48394746
13977657344,84331270144,56000512,1204252672,4.022,0.475,95.503,0,0,201462189,49523496
14069440512,84239482880,56000512,1204256768,3.883,0.391,95.726,0,0,201373764,43302098
14159310848,84149604352,56008704,1204256768,4.294,0.335,95.371,0,0,201443020,47775098
14246768640,84062146560,56008704,1204256768,4.233,0.473,95.294,0,0,201704486,48945744
14335451136,83973451776,56016896,1204260864,4.296,0.363,95.342,0,0,201626234,48928348
14422687744,83886215168,56016896,1204260864,3.942,0.447,95.611,0,0,201614884,48130794
14510002176,83798900736,56016896,1204260864,4.026,0.447,95.527,0,0,201189050,48626768
14598422528,83710472192,56025088,1204260864,4.184,0.418,95.397,0,0,201486320,48469180
14687350784,83621539840,56025088,1204264960,4.026,0.447,95.527,0,0,201607442,49533840
14778363904,83530518528,56033280,1204264960,4.157,0.419,95.424,0,0,201342798,47257498
14866751488,83442130944,56033280,1204264960,3.915,0.447,95.638,0,0,201470686,46136772
14954995712,83353882624,56033280,1204269056,4.074,0.558,95.368,0,0,201533360,48302932
15044632576,83264237568,56041472,1204269056,4.016,0.502,95.482,0,0,201622198,46944052
15133294592,83175575552,56041472,1204269056,4.427,0.390,95.184,0,0,201297810,47666674
15220379648,83088482304,56049664,1204269056,4.049,0.419,95.532,0,0,201455116,50209258
15310913536,82997944320,56049664,1204273152,4.370,0.362,95.269,0,0,201569200,44806320
15398776832,82910081024,56049664,1204273152,4.073,0.446,95.481,0,0,201459580,48743422
15487430656,82821423104,56049664,1204277248,4.347,0.362,95.291,0,0,201404204,48685950
15577878528,82730967040,56057856,1204277248,3.959,0.585,95.456,0,0,201359536,42238230
15668559872,82640277504,56066048,1204277248,4.320,0.390,95.290,0,0,201783498,46629250
15757479936,82551353344,56066048,1204281344,4.283,0.612,95.106,0,0,201459290,48296166
15845048320,82463784960,56066048,1204281344,4.160,0.447,95.394,0,0,201798724,48589780
15935254528,82373574656,56066048,1204285440,4.077,0.391,95.532,0,0,201312662,48686780
16024784896,82284032000,56078336,1204285440,4.051,0.447,95.502,0,0,201727032,48436394
16113926144,82194886656,56086528,1204281344,4.254,0.528,95.190,0.028,0,201543792,43329214
16203448320,82105356288,56086528,1204289536,4.279,0.419,95.302,0,0,201483332,45936648
16293134336,82015666176,56086528,1204293632,4.124,0.418,95.458,0,0,201455492,44966832
16383168512,81925632000,56086528,1204293632,4.155,0.446,95.399,0,0,201224434,45967164
16473194496,81835593728,56094720,1204293632,4.228,0.640,95.132,0,0,201651880,48501306
16561373184,81747402752,56102912,1204297728,3.975,0.364,95.661,0,0,201508672,49674402
16649551872,81659224064,56102912,1204297728,4.530,0.445,95.025,0,0,201528035,45970406
16744656896,81564119040,56102912,1204297728,3.776,0.392,95.832,0,0,201295358,36068458
16843436032,81465339904,56102912,1204297728,4.382,0.419,95.200,0,0,201763916,33327349
16934866944,81373896704,56111104,1204301824,3.914,0.447,95.639,0,0,201557034,42791491
17026662400,81282093056,56119296,1204301824,3.911,0.335,95.754,0,0,201421970,39973698
17116291072,81192464384,56119296,1204301824,4.461,0.335,95.205,0,0,201429522,48974758
17209884672,81098866688,56119296,1204305920,4.040,0.502,95.458,0,0,201647822,40920710
17298731008,81010020352,56119296,1204305920,4.106,0.419,95.475,0,0,201607290,47364484
17384456192,80924286976,56127488,1204305920,4.240,0.418,95.342,0,0,201470040,49956654
17474097152,80834633728,56135680,1204310016,4.508,0.417,95.075,0,0,201318754,47924412
17563058176,80745672704,56135680,1204310016,4.177,0.446,95.377,0,0,201689120,46923780
17654276096,80654454784,56135680,1204310016,4.292,0.697,95.011,0,0,201308800,43957866
17744228352,80564498432,56135680,1204314112,4.200,0.501,95.299,0,0,201665859,47136930
17831403520,80477315072,56143872,1204314112,4.328,0.475,95.197,0,0,201362259,48607792
17921363968,80387354624,56152064,1204305920,3.965,0.503,95.532,0,0,201668922,46726606
18013306880,80295403520,56152064,1204314112,4.336,0.528,95.136,0,0,201289172,43186048
18102456320,80206249984,56152064,1204318208,4.073,0.474,95.453,0,0,201529566,44866690
18192605184,80116101120,56152064,1204318208,4.261,0.501,95.238,0,0,201467790,46363742
18287517696,80021180416,56160256,1204318208,3.931,0.474,95.595,0,0,201358924,37348914
18377179136,79931506688,56168448,1204322304,4.365,0.528,95.107,0,0,201534974,43743014
18467078144,79841607680,56168448,1204322304,3.963,0.530,95.507,0,0,201306312,46109540
18555838464,79752814592,56168448,1204322304,4.561,0.528,94.911,0,0,201367491,50231294
18642993152,79665655808,56168448,1204326400,4.188,0.447,95.366,0,0,201645920,48271352
18731376640,79577264128,56176640,1204326400,4.242,0.363,95.395,0,0,201521436,49533374
18820997120,79487635456,56184832,1204326400,4.315,0.585,95.100,0,0,201504996,48680944
18912002048,79396634624,56184832,1204330496,4.018,0.446,95.536,0,0,201385814,42895776
19004289024,79304347648,56184832,1204330496,4.017,0.530,95.453,0,0,201587758,40273986
19095183360,79213453312,56184832,1204330496,4.314,0.501,95.185,0,0,201416340,47183252
19184893952,79123738624,56184832,1204334592,4.159,0.447,95.395,0,0,201399038,47247056
19271704576,79036911616,56201216,1204334592,4.128,0.502,95.370,0,0,201643204,49784212
19361640448,78946975744,56201216,1204334592,3.966,0.503,95.531,0,0,201481891,46133424
19449606144,78859010048,56201216,1204334592,4.184,0.391,95.425,0,0,201609610,47923738
19540688896,78767923200,56201216,1204338688,4.401,0.474,95.125,0,0,201352662,47861392
19627618304,78680993792,56201216,1204338688,4.287,0.418,95.295,0,0,201546920,49874868
19715227648,78593363968,56217600,1204342784,4.320,0.502,95.151,0.028,0,201598456,49872778
19803377664,78505213952,56217600,1204342784,4.351,0.418,95.230,0,0,201577257,47802192
19894124544,78414467072,56217600,1204342784,4.124,0.446,95.430,0,0,201590888,44593800
19982909440,78325678080,56217600,1204346880,3.996,0.475,95.529,0,0,201551792,46806328
20070817792,78237769728,56217600,1204346880,4.322,0.474,95.204,0,0,201573078,49502702
20158103552,78150467584,56233984,1204346880,3.997,0.447,95.556,0,0,201595580,47655452
20247121920,78061441024,56233984,1204355072,4.518,0.363,95.120,0,0,201344716,49634974
20335505408,77973057536,56233984,1204355072,4.213,0.335,95.452,0,0,201524116,48235780
20424908800,77883654144,56233984,1204355072,4.208,0.446,95.346,0,0,201652372,46641692
20514263040,77794295808,56233984,1204359168,4.106,0.419,95.475,0,0,201222774,47664386
20602744832,77705797632,56250368,1204359168,3.991,0.474,95.534,0,0,201431768,43761882
20691120128,77617422336,56250368,1204359168,4.259,0.501,95.239,0,0,201511082,47373474
20780081152,77528461312,56250368,1204359168,4.127,0.502,95.371,0,0,201500913,48342534
20871446528,77437091840,56250368,1204363264,4.041,0.641,95.318,0,0,201512857,46908404
20960997376,77347540992,56250368,1204363264,4.106,0.363,95.531,0,0,201542574,46337838
21048750080,77259771904,56266752,1204363264,4.337,0.556,95.107,0,0,201429618,48336698
21139509248,77169008640,56266752,1204367360,4.071,0.502,95.427,0,0,201496320,46538496
21229383680,77079134208,56266752,1204367360,4.588,0.389,95.022,0,0,201605958,48013632
21317038080,76991479808,56266752,1204367360,4.155,0.502,95.343,0,0,201629328,48111564
21407092736,76901421056,56266752,1204371456,4.452,0.473,95.075,0,0,201545631,48518930
21493145600,76815368192,56283136,1204355072,4.291,0.557,95.152,0,0,201621106,50360086
21583568896,76724928512,56283136,1204371456,4.126,0.446,95.428,0,0,199641644,43692784
21659889664,76648603648,56283136,1204375552,4.185,0.419,95.396,0,0,178746282,48973900
21722722304,76585771008,56283136,1204375552,4.148,0.334,95.518,0,0,153325460,46185752
21769949184,76538544128,56283136,1204375552,4.039,0.251,95.710,0,0,126668322,44756610
21799911424,76508561408,56299520,1204379648,3.844,0.251,95.905,0,0,100490868,47308820
21819985920,76488478720,56299520,1204383744,3.712,0.112,96.176,0,0,74927997,42923836
21822353408,76486111232,56299520,1204383744,3.778,0.111,96.111,0,0,49458268,46277438
21822025728,76486438912,56299520,1204383744,3.751,0.111,96.138,0,0,24141094,38475464
21816053760,76492406784,56299520,1204387840,3.662,0.111,96.227,0,0,2845876,46419658
21803958272,76504485888,56315904,1204387840,3.423,0.083,96.493,0,0,121570,45408278
21788553216,76519882752,56315904,1204396032,3.613,0.028,96.359,0,0,152816,45787756
21780058112,76528377856,56315904,1204396032,3.719,0.056,96.225,0,0,142820,44797780
21771419648,76537016320,56315904,1204396032,3.582,0.056,96.362,0,0,142628,43178278
21762998272,76545433600,56315904,1204400128,3.720,0.028,96.252,0,0,162548,44010714
21752934400,76555489280,56324096,1204400128,3.586,0.028,96.386,0,0,193554,46056906
21748174848,76560240640,56332288,1204400128,3.560,0,96.440,0,0,153698,43428168
21743013888,76565397504,56332288,1204404224,3.660,0.111,96.230,0,0,185250,42152424
21737000960,76571410432,56332288,1204404224,3.828,0.055,96.117,0,0,124860,41671134
21729771520,76578639872,56332288,1204404224,3.555,0.056,96.390,0,0,130276,47033538
21719310336,76589088768,56340480,1204408320,3.774,0.055,96.171,0,0,119100,45270128
21709201408,76599189504,56348672,1204408320,3.588,0.083,96.300,0.028,0,159060,46428832
21700968448,76607422464,56348672,1204408320,3.587,0.056,96.357,0,0,129780,46120676
21693349888,76615036928,56348672,1204412416,3.778,0.028,96.194,0,0,160926,45936026
21681438720,76626948096,56348672,1204412416,3.777,0.083,96.140,0,0,150006,47923780
21765017600,76541820928,56356864,1204895744,4.631,0.361,95.008,0,0,587572,46194460
21693607936,76612947968,56369152,1204428800,4.125,0.138,95.736,0,0,167950,44936114
