172.16.72.14 : 200.34 200.25 200.25 200.26 200.30 200.21 200.25 200.30 200.30 200.29
172.16.72.23 : - - 200.29 200.29 200.27 200.28 - 200.31 200.30 200.27
172.16.72.25 : 0.19 0.17 0.17 0.20 0.17 0.21 0.19 0.19 0.20 0.20
172.16.72.26 : 0.21 0.20 0.16 0.19 0.18 0.15 0.22 0.17 0.20 0.20
172.16.72.27 : 0.02 0.03 0.03 0.03 0.03 0.04 0.03 0.03 0.01 0.03
172.16.72.28 : 0.08 0.13 0.12 0.18 0.16 0.14 0.12 0.15 0.15 0.14
172.16.72.29 : 0.25 0.21 0.17 0.21 0.20 0.19 0.17 0.20 0.19 0.20
172.16.72.3  : 0.13 0.20 0.18 0.16 0.20 0.14 0.20 0.20 0.20 0.17
172.16.72.30 : 0.15 0.21 0.20 0.19 0.21 0.19 0.19 0.17 0.18 0.19
172.16.72.31 : 0.14 0.20 0.19 0.19 0.19 0.19 0.17 0.18 0.20 0.19
172.16.72.32 : 0.14 0.19 0.20 0.20 0.22 0.15 0.19 0.15 0.20 0.21
172.16.72.33 : 0.15 0.14 0.17 0.17 0.18 0.19 0.20 0.18 0.21 0.21
172.16.72.34 : 0.11 0.23 0.22 0.21 0.18 0.18 0.21 0.11 0.20 0.20
172.16.72.35 : 0.14 0.20 0.18 0.21 0.20 0.21 0.18 0.20 0.19 0.19
172.16.72.36 : 0.17 0.20 0.18 0.16 0.17 0.21 0.21 0.14 0.20 0.21
172.16.72.37 : 0.16 0.21 0.22 0.22 0.21 0.20 0.21 0.21 0.17 0.20
172.16.72.38 : 0.22 0.19 0.20 0.20 0.20 0.16 0.15 0.19 0.16 0.19
172.16.72.39 : 0.18 0.16 0.19 0.17 0.20 0.19 0.21 0.19 0.19 0.17
172.16.72.4  : 10.22 10.26 10.27 10.28 10.28 10.28 10.25 10.28 10.23 10.28
172.16.72.40 : 10.32 10.28 - 10.24 10.28 10.29 10.28 10.27 10.26 10.28
172.16.72.41 : 10.26 10.28 - 10.28 10.22 10.21 10.25 - 10.29 10.29
172.16.72.42 : 10.24 10.27 10.30 10.29 10.28 10.30 10.25 10.28 10.29 10.28
172.16.72.43 : 10.26 10.25 10.26 10.28 10.29 - 10.27 10.31 10.30 10.30
172.16.72.44 : 10.25 10.30 10.30 10.29 10.27 - 10.28 10.28 10.27 10.27
172.16.72.46 : 10.26 10.29 10.21 10.30 10.28 10.29 10.31 10.27 10.28 10.29
172.16.72.47 : 10.26 10.27 10.28 10.28 10.28 10.29 10.29 10.23 10.25 10.30
172.16.72.48 : 10.29 10.32 10.21 10.30 10.26 10.28 10.31 10.26 10.29 10.30
172.16.72.49 : 10.32 10.24 10.28 10.28 10.29 10.29 10.22 10.27 10.26 10.26
172.16.72.5  : 10.26 10.21 10.29 10.31 10.29 10.27 10.26 10.25 10.27 10.28
172.16.72.50 : 10.28 10.30 10.27 10.27 10.25 10.31 10.25 10.29 10.27 10.27
172.16.72.51 : 10.30 10.29 10.29 10.31 10.30 10.25 10.30 10.29 10.29 10.28
172.16.72.6  : 10.29 - 10.24 10.21 10.24 10.28 10.23 - 10.28 10.34
172.16.72.7  : 10.27 10.27 10.26 10.26 10.31 10.25 10.30 10.27 10.23 10.22
172.16.72.8  : 10.29 10.27 10.23 10.22 10.25 10.24 10.24 10.27 10.30 10.24
172.16.72.9  : 4.31 4.30 4.29 4.31 4.31 4.30 4.27 4.26 4.26 4.26

      35 targets
      35 alive
       0 unreachable
       0 unknown addresses

       6 timeouts (waiting for response)
     350 ICMP Echos sent
     340 ICMP Echo Replies received
       0 other ICMP received

 0.01 ms (min round trip time)
 14.8 ms (avg round trip time)
 200 ms (max round trip time)
       10.325 sec (elapsed real time)

