"Dstat 0.7.3 CSV output"
"Author:","Dag Wieers <dag@wieers.com>",,,,"URL:","http://dag.wieers.com/home-made/dstat/"
"Host:","gros-74.nancy.grid5000.fr",,,,"User:","root"
"Cmdline:","dstat -m -c -n -o dstat.csv",,,,"Date:","23 May 2020 19:57:36 CEST"
"memory usage",,,,"total cpu usage",,,,,"net/total",
"used","free","buff","cach","usr","sys","idl","wai","stl","recv","send"
1313882112,97357389824,55070720,845541376,1.330,0.395,98.251,0.024,0,0,0
1312210944,97358671872,55070720,845807616,0.666,0.333,99.001,0,0,394498,29138
1308254208,97362288640,55087104,846004224,0.611,0.333,98.722,0.333,0,393534,17410
1307381760,97363607552,55087104,845557760,0,0,100,0,0,17296,132
1303289856,97367420928,55099392,845815808,0.528,0.472,99.000,0,0,398228,17558
1303826432,97367109632,55099392,845557760,0,0,100,0,0,11710,0
1303818240,97367117824,55099392,845557760,0,0,100,0,0,12064,0
1303810048,97367117824,55111680,845553664,0,0,100,0,0,6214,0
1303805952,97367117824,55111680,845557760,0,0,100,0,0,4896,0
1303805952,97367117824,55111680,845557760,0,0,100,0,0,28423,2380
1317965824,97352687616,55123968,845815808,0.804,0.333,98.863,0,0,392708,17386
1305440256,97365422080,55123968,845582336,0.222,0.500,99.277,0,0,173850,14928
1304793088,97365606400,55136256,846028800,0.667,0.333,99,0,0,393480,29442
1305497600,97364897792,55136256,846028800,0.612,0.278,99.110,0,0,390900,17394
1304985600,97365856256,55136256,845582336,0,0,100,0,0,1894,0
1303752704,97367330816,55152640,845324288,0.528,0.389,99.083,0,0,386452,16690
1333571584,97337102336,55152640,845729792,0.417,0.083,99.500,0,0,222306,8908
1305092096,97365684224,55152640,845586432,0.695,0.083,99.222,0,0,3754,4872
1313800192,97356959744,55164928,845590528,0.333,0.056,99.611,0,0,342908,15070
1313800192,97356853248,55164928,845697024,0.195,0.250,99.555,0,0,179830,20804
1313722368,97356853248,55164928,845774848,0.028,0.056,99.917,0,0,11120,9898
1313701888,97356861440,55177216,845774848,0.028,0.028,99.917,0.028,0,11594,10094
1313701888,97356861440,55177216,845774848,0,0.028,99.972,0,0,11662,9996
1313701888,97356861440,55177216,845774848,0,0,100,0,0,13462,10192
1313681408,97356869632,55189504,845774848,0,0.028,99.972,0,0,15442,14374
1313681408,97356869632,55189504,845774848,0,0,100,0,0,16038,11392
1313681408,97356869632,55189504,845774848,0.028,0,99.972,0,0,13306,10192
1313681408,97356869632,55189504,845774848,0,0,100,0,0,14146,10324
1313681408,97356869632,55189504,845774848,0.028,0.028,99.944,0,0,10688,10324
1306566656,97364094976,55189504,845664256,0.028,0,99.972,0,0,3380,2236
1306161152,97364561920,55201792,845590528,0.167,0.056,99.778,0,0,178756,14546
1306161152,97364561920,55201792,845590528,0,0,100,0,0,8470,0
1306161152,97364561920,55201792,845590528,0,0,100,0,0,5900,0
1306161152,97364561920,55201792,845590528,0,0,100,0,0,5098,102
1306148864,97364561920,55214080,845590528,0,0,100,0,0,2704,0
1306136576,97364561920,55226368,845590528,0,0,100,0,0,492,0
1306136576,97364561920,55226368,845590528,0,0,100,0,0,2042,476
1306136576,97364561920,55226368,845590528,0,0,100,0,0,768,148
1307324416,97363369984,55226368,845590528,0.584,0.417,98.999,0,0,389890,29310
1306955776,97363734528,55226368,845594624,0,0,100,0,0,707,148
1306955776,97363734528,55226368,845594624,0,0,100,0,0,5558,0
1306935296,97363742720,55238656,845594624,0,0,100,0,0,6726,102
1306935296,97363742720,55238656,845594624,0,0.028,99.972,0,0,8230,0
1668751360,97002328064,55250944,845041664,2.109,0.721,97.170,0,0,757718,33008
4919717888,93748809728,55250944,847192064,23.993,7.720,68.287,0,0,1777718,76592
8654508032,90012459008,55255040,848596992,26.531,9.076,64.393,0,0,1477562,69878
12222070784,86442745856,55267328,850661376,25.277,9.551,65.172,0,0,1661508,71268
15698989056,82964602880,55291904,851828736,24.364,8.476,67.161,0,0,999884,46985
15965405184,82698149888,55304192,851849216,2.167,0.834,96.971,0.028,0,8264,1370
15999332352,82664132608,55308288,851861504,1.171,0.251,98.551,0.028,0,116518,6855733
16050974720,82612445184,55308288,851906560,2.837,0.445,96.718,0,0,477846,30545784
16149426176,82513969152,55308288,851931136,3.309,0.533,96.158,0,0,863930,55958751
16236863488,82426466304,55316480,851988480,5.596,0.501,93.903,0,0,1256442,79657814
16319549440,82343718912,55316480,852049920,5.946,0.726,93.328,0,0,1543328,99519931
16470417408,82192773120,55316480,852123648,9.388,0.643,89.969,0,0,1653982,104091985
16602345472,82060787712,55324672,852172800,10.231,0.945,88.824,0,0,1604070,101882637
16721055744,81942003712,55324672,852234240,9.053,0.643,90.305,0,0,1622164,101706567
16837038080,81825955840,55332864,852291584,10.330,0.644,89.026,0,0,1619000,102427661
16840450048,81822482432,55332864,852348928,5.323,0.474,94.203,0,0,1558752,98336867
16818753536,81844121600,55332864,852406272,4.182,0.393,95.425,0,0,1652592,106084562
16792596480,81870225408,55332864,852459520,4.743,0.530,94.727,0,0,1600908,101356385
16790020096,81872740352,55332864,852520960,4.338,0.473,95.189,0,0,1605778,102019722
16785301504,81877389312,55341056,852578304,3.594,0.502,95.904,0,0,1611610,103272156
16794742784,81867886592,55341056,852639744,3.115,0.556,96.329,0,0,1598580,102458896
16770879488,81891536896,55341056,852832256,2.659,0.886,96.427,0.028,0,1567144,101473695
16748728320,81913614336,55341056,852905984,3.277,0.500,96.223,0,0,1648286,104782383
16729776128,81932521472,55341056,852951040,3.172,0.529,96.299,0,0,1602858,101384708
16713805824,81948409856,55349248,853024768,2.701,0.362,96.937,0,0,1652524,103301329
16713293824,81948868608,55349248,853078016,2.237,0.391,97.371,0,0,1521818,100204305
16718311424,81943789568,55357440,853131264,2.199,0.668,97.133,0,0,1585451,103167180
16745439232,81916583936,55357440,853188608,2.344,0.474,97.181,0,0,1570538,101867302
16745648128,81916321792,55357440,853241856,2.063,0.502,97.435,0,0,1583794,103604922
16746369024,81915510784,55365632,853323776,1.949,0.640,97.411,0,0,1607518,102586131
16750731264,81911062528,55398400,853372928,1.677,0.447,97.848,0.028,0,1582926,101008185
16758435840,81903292416,55398400,853438464,1.682,0.420,97.898,0,0,1593668,99792139
16764506112,81897168896,55398400,853491712,1.923,0.669,97.409,0,0,1596016,105713256
16773636096,81887961088,55398400,853561344,2.111,0.639,97.251,0,0,1581396,103438251
16784371712,81877151744,55398400,853630976,2.286,0.585,97.129,0,0,1549472,98775624
16784510976,81876963328,55406592,853671936,2.514,0.447,97.039,0,0,1637164,104271621
16783892480,81877524480,55406592,853729280,2.645,0.529,96.826,0,0,1629288,102302612
16789442560,81871892480,55406592,853807104,1.869,0.530,97.600,0,0,1625284,100372714
16802193408,81859088384,55406592,853856256,1.704,0.447,97.849,0,0,1650992,104292560
16803229696,81857978368,55406592,853925888,2.588,0.584,96.828,0,0,1537042,96982876
16801243136,81859915776,55414784,853966848,2.368,0.529,97.102,0,0,1688194,108871900
16803295232,81857785856,55414784,854044672,1.959,0.392,97.650,0,0,1639254,101312421
16805597184,81855418368,55414784,854110208,1.926,0.335,97.739,0,0,1664704,103068134
16806567936,81854402560,55414784,854155264,1.616,0.585,97.798,0,0,1676092,102485797
16811745280,81849163776,55414784,854216704,1.621,0.447,97.932,0,0,1613742,99594366
16810856448,81849987072,55422976,854274048,1.750,0.667,97.583,0,0,1711068,104168146
16811630592,81849143296,55422976,854339584,1.231,0.503,98.266,0,0,1662360,101601906
16811819008,81848913920,55422976,854380544,1.643,0.529,97.828,0,0,1569660,100789161
16811704320,81848930304,55422976,854470656,1.312,0.474,98.214,0,0,1696956,106599273
16821985280,81838587904,55422976,854528000,1.428,0.504,98.068,0,0,1607926,100461226
16820047872,81840455680,55431168,854589440,1.808,0.529,97.663,0,0,1654486,103651045
16821125120,81839312896,55431168,854654976,1.974,0.667,97.358,0,0,1639184,101524496
16822333440,81838043136,55431168,854712320,2.170,0.556,97.274,0,0,1600416,99783627
16821518336,81838669824,55431168,854900736,1.640,0.639,97.720,0,0,1705856,106171131
16823017472,81837105152,55431168,854962176,2.199,0.473,97.328,0,0,1622616,98574168
16822104064,81837957120,55439360,855015424,1.860,0.611,97.501,0.028,0,1657858,104644629
16822730752,81837273088,55439360,855068672,1.895,0.530,97.575,0,0,1608505,102645561
16827080704,81832849408,55447552,855134208,1.780,0.668,97.552,0,0,1550302,100639006
16828915712,81831067648,55447552,855199744,2.275,0.666,97.059,0,0,1612610,103992941
16828129280,81831792640,55447552,855261184,2.165,0.555,97.279,0,0,1520578,99516013
16829472768,81830387712,55455744,855314432,2.645,0.529,96.826,0,0,1614868,104380147
16834940928,81824829440,55455744,855371776,4.227,0.473,95.300,0,0,1623620,102967045
16842321920,81817374720,55455744,855445504,4.442,0.555,95.003,0,0,1600158,102404635
16842575872,81817059328,55455744,855506944,4.612,0.389,94.999,0,0,1598776,102131569
16841789440,81817788416,55455744,855564288,3.224,0.528,96.248,0,0,1623534,102194074
16841891840,81817620480,55463936,855621632,2.673,0.390,96.937,0,0,1618522,102970579
16838156288,81821290496,55463936,855687168,1.977,0.501,97.522,0,0,1549058,100525276
16837283840,81822109696,55463936,855736320,1.760,0.307,97.932,0,0,1612318,103726956
16838819840,81820512256,55463936,855797760,1.500,0.695,97.805,0,0,1683422,103798484
16838520832,81820741632,55463936,855867392,1.587,0.612,97.801,0,0,1607618,100965015
16841199616,81817997312,55472128,855924736,2.640,0.445,96.915,0,0,1544432,99957731
16882286592,81776844800,55472128,855990272,6.381,0.362,93.257,0,0,1652764,106187141
16940081152,81718996992,55472128,856039424,10.022,0.418,89.560,0,0,1577420,100550571
17018826752,81640177664,55472128,856113152,8.155,0.529,91.289,0.028,0,1635366,103822875
17062899712,81596039168,55472128,856178688,6.925,0.363,92.712,0,0,1580396,103157246
17063096320,81595793408,55480320,856215552,2.256,0.557,97.187,0,0,1628384,101840388
17053073408,81605746688,55480320,856285184,2.222,0.500,97.278,0,0,1531846,99569504
17044996096,81613750272,55480320,856358912,1.450,0.418,98.132,0,0,1587894,103090722
17018343424,81640341504,55488512,856412160,1.556,0.639,97.806,0,0,1613820,104137188
17015361536,81643270144,55488512,856465408,1.639,0.500,97.861,0,0,1609790,100444915
17015545856,81643012096,55496704,856530944,1.700,0.474,97.827,0,0,1677904,104534931
17038508032,81619988480,55496704,856592384,4.173,0.476,95.351,0,0,1615452,103154018
17065668608,81592766464,55496704,856653824,5.304,0.528,94.168,0,0,1624532,101524089
17086578688,81571811328,55496704,856698880,3.957,0.502,95.542,0,0,1570004,101844824
17104216064,81554100224,55496704,856772608,4.147,0.390,95.463,0,0,1670710,102461713
17107070976,81551192064,55504896,856817664,2.056,0.583,97.360,0,0,1550224,101035030
17101352960,81556774912,55504896,856879104,1.672,0.306,98.022,0,0,1626601,102578264
17089855488,81568198656,55504896,856952832,1.638,0.611,97.751,0,0,1601542,103511039
17099190272,81558798336,55504896,857014272,1.476,0.501,98.023,0,0,1649618,102588334
17097633792,81560281088,55504896,857083904,1.696,0.584,97.720,0,0,1633436,102087905
17096265728,81561591808,55513088,857133056,1.256,0.558,98.186,0,0,1611972,102372480
17097699328,81560088576,55513088,857198592,1.529,0.639,97.832,0,0,1616704,103022302
17102245888,81555476480,55513088,857264128,2.032,0.557,97.411,0,0,1594046,101139535
17101881344,81555640320,55521280,857456640,1.310,0.585,98.104,0,0,1621618,102302062
17101893632,81555574784,55521280,857509888,1.918,0.667,97.415,0,0,1618636,101608608
17101328384,81556066304,55529472,857575424,2.054,0.583,97.363,0,0,1588374,103949056
17112403968,81544941568,55529472,857620480,1.339,0.474,98.187,0,0,1607634,99883018
17113640960,81543630848,55529472,857694208,1.227,0.530,98.243,0,0,1643844,104745796
17111678976,81545531392,55529472,857755648,1.726,0.445,97.829,0,0,1617512,102504495
17113501696,81543630848,55537664,857825280,1.532,0.446,98.022,0,0,1562944,102135514
17112387584,81544712192,55545856,857849856,1.173,0.475,98.353,0,0,1533226,101854336
17114087424,81542914048,55545856,857944064,1.832,0.527,97.640,0,0,1573866,101998538
17113194496,81543741440,55545856,858001408,1.338,0.530,98.133,0,0,1607366,102126349
17114046464,81542823936,55545856,858066944,1.284,0.530,98.185,0,0,1556798,100590282
17113001984,81543843840,55545856,858091520,1.284,0.419,98.297,0,0,1622356,103953961
17112875008,81543876608,55554048,858177536,1.199,0.669,98.132,0,0,1644446,103872123
17113419776,81543270400,55554048,858230784,1.641,0.584,97.775,0,0,1627552,102078731
17114636288,81541959680,55562240,858316800,1.311,0.418,98.243,0.028,0,1644728,102225201
17114783744,81541771264,55562240,858357760,1.699,0.696,97.605,0,0,1595760,101546276
17120153600,81536335872,55562240,858423296,1.394,0.446,98.160,0,0,1631200,100584338
17118793728,81537622016,55570432,858484736,1.531,0.501,97.968,0,0,1628976,102075355
17119363072,81536999424,55570432,858537984,1.202,0.503,98.295,0,0,1659418,105608960
17120612352,81535688704,55570432,858599424,1.805,0.639,97.556,0,0,1657110,101069884
17119645696,81536573440,55570432,858681344,1.558,0.584,97.858,0,0,1531382,103760287
17119449088,81536708608,55570432,858742784,1.667,0.556,97.778,0,0,1524776,98186528
17119772672,81536319488,55578624,858800128,1.529,0.528,97.943,0,0,1704698,105558828
17120292864,81535733760,55578624,858865664,1.671,0.501,97.827,0,0,1603215,102876350
17120018432,81535963136,55578624,858910720,1.311,0.558,98.131,0,0,1594834,102421816
17118531584,81537376256,55578624,858984448,1.393,0.418,98.189,0,0,1544400,100295880
17120493568,81535344640,55586816,859045888,1.282,0.530,98.188,0,0,1558104,102543183
17120030720,81535737856,55595008,859107328,1.506,0.474,98.020,0,0,1619716,104170260
17120878592,81534820352,55595008,859172864,1.368,0.363,98.269,0,0,1580508,100944875
17119137792,81536491520,55595008,859238400,1.669,0.473,97.858,0,0,1645758,103808665
17121271808,81534300160,55595008,859295744,1.422,0.418,98.160,0,0,1676688,100659022
17121390592,81534062592,55595008,859373568,1.311,0.446,98.242,0,0,1569158,101196112
17120227328,81535180800,55611392,859402240,1.669,0.723,97.579,0.028,0,1659164,105773493
17119289344,81536036864,55611392,859484160,1.665,0.722,97.613,0,0,1621342,100936258
17119973376,81535283200,55611392,859553792,1.641,0.529,97.830,0,0,1598442,103086810
17120956416,81534238720,55611392,859615232,1.473,0.695,97.833,0,0,1526316,98719100
17120591872,81534537728,55611392,859680768,2.111,0.361,97.528,0,0,1631592,105465220
17122496512,81532559360,55627776,859734016,1.396,0.363,98.241,0,0,1623952,102607813
17121255424,81533722624,55627776,859799552,1.696,0.584,97.720,0,0,1577478,98961620
17120657408,81534267392,55627776,859852800,1.478,0.502,98.020,0,0,1593434,103461707
17121017856,81533837312,55627776,859922432,1.695,0.528,97.777,0,0,1558274,104454096
17120571392,81534210048,55627776,859992064,1.391,0.556,98.052,0,0,1565986,103002142
17121746944,81532964864,55635968,860049408,1.392,0.473,98.134,0,0,1535324,101291607
17121816576,81532833792,55635968,860110848,1.285,0.503,98.213,0,0,1601896,103882228
17121419264,81533165568,55635968,860176384,1.119,0.391,98.490,0,0,1627166,101640499
17122029568,81532354560,55635968,860364800,1.697,0.334,97.969,0,0,1628278,101585257
17123078144,81531240448,55635968,860430336,1.366,0.390,98.243,0,0,1606692,101703934
17122009088,81532256256,55644160,860475392,1.612,0.639,97.748,0,0,1513840,102494656
17123139584,81531043840,55644160,860557312,1.446,0.584,97.970,0,0,1591712,101830420
17121726464,81532391424,55644160,860622848,1.446,0.612,97.942,0,0,1581332,102678317
17122447360,81531609088,55644160,860676096,1.782,0.445,97.773,0,0,1554710,103280282
17122598912,81531383808,55644160,860745728,1.256,0.502,98.214,0.028,0,1586848,103163281
17122598912,81531318272,55652352,860798976,1.697,0.417,97.885,0,0,1552204,102216434
17123475456,81530372096,55652352,860864512,1.174,0.447,98.379,0,0,1614153,100905076
17123168256,81530605568,55652352,860938240,1.640,0.584,97.777,0,0,1569132,102362286
17122582528,81531129856,55652352,860999680,1.587,0.446,97.967,0,0,1616886,104539518
17124024320,81529630720,55652352,861052928,1.365,0.501,98.134,0,0,1553504,100095368
17122942976,81530621952,55668736,861122560,1.640,0.528,97.832,0,0,1599872,103874185
17123770368,81529737216,55668736,861175808,1.503,0.529,97.969,0,0,1640830,102417231
17122713600,81530728448,55668736,861241344,1.339,0.502,98.159,0,0,1634226,102956081
17125011456,81528373248,55668736,861294592,1.285,0.391,98.324,0,0,1646316,101593462
17125285888,81528045568,55668736,861347840,1.337,0.557,98.106,0,0,1632308,100001368
17123725312,81529491456,55685120,861437952,1.339,0.418,98.243,0,0,1643298,104640057
17124249600,81528901632,55685120,861499392,1.425,0.363,98.211,0,0,1583694,101003618
17123119104,81529982976,55685120,861548544,1.311,0.391,98.298,0,0,1662272,104204412
17125093376,81527922688,55685120,861630464,1.557,0.417,98.026,0,0,1556622,97250676
17125011456,81527959552,55685120,861675520,1.584,0.583,97.833,0,0,1599846,103692548
17125150720,81527734272,55693312,861753344,1.586,0.473,97.942,0,0,1677804,107457636
17124184064,81528651776,55693312,861798400,1.282,0.502,98.217,0,0,1539732,99864921
17125371904,81527386112,55701504,861868032,1.776,0.500,97.724,0,0,1656786,102968140
17124913152,81527783424,55701504,861925376,1.282,0.585,98.133,0,0,1623014,102924660
17124917248,81527717888,55701504,861986816,1.229,0.447,98.324,0,0,1724432,101714156
17125240832,81527328768,55713792,862040064,1.035,0.559,98.406,0,0,1793676,102911032
17124311040,81528184832,55713792,862113792,1.369,0.391,98.240,0,0,1806806,102999478
17126625280,81525792768,55721984,862179328,1.529,0.473,97.970,0.028,0,1834464,100299653
17125593088,81526743040,55721984,862261248,1.369,0.447,98.183,0,0,1850908,103653242
17124982784,81527300096,55721984,862314496,1.364,0.640,97.996,0,0,1853968,102659322
17125629952,81526583296,55730176,862375936,1.365,0.501,98.134,0,0,1838944,101794824
17126465536,81525702656,55730176,862420992,1.502,0.473,98.026,0,0,1892196,102517477
17125965824,81526128640,55730176,862494720,1.504,0.474,98.022,0,0,1876860,102321624
17125433344,81526595584,55730176,862560256,1.283,0.502,98.214,0,0,1752114,101993418
17126830080,81525125120,55738368,862625792,1.119,0.364,98.518,0,0,1610292,101230029
17125855232,81526042624,55746560,862674944,1.395,0.446,98.158,0,0,1656454,103589471
17125670912,81526145024,55746560,862756864,1.693,0.583,97.725,0,0,1604861,103689044
17126113280,81525653504,55746560,862801920,1.826,0.636,97.537,0,0,1613540,101684257
17126068224,81525497856,55746560,863002624,1.528,0.611,97.861,0,0,1559092,103177292
17126105088,81525403648,55746560,863059968,1.229,0.391,98.380,0,0,1612474,101573163
17126993920,81524424704,55762944,863129600,1.339,0.363,98.298,0,0,1540510,95958555
17127698432,81523671040,55762944,863178752,1.337,0.557,98.105,0,0,1655666,101669358
17127936000,81523343360,55762944,863264768,1.525,0.776,97.699,0,0,1622306,100616703
17128710144,81522524160,55762944,863309824,1.366,0.502,98.133,0,0,1676476,103785165
17129381888,81521803264,55762944,863358976,1.694,0.556,97.750,0,0,1618946,104750119
17127522304,81523576832,55779328,863428608,1.201,0.503,98.297,0,0,1651554,107119504
17127854080,81523154944,55779328,863510528,1.172,0.502,98.325,0,0,1634400,100186755
17128284160,81522667520,55779328,863563776,1.366,0.390,98.243,0,0,1717030,103666158
17127432192,81523453952,55779328,863629312,1.639,0.528,97.833,0,0,1602982,103790363
17126785024,81524043776,55779328,863682560,1.614,0.417,97.969,0,0,1604544,100002573
17128132608,81522634752,55787520,863735808,1.506,0.446,98.047,0,0,1650218,102915600
17126871040,81523814400,55795712,863809536,1.640,0.500,97.860,0,0,1578050,102045202
17128873984,81521725440,55795712,863887360,1.283,0.502,98.215,0,0,1601990,100530310
17128726528,81521823744,55795712,863936512,1.478,0.390,98.132,0,0,1624338,103867719
17127997440,81522479104,55795712,864010240,1.254,0.557,98.188,0,0,1551386,100508211
17127030784,81523400704,55803904,864047104,1.613,0.584,97.775,0.028,0,1637352,106550762
17128275968,81522061312,55803904,864141312,1.228,0.558,98.214,0,0,1664460,102564029
17129525248,81520750592,55812096,864194560,1.144,0.447,98.409,0,0,1609644,99122872
17128939520,81521274880,55812096,864256000,1.340,0.419,98.242,0,0,1605302,102044087
17128071168,81522098176,55812096,864296960,1.337,0.557,98.106,0,0,1620640,102398518
17128620032,81521442816,55820288,864391168,1.337,0.474,98.189,0,0,1669202,104760695
17127976960,81522016256,55820288,864444416,1.392,0.501,98.107,0,0,1650494,101498057
17127686144,81522245632,55820288,864505856,1.641,0.445,97.914,0,0,1591182,97429165
17127645184,81522221056,55820288,864571392,1.588,0.362,98.050,0,0,1644464,105561280
17129971712,81519828992,55820288,864632832,1.558,0.445,97.997,0,0,1541506,100145543
17129398272,81520320512,55836672,864694272,1.338,0.502,98.160,0,0,1601098,103394014
17128931328,81520717824,55836672,864763904,1.774,0.693,97.533,0,0,1683485,106361011
17128333312,81521274880,55836672,864804864,1.612,0.500,97.887,0,0,1660344,100719981
17129398272,81520128000,55836672,864886784,1.119,0.447,98.434,0,0,1644794,103051298
17129332736,81520132096,55836672,864944128,1.337,0.557,98.106,0,0,1577296,102146180
17128624128,81520758784,55853056,865005568,1.283,0.586,98.131,0,0,1611932,102770258
17129660416,81519652864,55853056,865075200,1.256,0.335,98.409,0,0,1634976,102471848
17130463232,81518800896,55853056,865124352,1.421,0.418,98.161,0,0,1574988,98312429
17129091072,81520115712,55853056,865181696,1.064,0.392,98.544,0,0,1642012,106153594
17129361408,81519755264,55853056,865271808,1.256,0.475,98.269,0,0,1642612,102183044
17128845312,81520218112,55861248,865312768,1.255,0.530,98.215,0,0,1544680,101053695
17128472576,81520517120,55861248,865386496,1.229,0.503,98.268,0,0,1619990,104082078
17129889792,81518911488,55861248,865574912,1.474,0.501,98.025,0,0,1550392,99594691
17130106880,81518616576,55869440,865640448,1.532,0.529,97.939,0,0,1523036,102167371
17128804352,81519865856,55869440,865693696,1.396,0.279,98.325,0,0,1575834,100862035
17130098688,81518489600,55877632,865763328,1.227,0.530,98.243,0,0,1662276,105249245
17129324544,81519194112,55877632,865828864,1.475,0.473,98.024,0.028,0,1613682,104869545
17128505344,81519951872,55877632,865882112,1.314,0.363,98.323,0,0,1623156,101853180
17129279488,81519099904,55877632,865959936,1.475,0.556,97.969,0,0,1618264,101920326
17129336832,81518972928,55877632,866025472,1.450,0.418,98.132,0,0,1599262,103398992
16371490816,82276761600,55885824,866074624,1.476,0.501,98.023,0,0,1585898,100847888
12444479488,86203920384,55894016,865918976,1.230,0.447,98.323,0,0,1292578,85920452
8464822272,90184638464,55894016,864858112,0.754,0.363,98.882,0,0,875784,57834786
4477874176,94172315648,55894016,864129024,0.531,0.251,99.218,0,0,463798,33586723
1367486464,97283792896,55894016,863039488,0.251,0.167,99.582,0,0,160264,9961700
1332383744,97319739392,55894016,862154752,0.139,0.028,99.833,0,0,154826,18778
1332559872,97319772160,55906304,861933568,0,0,100,0,0,4544,0
1332551680,97319772160,55914496,861933568,0,0,100,0,0,5448,148
1332551680,97319772160,55914496,861933568,0,0,100,0,0,4308,0
1332551680,97319772160,55914496,861933568,0,0.028,99.972,0,0,5396,306
1332551680,97319772160,55914496,861933568,0,0,100,0,0,4808,0
1332551680,97319772160,55914496,861933568,0,0.028,99.972,0,0,3695,148
1332510720,97319804928,55922688,861933568,0,0,100,0,0,4814,0
1332502528,97319813120,55922688,861933568,0,0,100,0,0,9190,0
1332502528,97319813120,55922688,861933568,0,0,100,0,0,14238,0
1332502528,97319813120,55922688,861933568,0,0,100,0,0,20118,0
1332502528,97319813120,55922688,861933568,0,0,100,0,0,17892,0
1332502528,97319813120,55922688,861933568,0,0.028,99.972,0,0,9318,0
1332494336,97319813120,55930880,861933568,0,0,100,0,0,12698,0
1332494336,97319813120,55930880,861933568,0,0,100,0,0,9242,0
1332494336,97319813120,55930880,861933568,0,0,100,0,0,7832,280
1332494336,97319813120,55930880,861933568,0,0,100,0,0,86702,1948
1332494336,97319813120,55930880,861933568,0,0,100,0,0,17172,220
1332494336,97319813120,55930880,861933568,0,0,100,0,0,38194,0
1332486144,97319813120,55939072,861933568,0.111,0,99.889,0,0,20573,9264
1335709696,97315401728,55939072,861941760,0.998,0.444,98.558,0,0,464924,40328
1334915072,97315762176,55939072,861941760,0,0,100,0,0,6224,0
