"Dstat 0.7.3 CSV output"
"Author:","Dag Wieers <dag@wieers.com>",,,,"URL:","http://dag.wieers.com/home-made/dstat/"
"Host:","grisou-43.nancy.grid5000.fr",,,,"User:","root"
"Cmdline:","dstat -m -c -n -o dstat.csv",,,,"Date:","27 May 2020 10:04:35 CEST"
"memory usage",,,,"total cpu usage",,,,,"net/total",
"used","free","buff","cach","usr","sys","idl","wai","stl","recv","send"
992133120,133082456064,49905664,708288512,0.953,0.213,98.711,0.124,0,0,0
1002471424,133071654912,49905664,708747264,0.531,0.250,99.219,0,0,391586,15002
990478336,133084086272,49905664,708300800,0.469,0.531,99.000,0,0,385374,25988
990117888,133084434432,49905664,708300800,1.031,0.500,98.469,0,0,6934,15926
989798400,133084717056,49934336,708308992,0,0.031,98.561,1.408,0,10806,2836
992382976,133082124288,49934336,708308992,1.062,0.562,98.375,0,0,389922,27058
992022528,133082484736,49934336,708308992,0,0,100,0,0,6350,0
991764480,133082742784,49934336,708308992,0,0,100,0,0,14454,1008
990990336,133083516928,49934336,708308992,0,0,100,0,0,14806,0
990982144,133083525120,49934336,708308992,0,0.031,99.969,0,0,4372,0
990433280,133084049408,49958912,708308992,0,0,99.906,0.094,0,4128,0
990420992,133084061696,49958912,708308992,0,0,100,0,0,3854,662
989904896,133084577792,49958912,708308992,0,0,100,0,0,2130,0
989822976,133084659712,49958912,708308992,0,0.031,99.969,0,0,1066,0
989687808,133084794880,49958912,708308992,0.031,0,99.969,0,0,466,0
989421568,133085061120,49958912,708308992,0.031,0.031,99.938,0,0,1158,0
989155328,133085319168,49967104,708308992,0,0,99.969,0.031,0,1688,496
989155328,133085319168,49967104,708308992,0.031,0,99.969,0,0,4178,0
990146560,133083877376,49967104,708755456,1.094,0.594,98.312,0,0,394894,28942
989257728,133085212672,49967104,708308992,0,0.031,99.969,0,0,4698,1164
990056448,133084213248,49967104,708460544,0.281,0.312,99.406,0,0,191770,11784
1000816640,133073186816,49967104,708722688,0.500,0.156,99.344,0,0,407760,14368
987643904,133086605312,49979392,708464640,0.531,0.562,98.844,0.062,0,24168,16006
988442624,133085782016,49991680,708464640,0.969,0.563,98.374,0.094,0,405718,26186
988073984,133086150656,49991680,708464640,0,0.031,99.969,0,0,22102,0
1005158400,133068615680,49991680,708911104,0.844,0.531,98.625,0,0,389380,13394
992112640,133082066944,49991680,708464640,0.125,0.125,99.750,0,0,37414,13276
991584256,133082583040,50003968,708464640,0,0.031,99.937,0.031,0,26252,0
992092160,133081812992,50016256,708714496,1.688,0.219,98.062,0.031,0,224138,11152
990957568,133083164672,50016256,708464640,0.031,0,99.969,0,0,4080,2800
990806016,133083316224,50016256,708464640,0,0.031,98.812,1.156,0,918,84
990547968,133083574272,50016256,708464640,0,0,100,0,0,1112,0
991916032,133082193920,50016256,708476928,0.531,0.063,99.406,0,0,342654,15004
999583744,133074325504,50028544,708665344,0.281,0.062,99.625,0.031,0,178774,20818
999555072,133074341888,50040832,708665344,0,0,99.969,0.031,0,12416,12838
999477248,133074419712,50040832,708665344,0,0,100,0,0,12946,13132
998961152,133074935808,50040832,708665344,0,0.031,99.969,0,0,13474,13132
998703104,133075193856,50040832,708665344,0,0,100,0,0,12236,12740
998703104,133075193856,50040832,708665344,0.031,0,99.969,0,0,19748,19040
998694912,133075193856,50049024,708665344,0,0.031,99.906,0.062,0,12884,12838
998694912,133075193856,50049024,708665344,0,0,100,0,0,12928,12936
998567936,133075320832,50049024,708665344,0,0,100,0,0,12236,13132
998567936,133075320832,50049024,708665344,0,0,100,0,0,12478,12936
991322112,133082746880,50049024,708481024,0.031,0,99.969,0,0,1772,2236
991358976,133082710016,50049024,708481024,0.312,0.062,99.625,0,0,174004,16216
990810112,133083246592,50061312,708481024,0.031,0,99.937,0.031,0,66456,2516
990806016,133083246592,50061312,708485120,0,0,100,0,0,5910,2016
990547968,133083504640,50061312,708485120,0,0,100,0,0,692,0
990547968,133083504640,50061312,708485120,0,0,100,0,0,528,0
990535680,133083504640,50073600,708485120,0,0,99.969,0.031,0,692,0
990535680,133083504640,50073600,708485120,0,0,100,0,0,646,0
990527488,133083504640,50081792,708485120,0,0,99.938,0.062,0,346,0
990527488,133083504640,50081792,708485120,0,0,100,0,0,812,0
990523392,133083504640,50081792,708489216,0,0,100,0,0,1038,0
990523392,133083504640,50081792,708489216,0,0,100,0,0,1192,662
990523392,133083504640,50081792,708489216,0,0,100,0,0,692,0
990523392,133083504640,50081792,708489216,0,0,100,0,0,346,0
996921344,133076652032,50089984,708935680,1.124,0.531,98.283,0.062,0,391108,16786
987365376,133086638080,50089984,708489216,0.094,0.031,99.875,0,0,4222,13884
987365376,133086638080,50089984,708489216,0,0,100,0,0,2774,168
1004212224,133069680640,50089984,708599808,0.375,0.187,99.438,0,0,332232,12936
3347795968,130724274176,50094080,709062656,19.864,9.901,70.235,0,0,1652452,64544
6332059648,127738523648,50126848,710238208,35.795,13.482,50.157,0.566,0,1353744,59612
9346473984,124722343936,50143232,711827456,39.056,12.914,47.936,0.094,0,1622548,62414
12482551808,121584603136,50143232,713314304,34.334,14.384,51.220,0.063,0,1325324,57240
15619461120,118446030848,50147328,714829824,36.589,13.191,50.157,0.063,0,1324114,57100
18770558976,115293220864,50151424,716386304,36.769,14.173,47.172,1.886,0,1323850,83103
21823283200,112238993408,50180096,717713408,37.367,13.256,49.189,0.187,0,1337586,588829
24870555648,109190451200,50180096,718831616,38.674,13.883,47.350,0.093,0,1578302,1817114
28067348480,105992425472,50184192,720015360,45.568,13.342,40.965,0.125,0,1162536,2110092
30765412352,103293292544,50184192,721006592,36.121,12.061,51.601,0.218,0,428920,4514365
31106371584,102952153088,50184192,721182720,12.011,2.079,84.513,1.397,0,135272,5271031
31332823040,102725283840,50307072,721453056,15.282,1.650,77.124,5.945,0,113176,4768059
31505735680,102552297472,50307072,721522688,16.827,1.271,81.624,0.279,0,111694,4894527
31725555712,102332391424,50307072,721608704,16.837,1.517,81.368,0.279,0,139194,5366071
31899426816,102158442496,50307072,721686528,19.548,1.766,78.377,0.310,0,140408,5680417
32025878528,102031896576,50307072,721776640,18.830,1.814,79.074,0.282,0,251762,5575523
32153104384,101904568320,50315264,721862656,18.338,1.749,79.475,0.437,0,144964,5238794
32293826560,101763727360,50323456,721969152,17.457,2.543,79.372,0.628,0,230864,4337258
32371630080,101685817344,50323456,722071552,13.766,2.113,83.748,0.373,0,102992,3771506
32423899136,101633458176,50323456,722161664,15.889,1.461,82.307,0.342,0,218520,3702856
32406323200,101650935808,50323456,722259968,11.943,1.809,85.781,0.468,0,111148,3771274
32370933760,101686231040,50331648,722345984,7.562,1.438,88.125,2.875,0,325334,3530454
32321544192,101735518208,50331648,722448384,5.759,0.908,92.989,0.344,0,215762,3536032
32285523968,101771444224,50331648,722538496,8.528,1.992,89.076,0.405,0,122386,3442452
32264671232,101792215040,50331648,722620416,7.714,0.933,91.042,0.311,0,89938,3778012
32273154048,101783629824,50331648,722714624,6.744,1.124,91.820,0.312,0,121474,3772974
32299970560,101756686336,50339840,722833408,8.522,1.456,89.619,0.403,0,89730,3763656
32305680384,101750550528,50401280,723189760,6.159,1.026,80.840,11.975,0,119270,3799164
32307249152,101748879360,50401280,723288064,7.656,1.058,91.005,0.280,0,92142,3707746
32305848320,101750202368,50401280,723365888,6.994,1.243,91.421,0.342,0,124374,3801070
32309444608,101746487296,50401280,723480576,5.875,1.150,92.633,0.342,0,88960,3636862
32312287232,101743558656,50409472,723558400,6.737,0.900,91.804,0.559,0,90238,3730336
32314089472,101741617152,50417664,723689472,4.656,0.944,93.960,0.440,0,88338,3978676
32324521984,101731106816,50417664,723763200,7.841,1.281,90.503,0.375,0,94520,3849780
32327315456,101728210944,50417664,723865600,6.424,0.846,92.385,0.345,0,94272,3816088
32326860800,101728546816,50417664,723980288,5.229,0.903,93.557,0.311,0,121656,3771270
32340426752,101714890752,50425856,724062208,6.560,1.312,91.565,0.562,0,87040,3535314
32341282816,101713944576,50425856,724152320,6.893,1.206,91.592,0.309,0,87946,3550390
32344395776,101710729216,50425856,724250624,6.948,0.806,89.702,2.543,0,106326,3476342
32344772608,101710254080,50425856,724348928,6.310,1.119,92.229,0.342,0,88026,3315552
32347025408,101707894784,50425856,724451328,6.110,0.873,92.706,0.312,0,112938,3533444
32353312768,101701500928,50434048,724545536,5.915,1.221,92.269,0.595,0,91526,3600320
32353390592,101701324800,50434048,724643840,5.514,0.779,93.458,0.249,0,114498,3808058
32354918400,101699694592,50434048,724746240,6.518,0.931,89.851,2.700,0,84392,3564808
32359849984,101694652416,50434048,724852736,5.859,1.060,92.801,0.280,0,82920,3634306
32370180096,101684244480,50434048,724930560,6.371,1.218,92.130,0.281,0,88674,3684700
32371081216,101683216384,50442240,725041152,3.827,0.910,94.260,1.004,0,130156,3643994
32378531840,101675659264,50442240,725143552,5.663,0.996,93.093,0.249,0,86984,3427888
32378982400,101674991616,50442240,725360640,6.531,0.848,91.240,1.381,0,86030,3615766
32382042112,101671817216,50450432,725463040,4.629,1.282,93.713,0.375,0,86502,3618654
32385916928,101667860480,50450432,725544960,5.838,1.124,92.819,0.219,0,118830,3780276
32386609152,101667037184,50458624,725663744,5.257,0.804,93.537,0.402,0,93954,3819970
32384921600,101668626432,50458624,725762048,5.950,0.748,92.960,0.343,0,121024,3731460
32387301376,101666148352,50458624,725856256,7.866,1.548,89.687,0.898,0,93988,3747528
32389222400,101664133120,50458624,725950464,5.806,1.056,92.859,0.279,0,120726,3803010
32390754304,101662519296,50458624,726028288,4.898,1.271,93.583,0.248,0,86704,3528604
32392962048,101660200960,50466816,726130688,6.129,1.120,92.159,0.591,0,82592,3478504
32398340096,101654704128,50466816,726245376,7.027,1.710,90.920,0.342,0,84364,3545680
32399777792,101653159936,50466816,726351872,6.363,1.279,92.015,0.343,0,87654,3477298
32404795392,101648130048,50475008,726437888,5.590,1.280,90.350,2.780,0,92966,3433208
32406917120,101645803520,50475008,726511616,6.479,1.127,91.987,0.407,0,375050,3809404
32406364160,101646225408,50483200,726634496,7.485,1.516,90.319,0.680,0,89444,3701768
32410017792,101642485760,50483200,726720512,10.093,1.304,88.385,0.217,0,87112,3611404
32415121408,101637279744,50483200,726818816,8.378,0.910,90.430,0.282,0,91482,3725822
32418553856,101633740800,50483200,726913024,7.303,1.217,90.325,1.155,0,93334,3825796
32420765696,101631422464,50483200,727015424,8.253,1.121,90.439,0.187,0,106478,3787628
32425406464,101626667008,50491392,727113728,5.849,0.996,92.750,0.404,0,112414,3780944
32426479616,101625491456,50491392,727216128,9.396,1.848,88.417,0.339,0,111830,3722338
32428888064,101622820864,50491392,727441408,7.608,1.621,90.458,0.312,0,105098,3776628
32428621824,101622956032,50491392,727531520,6.115,0.749,91.170,1.966,0,100558,3985394
32445833216,101605629952,50499584,727638016,7.991,1.835,89.832,0.342,0,110410,3912006
32496734208,101554614272,50507776,727740416,7.499,0.628,91.465,0.408,0,107856,3849606
32538947584,101512310784,50507776,727830528,9.413,1.769,88.534,0.284,0,137558,3775784
32572092416,101479059456,50507776,727937024,8.878,0.563,90.247,0.313,0,96598,3598820
32612257792,101438808064,50507776,728023040,8.161,0.844,90.306,0.688,0,127062,3489966
32691191808,101359767552,50507776,728125440,9.944,1.153,88.560,0.343,0,149496,3917924
32743534592,101307330560,50515968,728211456,10.760,0.961,87.659,0.620,0,145126,4130748
32778305536,101272449024,50515968,728317952,8.210,0.912,90.532,0.346,0,109656,4161748
32804208640,101246451712,50515968,728412160,7.216,0.871,91.633,0.280,0,137798,4124624
32834392064,101216157696,50515968,728522752,8.234,0.974,90.478,0.314,0,146652,3938794
32823574528,101226881024,50524160,728608768,4.026,0.780,93.477,1.717,0,95592,3603438
32816963584,101233385472,50532352,728702976,5.654,0.781,92.940,0.625,0,85336,3749188
32815902720,101234352128,50532352,728793088,6.299,0.752,92.667,0.282,0,89946,3784944
32816480256,101233655808,50532352,728907776,5.634,0.595,93.521,0.250,0,85114,3637726
32807698432,101242363904,50532352,728981504,5.139,0.685,93.896,0.280,0,91990,3723878
32808251392,101241692160,50532352,729096192,6.063,0.933,91.418,1.586,0,85386,3606822
32809238528,101240598528,50540544,729190400,5.367,0.628,93.628,0.377,0,83236,3517260
32811266048,101238464512,50540544,729296896,6.328,1.003,92.356,0.313,0,84040,3433996
32812077056,101237559296,50540544,729391104,3.679,0.748,95.292,0.281,0,86654,3583332
32806326272,101243076608,50540544,729624576,6.860,0.811,92.017,0.312,0,95470,3635544
32791314432,101257977856,50540544,729722880,4.482,1.042,91.856,2.620,0,86862,3564346
32787185664,101261987840,50556928,729821184,5.362,0.596,92.631,1.411,0,86610,3671590
32788389888,101260685312,50556928,729915392,4.989,0.624,94.138,0.249,0,88226,3764552
32788893696,101260075008,50556928,730021888,4.453,0.564,94.732,0.251,0,96082,3639692
32786014208,101262848000,50556928,730124288,6.793,0.900,92.060,0.248,0,89010,3815676
32786145280,101262626816,50556928,730214400,4.959,0.811,93.169,1.061,0,90508,3831412
32786989056,101261684736,50565120,730296320,4.251,0.850,94.301,0.598,0,91878,3809852
32787365888,101261205504,50565120,730398720,5.875,0.628,93.151,0.346,0,84808,3537178
32787963904,101260492800,50565120,730505216,4.842,0.906,93.877,0.375,0,87884,3665030
32789110784,101259231232,50565120,730603520,6.526,0.777,92.418,0.280,0,83560,3694110
32788848640,101259268096,50565120,730828800,4.533,0.781,94.405,0.281,0,92202,3743962
32788353024,101259649024,50581504,730927104,4.817,0.724,91.341,3.117,0,90150,3786662
32788938752,101258969088,50581504,731021312,6.314,0.750,92.529,0.406,0,88796,3792136
32789331968,101258448896,50581504,731136000,5.039,0.814,93.772,0.376,0,89192,3886318
32790036480,101257646080,50581504,731226112,5.147,0.811,93.731,0.312,0,89788,3790140
32791887872,101255708672,50581504,731312128,5.783,1.032,92.873,0.313,0,84774,3564508
32791924736,101255548928,50589696,731422720,5.077,0.788,93.094,1.041,0,81126,3214624
32791650304,101255696384,50589696,731533312,4.323,0.627,94.768,0.282,0,77840,3170438
32792428544,101254823936,50589696,731627520,5.510,0.657,93.488,0.344,0,109942,3309860
32792768512,101254373376,50589696,731734016,5.842,0.785,92.933,0.440,0,80488,3445774
32793968640,101253079040,50589696,731824128,5.224,0.594,93.932,0.250,0,118832,3692480
32793333760,101253595136,50597888,731934720,4.672,0.915,92.424,1.989,0,88084,3854950
32793178112,101253632000,50606080,732037120,4.768,1.309,93.518,0.405,0,125898,3988496
32795320320,101251403776,50606080,732119040,5.627,0.844,93.248,0.281,0,94104,3944792
32796139520,101250465792,50606080,732237824,5.342,0.839,93.540,0.280,0,123494,3861518
32795009024,101251514368,50606080,732319744,5.291,0.751,93.644,0.313,0,95854,3987294
32795410432,101250998272,50614272,732418048,5.317,0.719,93.150,0.813,0,95220,4029126
32796954624,101249347584,50614272,732524544,6.076,0.837,92.777,0.310,0,115208,3915612
32798580736,101247610880,50614272,732631040,5.222,0.849,93.677,0.252,0,94168,3659044
32798695424,101247381504,50614272,732741632,3.453,0.628,95.700,0.220,0,85642,3589358
32800174080,101245673472,50614272,732971008,5.719,0.969,93,0.312,0,86592,3658874
32802430976,101243314176,50622464,733061120,6.957,1.051,91.466,0.526,0,91134,3782498
32802443264,101243191296,50630656,733163520,4.431,0.911,92.740,1.917,0,90378,3544544
32802807808,101242703872,50630656,733282304,4.201,0.596,94.890,0.313,0,94640,3417168
32802676736,101242740736,50630656,733376512,4.220,0.938,94.561,0.281,0,85014,3401826
32802910208,101242413056,50630656,733470720,5.962,0.852,92.902,0.284,0,97754,3546168
32803557376,101241643008,50638848,733585408,4.547,1.129,93.728,0.596,0,100902,3639050
32805761024,101239353344,50638848,733671424,4.611,0.903,93.240,1.246,0,93800,3808166
32809218048,101235781632,50638848,733777920,5.737,1.123,92.797,0.343,0,90614,3918178
32806887424,101238005760,50638848,733876224,4.393,0.997,94.268,0.343,0,90850,3878748
32806780928,101238009856,50638848,733978624,4.934,0.817,93.872,0.377,0,87792,3682568
32806666240,101238005760,50647040,734089216,3.906,0.724,94.898,0.472,0,88012,3759084
32807178240,101237395456,50647040,734183424,5.737,0.721,91.881,1.661,0,153502,3751040
32806084608,101238374400,50655232,734285824,6.534,1.058,91.817,0.591,0,84324,3459008
32807366656,101236977664,50655232,734400512,4.483,0.721,94.420,0.376,0,146858,3578178
32809693184,101234556928,50655232,734494720,6.020,0.873,92.670,0.437,0,87256,3556282
32808751104,101235392512,50663424,734588928,3.207,0.660,95.599,0.534,0,149598,3392264
32809668608,101234360320,50667520,734687232,5.919,1.034,92.609,0.438,0,91292,3540140
32810811392,101233111040,50667520,734793728,4.940,0.913,93.707,0.441,0,147608,3601948
32810835968,101232984064,50667520,734896128,5.031,0.844,93.750,0.375,0,87658,3587454
32812060672,101231656960,50667520,734994432,4.666,0.658,94.300,0.376,0,82754,3554086
32811393024,101232218112,50675712,735092736,3.885,0.815,94.674,0.627,0,85214,3441650
32813948928,101229432832,50675712,735322112,5.719,0.812,93,0.469,0,79254,3206208
32814260224,101228982272,50683904,735440896,5.319,0.876,92.053,1.752,0,84772,3096204
32814784512,101228367872,50683904,735526912,4.862,0.960,93.806,0.372,0,107992,3230772
32815976448,101227077632,50683904,735625216,3.771,0.691,95.192,0.346,0,87374,3195520
32815759360,101227167744,50692096,735739904,5.278,0.781,93.317,0.625,0,209378,3310112
32815316992,101227515904,50692096,735834112,6.193,0.692,92.832,0.283,0,349318,3278886
32816840704,101225902080,50692096,735924224,4.277,0.755,93.333,1.635,0,345358,3362658
32816746496,101225902080,50692096,736018432,3.426,0.974,95.255,0.346,0,129506,3445730
32822542336,101219995648,50692096,736129024,5.996,0.963,92.700,0.342,0,114718,3539690
32820490240,101221888000,50700288,736247808,4.666,1.127,93.799,0.407,0,84544,3603706
32820658176,101221621760,50700288,736346112,4.678,1.005,93.940,0.377,0,100712,3794832
32821313536,101220868096,50700288,736444416,4.721,0.881,92.603,1.794,0,90726,3933144
32821395456,101220659200,50708480,736559104,4.331,1.067,94.319,0.282,0,91414,3854240
32823492608,101218463744,50708480,736653312,5.895,0.749,93.075,0.281,0,96958,3843310
32823517184,101218336768,50716672,736747520,4.069,0.689,94.961,0.282,0,91320,3670274
32825397248,101216342016,50716672,736858112,7.016,1.180,91.555,0.248,0,95040,3734120
32825188352,101216464896,50716672,736944128,3.331,0.660,95.412,0.597,0,98612,3592632
32825991168,101215535104,50716672,737071104,5.804,0.900,93.017,0.279,0,160696,3755842
32826769408,101214662656,50716672,737157120,4.227,0.820,94.732,0.221,0,326718,3875976
32828084224,101213233152,50724864,737259520,5.052,0.753,93.473,0.722,0,504792,4031488
32828252160,101212954624,50724864,737366016,6.323,0.849,92.576,0.252,0,504674,3899244
32828276736,101212823552,50724864,737464320,3.843,0.781,94.970,0.406,0,412792,3931480
32827539456,101213323264,50733056,737689600,4.156,1.031,93.438,1.375,0,252018,3903762
32829800448,101210951680,50733056,737792000,5.816,0.719,93.246,0.219,0,191762,3914324
32830763008,101209870336,50741248,737898496,5.599,0.755,93.363,0.283,0,180270,3719634
32830541824,101209989120,50741248,737996800,6.200,0.713,92.684,0.403,0,114062,3729332
32831766528,101208662016,50741248,738095104,3.626,0.719,95.311,0.344,0,139700,3528332
32831750144,101208563712,50741248,738205696,4.035,0.751,93.119,2.096,0,89598,3749736
32832028672,101208190976,50741248,738299904,4.699,1.128,93.766,0.407,0,93326,3799358
32831410176,101208698880,50749440,738402304,5.781,0.566,93.340,0.314,0,136150,3698290
32833196032,101206814720,50749440,738492416,6.086,0.999,92.697,0.218,0,153182,3731310
32834629632,101205266432,50749440,738603008,3.605,0.627,95.455,0.313,0,233496,3626410
32833757184,101206036480,50749440,738701312,4.679,0.780,92.888,1.653,0,206964,3424102
32833789952,101205905408,50757632,738787328,4.909,0.688,94.090,0.313,0,267768,3182772
32838553600,101201035264,50765824,738881536,4.442,0.819,94.360,0.378,0,169098,3293470
32837550080,101201907712,50765824,739012608,4.796,0.972,94.013,0.219,0,132982,3438826
32836079616,101203263488,50765824,739123200,5.491,1.030,93.136,0.343,0,115872,3430458
32836886528,101202358272,50765824,739217408,4.228,0.964,94.343,0.466,0,113500,3617718
32837763072,101201375232,50765824,739323904,5.399,0.785,93.503,0.314,0,94218,3690618
32839725056,101199314944,50774016,739409920,5.755,1.001,92.868,0.375,0,90344,3743518
32840949760,101197987840,50774016,739512320,3.308,0.749,95.662,0.281,0,89454,3582698
32841314304,101197369344,50774016,739749888,5.835,1.179,92.706,0.279,0,97086,3909700
32842604544,101195968512,50774016,739856384,4.994,0.722,93.719,0.565,0,92058,3694310
32843317248,101195137024,50782208,739962880,4.581,0.879,92.720,1.820,0,89718,3666400
32843964416,101194383360,50790400,740057088,5.409,0.622,93.565,0.404,0,88808,3403980
32843268096,101194964992,50790400,740167680,3.304,0.755,95.626,0.315,0,95532,3378090
32844955648,101193105408,50790400,740270080,4.577,0.716,94.427,0.280,0,87254,3400672
32846254080,101191712768,50790400,740360192,4.906,0.719,94.094,0.281,0,83494,3385638
32848683008,101189165056,50790400,740474880,4.790,0.908,93.363,0.939,0,82566,3626976
32848703488,101189033984,50798592,740569088,6.484,0.966,92.113,0.436,0,90200,3816780
32848949248,101188681728,50798592,740675584,3.804,0.873,95.104,0.218,0,90408,3750118
32850489344,101187039232,50798592,740777984,5.714,1.068,92.936,0.283,0,89426,3710376
32850681856,101186744320,50798592,740876288,5.715,0.625,93.410,0.250,0,86656,3653700
32851251200,101186068480,50806784,740970496,5.111,0.878,91.032,2.979,0,94682,3870334
32845783040,101191421952,50814976,741076992,3.894,0.660,94.692,0.754,0,89532,3735868
32846061568,101191032832,50814976,741183488,4.732,1.059,93.867,0.342,0,90218,3795146
32847081472,101189906432,50814976,741289984,4.544,0.940,94.234,0.282,0,87098,3560778
32847212544,101189681152,50814976,741376000,5.115,0.753,93.850,0.282,0,87808,3630340
32847507456,101189165056,50814976,741597184,6.577,0.842,91.926,0.655,0,100684,3926568
32850436096,101186101248,50823168,741720064,5.979,0.623,92.993,0.405,0,92894,3697376
32858542080,101177905152,50823168,741810176,4.210,0.817,94.722,0.251,0,91176,3630122
32859049984,101177290752,50823168,741916672,5.838,0.843,92.944,0.375,0,94894,3729886
32868446208,101167128576,50831360,742019072,5.694,0.786,93.205,0.315,0,92236,3920204
32875253760,101160116224,50843648,742113280,4.870,0.974,93.465,0.691,0,143976,4021888
32879616000,101155581952,50855936,742223872,4.830,0.904,92.459,1.807,0,105216,3675766
32878891008,101156220928,50855936,742305792,5.175,0.992,93.523,0.310,0,115180,3503816
32878174208,101156835328,50855936,742404096,5.111,0.878,93.572,0.439,0,85788,3435912
32877830144,101157060608,50855936,742522880,5.266,0.721,93.636,0.376,0,114476,3411214
32882954240,101151838208,50855936,742617088,5.209,1.161,93.317,0.314,0,87308,3127712
32883458048,101151207424,50872320,742727680,3.975,0.782,92.864,2.379,0,107556,3200508
32883662848,101150908416,50872320,742821888,4.789,0.814,93.991,0.407,0,92218,3395438
32884187136,101150269440,50872320,742932480,4.479,0.846,94.363,0.313,0,87062,3391960
32884535296,101149818880,50872320,743034880,6.433,1.243,91.952,0.373,0,85754,3537882
32885125120,101149138944,50872320,743124992,4.098,0.694,94.830,0.378,0,84800,3527350
32886226944,101147918336,50880512,743235584,4.897,0.655,91.984,2.464,0,81438,3428944
32886259712,101147783168,50888704,743329792,4.530,0.719,94.314,0.437,0,84778,3488260
32885907456,101148020736,50888704,743444480,5.224,1.126,93.369,0.282,0,81956,3315330
32886919168,101146910720,50888704,743542784,5.669,0.940,93.047,0.345,0,84398,3444446
32888365056,101145366528,50888704,743641088,3.799,0.691,95.102,0.408,0,81008,3241462
32888795136,101144686592,50896896,743870464,4.344,0.812,94.031,0.812,0,77812,3083998
32893882368,101139496960,50896896,743972864,5.501,0.566,93.555,0.377,0,76662,2889888
32896016384,101137268736,50896896,744067072,4.784,0.976,93.894,0.346,0,79682,3227424
32895406080,101137756160,50896896,744185856,5.964,1.607,91.996,0.433,0,85462,3613088
28924977152,105108094976,50896896,744271872,4.363,1.028,94.297,0.312,0,84490,3540146
25825832960,108208005120,50909184,743493632,2.991,0.724,95.088,1.196,0,82204,3136736
22626390016,111408537600,50917376,742445056,4.195,0.657,92.517,2.630,0,65480,2633950
19449270272,114586505216,50917376,741638144,2.971,0.876,95.872,0.281,0,62794,2147838
15482351616,118554304512,50917376,740798464,2.820,0.627,96.177,0.376,0,59148,1691282
12294946816,121742544896,50917376,739962880,2.728,0.596,96.425,0.251,0,51340,1342352
9097089024,124941090816,50929664,739344384,2.870,0.530,96.319,0.281,0,30380,1051350
5921624064,128117903360,50929664,738037760,1.378,0.376,96.869,1.378,0,25194,903096
2694692864,131345735680,50929664,737177600,0.563,0.282,98.936,0.219,0,28586,464278
1054822400,132986531840,50929664,736292864,0.094,0.094,99.812,0,0,14094,180220
1036939264,133004865536,50929664,735850496,0.062,0.031,99.906,0,0,5638,23076
1036410880,133005381632,50941952,735850496,0,0,99.844,0.156,0,5514,0
1035878400,133005905920,50950144,735850496,0,0,99.906,0.094,0,28600,0
1035620352,133006163968,50950144,735850496,0,0,100,0,0,812,0
1035104256,133006680064,50950144,735850496,0,0,100,0,0,2698,0
1035104256,133006680064,50950144,735850496,0,0,100,0,0,3066,0
1035104256,133006680064,50950144,735850496,0,0,100,0,0,32950,264
1036152832,133005623296,50958336,735850496,0,0,99.875,0.125,0,3316,0
1035636736,133006139392,50958336,735850496,0,0,100,0,0,32452,132
1035120640,133006655488,50958336,735850496,0,0,100,0,0,3722,1508
1034862592,133006913536,50958336,735850496,0,0,100,0,0,12602,0
1034072064,133007704064,50958336,735850496,0.031,0,99.969,0,0,18450,1092
1033814016,133007962112,50958336,735850496,0,0,100,0,0,34702,1008
1033805824,133007962112,50966528,735850496,0,0,99.969,0.031,0,4598,168
1033547776,133008220160,50966528,735850496,0,0,100,0,0,2440,0
1033547776,133008220160,50966528,735850496,0,0,100,0,0,512,0
1033031680,133008736256,50966528,735850496,0,0,100,0,0,3902,0
1033031680,133008736256,50966528,735850496,0,0,100,0,0,25154,0
1032773632,133008994304,50966528,735850496,0.031,0,99.969,0,0,58254,0
1032245248,133009510400,50974720,735854592,0,0.031,99.906,0.063,0,123606,1008
1031729152,133010026496,50974720,735854592,0.031,0,99.969,0,0,131024,4032
1031729152,133010026496,50974720,735854592,0.063,0,99.937,0,0,112168,2016
1030696960,133011058688,50974720,735854592,0.031,0.031,99.937,0,0,97538,2016
1030696960,133011058688,50974720,735854592,0,0,99.187,0.813,0,13466,3024
1030430720,133011316736,50982912,735854592,0,0,99.969,0.031,0,33058,1008
1030430720,133011316736,50982912,735854592,0,0,100,0,0,3924,0
1030373376,133011374080,50982912,735854592,0,0,100,0,0,7224,0
1030373376,133011374080,50982912,735854592,0,0,100,0,0,7942,0
1030373376,133011374080,50982912,735854592,0,0,99.906,0.094,0,2518,2380
1029840896,133011906560,50982912,735854592,0,0,100,0,0,30738,1508
1029832704,133011906560,50991104,735854592,0,0,99.969,0.031,0,3500,662
1029832704,133011906560,50991104,735854592,0,0,100,0,0,28806,0
1029832704,133011906560,50991104,735854592,0,0,100,0,0,3604,0
1029832704,133011906560,50991104,735854592,0,0,99.906,0.094,0,8614,0
1029570560,133012164608,50995200,735854592,0,0,100,0,0,3700,0
1029570560,133012164608,50995200,735854592,0,0,100,0,0,32572,84
1029562368,133012164608,51003392,735854592,0,0,99.937,0.063,0,4078,390
1029304320,133012422656,51003392,735854592,0,0,100,0,0,24726,234
1029304320,133012422656,51003392,735854592,0,0,100,0,0,5010,702
1029304320,133012422656,51003392,735854592,0,0,100,0,0,12332,468
1029304320,133012422656,51003392,735854592,0,0,100,0,0,39746,468
1029304320,133012422656,51003392,735854592,0,0,100,0,0,12342,976
1029038080,133012680704,51011584,735854592,0,0,99.969,0.031,0,68324,1038
1029038080,133012680704,51011584,735854592,0.031,0,99.969,0,0,10990,656
1046069248,132995395584,51011584,735862784,1.124,0.312,98.563,0,0,480992,22712
1044172800,132995014656,51011584,735862784,0.531,0.531,98.938,0,0,196060,37356
