"Dstat 0.7.3 CSV output"
"Author:","Dag Wieers <dag@wieers.com>",,,,"URL:","http://dag.wieers.com/home-made/dstat/"
"Host:","gros-73.nancy.grid5000.fr",,,,"User:","root"
"Cmdline:","dstat -m -c -n -o dstat.csv",,,,"Date:","23 May 2020 23:46:40 CEST"
"memory usage",,,,"total cpu usage",,,,,"net/total",
"used","free","buff","cach","usr","sys","idl","wai","stl","recv","send"
1308504064,97498468352,49618944,734896128,0.860,0.216,98.888,0.036,0,0,0
1302306816,97504305152,49631232,735240192,0.749,0.333,98.918,0,0,406834,30598
1301262336,97505796096,49631232,734793728,0,0,100,0,0,12058,2168
1303408640,97503600640,49635328,734801920,0.749,0.361,98.835,0.055,0,392236,17618
1303367680,97503641600,49635328,734801920,0,0,100,0,0,4522,0
1297649664,97509343232,49647616,734801920,0.639,0.361,99,0,0,387728,17702
1297641472,97509351424,49647616,734801920,0,0.028,99.972,0,0,2933,148
1297620992,97509359616,49659904,734801920,0,0,100,0,0,4308,0
1297608704,97509359616,49664000,734810112,0,0.028,99.694,0.278,0,6372,0
1297608704,97509359616,49664000,734810112,0,0,100,0,0,7200,0
1297596416,97509359616,49676288,734810112,0,0,100,0,0,6622,0
1301008384,97505943552,49676288,734810112,0.722,0.361,98.917,0,0,391516,20438
1303027712,97503911936,49676288,734822400,0.306,0.445,99.249,0,0,559566,27564
1303740416,97503170560,49688576,734826496,0.722,0.333,98.945,0,0,387722,24970
1298632704,97508274176,49688576,734826496,0.473,0.334,99.194,0,0,9182,7742
1298702336,97508200448,49688576,734826496,0.694,0.305,99.000,0,0,386576,16586
1341865984,97464750080,49700864,735068160,0.972,0.111,98.917,0,0,225398,9040
1298501632,97508319232,49700864,734830592,0.250,0.056,99.695,0,0,5964,4888
1298563072,97508241408,49713152,734834688,0.388,0.139,99.473,0,0,343068,15532
1306206208,97500409856,49713152,735023104,0.250,0.306,99.443,0,0,180796,17810
1306189824,97500426240,49713152,735023104,0,0.028,99.972,0,0,17474,10192
1306189824,97500426240,49713152,735023104,0,0.028,99.972,0,0,22444,10176
1306169344,97500434432,49725440,735023104,0,0.028,99.972,0,0,24548,10020
1306169344,97500434432,49725440,735023104,0.028,0.028,99.944,0,0,13532,9996
1306157056,97500434432,49737728,735023104,0,0,100,0,0,21248,14994
1306157056,97500434432,49737728,735023104,0,0.028,99.972,0,0,13236,10498
1306157056,97500434432,49737728,735023104,0.028,0,99.972,0,0,14338,9898
1306157056,97500434432,49737728,735023104,0,0.028,99.972,0,0,18586,10094
1306157056,97500434432,49737728,735023104,0,0.028,99.972,0,0,16702,10192
1298886656,97507876864,49741824,734846976,0,0,99.972,0.028,0,6287,2500
1299456000,97507295232,49754112,734846976,0.139,0.083,99.778,0,0,176002,14536
1299447808,97507303424,49754112,734846976,0.028,0.028,99.944,0,0,1522,0
1299472384,97507278848,49754112,734846976,0,0.028,99.972,0,0,3860,0
1299472384,97507278848,49754112,734846976,0,0,100,0,0,1416,0
1299460096,97507278848,49766400,734846976,0,0,100,0,0,4224,60
1299447808,97507278848,49778688,734846976,0,0,100,0,0,2814,0
1299447808,97507278848,49778688,734846976,0,0,100,0,0,5367,0
1296453632,97509822464,49778688,735293440,0.584,0.334,99.083,0,0,391626,28490
1294958592,97511763968,49778688,734846976,0,0,100,0,0,4720,1164
1294958592,97511763968,49778688,734846976,0,0,100,0,0,2940,0
1672589312,97134505984,49778688,734425088,2.530,0.584,96.886,0,0,993394,39556
5305749504,93499166720,49795072,736165888,25.658,8.534,65.808,0,0,1675154,75598
9088200704,89714450432,49807360,738213888,27.326,9.641,63.033,0,0,1669610,76840
12763160576,86037553152,49811456,739991552,26.886,9.268,63.846,0,0,1660026,75098
16621084672,82177748992,49823744,741732352,27.456,10.711,61.832,0,0,1850132,79418
20465967104,78331031552,49913856,743354368,28.310,10.249,61.385,0.055,0,1795344,77654
23236169728,75559690240,49930240,744382464,22.234,7.255,70.510,0,0,398432,4982086
23262732288,75533090816,49942528,744394752,2.476,0.250,97.273,0,0,255446,18812040
23352573952,75443216384,49942528,744427520,3.537,0.473,95.990,0,0,522904,35057660
23515340800,75280424960,49942528,744452096,5.540,0.443,94.017,0,0,769556,50188442
23729197056,75066359808,49942528,744656896,6.921,0.639,92.440,0,0,1023824,69151420
24008564736,74786910208,49950720,744726528,12.535,1.253,86.212,0,0,1298944,83270245
24215076864,74580328448,49950720,744796160,11.894,0.804,87.302,0,0,1441168,90716884
24381444096,74413842432,49958912,744873984,11.791,0.890,87.319,0,0,1437208,90544546
24494047232,74301145088,49958912,744968192,10.490,0.720,88.790,0,0,1320170,83968418
24601616384,74193502208,49958912,745041920,10.767,0.809,88.424,0,0,1373718,87182432
24630071296,74164953088,49967104,745127936,10.765,0.856,88.380,0,0,1387090,86820932
24621772800,74173173760,49967104,745205760,5.038,0.417,94.545,0,0,1382930,90061446
24616992768,74177867776,49967104,745291776,5.094,0.692,94.214,0,0,1455524,91753368
24610885632,74183884800,49967104,745381888,4.667,0.503,94.830,0,0,1254736,80612256
24616116224,74178490368,49995776,745508864,5.502,0.945,93.526,0.028,0,1455588,88415796
24624160768,74170351616,50003968,745594880,6.292,0.637,93.071,0,0,1508794,91769180
24622530560,74171891712,50003968,745684992,4.915,0.363,94.722,0,0,1464150,90169262
24603262976,74191081472,50003968,745758720,4.288,0.557,95.155,0,0,1448264,91078924
24602767360,74191486976,50003968,745840640,5.585,0.553,93.862,0,0,1343576,89389972
24597725184,74196447232,50003968,745922560,4.488,0.446,95.066,0,0,1347202,88309050
24597356544,74196709376,50020352,746012672,4.230,0.501,95.269,0,0,1308077,83235988
24600715264,74193276928,50020352,746086400,3.868,0.640,95.492,0,0,1325408,85429836
24600395776,74193502208,50020352,746180608,2.840,0.612,96.548,0,0,1325514,84360566
24600403968,74193408000,50020352,746262528,4.662,0.524,94.814,0,0,1461850,91024260
24601698304,74192031744,50020352,746340352,3.622,0.636,95.715,0.028,0,1395412,88162282
24595906560,74197594112,50028544,746561536,3.259,0.529,96.212,0,0,1480432,96023594
24611991552,74181419008,50028544,746647552,4.092,0.585,95.323,0,0,1397674,90263760
24613289984,74180046848,50028544,746717184,4.066,0.501,95.433,0,0,1419394,92573994
24618340352,74174910464,50028544,746803200,3.594,0.502,95.904,0,0,1406294,88653366
24620646400,74172489728,50044928,746901504,2.882,0.420,96.698,0,0,1403424,88774156
24624812032,74168233984,50053120,746979328,3.197,0.473,96.330,0,0,1366850,87743656
24628154368,74164809728,50053120,747057152,2.452,0.724,96.824,0,0,1371656,86007880
24634712064,74158166016,50053120,747139072,3.856,0.499,95.645,0,0,1305158,83886188
24635273216,74157514752,50053120,747225088,2.973,0.583,96.443,0,0,1363620,89871400
24634916864,74157780992,50061312,747307008,3.573,0.582,95.817,0.028,0,1363460,90202174
24638103552,74154516480,50061312,747384832,3.727,0.389,95.883,0,0,1377278,85612636
24642592768,74149875712,50061312,747466752,2.800,0.588,96.613,0,0,1356762,89774998
24646324224,74146045952,50061312,747565056,2.908,0.587,96.504,0,0,1287545,85405880
24646234112,74146050048,50061312,747646976,2.651,0.446,96.903,0,0,1208688,81562882
24658878464,74133336064,50069504,747708416,3.431,0.697,95.872,0,0,1465994,91761212
24670314496,74121801728,50069504,747802624,3.146,0.557,96.297,0,0,1342474,83926364
24669343744,74122690560,50069504,747884544,2.455,0.446,97.099,0,0,1401657,87456806
24669380608,74122567680,50069504,747970560,2.703,0.390,96.906,0,0,1406360,89888574
24671330304,74120540160,50069504,748048384,2.720,0.555,96.725,0,0,1404872,90261138
24680517632,74111254528,50077696,748138496,2.812,0.557,96.631,0,0,1309770,83412384
24680235008,74111455232,50077696,748216320,2.152,0.615,97.233,0,0,1267666,81530650
24687157248,74104446976,50077696,748302336,2.785,0.613,96.603,0,0,1376972,90245200
24688300032,74103218176,50077696,748384256,2.709,0.559,96.733,0,0,1388636,88608896
24688513024,74102927360,50077696,748462080,2.827,0.504,96.669,0,0,1515864,94428104
24688066560,74103263232,50085888,748564480,3.083,0.472,96.444,0,0,1302052,83450550
24693682176,74097565696,50094080,748634112,3.414,0.749,95.837,0,0,1304161,84527266
24695263232,74095898624,50094080,748720128,2.097,0.419,97.484,0,0,1345100,88662058
24696303616,74094784512,50094080,748793856,3.174,0.501,96.325,0,0,1339284,85184898
24696598528,74094260224,50094080,748998656,2.840,0.501,96.658,0,0,1426628,89096038
24708902912,74081845248,50102272,749096960,3.963,0.502,95.507,0.028,0,1424946,88579560
24739422208,74051297280,50102272,749182976,4.632,0.943,94.424,0,0,1411084,89952348
24750133248,74040504320,50102272,749260800,4.967,0.586,94.448,0,0,1494310,94698198
24771866624,74018680832,50102272,749350912,6,0.556,93.444,0,0,1369064,87617730
24775184384,74015240192,50102272,749432832,4.411,0.583,95.007,0,0,1380340,89544094
24790110208,74000236544,50110464,749498368,5.004,0.584,94.412,0,0,1270006,84235086
24796835840,73993428992,50110464,749580288,3.833,0.639,95.528,0,0,1322138,85976668
24799961088,73990197248,50110464,749682688,2.817,0.418,96.765,0,0,1460330,94096460
24799285248,73990795264,50110464,749760512,2.976,0.473,96.551,0,0,1326582,87553368
24799158272,73990799360,50110464,749846528,2.425,0.418,97.157,0,0,1411182,90071206
24848973824,73940901888,50118656,749920256,4.919,0.639,94.441,0,0,1313196,84495836
24884273152,73905508352,50126848,750006272,5.912,0.666,93.422,0,0,1395844,86847458
24922386432,73867304960,50126848,750096384,5.704,0.445,93.851,0,0,1355586,86147212
25025089536,73764519936,50126848,750170112,7.248,0.697,92.055,0,0,1446722,93162132
25090342912,73699180544,50126848,750252032,7.049,0.557,92.393,0,0,1305104,85692040
25110949888,73678475264,50135040,750342144,6.260,0.554,93.186,0,0,1265406,83348510
25123860480,73665499136,50135040,750407680,3.129,0.447,96.424,0,0,1358772,88499072
25123557376,73665699840,50135040,750505984,2.958,0.502,96.539,0,0,1431064,90119690
25100652544,73688510464,50135040,750600192,2.724,0.695,96.581,0,0,1393274,87918268
25090445312,73698643968,50135040,750669824,2.450,0.390,97.160,0,0,1422900,90959094
25085038592,73703960576,50143232,750751744,2.390,0.556,97.026,0.028,0,1322500,84562238
25087713280,73701187584,50143232,750845952,2.453,0.530,97.018,0,0,1400210,88880970
25097412608,73691394048,50143232,750936064,2.205,0.502,97.293,0,0,1429164,92108664
25102028800,73686716416,50143232,750997504,3.350,0.419,96.231,0,0,1427576,89761278
25105371136,73683279872,50143232,751087616,3.692,0.777,95.530,0,0,1367142,87827714
25109544960,73678860288,50151424,751321088,1.894,0.752,97.354,0,0,1531056,95355580
25111470080,73676877824,50151424,751378432,2.201,0.474,97.326,0,0,1413801,86652932
25113915392,73674334208,50159616,751464448,2.665,0.722,96.613,0,0,1386500,87159746
25113440256,73674702848,50159616,751566848,1.954,0.475,97.571,0,0,1340500,86103388
25110896640,73677176832,50159616,751636480,2.366,0.417,97.217,0,0,1386466,89751630
25113804800,73674170368,50167808,751726592,2.427,0.391,97.182,0,0,1284851,83713892
25112174592,73675714560,50167808,751812608,2.259,0.558,97.183,0,0,1344492,85179030
25112326144,73675489280,50167808,751886336,2.311,0.418,97.271,0,0,1412926,89318360
25111191552,73676537856,50167808,751972352,2.040,0.475,97.485,0,0,1382500,86242716
25109610496,73678020608,50167808,752066560,3.329,0.527,96.144,0,0,1381645,89621044
25109680128,73677893632,50176000,752115712,2.941,0.610,96.448,0,0,1440024,94107310
25110237184,73677238272,50176000,752209920,2.312,0.390,97.298,0,0,1304310,83519570
25114796032,73672585216,50176000,752304128,3.085,0.695,96.192,0.028,0,1476720,93603204
25117003776,73670291456,50176000,752390144,2.259,0.558,97.183,0,0,1402438,86914414
25121898496,73665314816,50176000,752472064,2.461,0.475,97.064,0,0,1422478,92394096
25122029568,73665085440,50184192,752562176,1.988,0.448,97.564,0,0,1465818,90838264
25121304576,73665748992,50184192,752619520,3.698,0.473,95.830,0,0,1426988,86984776
25121026048,73665908736,50192384,752726016,2.904,0.363,96.733,0,0,1488084,89932628
25122590720,73664253952,50192384,752812032,4.008,0.612,95.380,0,0,1473224,91385926
25122279424,73664491520,50192384,752877568,3.174,0.557,96.269,0,0,1382122,90619846
25122947072,73663717376,50200576,752971776,2.430,0.447,97.123,0,0,1321648,84305174
25123823616,73662742528,50200576,753065984,3.673,0.501,95.826,0,0,1362556,87184238
25123946496,73662550016,50200576,753135616,2.400,0.447,97.153,0,0,1519304,96912988
25125216256,73661186048,50208768,753217536,3.151,0.669,96.180,0,0,1402426,90997080
25124818944,73661489152,50208768,753311744,1.873,0.419,97.708,0,0,1397174,88204428
25125310464,73660903424,50216960,753393664,2.260,0.586,97.154,0,0,1374126,85626230
25126359040,73659789312,50216960,753459200,2.306,0.445,97.249,0,0,1424926,91444474
25124294656,73661726720,50225152,753573888,2.061,0.613,97.299,0.028,0,1454206,93184712
25129476096,73656467456,50225152,753651712,3.030,0.500,96.469,0,0,1429010,91441520
25129615360,73656246272,50225152,753733632,2.999,0.555,96.445,0,0,1458946,92576886
25134145536,73651470336,50233344,753954816,3.174,0.696,96.130,0,0,1393368,88666546
25134620672,73650913280,50233344,754036736,3.245,0.638,96.117,0,0,1420415,90348794
25135771648,73649659904,50241536,754126848,4.234,0.585,95.181,0,0,1430202,89779088
25135091712,73650249728,50241536,754216960,4.075,0.419,95.507,0,0,1526034,93036234
25137221632,73648037888,50241536,754294784,3.558,0.611,95.831,0,0,1439100,88134634
25140174848,73644982272,50249728,754388992,5.741,0.446,93.813,0,0,1430932,89542038
25142075392,73642987520,50249728,754483200,4.841,0.529,94.630,0,0,1439354,90056286
25143189504,73641705472,50249728,754577408,2.432,0.419,97.149,0,0,1307156,82885474
25145225216,73639591936,50249728,754651136,5.639,0.667,93.694,0,0,1459192,92329456
25149079552,73635655680,50249728,754733056,4.660,0.638,94.702,0,0,1258988,82908830
25149050880,73635565568,50257920,754835456,2.621,0.446,96.933,0,0,1268554,83280906
25148346368,73636196352,50257920,754909184,2.591,0.446,96.964,0,0,1337124,87098572
25148321792,73636139008,50257920,754991104,2.333,0.667,96.972,0.028,0,1372594,87593756
25149304832,73635057664,50257920,755089408,1.590,0.363,98.047,0,0,1358104,86605152
25149595648,73634680832,50257920,755171328,2.852,0.554,96.595,0,0,1383214,87697718
25150287872,73633902592,50266112,755249152,3.307,0.611,96.081,0,0,1339768,87598132
25150099456,73634000896,50266112,755335168,2.808,0.417,96.775,0,0,1387242,91154632
25150091264,73633910784,50266112,755433472,2.446,0.528,97.025,0,0,1304762,86106820
25148792832,73635127296,50274304,755507200,1.896,0.502,97.602,0,0,1385330,87226842
25148723200,73635102720,50274304,755597312,1.948,0.529,97.523,0,0,1361736,88390652
25151037440,73632681984,50282496,755687424,2.199,0.445,97.355,0,0,1306706,85920278
25149243392,73634390016,50282496,755773440,2.640,0.556,96.804,0,0,1393930,90691912
25151418368,73632129024,50282496,755859456,2.583,0.472,96.945,0,0,1377986,86126506
25149353984,73634099200,50282496,755949568,2.556,0.500,96.944,0,0,1363752,87345576
25150320640,73633058816,50282496,756023296,2.345,0.391,97.264,0,0,1322708,85392892
25151123456,73632161792,50290688,756109312,2.536,0.390,97.074,0,0,1404040,87912714
25151324160,73631866880,50290688,756203520,2.064,0.446,97.490,0,0,1447072,92939024
25151520768,73631576064,50290688,756293632,1.508,0.503,97.989,0,0,1408232,87821450
25151057920,73631977472,50290688,756355072,2.315,0.446,97.211,0.028,0,1353820,85215360
25152528384,73630388224,50290688,756461568,2.253,0.417,97.330,0,0,1478322,93262392
25153417216,73629245440,50298880,756551680,1.539,0.420,98.041,0,0,1493839,88617784
25153720320,73628856320,50298880,756637696,2.396,0.418,97.187,0,0,1346131,87307940
25154920448,73627578368,50298880,756715520,2.005,0.418,97.577,0,0,1441610,92418588
25153273856,73629118464,50307072,756809728,2.336,0.501,97.164,0,0,1348588,84746720
25152786432,73629528064,50307072,756883456,2.590,0.529,96.881,0,0,1356516,86985882
25154265088,73627922432,50315264,756969472,2.091,0.446,97.463,0,0,1441494,90991116
25153822720,73628254208,50315264,757071872,2.396,0.446,97.159,0,0,1386258,85482220
25153634304,73628356608,50315264,757153792,2.455,0.363,97.183,0,0,1394820,88930134
25154748416,73627156480,50323456,757231616,1.784,0.390,97.798,0.028,0,1464892,92671090
25155121152,73626603520,50323456,757399552,1.869,0.474,97.657,0,0,1374222,87217066
25157029888,73624608768,50331648,757477376,1.647,0.530,97.822,0,0,1361456,86030282
25156575232,73625001984,50331648,757538816,1.791,0.336,97.873,0,0,1369466,87343538
25155604480,73625858048,50331648,757653504,3.139,0.444,96.417,0,0,1356602,85845178
25156202496,73625169920,50339840,757735424,2.615,0.473,96.912,0,0,1347632,86016388
25155534848,73625759744,50339840,757813248,1.867,0.502,97.632,0,0,1410312,90267024
25156681728,73624526848,50348032,757891072,1.623,0.420,97.957,0,0,1315234,82595530
25156366336,73624604672,50348032,758124544,1.973,0.500,97.527,0,0,1330540,86456834
25156423680,73624428544,50348032,758206464,2.550,0.554,96.896,0,0,1387060,85901726
25157038080,73623711744,50360320,758288384,1.676,0.447,97.878,0,0,1422846,89661396
25158524928,73622126592,50360320,758382592,2.261,0.447,97.293,0,0,1422862,90359190
25158230016,73622327296,50368512,758468608,2.252,0.389,97.359,0,0,1408988,89694966
25159962624,73620504576,50368512,758554624,2.203,0.446,97.351,0,0,1417958,92304138
25158430720,73621946368,50368512,758644736,1.816,0.447,97.737,0,0,1425624,88043346
25158955008,73621327872,50368512,758734848,2.204,0.558,97.238,0,0,1383284,88189156
25159954432,73620119552,50376704,758935552,2.414,0.666,96.920,0,0,1376686,86276474
25159835648,73620127744,50384896,759033856,1.484,0.448,98.040,0.028,0,1368056,86118364
25159299072,73620566016,50384896,759132160,1.567,0.616,97.818,0,0,1368450,87273720
25159839744,73619947520,50384896,759205888,1.864,0.501,97.635,0,0,1463824,93810142
25160617984,73619062784,50384896,759300096,2.004,0.584,97.412,0,0,1347412,89511920
25160273920,73619324928,50393088,759373824,1.703,0.586,97.710,0,0,1330146,84784288
25162178560,73617334272,50401280,759447552,2.032,0.445,97.522,0,0,1376402,86751114
25161895936,73617514496,50401280,759545856,2.199,0.584,97.217,0,0,1351265,85632314
25161146368,73618178048,50401280,759631872,2.204,0.474,97.321,0,0,1401818,89526330
25161785344,73617461248,50401280,759709696,2.369,0.474,97.157,0,0,1312958,83122634
25162244096,73616904192,50405376,759803904,2.747,0.499,96.754,0,0,1427350,89277262
25162031104,73617010688,50413568,759902208,2.200,0.473,97.327,0,0,1391440,89563594
25162178560,73616785408,50413568,759975936,2.361,0.639,97,0,0,1324532,84201426
25162321920,73616547840,50413568,760070144,1.698,0.473,97.829,0,0,1387418,88347112
25162989568,73615798272,50413568,760152064,2.119,0.558,97.323,0,0,1421912,90432146
25162502144,73616191488,50421760,760238080,1.753,0.557,97.690,0,0,1362532,85024832
25162776576,73615839232,50429952,760307712,2.422,0.501,97.077,0,0,1289728,82351608
25163063296,73615454208,50429952,760406016,2.533,0.557,96.910,0,0,1339318,89606808
25165062144,73613357056,50429952,760496128,1.811,0.446,97.744,0,0,1387976,88466346
25162854400,73615491072,50429952,760569856,1.790,0.448,97.762,0,0,1415166,89373006
25164251136,73614004224,50429952,760659968,2.889,0.389,96.722,0,0,1380558,86090422
25164197888,73613946880,50438144,760758272,1.892,0.501,97.579,0.028,0,1400410,91128790
25165447168,73612611584,50446336,760836096,2.726,0.501,96.773,0,0,1422736,91575726
25165529088,73612292096,50446336,761069568,1.809,0.529,97.662,0,0,1328284,84404214
25166864384,73610887168,50446336,761139200,2.029,0.556,97.415,0,0,1327624,85422278
25165987840,73611681792,50446336,761221120,1.618,0.446,97.935,0,0,1411764,90596738
25166802944,73610739712,50454528,761339904,2.121,0.446,97.433,0,0,1450512,90086476
25168175104,73609293824,50454528,761405440,2.424,0.362,97.214,0,0,1384276,88851226
25166700544,73610670080,50454528,761503744,2.088,0.501,97.411,0,0,1377208,87141610
25166647296,73610641408,50454528,761585664,2.423,0.418,97.159,0,0,1369516,85174194
25167151104,73610051584,50454528,761671680,1.701,0.558,97.713,0.028,0,1447236,93074018
25167294464,73609785344,50462720,761769984,2.501,0.417,97.082,0,0,1329768,84243986
25167663104,73609326592,50462720,761851904,2.712,0.554,96.734,0,0,1390782,86215830
25167413248,73609498624,50462720,761929728,1.872,0.559,97.570,0,0,1510000,92549668
25168076800,73608716288,50462720,762040320,1.754,0.473,97.773,0,0,1250194,81637940
25169321984,73607417856,50462720,762085376,1.673,0.446,97.881,0,0,1265906,82186678
25167872000,73608765440,50479104,762171392,2.283,0.445,97.272,0,0,1425618,92728938
25168695296,73607815168,50479104,762290176,2.222,0.556,97.222,0,0,1383095,87355558
25168973824,73607458816,50479104,762363904,1.722,0.694,97.584,0,0,1377894,86666670
25168248832,73608085504,50479104,762458112,2.181,0.531,97.287,0,0,1469700,93482900
25169457152,73606782976,50479104,762552320,2.008,0.418,97.574,0,0,1506578,93730058
25169379328,73606758400,50495488,762638336,1.536,0.559,97.905,0,0,1482750,93225090
25171980288,73604067328,50495488,762728448,1.984,0.447,97.568,0,0,1478828,93848954
25171607552,73604362240,50495488,762806272,1.899,0.391,97.709,0,0,1382122,88807402
25173893120,73601986560,50495488,762892288,2.504,0.445,97.051,0,0,1400264,90395840
25173770240,73602023424,50495488,762978304,1.669,0.556,97.774,0,0,1411470,88210754
25173344256,73602334720,50511872,763060224,1.953,0.446,97.601,0,0,1404718,88623018
25171890176,73603678208,50511872,763162624,1.894,0.724,97.382,0,0,1361484,86355800
25172897792,73602596864,50511872,763232256,2.039,0.447,97.514,0,0,1388658,91562040
25173061632,73602191360,50511872,763457536,2.001,0.389,97.610,0,0,1292454,86966526
25171382272,73603768320,50511872,763555840,2.372,0.447,97.181,0,0,1262538,83266904
25172488192,73602592768,50520064,763617280,1.728,0.502,97.771,0,0,1307340,83612500
25174278144,73600696320,50528256,763711488,1.950,0.474,97.549,0.028,0,1457212,91568476
25172643840,73602236416,50528256,763801600,2.342,0.474,97.184,0,0,1381138,89054090
25172365312,73602433024,50528256,763883520,1.976,0.445,97.579,0,0,1408474,88533844
25173151744,73601552384,50528256,763973632,2.578,0.554,96.868,0,0,1418398,92638826
24412446720,74362171392,50536448,764051456,2.979,0.501,96.520,0,0,1326296,83376348
20426870784,78347870208,50544640,763920384,1.681,0.504,97.815,0,0,1197650,76627172
15692103680,83083460608,50544640,763097088,1.481,0.475,98.044,0,0,950346,60498964
11667959808,87108874240,50544640,761827328,1.282,0.474,98.244,0,0,722506,46251868
7660216320,91117690880,50544640,760750080,0.614,0.335,99.052,0,0,489062,32298048
3654070272,95125135360,50556928,759439360,0.362,0.251,99.388,0,0,239016,17855160
1349320704,97430982656,50556928,758341632,0.417,0.083,99.499,0,0,34390,3513134
1323352064,97457606656,50565120,757678080,0.056,0.028,99.917,0,0,1220,0
1323319296,97457639424,50565120,757678080,0,0,100,0,0,938,0
1323311104,97457647616,50565120,757678080,0,0,100,0,0,3728,0
1323298816,97457647616,50577408,757678080,0,0.028,99.972,0,0,2562,0
1323298816,97457647616,50577408,757678080,0,0,100,0,0,5747,0
1323298816,97457647616,50577408,757678080,0,0,100,0,0,1894,0
1323298816,97457647616,50577408,757678080,0,0,100,0,0,4370,0
1323298816,97457647616,50577408,757678080,0,0,100,0,0,1592,0
1323290624,97457655808,50577408,757678080,0,0,100,0,0,5292,0
1323274240,97457664000,50585600,757678080,0,0,100,0,0,15534,220
1323274240,97457664000,50585600,757678080,0,0,100,0,0,12740,2168
1323274240,97457664000,50585600,757678080,0,0,100,0,0,3654,476
1323274240,97457664000,50585600,757678080,0,0,100,0,0,3012,148
1323274240,97457664000,50585600,757678080,0,0,100,0,0,2532,0
1323274240,97457664000,50585600,757678080,0,0,100,0,0,2830,328
1323266048,97457664000,50593792,757678080,0,0.056,99.917,0.028,0,9676,132
1323290624,97457639424,50593792,757678080,0,0,100,0,0,6582,204
1323290624,97457639424,50593792,757678080,0,0,100,0,0,8642,0
1323290624,97457639424,50593792,757678080,0,0.028,99.972,0,0,7542,148
1323290624,97457639424,50593792,757678080,0,0,100,0,0,3672,0
1323290624,97457639424,50593792,757678080,0,0,100,0,0,986,204
1323282432,97457639424,50601984,757678080,0,0,100,0,0,2894,0
1323282432,97457639424,50601984,757678080,0,0,100,0,0,708,0
1323282432,97457639424,50601984,757678080,0,0,100,0,0,5182,102
1323282432,97457639424,50601984,757678080,0,0,100,0,0,3594,0
1323282432,97457639424,50601984,757678080,0.056,0,99.944,0,0,4448,0
1323282432,97457639424,50601984,757678080,0.028,0.028,99.944,0,0,5570,4102
1322967040,97456340992,50610176,757686272,0.889,0.417,98.694,0,0,412788,46098
1322926080,97456381952,50610176,757686272,0,0,100,0,0,8436,0
