"Dstat 0.7.3 CSV output"
"Author:","Dag Wieers <dag@wieers.com>",,,,"URL:","http://dag.wieers.com/home-made/dstat/"
"Host:","gros-6.nancy.grid5000.fr",,,,"User:","root"
"Cmdline:","dstat -m -c -n -o dstat.csv",,,,"Date:","23 May 2020 19:57:36 CEST"
"memory usage",,,,"total cpu usage",,,,,"net/total",
"used","free","buff","cach","usr","sys","idl","wai","stl","recv","send"
1528504320,96756953088,54583296,1225330688,3.083,0.350,96.537,0.030,0,0,0
1534976000,96750141440,54583296,1225678848,0.583,0.333,99.083,0,0,391348,18976
1536000000,96749109248,54583296,1225678848,0.750,0.528,98.722,0,0,395008,28896
1522282496,96763273216,54583296,1225232384,0.028,0.028,99.944,0,0,15370,1584
1521651712,96763449344,54607872,1225654272,0.583,0.500,98.916,0,0,409734,20932
1519464448,96766058496,54607872,1225232384,0,0,100,0,0,9522,132
1519456256,96766066688,54607872,1225232384,0.028,0,99.972,0,0,9930,0
1519448064,96766074880,54607872,1225232384,0,0.028,99.972,0,0,9028,0
1519448064,96766074880,54607872,1225232384,0,0,100,0,0,7424,450
1519431680,96766091264,54607872,1225232384,0,0,100,0,0,25530,2292
1537257472,96748240896,54632448,1225232384,0.473,0.250,99.277,0,0,394666,17140
1521119232,96764358656,54632448,1225252864,0.417,0.529,99.054,0,0,173444,15492
1528152064,96756867072,54632448,1225703424,0.584,0.306,99.110,0,0,392094,17384
1519587328,96765378560,54632448,1225707520,0.750,0.555,98.695,0,0,393954,30576
1518514176,96766898176,54632448,1225261056,0,0,100,0,0,1140,132
1515618304,96769765376,54661120,1225256960,0.584,0.417,98.999,0,0,387572,17440
1536385024,96748843008,54661120,1225412608,0.389,0.083,99.528,0,0,222270,9040
1518198784,96767131648,54661120,1225269248,0.861,0.056,99.084,0,0,3694,4990
1526345728,96758984704,54661120,1225269248,0.111,0.056,99.833,0,0,167382,7626
1527394304,96757743616,54661120,1225461760,0.390,0.278,99.332,0,0,353788,27068
1527361536,96757751808,54689792,1225457664,0,0.083,99.889,0.028,0,11744,10388
1527341056,96757760000,54689792,1225469952,0,0.056,99.944,0,0,10632,10192
1527341056,96757760000,54689792,1225469952,0.028,0.028,99.944,0,0,12492,10192
1527341056,96757760000,54689792,1225469952,0,0.028,99.972,0,0,13044,9898
1527341056,96757760000,54689792,1225469952,0.028,0.028,99.944,0,0,15290,13766
1527341056,96757760000,54697984,1225461760,0.028,0.056,99.917,0,0,13020,11726
1527332864,96757760000,54697984,1225469952,0,0.056,99.944,0,0,15828,10094
1527332864,96757760000,54697984,1225469952,0.028,0.028,99.944,0,0,13776,10192
1527332864,96757760000,54697984,1225469952,0,0.083,99.917,0,0,11078,9996
1520406528,96764686336,54697984,1225469952,0.056,0,99.944,0,0,4400,3216
1520488448,96764788736,54697984,1225285632,0.139,0.167,99.694,0,0,177964,14552
1520476160,96764788736,54710272,1225285632,0,0,100,0,0,7636,0
1520467968,96764796928,54710272,1225285632,0,0.056,99.944,0,0,6742,0
1520467968,96764796928,54710272,1225285632,0.028,0.028,99.944,0,0,5430,0
1520459776,96764805120,54710272,1225285632,0,0,100,0,0,2376,0
1518735360,96766517248,54722560,1225285632,0.612,0.445,98.943,0,0,390598,30560
1516679168,96768573440,54722560,1225285632,0.028,0,99.972,0,0,1378,0
1671073792,96613842944,54734848,1225596928,2.165,0.167,97.669,0,0,331942,14104
1671688192,96613228544,54734848,1225588736,0,0,100,0,0,348,0
1671688192,96613228544,54734848,1225588736,0,0,100,0,0,332,0
1671938048,96612978688,54747136,1225576448,0.028,0.028,99.944,0,0,6082,942
1671925760,96612978688,54747136,1225588736,0.028,0,99.972,0,0,6952,2100
1709842432,96575037440,54759424,1225601024,1.524,0.388,98.088,0,0,11758,1612
1768480768,96516399104,54759424,1225601024,2.998,0.111,96.891,0,0,17704,2372
1830522880,96454356992,54759424,1225601024,2.973,0.083,96.944,0,0,18650,1680
1918857216,96366022656,54759424,1225601024,4.489,0.166,95.345,0,0,2127192,31262
2131783680,96153083904,54767616,1225605120,9.460,0.139,90.401,0,0,20363940,600310
2413920256,95870939136,54775808,1225605120,9.738,0.473,89.789,0,0,46102122,1168004
2475503616,95809355776,54775808,1225605120,8.057,1.171,90.772,0,0,69156242,1844988
2492624896,95792234496,54775808,1225605120,8.398,0.665,90.937,0,0,91936030,2262404
2558132224,95726723072,54775808,1225609216,9.391,1.223,89.386,0,0,102843012,2554910
2566959104,95717896192,54775808,1225609216,8.722,0.308,90.970,0,0,99947736,2635268
2647339008,95637495808,54792192,1225613312,8.417,1.867,89.716,0,0,103394136,2887664
2686308352,95598526464,54792192,1225613312,8.366,1.028,90.606,0,0,100296950,2903422
2916704256,95368130560,54792192,1225613312,8.266,1.642,90.092,0,0,101328538,2660206
2986016768,95298818048,54792192,1225613312,8.050,0.557,91.393,0,0,97946838,2548876
2990997504,95293837312,54792192,1225613312,8.064,0.391,91.546,0,0,100506934,3442580
2994118656,95290699776,54808576,1225613312,8.662,0.389,90.922,0.028,0,102794492,3096078
2995822592,95288995840,54808576,1225613312,8.604,0.416,90.980,0,0,103571548,3197176
3031879680,95252938752,54808576,1225613312,8.092,0.698,91.211,0,0,99501310,3196424
3034591232,95250223104,54808576,1225617408,8.245,0.474,91.281,0,0,102313470,3229032
3048116224,95236698112,54808576,1225617408,8.094,0.447,91.460,0,0,101242880,3340630
3052044288,95232753664,54824960,1225617408,8.906,0.445,90.648,0,0,100638888,3352036
3054592000,95230205952,54824960,1225617408,8.117,0.446,91.437,0,0,94439546,3297076
3059286016,95225511936,54824960,1225617408,8.417,0.391,91.191,0,0,106898980,3341740
3062104064,95222693888,54824960,1225617408,8.772,0.501,90.727,0,0,101199324,3397968
3065790464,95219003392,54824960,1225621504,8.088,0.448,91.464,0,0,102348692,3521430
3067678720,95217098752,54841344,1225621504,8.178,0.586,91.236,0,0,98510476,3423780
3070349312,95214428160,54841344,1225621504,8.480,0.474,91.046,0,0,100386718,3550521
3074408448,95210369024,54841344,1225621504,8.756,0.446,90.798,0,0,102493944,3634104
3074424832,95210352640,54841344,1225621504,9.574,0.362,90.064,0,0,101016724,3514722
3281747968,95003029504,54841344,1225621504,9.068,0.756,90.176,0,0,100953360,3638310
3563720704,94721036288,54857728,1225625600,8.079,0.755,91.166,0,0,100831744,3762158
3736670208,94548086784,54857728,1225625600,8.440,1.560,90,0,0,101677004,3824762
3743948800,94540808192,54857728,1225625600,8.606,0.555,90.838,0,0,100978742,3749491
3759595520,94525161472,54857728,1225625600,8.428,0.556,91.015,0,0,98662360,3730328
4328194048,93956562944,54857728,1225625600,8.909,1.415,89.675,0,0,103147538,3840530
4334546944,93950177280,54865920,1225633792,8.927,0.612,90.462,0,0,100620226,3907420
4342894592,93941821440,54874112,1225633792,8.028,0.392,91.580,0,0,99024118,3827434
4343955456,93940760576,54874112,1225633792,8.054,0.280,91.667,0,0,104584616,3874948
4345114624,93939601408,54874112,1225633792,8.194,0.336,91.471,0,0,99123164,3975980
4370722816,93913993216,54874112,1225633792,8.371,0.949,90.681,0,0,103345504,3864976
4372815872,93911887872,54882304,1225637888,8.366,0.389,91.245,0,0,99407840,3552242
4375400448,93909295104,54890496,1225637888,8.641,0.556,90.803,0,0,103442902,4182378
4378640384,93906055168,54890496,1225637888,8.489,0.445,91.066,0,0,99493910,3706484
4377513984,93907181568,54890496,1225637888,8.389,0.389,91.222,0,0,101054012,3526582
4381085696,93903609856,54890496,1225637888,8.869,0.250,90.881,0,0,99483874,3994324
4381892608,93902790656,54898688,1225641984,8.674,0.389,90.937,0,0,101555726,3972685
4383834112,93900840960,54906880,1225641984,8.909,0.527,90.563,0,0,102599542,3995817
4385419264,93899182080,54906880,1225641984,8.965,0.555,90.480,0,0,100203754,3837930
4386299904,93898260480,54906880,1225641984,8.872,0.444,90.685,0,0,101424712,3892448
4386603008,93897957376,54906880,1225641984,8.665,0.446,90.889,0,0,99965188,3866452
4388536320,93896011776,54915072,1225646080,8.929,0.446,90.625,0,0,99289406,3974860
4390277120,93894262784,54923264,1225646080,8.550,0.447,91.003,0,0,102465922,3854216
4402720768,93881802752,54939648,1225646080,10.389,0.472,89.111,0.028,0,103446292,4030915
4404830208,93879693312,54939648,1225646080,9.222,0.472,90.306,0,0,99136148,3800754
4408274944,93876162560,54947840,1225650176,8.929,0.445,90.626,0,0,98315852,3853122
4403597312,93880840192,54947840,1225650176,9.250,0.446,90.304,0,0,105188568,4009500
4543344640,93741084672,54956032,1225650176,9.449,1.275,89.277,0,0,102203064,3889368
4747153408,93537271808,54956032,1225654272,8.620,1.552,89.828,0,0,97073888,3828566
4750401536,93534023680,54956032,1225654272,8.755,0.778,90.467,0,0,104410236,3980300
4758695936,93525716992,54964224,1225658368,9.668,0.637,89.695,0,0,99085904,3905593
4820860928,93463552000,54964224,1225658368,9.025,1.257,89.718,0,0,102698386,3853786
5202300928,93082103808,54972416,1225658368,8.957,1.502,89.541,0,0,100786458,3785263
5350146048,92934258688,54972416,1225658368,8.357,1.727,89.916,0,0,102132696,3960578
5643935744,92640464896,54972416,1225662464,8.512,1.057,90.431,0,0,99771778,3812244
6102036480,92182355968,54980608,1225662464,8.560,1.884,89.557,0,0,102728886,3575686
6260174848,92024217600,54980608,1225654272,9.387,1.950,88.663,0,0,100682198,4068630
6288592896,91995791360,54988800,1225654272,9.217,0.724,90.058,0,0,101672062,3816007
6291591168,91992793088,54988800,1225654272,8.086,0.445,91.470,0,0,98180054,3726930
6322913280,91961470976,54988800,1225654272,8.801,0.888,90.311,0,0,103535386,3633398
6333665280,91950706688,54996992,1225658368,8.338,0.445,91.217,0,0,101158934,4295403
6322413568,91961954304,54996992,1225662464,8.630,0.362,91.008,0,0,100721210,3680648
6328225792,91956133888,55005184,1225662464,7.984,0.335,91.681,0,0,101020640,3981420
6387339264,91897020416,55005184,1225662464,8.280,1.584,90.136,0,0,100139310,3904890
6387462144,91896893440,55005184,1225666560,8.245,0.279,91.476,0,0,101417240,3923474
6409031680,91875315712,55013376,1225666560,8.143,0.613,91.244,0,0,102063528,3918556
6467289088,91817058304,55013376,1225666560,8.551,1.471,89.978,0,0,100501816,4050025
6524297216,91760050176,55013376,1225666560,8.380,1.086,90.535,0,0,99913084,3973618
6553550848,91730788352,55021568,1225666560,9.194,1.056,89.750,0,0,101853388,3626785
6553219072,91731116032,55021568,1225670656,8.296,0.306,91.398,0,0,102231095,4270850
6554185728,91730141184,55029760,1225670656,8.624,0.335,91.041,0,0,100613539,3984965
6554083328,91730243584,55029760,1225670656,8.727,0.528,90.745,0,0,100428890,3983008
6556446720,91727880192,55029760,1225670656,8.110,0.390,91.499,0,0,98197434,3953620
6556794880,91727523840,55037952,1225670656,8.445,0.362,91.193,0,0,102594636,3970808
6558224384,91726090240,55037952,1225674752,8.717,0.639,90.644,0,0,100794166,3934426
6557396992,91726909440,55046144,1225674752,8.602,0.445,90.952,0,0,103831702,3977423
6564671488,91719634944,55046144,1225674752,9.124,0.691,90.185,0,0,101154516,3876267
6568120320,91716186112,55046144,1225674752,8.828,0.389,90.783,0,0,98628228,3576844
6567985152,91716235264,55054336,1225678848,9.289,0.415,90.268,0.028,0,102102324,4220553
6585171968,91699048448,55054336,1225678848,11.544,0.497,87.959,0,0,101863252,3980754
6584061952,91700150272,55062528,1225678848,8.889,0.444,90.667,0,0,98717026,3825290
6585970688,91698241536,55062528,1225678848,9.778,0.443,89.778,0,0,102928746,3980084
6586245120,91697934336,55062528,1225678848,8.303,0.363,91.334,0,0,99556578,3869166
6588932096,91695235072,55070720,1225682944,9.161,0.415,90.423,0,0,101055557,3669887
6588420096,91695747072,55070720,1225682944,9.288,0.389,90.323,0,0,102667169,3998922
6589607936,91694551040,55078912,1225682944,8.824,0.638,90.538,0,0,99321538,4095307
6589755392,91694403584,55078912,1225682944,9.093,0.418,90.488,0,0,100827896,3978312
6593167360,91690958848,55078912,1225682944,9.315,0.277,90.408,0,0,101737742,3590181
6593466368,91690651648,55087104,1225682944,8.893,0.502,90.605,0,0,100558156,3753436
6625406976,91658706944,55087104,1225687040,8.560,0.945,90.495,0,0,99482314,4305358
6681120768,91602980864,55095296,1225687040,9.240,1.113,89.647,0,0,103778220,4042374
6734168064,91549933568,55095296,1225687040,9.048,1.138,89.814,0,0,100968424,3911436
6788308992,91495788544,55095296,1225691136,9.446,1.302,89.252,0,0,100735282,3438372
6851276800,91432812544,55103488,1225691136,8.486,1.280,90.234,0,0,100308762,4070362
6885572608,91398516736,55103488,1225691136,8.552,0.587,90.861,0,0,99747150,4132194
6947377152,91336704000,55111680,1225691136,9.656,0.860,89.484,0,0,104063060,4018614
6981238784,91302842368,55111680,1225691136,8.600,0.891,90.509,0,0,101359944,3946106
7040835584,91243237376,55111680,1225699328,9.053,1.583,89.364,0,0,101721476,3926032
7081222144,91202842624,55119872,1225699328,8.343,1.088,90.569,0,0,97144586,3895300
7134834688,91149230080,55119872,1225699328,8.699,1.334,89.967,0,0,104608546,4023630
7195463680,91088592896,55128064,1225699328,9.278,1.083,89.639,0,0,99125838,3917236
7237709824,91046346752,55128064,1225699328,9.096,0.974,89.930,0,0,102260186,3981298
7301804032,90982248448,55128064,1225703424,9.134,1.083,89.783,0,0,101359436,3641596
7348523008,90935521280,55136256,1225703424,8.845,0.586,90.569,0,0,97587392,4100192
7411466240,90872578048,55136256,1225703424,9.672,1.112,89.216,0,0,101369646,3968430
7455334400,90828701696,55144448,1225703424,8.178,1.200,90.622,0,0,101375812,3915093
7501369344,90782658560,55144448,1225711616,8.603,0.894,90.503,0,0,102574622,3878244
7549034496,90734993408,55144448,1225711616,8.657,0.977,90.366,0,0,100708674,3802092
7619252224,90664775680,55144448,1225711616,9.101,1.276,89.623,0,0,101042578,3755982
7661760512,90622259200,55152640,1225711616,9.018,1.113,89.869,0,0,103148946,3582210
7710265344,90573746176,55160832,1225711616,8.529,0.727,90.744,0,0,99596608,3878352
7766728704,90517278720,55160832,1225715712,8.972,1.167,89.861,0,0,100502238,3867118
7815409664,90468597760,55160832,1225715712,8.980,1.053,89.967,0,0,100170812,3663356
7857463296,90426544128,55160832,1225715712,9.010,0.418,90.572,0,0,101895748,4128924
7927058432,90356940800,55169024,1225715712,9.403,1.032,89.565,0,0,100899450,3899699
7977799680,90306191360,55177216,1225715712,8.685,0.698,90.617,0,0,99721714,3884056
8022020096,90261966848,55177216,1225719808,8.322,0.700,90.978,0,0,101656852,3951198
8077385728,90206601216,55177216,1225719808,8.713,0.894,90.394,0,0,103076932,3894194
8148889600,90135097344,55177216,1225719808,8.668,1.338,89.994,0,0,100677928,3751898
8195416064,90088562688,55185408,1225719808,8.734,1.085,90.153,0.028,0,101410270,3890624
8247943168,90036023296,55193600,1225719808,8.681,1.141,90.178,0,0,100368220,3808635
8295780352,89988182016,55193600,1225723904,8.707,1.168,90.125,0,0,100799814,3906905
8346796032,89937166336,55193600,1225723904,9.530,1.160,89.309,0,0,102486180,3830353
8396005376,89887956992,55193600,1225723904,8.870,0.893,90.237,0,0,101607100,3792536
8472113152,89811841024,55201792,1225723904,9.670,1.081,89.249,0,0,99037626,3729658
8522993664,89760952320,55209984,1225723904,9.256,0.948,89.796,0,0,102293922,3412502
8572039168,89711902720,55209984,1225728000,8.822,0.698,90.480,0,0,100396146,4265140
8627769344,89656172544,55209984,1225728000,8.809,1.385,89.806,0,0,98527650,3688528
8679804928,89604136960,55209984,1225728000,9.273,0.944,89.783,0,0,102126078,4039924
8727973888,89555959808,55218176,1225728000,8.790,1.113,90.097,0,0,102371258,3888790
8785219584,89498701824,55226368,1225732096,8.829,0.615,90.556,0,0,100892284,3714308
8838377472,89445543936,55226368,1225732096,8.828,1.333,89.839,0,0,101796522,3737796
8842997760,89440923648,55226368,1225732096,9.290,0.416,90.294,0,0,101506602,4338530
8883740672,89400180736,55226368,1225732096,8.602,1.197,90.200,0,0,100795840,3788768
8938737664,89345175552,55234560,1225732096,8.714,0.919,90.367,0,0,97915612,3771126
8990904320,89292996608,55242752,1225736192,9.126,0.447,90.427,0,0,104924482,3795356
9047789568,89236111360,55242752,1225736192,9.119,1.136,89.745,0,0,101290372,3849310
9107169280,89176690688,55242752,1225736192,8.319,1.085,90.595,0,0,97710834,3754556
9191493632,89092366336,55242752,1225736192,8.691,0.919,90.390,0,0,103911238,3903398
9190838272,89093013504,55250944,1225736192,9.467,0.583,89.950,0,0,101077758,3895618
9253212160,89030627328,55259136,1225740288,9.278,0.889,89.833,0,0,99006824,3903720
9305632768,88978206720,55259136,1225740288,8.962,1.002,90.036,0,0,102523144,3920356
9362608128,88921231360,55259136,1225740288,9.008,1.084,89.908,0,0,98310312,3784130
9421062144,88862777344,55259136,1225740288,8.824,0.922,90.254,0,0,104104498,4013934
9456074752,88827756544,55267328,1225740288,9.015,1.082,89.903,0,0,100756894,3883814
9484042240,88799776768,55275520,1225744384,8.681,1.002,90.317,0,0,101405882,3884585
9538183168,88745631744,55275520,1225748480,9.063,1.001,89.936,0,0,100384206,3860366
9596317696,88687497216,55275520,1225748480,8.898,1.088,90.014,0,0,101414542,3922350
9655058432,88628756480,55275520,1225748480,8.820,1.169,90.011,0,0,101262524,3893068
9709412352,88574394368,55287808,1225744384,8.343,1.144,90.513,0,0,97640340,3366538
9743384576,88540413952,55296000,1225744384,8.285,0.586,91.130,0,0,102764808,4134326
9796075520,88487714816,55296000,1225752576,9.136,0.836,90.028,0,0,101104262,3784518
9856258048,88427532288,55296000,1225752576,9.030,1.167,89.803,0,0,102644476,3802586
9922494464,88361295872,55296000,1225752576,8.860,1.198,89.941,0,0,100136972,3826018
9955508224,88328282112,55296000,1225752576,8.929,0.834,90.236,0,0,98717696,4178094
10018168832,88265601024,55312384,1225756672,8.668,0.673,90.659,0,0,104043558,3787886
10082758656,88201011200,55312384,1225756672,8.602,1.392,90.006,0,0,99762708,3885404
10094899200,88188870656,55312384,1225756672,8.380,0.390,91.231,0,0,102278308,3742724
10156281856,88127488000,55312384,1225756672,9.275,1.194,89.531,0,0,101914884,3948911
10220548096,88063217664,55312384,1225760768,8.962,1.058,89.981,0,0,99066310,3932866
10260156416,88023592960,55328768,1225760768,8.898,0.642,90.432,0.028,0,103105137,3947292
10316365824,87967383552,55328768,1225760768,9.010,1.196,89.794,0,0,102078511,3905300
10378219520,87905529856,55328768,1225760768,9.156,1.332,89.512,0,0,99647164,3941020
10406723584,87877025792,55328768,1225760768,8.106,0.641,91.253,0,0,99640402,3793596
10471862272,87811883008,55328768,1225764864,8.844,0.812,90.344,0,0,103871934,3899652
10537357312,87746371584,55345152,1225764864,9.474,1.136,89.391,0,0,100877402,4095004
10572533760,87711195136,55345152,1225764864,8.828,0.891,90.281,0,0,100351388,3881646
10641534976,87642193920,55345152,1225764864,9.164,1.114,89.721,0,0,101805936,3965528
10670383104,87613345792,55345152,1225764864,8.040,0.726,91.234,0,0,98312584,3846250
10731761664,87551963136,55345152,1225768960,9.274,1.117,89.609,0,0,101553298,3971586
10765205504,87518502912,55361536,1225768960,9.434,0.805,89.761,0,0,104554092,3915662
10838908928,87444799488,55361536,1225768960,9.728,1.306,88.966,0,0,99331226,3978024
10872684544,87411023872,55361536,1225768960,8.727,0.806,90.467,0,0,102795698,3858984
10940710912,87342993408,55361536,1225773056,9.210,1.002,89.789,0,0,100356982,3797746
11007311872,87276392448,55361536,1225773056,9.499,1.163,89.338,0,0,101716000,4000213
11043627008,87240069120,55377920,1225764864,9.271,0.947,89.783,0,0,98849484,3823904
11128631296,87154909184,55377920,1225904128,10.793,1.037,88.169,0,0,103783932,3419260
11174334464,87109206016,55377920,1225904128,11.904,0.864,87.232,0,0,99775852,4148338
11246395392,87037140992,55377920,1225908224,11.365,1.142,87.493,0,0,100376090,4001846
11285377024,86998159360,55377920,1225908224,8.743,0.866,90.391,0,0,100616058,3873010
11299086336,86984433664,55394304,1225908224,7.746,0.615,91.639,0,0,100384604,3660106
11352727552,86930792448,55394304,1225908224,9.063,1.199,89.738,0,0,101893342,3862528
11388964864,86894551040,55394304,1225912320,8.811,0.699,90.490,0,0,100201268,3789247
11460980736,86822535168,55394304,1225912320,9.172,1.087,89.741,0,0,103481934,3923981
11495079936,86788435968,55394304,1225912320,7.962,0.919,91.119,0,0,100246346,3859623
11563192320,86720315392,55402496,1225912320,8.792,1.256,89.953,0,0,101836860,3602724
11604692992,86678806528,55410688,1225912320,8.600,1.225,90.175,0,0,99522511,4220036
11676024832,86607470592,55410688,1225916416,8.646,1.091,90.263,0,0,100451245,3709330
11715207168,86568288256,55410688,1225916416,8.747,0.724,90.529,0,0,102547186,3190232
11751677952,86531817472,55410688,1225916416,8.759,0.753,90.488,0,0,95602790,4598256
11829039104,86454456320,55418880,1225908224,9.427,1.251,89.321,0,0,105283342,3565454
11852136448,86431338496,55427072,1225916416,8.470,0.334,91.195,0,0,102817538,4154546
11924455424,86359015424,55427072,1225920512,8.883,1.476,89.641,0,0,100546498,3919671
11967504384,86315966464,55427072,1225920512,8.835,1.031,90.134,0,0,100165856,3730778
11999272960,86284193792,55427072,1225924608,7.602,0.701,91.697,0,0,102169462,3873106
12074516480,86208950272,55427072,1225924608,8.992,1.448,89.560,0,0,100019890,3932344
12121673728,86161776640,55443456,1225924608,9.124,0.781,90.095,0,0,100765182,3931018
12150857728,86132588544,55443456,1225928704,8.226,0.613,91.160,0,0,100220246,3980392
12225789952,86057656320,55443456,1225928704,9.550,1.083,89.367,0,0,102771278,3966614
12268535808,86014910464,55443456,1225928704,9.177,0.642,90.181,0,0,100479626,3946594
12302942208,85980504064,55443456,1225928704,8.255,0.723,91.023,0,0,102460974,3573446
12385939456,85897486336,55459840,1225932800,9.144,1.334,89.494,0.028,0,98335776,3990664
12428935168,85854490624,55459840,1225932800,9.333,1.025,89.643,0,0,101852908,4133754
12462161920,85821263872,55459840,1225932800,8.359,0.694,90.947,0,0,100893722,4021434
12535193600,85748232192,55459840,1225932800,9.584,1.330,89.086,0,0,102601802,4010580
12580782080,85702643712,55459840,1225932800,9.159,1.166,89.675,0,0,101452292,3883466
12619444224,85663961088,55476224,1225936896,8.234,0.751,91.015,0,0,99278450,3821658
12667150336,85616254976,55476224,1225936896,9.262,1.082,89.656,0,0,101990570,3978394
12746686464,85536718848,55476224,1225936896,9.634,1.110,89.256,0,0,100360968,4110876
12784427008,85498978304,55476224,1225936896,7.891,1.111,90.997,0,0,100554742,3732554
12829683712,85453721600,55476224,1225936896,9.238,0.807,89.955,0,0,103788940,4041516
12909998080,85373382656,55492608,1225945088,8.524,1.146,90.330,0,0,99858702,3822038
12952137728,85331202048,55492608,1225945088,9.091,0.834,90.075,0,0,99854379,3896281
12998758400,85284581376,55492608,1225945088,9.437,0.971,89.592,0,0,101921966,4117668
13022711808,85260627968,55492608,1225945088,7.836,0.917,91.248,0,0,92755412,3352096
13062189056,85221142528,55492608,1225953280,7.954,0.921,91.125,0,0,65858304,3690974
13102374912,85180940288,55508992,1225953280,7.212,0.749,92.039,0,0,45909408,2956194
13101490176,85181825024,55508992,1225953280,6.299,0.111,93.590,0,0,18390312,2400490
13101522944,85181792256,55508992,1225953280,6.072,0.055,93.873,0,0,871822,2050716
13101944832,85181370368,55508992,1225953280,6.009,0.055,93.935,0,0,33930,2198758
13101776896,85181534208,55508992,1225957376,5.881,0.028,94.092,0,0,34418,1851570
13103308800,85179981824,55525376,1225957376,5.881,0.055,94.064,0,0,35588,2084046
13104758784,85178531840,55525376,1225957376,5.988,0.028,93.984,0,0,330170,2288598
13106954240,85176336384,55525376,1225957376,6.110,0.111,93.779,0,0,29616,2230134
13108666368,85174624256,55525376,1225957376,5.824,0.111,94.065,0,0,25990,1808246
13110984704,85172301824,55525376,1225961472,5.802,0.028,94.170,0,0,36452,2438530
13115064320,85168205824,55541760,1225961472,6.004,0.138,93.857,0,0,30068,1969690
13115838464,85167431680,55541760,1225961472,5.907,0.028,94.065,0,0,30620,2172740
13120143360,85163126784,55541760,1225961472,5.978,0.111,93.911,0,0,29126,2110747
13123395584,85159870464,55541760,1225965568,5.935,0.028,94.038,0,0,28332,2214546
13126983680,85156282368,55541760,1225965568,6.217,0.083,93.700,0,0,29446,2053570
13131857920,85151383552,55558144,1225965568,5.886,0.028,94.087,0,0,42844,2135272
13136474112,85146767360,55558144,1225965568,6.087,0.055,93.857,0,0,47366,2131548
13141086208,85142155264,55558144,1225965568,6.037,0.055,93.908,0,0,41560,2122818
13147955200,85135282176,55558144,1225969664,5.983,0.055,93.961,0,0,31712,1898762
13153308672,85129928704,55558144,1225969664,5.931,0.055,94.013,0,0,36906,1966726
13160267776,85122961408,55566336,1225969664,6.035,0.055,93.909,0,0,34064,2003294
13179359232,85103861760,55574528,1225969664,7.214,0.083,92.703,0,0,31806,1787413
13180489728,85102731264,55574528,1225969664,6.011,0.055,93.934,0,0,105636,1961462
13180710912,85102505984,55574528,1225973760,6.115,0.028,93.857,0,0,45694,1959690
13182910464,85100306432,55574528,1225973760,6.117,0,93.883,0,0,62492,1771837
13184217088,85098991616,55582720,1225973760,5.987,0,94.013,0,0,43334,2092882
13201367040,85079199744,55590912,1226240000,7.161,0.387,92.425,0.028,0,497684,2079748
13203267584,85077557248,55590912,1225981952,6.426,0,93.574,0,0,29186,1944882
