172.16.72.14 : 10.26 10.26 10.28 10.28 10.31 10.27 10.29 10.29 10.27 10.29
172.16.72.23 : 10.29 10.26 10.31 10.29 10.30 10.31 10.31 10.29 10.29 10.33
172.16.72.25 : 0.21 0.18 0.20 0.14 0.21 0.19 0.18 0.16 0.19 0.16
172.16.72.26 : 0.18 0.18 0.16 0.17 0.19 0.19 0.13 0.13 0.16 0.13
172.16.72.27 : 0.21 0.19 0.22 0.19 0.19 0.17 0.18 0.19 0.20 0.16
172.16.72.28 : 0.20 0.20 0.18 0.21 0.19 0.20 0.20 0.21 0.22 0.18
172.16.72.29 : 0.16 0.19 0.20 0.21 0.20 0.21 0.20 0.20 0.20 0.18
172.16.72.3  : 0.17 0.19 0.21 0.18 0.20 0.21 0.20 0.18 0.20 0.20
172.16.72.30 : 0.20 0.17 0.21 0.20 0.15 0.20 0.18 0.19 0.19 0.18
172.16.72.31 : 0.18 0.22 0.17 0.20 0.21 0.20 0.20 0.17 0.19 0.19
172.16.72.32 : 0.20 0.20 0.17 0.19 0.19 0.20 0.17 0.22 0.19 0.21
172.16.72.33 : 0.20 0.20 0.20 0.20 0.21 0.22 0.17 0.17 0.18 0.19
172.16.72.34 : 0.19 0.17 0.20 0.20 0.17 0.19 0.21 0.19 0.16 0.21
172.16.72.35 : 0.03 0.03 0.03 0.03 0.04 0.03 0.03 0.03 0.03 0.01
172.16.72.36 : 0.18 0.19 0.21 0.20 0.18 0.20 0.20 0.20 0.21 0.18
172.16.72.37 : 0.19 0.21 0.20 0.19 0.21 0.21 0.18 0.22 0.19 0.19
172.16.72.38 : 0.18 0.20 0.21 0.17 0.19 0.11 0.17 0.20 0.17 0.20
172.16.72.39 : 0.19 0.21 0.15 0.18 0.20 0.19 0.20 0.19 0.18 0.21
172.16.72.4  : 200.30 200.29 200.29 200.32 200.31 200.32 - 200.30 200.29 200.29
172.16.72.40 : 200.28 200.30 - 200.29 200.32 200.31 200.32 200.29 200.28 200.30
172.16.72.41 : 200.30 200.31 200.33 200.32 200.31 200.29 200.27 200.29 200.26 200.27
172.16.72.42 : 200.29 200.28 200.25 200.26 200.28 200.25 200.27 200.27 200.26 200.28
172.16.72.43 : - 200.32 200.34 200.32 200.31 200.33 200.30 200.32 200.32 200.33
172.16.72.44 : 200.24 200.30 200.32 200.25 200.25 - - 200.28 200.24 200.28
172.16.72.46 : 200.27 - 200.32 200.25 200.26 200.29 200.26 200.26 200.33 200.27
172.16.72.47 : - 200.32 200.31 200.26 200.32 200.30 200.27 200.23 200.31 200.28
172.16.72.48 : 200.34 - - 200.28 200.32 200.25 200.28 200.30 200.31 -
172.16.72.49 : 200.24 200.32 200.31 200.32 200.32 200.30 200.30 200.31 200.30 200.31
172.16.72.5  : 200.22 200.29 - 200.29 200.31 200.30 200.32 200.32 200.29 200.30
172.16.72.50 : 200.31 200.30 200.30 200.31 200.31 200.32 200.31 200.32 200.33 200.30
172.16.72.51 : 200.29 200.32 200.32 200.30 200.32 200.31 200.31 200.30 200.31 200.31
172.16.72.6  : 200.30 200.31 200.32 200.32 200.36 - 200.31 200.32 200.29 -
172.16.72.7  : - 200.29 200.25 - 200.25 - 200.30 200.30 200.28 200.28
172.16.72.8  : 200.27 200.32 200.29 200.34 200.27 - 200.25 200.30 200.28 200.32
172.16.72.9  : 4.25 4.28 4.31 4.30 4.29 4.26 4.27 4.32 4.24 4.28

      35 targets
      35 alive
       0 unreachable
       0 unknown addresses

      11 timeouts (waiting for response)
     350 ICMP Echos sent
     333 ICMP Echo Replies received
       0 other ICMP received

 0.01 ms (min round trip time)
 86.8 ms (avg round trip time)
 200 ms (max round trip time)
       10.346 sec (elapsed real time)

