"Dstat 0.7.3 CSV output"
"Author:","Dag Wieers <dag@wieers.com>",,,,"URL:","http://dag.wieers.com/home-made/dstat/"
"Host:","econome-6.nantes.grid5000.fr",,,,"User:","root"
"Cmdline:","dstat -m -c -n -o dstat.csv",,,,"Date:","26 May 2020 22:32:42 CEST"
"memory usage",,,,"total cpu usage",,,,,"net/total",
"used","free","buff","cach","usr","sys","idl","wai","stl","recv","send"
838987776,65435303936,67133440,952360960,3.628,0.842,95.342,0.188,0,0,0
835833856,65438294016,67133440,952516608,1.124,0.687,98.189,0,0,397292,30058
834351104,65440034816,67133440,952258560,0,0,100,0,0,5126,0
836169728,65438019584,67133440,952451072,1.062,0.718,98.220,0,0,392246,21554
836100096,65438265344,67145728,952262656,0.031,0.031,99.000,0.938,0,15856,4572
836571136,65437777920,67158016,952262656,1.125,0.531,98.249,0.094,0,396362,14766
836079616,65438269440,67158016,952262656,0,0,100,0,0,13240,132
836071424,65438277632,67158016,952262656,0,0.031,99.969,0,0,7792,616
835198976,65439150080,67158016,952262656,0,0,100,0,0,7570,84
835198976,65439150080,67170304,952250368,0,0,100,0,0,3404,0
845537280,65428799488,67182592,952250368,0.250,0.062,99.625,0.062,0,387040,14880
835489792,65438826496,67182592,952262656,0.938,0.562,98.500,0,0,6594,6466
838750208,65435377664,67182592,952451072,0.250,0.156,99.594,0,0,171100,10992
837156864,65436680192,67182592,952721408,1.250,0.594,98.157,0,0,390344,29062
836673536,65437609984,67182592,952274944,0,0,100,0,0,5754,352
845320192,65428492288,67194880,952729600,0.656,0.188,99.156,0,0,384178,11038
835104768,65438883840,67207168,952541184,0.375,0.469,99.093,0.063,0,7144,5944
837050368,65437192192,67207168,952283136,1.032,0.656,98.312,0,0,387604,16834
836452352,65437790208,67207168,952283136,0.031,0,99.969,0,0,1482,0
836452352,65437790208,67207168,952283136,0,0,100,0,0,610,0
838385664,65435836416,67219456,952283136,1.966,0.250,97.722,0.062,0,222758,11012
838406144,65435574272,67231744,952508416,0.531,0.125,99.281,0.063,0,344578,16640
845815808,65428205568,67231744,952467456,0.219,0.094,99.687,0,0,171930,13162
845787136,65428230144,67231744,952471552,0.031,0.031,99.938,0,0,6572,3724
845262848,65428754432,67231744,952471552,0,0.031,99.969,0,0,7642,4100
844668928,65429348352,67231744,952471552,0,0.031,99.969,0,0,11526,4582
844656640,65429348352,67244032,952471552,0.031,0.031,99.938,0,0,6386,4052
844120064,65429872640,67256320,952471552,0.031,0.031,99.844,0.094,0,7740,5732
844050432,65429942272,67256320,952471552,0,0,100,0,0,3458,3724
844050432,65429942272,67256320,952471552,0,0.062,99.938,0,0,6452,4100
844050432,65429942272,67256320,952471552,0.031,0.031,99.906,0.031,0,3854,3920
836501504,65437601792,67256320,952360960,0.031,0.031,99.938,0,0,13400,5960
836648960,65437425664,67268608,952373248,0.281,0.187,99.500,0.031,0,178578,13488
836378624,65437777920,67268608,952291328,0,0,100,0,0,6006,1948
836112384,65438044160,67268608,952291328,0,0,100,0,0,10542,1040
836112384,65438044160,67268608,952291328,0,0,99.969,0.031,0,10508,0
836112384,65438044160,67268608,952291328,0,0.031,99.969,0,0,11078,0
836100096,65438044160,67293184,952279040,0.031,0,99.875,0.094,0,11474,0
835874816,65438257152,67293184,952291328,0,0.031,99.969,0,0,5840,0
835616768,65438515200,67293184,952291328,0,0,100,0,0,2242,0
835608576,65438523392,67293184,952291328,0,0.031,99.969,0,0,1006,0
835608576,65438523392,67293184,952291328,0,0,100,0,0,388,0
847364096,65426767872,67293184,952291328,0.719,0.219,99.062,0,0,387052,14842
845959168,65427714048,67301376,952737792,0.188,0.250,99.562,0,0,2428,1768
1433665536,64840069120,67301376,952492032,6.873,2.562,90.565,0,0,1329834,64188
4025159680,62247514112,67305472,953577472,31.465,12.523,56.011,0,0,1328338,53012
6942068736,59329032192,67338240,955011072,38.712,14.335,46.763,0.189,0,1323208,54606
9768415232,56501325824,67354624,956301312,38.029,15.014,46.926,0.031,0,1321942,54550
12758126592,53510221824,67354624,957628416,40.965,13.592,45.412,0.031,0,1321898,54509
15608156160,50658779136,67371008,958951424,37.176,13.839,48.891,0.094,0,1322264,54375
18456686592,47808897024,67375104,960077824,39.410,13.681,46.878,0.031,0,1323540,141471
21267832832,44996091904,67379200,961593344,41.411,13.135,45.016,0.439,0,1331218,550547
24106680320,42155597824,67395584,963080192,43.285,14.092,42.465,0.158,0,1180208,991477
26863370240,39397629952,67399680,964300800,43.785,14.721,41.431,0.063,0,1188248,1444827
29754093568,36506157056,67407872,964997120,42.130,14.546,43.230,0.094,0,371824,1701546
30436831232,35823366144,67407872,965046272,21.160,3.762,75.016,0.063,0,53436,2135809
30665236480,35594633216,67489792,965279744,16.107,1.570,75.133,7.190,0,59450,2629849
30851477504,35408334848,67489792,965332992,16.641,1.342,82.017,0,0,72740,3103218
31024656384,35235065856,67502080,965402624,15.751,1.326,82.828,0.095,0,76388,3253723
31185960960,35073667072,67510272,965488640,17.516,1.595,80.794,0.094,0,80500,3642282
31330013184,34929532928,67510272,965562368,18.688,1.969,79.281,0.062,0,90844,4027222
31452712960,34806591488,67510272,965795840,16.838,1.999,81.131,0.031,0,96590,4233642
31559819264,34699415552,67510272,965861376,17.495,1.812,80.662,0.031,0,90686,3882612
31672676352,34586423296,67510272,965996544,18.806,2.784,78.317,0.093,0,91492,3893958
31768363008,34490638336,67518464,966086656,15.832,1.377,82.697,0.094,0,86050,3482926
31762579456,34496307200,67518464,966197248,13.236,1.931,84.771,0.062,0,88922,3411748
31741304832,34517491712,67518464,966287360,8.001,1.286,90.681,0.031,0,79804,3415294
31684673536,34574012416,67518464,966385664,5.821,1.353,92.794,0.031,0,76308,3371670
31650013184,34608582656,67518464,966475776,6.938,1.545,91.485,0.032,0,77744,3312894
31629000704,34629484544,67526656,966574080,7.743,1.467,90.665,0.125,0,80992,3235516
31631732736,34626666496,67526656,966660096,5.419,0.788,93.762,0.032,0,77888,3326388
31640920064,34617389056,67526656,966750208,6.511,1.038,92.450,0,0,94440,3685754
31644585984,34613604352,67526656,966868992,5.446,1.127,92.707,0.720,0,99756,3955408
31649284096,34608832512,67526656,966942720,6.593,1.005,92.402,0,0,94708,3687836
31650279424,34607706112,67534848,967053312,5.829,0.752,93.325,0.094,0,92638,3599342
31656398848,34601504768,67534848,967135232,4.481,0.757,94.762,0,0,92146,3562824
31656697856,34601095168,67534848,967241728,6.156,0.875,92.969,0,0,97340,3740246
31656898560,34600640512,67584000,967442432,5.399,0.628,92.153,1.820,0,102734,3811282
31665520640,34591932416,67584000,967528448,6.146,0.819,93.035,0,0,100430,3942300
31667978240,34589351936,67592192,967639040,6.277,1.437,92.192,0.094,0,95786,3890610
31672987648,34584252416,67592192,967729152,5.564,0.688,93.748,0,0,90298,3694204
31678042112,34579091456,67592192,967831552,5.304,1.099,93.566,0.031,0,79086,3386234
31682609152,34574422016,67600384,967925760,5.319,1.070,93.421,0.189,0,78680,3581034
31687053312,34569752576,67600384,968146944,7.255,1.251,91.432,0.063,0,81014,3578620
31687921664,34568757248,67608576,968257536,4.222,0.725,94.959,0.095,0,97652,3907394
31689396224,34567180288,67608576,968355840,5.227,1.064,93.709,0,0,92896,3962162
31691866112,34564620288,67608576,968445952,4.861,1.326,93.813,0,0,89742,3648276
31692156928,34564218880,67608576,968556544,5.150,0.821,94.028,0,0,81926,3606120
31694544896,34561732608,67608576,968650752,5.446,0.814,93.740,0,0,81914,3555274
31694438400,34561732608,67616768,968749056,4.845,1.000,94.123,0.031,0,84332,3567166
31696781312,34559303680,67616768,968830976,3.399,1.017,95.584,0,0,87632,3692966
31697444864,34558529536,67616768,968937472,4.281,1.322,94.397,0,0,95578,3753990
31698448384,34557431808,67616768,969031680,5.958,1.537,92.474,0.031,0,85734,3362220
31700185088,34555600896,67616768,969121792,3.957,0.974,94.567,0.503,0,85402,3538592
31700439040,34555236352,67624960,969220096,4.599,1.064,94.274,0.063,0,89164,3590314
31701524480,34554052608,67624960,969318400,4.107,0.690,95.172,0.031,0,88658,3613594
31702540288,34552913920,67624960,969433088,5.155,1.328,93.517,0,0,92176,3455320
31705239552,34550120448,67624960,969527296,5.774,1.124,93.102,0,0,88322,3532336
31706869760,34548404224,67624960,969613312,4.310,0.531,95.128,0.031,0,93806,3753110
31708127232,34547019776,67633152,969728000,4.439,0.625,94.873,0.063,0,88272,3888920
31710498816,34544562176,67633152,969814016,5.128,1.470,93.402,0,0,87238,3812090
31711928320,34543013888,67633152,969928704,5.534,0.886,93.580,0,0,86392,3703438
31714271232,34540593152,67633152,970006528,4.254,0.719,95.027,0,0,85156,3669336
31716499456,34538110976,67633152,970260480,4.448,0.599,94.953,0,0,87146,3845060
31722942464,34531557376,67649536,970350592,5.856,0.850,92.979,0.315,0,93816,3913152
31726387200,34528026624,67649536,970432512,7.320,0.848,91.832,0,0,91408,3635834
31726903296,34527404032,67649536,970539008,6.582,0.696,92.722,0,0,84340,3648454
31728291840,34525921280,67649536,970629120,6.146,0.693,93.161,0,0,85844,3798012
31729692672,34524405760,67649536,970739712,5.641,0.693,93.161,0.504,0,85060,3612604
31730237440,34523746304,67657728,970846208,7.435,0.805,91.450,0.310,0,83410,3618252
31731605504,34522288128,67657728,970932224,7.281,0.875,91.844,0,0,83240,3599352
31735799808,34518003712,67657728,971022336,7.569,0.817,91.614,0,0,89160,3805022
31738294272,34515501056,67657728,971116544,6.633,0.751,92.616,0,0,87536,3881626
31737827328,34515886080,67657728,971198464,5.357,0.689,93.954,0,0,94492,4002508
31742050304,34511560704,67665920,971292672,6.963,0.819,92.124,0.095,0,92128,3817402
31783383040,34469969920,67665920,971542528,9.393,0.877,89.731,0,0,92370,3776390
31816069120,34437181440,67665920,971636736,8.176,0.849,90.975,0,0,92170,3596084
31856087040,34397057024,67665920,971739136,6.950,0.881,92.138,0.031,0,84958,3708118
31893159936,34359894016,67665920,971829248,8.131,0.725,91.144,0,0,86714,3733972
31927316480,34325643264,67682304,971902976,8.066,0.851,90.800,0.284,0,88444,3887166
31965425664,34287276032,67682304,972161024,8.136,0.820,91.044,0,0,86840,3738462
31995682816,34256920576,67682304,972255232,8.667,0.907,90.426,0,0,78278,3314750
32041000960,34211508224,67682304,972349440,7.924,0.595,91.450,0.031,0,78414,3416526
32071852032,34180567040,67682304,972435456,7.647,0.971,91.037,0.345,0,78638,3462648
32112996352,34139320320,67690496,972529664,7.879,0.756,87.709,3.656,0,95170,3571762
32113127424,34139062272,67690496,972652544,6.746,0.718,92.536,0,0,89470,3662020
32107597824,34144518144,67690496,972722176,4.237,0.816,94.947,0,0,87312,3853250
32105254912,34146725888,67690496,972845056,4.707,1.029,94.264,0,0,89176,3941198
32107184128,34144710656,67690496,972926976,4.651,0.691,94.657,0,0,90558,3936008
32105455616,34146316288,67698688,973041664,4.304,0.749,92.046,2.901,0,83868,3606474
32106057728,34145611776,67698688,973144064,5.227,0.787,93.986,0,0,80644,3469354
32103555072,34148020224,67698688,973238272,3.435,0.567,95.997,0,0,83608,3527944
32103944192,34147516416,67698688,973352960,5.470,0.531,93.998,0,0,80546,3483574
32104656896,34146742272,67698688,973410304,4.327,0.690,94.983,0,0,77076,3334630
32104796160,34146480128,67715072,973516800,5.846,0.808,91.947,1.399,0,76832,3192406
32105562112,34145611776,67715072,973619200,5.161,0.751,94.088,0,0,78534,3278270
32106668032,34144407552,67715072,973717504,4.376,0.781,94.842,0,0,80086,3387958
32106999808,34143956992,67715072,973836288,4.676,0.592,94.701,0.031,0,84058,3614022
32107569152,34143309824,67715072,973914112,3.259,0.506,96.234,0,0,81658,3486754
32107405312,34143346688,67723264,974024704,4.508,0.757,94.609,0.126,0,77088,3285852
32109903872,34140753920,67723264,974114816,4.461,0.723,94.816,0,0,82372,3262702
32111091712,34139471872,67723264,974209024,5.232,0.721,94.048,0,0,79078,3502748
32111554560,34138767360,67723264,974450688,3.368,0.661,95.971,0,0,83244,3671748
32111996928,34138247168,67723264,974528512,4.747,0.629,94.624,0,0,90330,3741040
32112570368,34137534464,67739648,974639104,4.048,0.753,93.254,1.945,0,87508,3591962
32113147904,34136854528,67739648,974737408,3.282,0.789,95.330,0.600,0,90154,3761538
32112582656,34137309184,67739648,974843904,5.123,0.691,94.186,0,0,85206,3626300
32114524160,34135277568,67739648,974934016,5.212,0.565,94.192,0.031,0,82884,3556320
32114950144,34134761472,67739648,975020032,4.892,0.784,94.324,0,0,80538,3537746
32115105792,34134343680,67747840,975265792,4.641,0.439,94.857,0.063,0,84002,3687566
32115281920,34134077440,67747840,975355904,5.460,0.973,93.568,0,0,83730,3637922
32116011008,34133245952,67747840,975458304,3.881,0.751,95.368,0,0,80428,3491818
32117649408,34131501056,67747840,975564800,4.259,0.720,95.020,0,0,85820,3805774
32118013952,34131054592,67747840,975646720,5.154,0.723,94.123,0,0,90746,3855670
32118415360,34130538496,67756032,975749120,4.780,0.692,94.465,0.063,0,84520,3425728
32118972416,34129895424,67760128,975831040,5.141,0.752,93.950,0.157,0,84802,3386250
32119631872,34129117184,67760128,975945728,3.809,0.968,95.223,0,0,86276,3448836
32119672832,34128977920,67760128,976039936,4.277,0.849,94.874,0,0,81600,3494620
32119611392,34128916480,67760128,976154624,3.784,0.820,95.396,0,0,86546,3414372
32119861248,34128576512,67768320,976236544,3.813,0.756,95.399,0.032,0,80636,3479592
32121737216,34126569472,67768320,976367616,5.255,1.244,92.786,0.715,0,77996,3339082
32122466304,34125729792,67768320,976470016,4.292,1.089,94.619,0,0,76692,3171934
32123252736,34124857344,67768320,976556032,5.034,0.876,94.059,0.031,0,80126,3217754
32123457536,34124541952,67768320,976658432,4.705,0.847,94.448,0,0,75500,3130862
32124116992,34123759616,67776512,976773120,4.642,0.779,94.486,0.093,0,85108,3183234
32124526592,34123247616,67780608,976871424,4.388,0.663,94.855,0.095,0,78858,3381614
32124915712,34122764288,67780608,976965632,2.539,1.034,96.426,0,0,84340,3471212
32125669376,34121924608,67780608,977047552,3.263,0.533,96.203,0,0,86086,3677138
32126091264,34121379840,67780608,977170432,3.516,1.394,95.090,0,0,87172,3635474
32128487424,34118877184,67788800,977264640,4.474,0.970,94.431,0.125,0,81008,3453544
32128028672,34119217152,67788800,977383424,5.392,1.348,92.382,0.878,0,79594,3295788
32127778816,34119380992,67788800,977461248,3.101,0.783,96.117,0,0,79280,3372138
32128942080,34117955584,67788800,977723392,3.177,0.818,96.005,0,0,79874,3333768
32129138688,34117697536,67788800,977784832,4.914,0.840,94.246,0,0,76456,3215280
32129826816,34116857856,67796992,977915904,4.329,0.632,94.913,0.126,0,76400,3288404
32131596288,34115022848,67796992,977977344,5.647,0.874,93.448,0.031,0,76822,3308412
32132734976,34113728512,67796992,978116608,4.303,0.748,94.949,0,0,76640,3230484
32134647808,34111725568,67796992,978206720,4.557,0.905,94.538,0,0,80018,3327322
32135000064,34111246336,67796992,978325504,4.436,1.156,94.408,0,0,78030,3222706
32134918144,34111213568,67805184,978423808,5.019,0.753,94.166,0.063,0,78288,3421564
32135856128,34110181376,67805184,978518016,3.604,0.689,95.707,0,0,82520,3572158
32137539584,34108391424,67813376,978616320,3.904,1.156,94.628,0.312,0,95928,3745362
32138534912,34107273216,67813376,978735104,5.180,0.726,94.093,0,0,87834,3583964
32139628544,34106105856,67813376,978804736,4.747,0.817,94.436,0,0,93708,3792040
32139980800,34105622528,67821568,978927616,5.469,0.963,93.505,0.062,0,94068,3763600
32141516800,34103975936,67821568,979034112,4.645,0.842,94.514,0,0,89224,3630640
32140967936,34104426496,67821568,979128320,3.438,0.694,94.984,0.883,0,93818,3653532
32140234752,34105073664,67821568,979210240,4.302,0.748,94.950,0,0,94078,3845818
32142946304,34102231040,67821568,979337216,5.526,0.843,93.631,0,0,94244,3871976
32143642624,34101424128,67829760,979435520,5.265,0.909,93.764,0.063,0,91356,3854736
32143601664,34101395456,67829760,979505152,3.794,0.443,95.764,0,0,85480,3662464
32143536128,34101329920,67829760,979636224,4.108,0.659,95.202,0.031,0,81648,3437576
32145604608,34099134464,67829760,979755008,4.477,0.788,94.735,0,0,80308,3520410
32146968576,34097684480,67829760,979841024,4.722,0.963,94.315,0,0,86564,3729798
32147750912,34096685056,67837952,980049920,3.343,0.599,95.963,0.095,0,86854,3857676
32148402176,34095910912,67837952,980172800,4.992,0.754,94.254,0,0,95042,3803066
32148844544,34095362048,67837952,980279296,3.497,0.812,95.692,0,0,92224,3570730
32149868544,34094223360,67846144,980381696,6.510,0.720,92.645,0.125,0,73302,3105232
32150278144,34093719552,67846144,980475904,4.360,0.659,94.981,0,0,76950,3106044
32151814144,34092064768,67854336,980582400,3.772,1.091,95.044,0.094,0,76154,3127790
32151678976,34092101632,67854336,980676608,4.305,0.817,94.877,0,0,73112,3188936
32151838720,34091798528,67854336,980779008,3.997,0.724,94.492,0.787,0,81776,3603256
32152231936,34091274240,67854336,980901888,5.689,1.094,93.185,0.031,0,87078,3751240
32152776704,34090639360,67854336,980992000,4.685,0.718,94.597,0,0,86826,3852654
32154927104,34088394752,67862528,981078016,4.983,0.978,93.945,0.095,0,96850,3753328
32155377664,34087813120,67862528,981204992,3.611,0.722,95.667,0,0,87136,3457164
32156143616,34086969344,67862528,981282816,5.281,0.719,94,0,0,79976,3402444
32155889664,34087104512,67866624,981397504,3.214,0.914,95.841,0.032,0,81342,3544484
32157241344,34085654528,67866624,981487616,3.455,0.660,95.886,0,0,77064,3420030
32156737536,34086039552,67874816,981590016,4.916,0.756,94.233,0.095,0,80794,3428240
32156811264,34085847040,67874816,981704704,3.787,0.782,95.430,0,0,83584,3619380
32158519296,34084040704,67874816,981794816,5.416,0.751,93.832,0,0,90152,3749572
32159657984,34082783232,67883008,981905408,4.668,0.721,92.607,2.005,0,87798,3887718
32159870976,34082459648,67891200,982007808,4.122,0.750,94.004,1.124,0,91076,3872100
32159862784,34082361344,67891200,982110208,4.386,0.783,94.831,0,0,91164,3742920
32159862784,34082263040,67891200,982208512,5.947,0.657,93.396,0,0,93778,3654592
32161665024,34080227328,67891200,982437888,4.374,0.968,94.658,0,0,82576,3448754
32160772096,34081005568,67899392,982544384,3.448,0.564,95.925,0.063,0,83096,3364898
32161239040,34080428032,67899392,982646784,3.790,0.814,95.396,0,0,79958,3491686
32164212736,34077356032,67899392,982745088,6.496,0.937,92.567,0,0,79634,3431048
32164909056,34076553216,67899392,982851584,5.139,1.065,93.795,0,0,77062,3439170
32165228544,34076135424,67899392,982941696,3.894,0.817,95.289,0,0,77412,3475474
32166957056,34074292224,67911680,983044096,4.371,0.755,92.925,1.950,0,78458,3462314
32167682048,34073452544,67915776,983150592,3.256,0.814,92.329,3.601,0,82274,3605412
32167006208,34074009600,67915776,983269376,5.078,0.690,94.232,0,0,92800,3897000
32167915520,34073006080,67915776,983363584,4.016,0.690,95.293,0,0,94968,3922010
32167530496,34073300992,67915776,983453696,4.793,0.658,94.518,0.031,0,92298,4027198
32168001536,34072715264,67923968,983560192,5.822,0.782,93.333,0.063,0,93192,4017346
32169398272,34071203840,67923968,983670784,2.869,0.694,96.438,0,0,89936,3916686
32169865216,34070650880,67923968,983756800,5.309,0.943,93.748,0,0,83996,3523292
32170233856,34070167552,67923968,983863296,3.604,0.815,95.550,0.031,0,75438,3305804
32171708416,34068590592,67923968,983965696,3.396,0.786,95.818,0,0,75880,3245928
32172175360,34068008960,67932160,984068096,5.002,0.531,94.436,0.031,0,71792,3079944
32172687360,34067267584,67932160,984293376,6.252,0.840,91.788,1.120,0,78174,3143672
32173395968,34066427904,67940352,984412160,4.524,0.880,94.471,0.126,0,72910,3055568
32173957120,34065780736,67940352,984494080,4.171,0.627,95.202,0,0,81336,3191164
32174006272,34065584128,67940352,984608768,3.309,0.567,96.124,0,0,81226,3377974
32174403584,34065096704,67948544,984690688,2.774,0.946,96.248,0.032,0,77786,3249564
32175845376,34063523840,67948544,984817664,5.080,0.663,94.225,0.032,0,79034,3341990
32177401856,34061877248,67948544,984907776,6.349,0.965,92.686,0,0,81590,3418430
32177987584,34061168640,67948544,985010176,4.819,0.819,94.362,0,0,79072,3405766
32180273152,34058776576,67948544,985112576,5.161,0.970,93.869,0,0,77682,3504696
32182812672,34056101888,67956736,985227264,4.493,0.691,94.753,0.063,0,88066,3863890
32182464512,34056359936,67964928,985309184,4.237,1.067,93.566,1.130,0,88372,3911340
32182378496,34056327168,67964928,985423872,6.174,0.846,90.191,2.789,0,99828,4073194
32182652928,34055942144,67964928,985522176,3.356,0.627,96.016,0,0,96322,3852574
32183603200,34054877184,67964928,985632768,5.286,1.220,93.494,0,0,85932,3631696
32182685696,34055680000,67973120,985735168,5.045,0.627,94.265,0.063,0,84716,3722412
32182751232,34055516160,67973120,985833472,5.731,0.908,93.360,0,0,86776,3731712
32184135680,34054037504,67973120,985923584,6.199,0.626,93.143,0.031,0,86838,3586258
32185036800,34053038080,67973120,986017792,3.241,0.566,96.193,0,0,81008,3294910
32185352192,34052616192,67973120,986120192,3.533,0.631,95.836,0,0,83212,3100744
32184623104,34053103616,67981312,986353664,3.581,1.059,95.297,0.062,0,82670,3137898
32185958400,34051645440,67981312,986468352,5.265,0.698,94.037,0,0,85110,3330070
32187359232,34050146304,67989504,986558464,5.460,0.659,92.909,0.973,0,90022,3489948
32187858944,34049548288,67989504,986656768,5.076,0.997,93.803,0.125,0,86810,3442422
32187629568,34049646592,67989504,986779648,3.948,0.726,95.325,0,0,96516,3796444
32188321792,34048847872,67997696,986877952,4.618,0.811,94.509,0.062,0,102164,3810482
32190660608,34046402560,67997696,986980352,5.505,0.755,93.740,0,0,94838,3716386
32189562880,34047389696,67997696,987090944,3.824,0.658,95.486,0.031,0,94342,3969636
32190480384,34046394368,67997696,987168768,5.369,0.816,93.783,0.031,0,94210,4051352
32191488000,34045259776,67997696,987291648,4.019,0.717,95.265,0,0,90488,3924120
32191258624,34045394944,68005888,987377664,5.592,0.632,93.744,0.032,0,91164,4103856
32192548864,34043977728,68005888,987484160,5.649,0.749,93.602,0,0,93006,3942496
32192606208,34043813888,68014080,987582464,4.163,0.970,94.742,0.125,0,90668,3834886
32194224128,34042073088,68014080,987701248,5.350,0.871,93.717,0.062,0,91770,3882790
32195444736,34040750080,68014080,987803648,3.077,0.848,96.075,0,0,86820,3671366
32196648960,34039447552,68022272,987893760,5.590,1.156,93.223,0.031,0,84708,3774162
32196927488,34039074816,68022272,987983872,5.990,1.103,92.907,0,0,86008,3653734
30660354048,35575525376,68022272,988102656,5.301,0.726,93.247,0.726,0,83906,3543138
26803990528,39432024064,68022272,987959296,3.553,0.943,95.472,0.031,0,77254,3387692
23608426496,42628583424,68022272,986963968,3.330,0.754,95.916,0,0,77098,2994504
20433838080,45803855872,68034560,986267648,1.851,0.596,97.490,0.063,0,66820,2605164
17309671424,48928841728,68034560,985448448,4.129,0.532,95.339,0,0,60372,2213940
14965624832,51273715712,68034560,984621056,3.401,0.468,96.131,0,0,50386,1917770
11854327808,54385852416,68034560,983781376,2.092,0.500,97.408,0,0,45746,1650286
8707211264,57533390848,68034560,983359488,1.635,0.314,98.050,0,0,42986,1078084
5555056640,60686831616,68046848,982061056,1.156,0.344,98.500,0,0,31188,795912
2453127168,63789633536,68046848,981188608,0.564,0.282,99.154,0,0,21994,491134
889458688,65354186752,68046848,980303872,0.063,0.094,99.844,0,0,7026,172656
872124416,65371963392,68046848,979861504,0.031,0.031,99.938,0,0,2308,33488
871399424,65372680192,68055040,979861504,0,0.031,99.813,0.156,0,3616,7894
871399424,65372680192,68055040,979861504,0,0,100,0,0,214,0
871387136,65372680192,68067328,979861504,0,0,100,0,0,0,0
871387136,65372680192,68067328,979861504,0,0.031,99.969,0,0,9618,0
871387136,65372680192,68067328,979861504,0,0,100,0,0,5396,0
871120896,65372946432,68067328,979861504,0,0.031,99.969,0,0,848,0
871120896,65372946432,68067328,979861504,0,0,100,0,0,166,0
871120896,65372946432,68067328,979861504,0,0,100,0,0,0,0
870854656,65373204480,68075520,979861504,0,0,100,0,0,388,0
870854656,65373204480,68075520,979861504,0.031,0.031,99.938,0,0,380,180
870854656,65373204480,68075520,979861504,0,0,100,0,0,3058,180
870596608,65373462528,68075520,979861504,0,0.031,99.969,0,0,840,0
870596608,65373462528,68075520,979861504,0,0,100,0,0,2544,0
870596608,65373462528,68075520,979861504,0,0,100,0,0,2314,1508
870588416,65373462528,68083712,979861504,0,0,100,0,0,6376,300
870330368,65373720576,68083712,979861504,0.031,0.031,99.938,0,0,9280,4038
874905600,65367564288,68083712,979873792,1.436,0.874,97.690,0,0,408168,45868
872656896,65369288704,68083712,979873792,0,0,100,0,0,2908,0
