"Dstat 0.7.3 CSV output"
"Author:","Dag Wieers <dag@wieers.com>",,,,"URL:","http://dag.wieers.com/home-made/dstat/"
"Host:","grisou-7.nancy.grid5000.fr",,,,"User:","root"
"Cmdline:","dstat -m -c -n -o dstat.csv",,,,"Date:","27 May 2020 10:04:35 CEST"
"memory usage",,,,"total cpu usage",,,,,"net/total",
"used","free","buff","cach","usr","sys","idl","wai","stl","recv","send"
999968768,133071556608,49356800,708767744,0.933,0.214,98.731,0.121,0,0,0
1013682176,133057527808,49356800,709042176,0.811,0.375,98.814,0,0,392440,17248
1006862336,133064781824,49369088,708595712,0.344,0.344,97.998,1.314,0,385316,24716
1003655168,133067735040,49369088,708595712,0.937,0.593,98.470,0,0,8974,15540
1003380736,133068009472,49369088,708595712,0,0,100,0,0,9544,0
1003057152,133068283904,49381376,708595712,1.000,0.625,98.312,0.063,0,388312,27180
1002958848,133068382208,49381376,708595712,0,0,100,0,0,8338,0
1002926080,133068390400,49397760,708603904,0,0.031,99.312,0.656,0,15178,0
1002663936,133068652544,49397760,708603904,0.031,0.031,99.781,0.156,0,13402,0
1002663936,133068652544,49397760,708603904,0,0,100,0,0,4492,0
1002139648,133069176832,49397760,708603904,0,0.031,99.969,0,0,2870,0
1002119168,133069185024,49410048,708603904,0,0,99.969,0.031,0,3448,662
1001852928,133069451264,49410048,708603904,0,0,100,0,0,2490,0
1001582592,133069713408,49418240,708603904,0,0,99.938,0.062,0,766,0
1001582592,133069713408,49418240,708603904,0,0,100,0,0,406,0
1001324544,133069971456,49418240,708603904,0,0,100,0,0,1218,0
1001066496,133070229504,49418240,708603904,0,0.031,99.969,0,0,1278,0
1000550400,133070745600,49418240,708603904,0,0.031,99.969,0,0,4528,496
1012752384,133058093056,49418240,709050368,0.594,0.219,99.187,0,0,392564,15188
1004548096,133066289152,49426432,709050368,0.500,0.531,98.938,0.031,0,10204,15028
1004503040,133066584064,49426432,708800512,0.344,0.250,99.406,0,0,193706,11784
1016782848,133054033920,49426432,709066752,0.625,0.219,99.156,0,0,407650,15768
1005969408,133065293824,49426432,708620288,0.593,0.437,98.970,0,0,26846,15604
1007382528,133063852032,49438720,708620288,0.875,0.719,97.688,0.719,0,406544,26312
1006518272,133064716288,49438720,708620288,0,0,100,0,0,14136,0
1018130432,133052645376,49451008,709066752,0.999,0.656,98.282,0.062,0,389234,13168
1006559232,133064663040,49451008,708620288,0.063,0,99.937,0,0,49118,13276
1006714880,133064507392,49451008,708620288,0,0,100,0,0,15340,0
1007394816,133063593984,49463296,708751360,1.902,0.218,97.381,0.499,0,224244,11268
1006546944,133064572928,49463296,708620288,0.031,0.031,99.937,0,0,3328,2800
1006563328,133064556544,49463296,708620288,0,0,100,0,0,918,84
1006219264,133064888320,49475584,708620288,0,0,99.969,0.031,0,1218,0
1006817280,133064278016,49475584,708632576,0.406,0.156,99.437,0,0,342348,14948
1013944320,133056966656,49475584,708816896,0.156,0.094,99.750,0,0,179484,21342
1013391360,133057490944,49491968,708829184,0,0.031,99.469,0.500,0,12780,13034
1013133312,133057748992,49491968,708829184,0,0.031,99.969,0,0,12522,12838
1013133312,133057748992,49491968,708829184,0,0,100,0,0,12564,12642
1012862976,133058007040,49504256,708829184,0,0.031,99.938,0.031,0,11872,12838
1012346880,133058523136,49504256,708829184,0,0,100,0,0,20112,18844
1012293632,133058576384,49504256,708829184,0,0.031,99.969,0,0,13066,13034
1011773440,133059092480,49508352,708829184,0,0,100,0,0,13292,15276
1011257344,133059608576,49508352,708829184,0,0,100,0,0,12054,13254
1010741248,133060124672,49508352,708829184,0,0,100,0,0,12720,13132
1003307008,133067542528,49516544,708833280,0.031,0.062,99.875,0.031,0,2118,2236
1002778624,133068259328,49516544,708644864,0.219,0.187,99.594,0,0,176192,14268
1002328064,133068709888,49516544,708644864,0,0,100,0,0,65190,1000
1001811968,133069225984,49516544,708644864,0,0.031,99.969,0,0,4432,1078
1001295872,133069742080,49516544,708644864,0,0,100,0,0,692,0
1001029632,133070000128,49524736,708644864,0,0,100,0,0,528,0
1001013248,133070000128,49541120,708644864,0,0,99.875,0.125,0,692,0
1001013248,133070000128,49541120,708644864,0,0,100,0,0,646,0
1001013248,133070000128,49541120,708644864,0,0,100,0,0,552,86
1001009152,133070000128,49541120,708648960,0,0,100,0,0,1038,0
1000988672,133070020608,49541120,708648960,0,0,100,0,0,874,0
1000714240,133070286848,49549312,708648960,0,0,99.969,0.031,0,1010,662
1000456192,133070544896,49549312,708648960,0,0,100,0,0,692,0
1000456192,133070544896,49549312,708648960,0,0,100,0,0,346,0
1000198144,133070802944,49549312,708648960,0,0,100,0,0,3580,0
1014747136,133056253952,49549312,708648960,0.469,0.125,99.406,0,0,387614,14368
1000099840,133070901248,49549312,708648960,0.532,0.469,98.999,0,0,7752,16464
1000079360,133070909440,49561600,708648960,0,0,99.344,0.656,0,2928,0
999804928,133071183872,49561600,708648960,0.031,0,99.969,0,0,3422,1508
999804928,133071183872,49561600,708648960,0,0,100,0,0,2780,0
999546880,133071441920,49561600,708648960,0,0,100,0,0,708,0
999276544,133071699968,49573888,708648960,0,0,99.938,0.062,0,664,252
999276544,133071699968,49573888,708648960,0,0,100,0,0,2076,0
999268352,133071699968,49582080,708648960,0,0,99.969,0.031,0,752,0
999006208,133071962112,49582080,708648960,0,0,100,0,0,6282,0
998748160,133072220160,49582080,708648960,0,0.031,99.969,0,0,2604,0
998748160,133072220160,49582080,708648960,0,0,100,0,0,346,0
998748160,133072220160,49582080,708648960,0,0,100,0,0,1418,0
998490112,133072478208,49582080,708648960,0,0,100,0,0,2036,0
998121472,133072838656,49590272,708648960,0,0,99.938,0.062,0,4164,624
998121472,133072838656,49590272,708648960,0,0,100,0,0,3862,234
997863424,133073096704,49590272,708648960,0,0,100,0,0,12304,546
997863424,133073096704,49590272,708648960,0,0,100,0,0,13298,390
997863424,133073096704,49590272,708648960,0.031,0,99.969,0,0,121022,780
997863424,133073096704,49590272,708648960,0,0,100,0,0,16864,1184
997597184,133073354752,49598464,708648960,0,0,99.969,0.031,0,121266,414
1021120512,133049831424,49598464,708648960,0.281,0.125,99.593,0,0,348484,16412
3233738752,130836283392,49598464,708927488,19.449,9.458,71.093,0,0,1780884,67506
6319980544,127748141056,49598464,710586368,30.613,13.258,56.066,0.063,0,1346488,58398
9351139328,124715507712,49610752,711913472,35.445,13.018,51.506,0.031,0,1563364,55627
12324708352,121740320768,49618944,713363456,33.719,11.917,54.238,0.125,0,1463442,53428
15240863744,118822465536,49696768,714915840,34.022,11.831,52.739,1.408,0,1529810,61580
18292543488,115769475072,49700864,716103680,35.221,12.699,51.830,0.250,0,1490460,88066
21313703936,112746500096,49709056,717852672,38.110,13.165,48.567,0.157,0,1371688,911826
24404656128,109654474752,49721344,718815232,39.642,12.178,48.054,0.126,0,1362848,1720105
27414925312,106642518016,49737728,720297984,41.538,13.678,44.564,0.221,0,1421472,3616500
30179364864,103876665344,49799168,721510400,37.044,12.317,49.922,0.717,0,453764,4153811
30846115840,103209844736,49799168,721580032,16.718,3.808,79.133,0.341,0,122128,3894504
31072522240,102983368704,49799168,721641472,16.132,1.141,82.418,0.308,0,123754,5565124
31314206720,102741630976,49799168,721694720,18.300,1.272,80.149,0.279,0,128558,5408621
31535431680,102520320000,49807360,721768448,15.801,1.649,82.115,0.435,0,123704,5512013
31789895680,102265634816,49860608,721928192,18.890,1.746,76.216,3.148,0,133642,5688049
31954653184,102100762624,49864704,722038784,18.721,1.373,64.399,15.507,0,138532,5506653
32129101824,101926232064,49864704,722120704,19.566,1.767,78.357,0.310,0,162616,5423552
32301010944,101754204160,49864704,722239488,20.746,3.447,74.835,0.971,0,118592,5055460
32386453504,101668630528,49872896,722354176,18.350,2.286,78.746,0.618,0,135582,4314548
32476524544,101578502144,49872896,722411520,17.505,1.459,80.664,0.372,0,98262,4185684
32457867264,101597040640,49881088,722522112,13.142,1.464,84.833,0.561,0,121484,3599354
32455262208,101599547392,49881088,722620416,8.632,1.465,89.467,0.436,0,91124,3581406
32428544000,101626159104,49881088,722726912,7.121,1.555,90.827,0.498,0,117528,3575804
32369762304,101684838400,49889280,722812928,7.726,2.315,89.396,0.563,0,81668,3315950
32343359488,101711138816,49889280,722915328,7.625,1.031,90.906,0.438,0,81590,3536494
32339283968,101714980864,49889280,723148800,7.053,0.909,91.379,0.658,0,85564,3752712
32304545792,101749628928,49889280,723238912,6.102,0.924,91.156,1.818,0,121924,3739348
32295063552,101759008768,49889280,723337216,7.329,0.940,91.450,0.282,0,98748,3594458
32294957056,101759004672,49897472,723439616,8.313,1.148,89.981,0.558,0,88132,3407284
32292507648,101761363968,49897472,723529728,5.232,0.846,93.578,0.345,0,81424,3350762
32300974080,101752807424,49897472,723615744,6.662,0.751,92.086,0.500,0,115224,3499658
32314368000,101739294720,49897472,723730432,6.858,0.842,91.646,0.655,0,89834,3872200
32320045056,101733507072,49905664,723832832,6.654,1.026,91.884,0.435,0,121110,3618310
32320491520,101732978688,49913856,723906560,5.862,0.873,92.703,0.561,0,90338,3732212
32323121152,101730226176,49913856,724025344,7.287,1.209,91.070,0.434,0,125114,3872918
32325865472,101727391744,49913856,724115456,6.074,1.085,92.470,0.372,0,86620,3627534
32329482240,101723676672,49913856,724209664,5.666,1.370,89.446,3.518,0,84290,3544892
32341254144,101711790080,49913856,724320256,8.377,1.484,89.768,0.371,0,83244,3529246
32343339008,101709611008,49922048,724402176,4.844,1.031,93.531,0.594,0,87004,3453822
32354734080,101698097152,49922048,724520960,7.680,1.928,89.863,0.529,0,86852,3433226
32351543296,101701156864,49922048,724611072,5.189,1.188,93.248,0.375,0,85990,3352516
32379559936,101673054208,49930240,724684800,4.973,0.876,93.525,0.626,0,77078,3269262
32379686912,101672873984,49930240,724779008,6.381,1.470,91.117,1.032,0,81466,3344630
32360701952,101691740160,49938432,724885504,6.390,1.714,91.521,0.374,0,330518,3362230
32365187072,101687058432,49938432,724996096,4.759,1.002,93.738,0.501,0,134622,3385606
32372994048,101679165440,49938432,725082112,5.580,1.060,93.017,0.343,0,84742,3351272
32372428800,101679534080,49938432,725278720,5.199,1.027,93.431,0.342,0,97500,3400834
32376033280,101675798528,49938432,725405696,7.088,0.959,89.817,2.136,0,101936,3515408
32384888832,101666852864,49946624,725487616,6.158,0.781,92.623,0.438,0,110422,3828652
32385331200,101666291712,49946624,725606400,4.949,1.183,93.589,0.280,0,107970,3903564
32389124096,101662396416,49946624,725696512,4.969,1.069,93.648,0.314,0,100908,3797420
32392114176,101659291648,49946624,725811200,4.724,0.787,93.953,0.535,0,98234,3503040
32392372224,101658943488,49954816,725893120,4.700,0.747,93.122,1.432,0,99898,3409756
32394985472,101656215552,49963008,725995520,5.989,1.216,92.265,0.530,0,128342,3442952
32398262272,101652844544,49963008,726085632,5.849,1.189,92.681,0.282,0,92898,3450460
32400343040,101650661376,49963008,726188032,5.679,0.874,93.042,0.406,0,121826,3376430
32401113088,101649780736,49963008,726298624,5.522,1.035,92.909,0.533,0,148486,3748254
32403038208,101647765504,49963008,726384640,5.380,0.813,91.586,2.221,0,132316,3851880
32404901888,101645783040,49971200,726491136,6.012,1.121,92.368,0.498,0,102700,3655178
32405630976,101644972032,49971200,726573056,5.549,0.779,93.329,0.343,0,129188,3698360
32409980928,101640515584,49971200,726679552,8.440,1.433,89.816,0.311,0,143518,3387896
32410091520,101640302592,49971200,726781952,7.238,1.180,91.240,0.342,0,81826,3469962
32415203328,101635104768,49971200,726863872,9.331,1.400,88.647,0.622,0,80144,3480736
32418418688,101631758336,49987584,726970368,8.128,1.370,89.910,0.592,0,81740,3559314
32418697216,101631348736,49987584,727097344,6.886,1.179,91.408,0.527,0,82822,3488566
32422277120,101627674624,49987584,727191552,8.964,1.365,89.361,0.310,0,87830,3585238
32422891520,101626843136,49987584,727408640,7.478,1.064,91.145,0.313,0,84856,3716672
32423587840,101626052608,49987584,727498752,8.047,1.996,89.457,0.499,0,90310,3840232
32426520576,101623005184,49995776,727605248,7.399,1.623,90.415,0.562,0,89618,3695056
32425480192,101623951360,49995776,727695360,6.184,0.812,92.692,0.312,0,90690,3745598
32457101312,101592227840,49995776,727793664,10.745,1.509,87.223,0.523,0,97342,3510502
32500539392,101548666880,49995776,727912448,8.641,0.783,90.169,0.407,0,85908,3496408
32531394560,101517725696,49995776,727998464,9.311,1.366,89.013,0.310,0,85602,3652498
32569184256,101479825408,50003968,728100864,8.328,0.842,88.366,2.464,0,82606,3645542
32606535680,101442359296,50003968,728211456,7.400,1.150,91.107,0.342,0,96906,3670260
32646430720,101402353664,50003968,728322048,9.516,1.123,88.799,0.562,0,81368,3377400
32713822208,101334863872,50003968,728416256,11.909,0.933,86.785,0.373,0,81470,3300888
32779669504,101268938752,50003968,728494080,10.421,1.092,88.206,0.281,0,82824,3404702
32828231680,101220249600,50020352,728604672,8.074,0.785,89.695,1.445,0,81538,3345890
32871555072,101176827904,50020352,728690688,8.606,1.123,89.959,0.312,0,78336,3131342
32867119104,101181153280,50020352,728797184,3.907,0.725,94.959,0.410,0,77430,3187478
32858365952,101189795840,50020352,728903680,4.750,0.975,93.960,0.315,0,80012,3255084
32849862656,101198196736,50020352,729001984,4.831,0.821,93.780,0.568,0,79614,3255732
32849354752,101198606336,50028544,729088000,4.545,0.784,92.445,2.226,0,78224,3312848
32850780160,101197086720,50028544,729182208,4.164,0.939,94.521,0.376,0,81158,3328242
32852578304,101195182080,50028544,729288704,4.909,0.598,94.021,0.472,0,77856,3093206
32852504576,101195153408,50028544,729387008,4.739,0.628,94.319,0.314,0,76424,3424576
32847249408,101200154624,50028544,729624576,5.211,0.686,93.729,0.374,0,83254,3512752
32848121856,101199167488,50036736,729722880,7.328,0.624,91.799,0.249,0,79640,3394410
32849702912,101197492224,50044928,729804800,5.446,0.689,92.989,0.876,0,114436,3518880
32846831616,101200269312,50044928,729899008,4.983,0.872,93.865,0.280,0,87498,3674262
32846675968,101200326656,50044928,729993216,3.708,0.817,95.097,0.377,0,117232,3494438
32841744384,101205147648,50044928,730103808,4.564,0.944,94.177,0.315,0,87212,3530486
32841908224,101204881408,50053120,730193920,6.203,0.752,92.481,0.564,0,111344,3383648
32841408512,101205270528,50053120,730304512,3.934,0.562,94.099,1.405,0,83802,3608884
32843616256,101202968576,50053120,730394624,5.449,1.253,93.016,0.282,0,116340,3461694
32842518528,101203976192,50053120,730484736,4.716,0.718,94.285,0.281,0,88360,3658612
32843476992,101202911232,50053120,730591232,5.352,0.778,93.373,0.498,0,87494,3558196
32844525568,101201752064,50061312,730693632,6.515,0.779,92.238,0.468,0,107512,3534326
32845008896,101201170432,50061312,730783744,5.706,0.935,92.672,0.686,0,89842,3519312
32845312000,101200752640,50069504,730890240,4.235,0.934,94.457,0.374,0,83662,3460672
32845688832,101200297984,50069504,730968064,4.920,0.752,93.701,0.627,0,83826,3505894
32846479360,101199392768,50069504,731074560,5.614,0.655,93.200,0.530,0,86366,3681022
32847151104,101198614528,50077696,731160576,4.866,0.811,93.575,0.749,0,95850,3843386
32846692352,101198954496,50077696,731275264,5.952,0.877,90.382,2.788,0,101278,3831034
32848236544,101197312000,50077696,731373568,6.361,0.842,92.173,0.624,0,92244,3761480
32848105472,101197373440,50077696,731443200,5.260,0.591,93.713,0.436,0,102908,3643338
32849014784,101196341248,50077696,731566080,6.435,0.870,91.949,0.746,0,94210,3342056
32849272832,101195980800,50085888,731660288,3.734,0.533,95.231,0.502,0,89308,3492846
32848654336,101196500992,50085888,731754496,5.728,0.845,92.833,0.595,0,84026,3488610
32849420288,101195608064,50094080,731869184,5.866,0.941,91.656,1.537,0,87874,3692172
32850804736,101194141696,50094080,731947008,4.768,0.878,94.009,0.345,0,85894,3597794
32849715200,101195108352,50094080,732069888,5.693,0.876,93.056,0.375,0,88272,3581898
32850632704,101194084352,50102272,732164096,3.513,0.753,94.981,0.753,0,142594,3358332
32850513920,101194117120,50102272,732250112,4.437,0.692,94.399,0.472,0,81864,3438040
32851718144,101192790016,50102272,732368896,4.383,1.033,92.799,1.785,0,145414,3428486
32851836928,101192568832,50102272,732471296,5.729,0.872,92.839,0.560,0,87074,3641218
32851632128,101192630272,50102272,732606464,5.592,0.754,93.371,0.283,0,160260,3768192
32853086208,101191036928,50110464,732733440,4.873,0.786,93.618,0.723,0,90306,3634472
32853860352,101190160384,50110464,732831744,4.399,0.874,94.321,0.406,0,143140,3377468
32853475328,101190426624,50110464,732946432,4.639,0.909,93.699,0.752,0,85782,3659684
32855003136,101188788224,50118656,733044736,6.176,0.905,92.545,0.374,0,88082,3777968
32854958080,101188755456,50118656,733122560,4.284,0.719,94.559,0.438,0,88672,3872354
32856719360,101186703360,50126848,733380608,6.365,0.780,92.356,0.499,0,100614,3732812
32856911872,101186416640,50126848,733474816,3.812,0.688,95.125,0.375,0,85072,3620974
32856903680,101186318336,50126848,733581312,4.674,0.690,91.154,3.482,0,118492,3773810
32857837568,101185286144,50126848,733675520,4.401,0.849,94.310,0.440,0,99496,3683822
32858324992,101184704512,50126848,733765632,5.493,0.780,93.290,0.437,0,248858,3660368
32861974528,101180801024,50135040,734011392,6.735,0.935,91.862,0.468,0,373176,3868688
32862363648,101180301312,50135040,734117888,4.415,0.808,94.403,0.373,0,347228,3899150
32862146560,101180403712,50135040,734228480,5.005,0.933,93.348,0.715,0,102236,3941688
32862994432,101179461632,50147328,734310400,4.950,0.809,93.213,1.027,0,123412,4052026
32863887360,101178462208,50147328,734412800,5.844,0.785,92.963,0.408,0,94534,4088228
32865144832,101177106432,50155520,734502912,7.395,0.905,91.139,0.562,0,109630,4184344
32865488896,101176627200,50155520,734638080,4.588,0.713,94.358,0.341,0,90540,3967004
32866734080,101175300096,50155520,734715904,4.267,0.847,94.321,0.565,0,94242,3917234
32866488320,101175431168,50155520,734822400,4.654,0.692,92.642,2.013,0,94288,3606592
32868171776,101173657600,50155520,734912512,5.189,1.000,93.279,0.531,0,90788,3731778
32869396480,101172305920,50163712,735027200,4.936,0.719,93.908,0.437,0,98516,3907148
32870289408,101171302400,50163712,735137792,4.413,0.845,94.210,0.532,0,112212,4186256
32871559168,101169950720,50163712,735219712,5.119,1.311,93.227,0.343,0,200008,4154238
32873009152,101168398336,50163712,735322112,4.640,0.872,93.927,0.561,0,363706,3674748
32874647552,101166657536,50171904,735416320,5.971,0.911,92.615,0.503,0,511954,3769072
32875085824,101166080000,50180096,735535104,5.235,1.028,93.331,0.405,0,486464,3710634
32876392448,101164687360,50180096,735621120,4.009,1.010,94.602,0.379,0,366956,3700226
32877977600,101162979328,50180096,735744000,4.942,0.751,93.775,0.532,0,242968,3846976
32878022656,101162852352,50180096,735825920,5.280,0.687,91.503,2.530,0,182748,4032198
32878530560,101162233856,50180096,735936512,5.380,0.876,93.275,0.469,0,181630,4208696
32879955968,101160685568,50188288,736047104,4.349,0.594,94.650,0.407,0,122814,4189210
32880599040,101159948288,50188288,736141312,6.590,0.743,92.172,0.495,0,142302,3924664
32880390144,101159931904,50188288,736362496,4.217,0.687,94.689,0.406,0,92980,3965424
32881258496,101158948864,50188288,736477184,6.541,0.775,92.188,0.496,0,131708,4085576
32881946624,101158137856,50196480,736591872,3.713,0.629,94.336,1.322,0,120642,3979020
32883085312,101156880384,50204672,736694272,4.984,0.972,93.730,0.313,0,195298,3696300
32883449856,101156425728,50204672,736784384,4.787,0.939,94.024,0.250,0,218134,3672732
32884264960,101155512320,50204672,736870400,4.520,0.842,94.296,0.343,0,240154,3583034
32885374976,101154287616,50204672,736985088,4.300,0.569,94.594,0.537,0,239488,3563162
32887590912,101151965184,50204672,737087488,5.424,0.966,93.392,0.218,0,155744,3528732
32887865344,101151584256,50212864,737177600,5.033,0.870,93.694,0.404,0,127580,3561050
32888049664,101151285248,50212864,737288192,4.890,0.815,93.856,0.439,0,121430,3478586
32889417728,101149806592,50212864,737390592,4.656,0.723,94.181,0.440,0,113234,3558628
32890871808,101148254208,50212864,737484800,4.615,0.811,94.231,0.343,0,84822,3279562
32890372096,101148639232,50212864,737595392,4.281,0.656,93.375,1.688,0,81508,3311116
32891191296,101147705344,50221056,737701888,4.800,1.091,93.672,0.436,0,82330,3113192
32893292544,101145440256,50221056,737792000,5.630,0.715,93.126,0.529,0,89305,3340742
32894709760,101143920640,50221056,737890304,5.247,0.781,93.691,0.281,0,87936,3496708
32894107648,101144403968,50221056,738004992,4.349,0.814,94.180,0.657,0,87772,3496824
32895057920,101143343104,50221056,738107392,6.582,1.056,91.524,0.838,0,88312,3403796
32895664128,101142630400,50237440,738193408,4.786,0.746,93.847,0.622,0,93822,3460884
32896700416,101141499904,50237440,738287616,3.960,1.006,94.626,0.409,0,83136,3381252
32897638400,101140439040,50237440,738406400,5.793,0.997,92.868,0.343,0,78966,3433104
32899223552,101138759680,50237440,738500608,4,0.719,94.938,0.344,0,85544,3761168
32898883584,101138989056,50237440,738607104,5.904,0.839,91.703,1.554,0,88468,3659658
32899903488,101137727488,50245632,738840576,4.871,0.691,93.746,0.691,0,90408,3835034
32899739648,101137784832,50253824,738934784,5.662,0.774,89.697,3.868,0,87020,3722568
32900456448,101136945152,50253824,739057664,5.119,0.905,93.695,0.281,0,87440,3606432
32901234688,101136072704,50253824,739147776,4.330,0.810,94.642,0.218,0,85812,3499238
32902053888,101135151104,50253824,739246080,4.994,0.936,93.820,0.250,0,86922,3502192
32902164480,101134897152,50262016,739348480,4.100,0.751,94.085,1.064,0,81854,3253678
32903172096,101133778944,50270208,739450880,6.312,0.933,92.289,0.466,0,81040,3316058
32903913472,101132926976,50270208,739561472,4.561,0.937,94.002,0.500,0,78680,3221398
32903430144,101133316096,50270208,739655680,4.612,0.873,94.235,0.280,0,80370,3079438
32905531392,101131120640,50270208,739741696,4.777,0.905,94.006,0.312,0,80734,3291218
32907681792,101128867840,50270208,739852288,4.160,0.657,92.774,2.409,0,80966,3055568
32907964416,101128482816,50278400,739946496,5.072,0.908,93.519,0.501,0,82408,3104752
32911491072,101124837376,50278400,740061184,4.251,0.819,94.616,0.315,0,81010,3264252
32912166912,101124022272,50278400,740159488,5.248,0.776,93.354,0.621,0,138954,3367266
32912736256,101123211264,50278400,740261888,3.797,0.809,95.082,0.311,0,100160,3302020
32914599936,101121241088,50278400,740352000,4.786,0.724,93.514,0.976,0,110914,3351872
32915603456,101120114688,50294784,740450304,5.634,0.908,92.864,0.595,0,84664,3518926
32915288064,101120180224,50294784,740700160,4.375,1.117,94.167,0.341,0,116346,3462414
32915320832,101120045056,50294784,740798464,5.640,1.209,92.842,0.310,0,91130,3391660
32914874368,101120401408,50294784,740888576,4.637,0.595,94.424,0.345,0,112598,3411096
32914956288,101120208896,50294784,740999168,6.128,0.660,92.929,0.283,0,96760,3451252
32915070976,101119979520,50302976,741101568,4.706,0.997,93.768,0.530,0,90672,3572086
32915927040,101119012864,50302976,741195776,4.435,0.944,94.243,0.377,0,86406,3655922
32917958656,101116870656,50302976,741306368,4.739,0.816,94.131,0.314,0,90128,3695166
32918257664,101116456960,50302976,741412864,4.744,0.718,94.039,0.499,0,86102,3708618
32925691904,101108932608,50302976,741498880,5.538,0.850,92.133,1.479,0,90218,3785346
32925859840,101108645888,50311168,741609472,5.204,0.752,92.414,1.630,0,87310,3615944
32926232576,101108080640,50311168,741715968,4.290,0.694,94.479,0.536,0,90428,3782128
32925683712,101108531200,50311168,741814272,3.797,0.879,95.011,0.314,0,93452,3915364
32928014336,101106110464,50311168,741904384,6.633,0.841,92.152,0.374,0,95520,3752776
32928047104,101105958912,50311168,742019072,4.760,0.783,93.893,0.564,0,83302,3514696
32927608832,101106274304,50327552,742125568,3.928,0.779,93.672,1.621,0,84932,3340506
32928821248,101104975872,50327552,742211584,5.514,0.752,93.202,0.533,0,81738,3368154
32928886784,101104820224,50327552,742301696,5.263,0.805,93.591,0.341,0,93792,3694410
32929251328,101104328704,50327552,742428672,6.221,1.120,92.286,0.373,0,91360,3903968
32933924864,101099429888,50327552,742653952,5.941,0.933,92.411,0.715,0,89570,3647004
32934776832,101098496000,50335744,742727680,4.195,0.715,93.195,1.896,0,98510,3855220
32935497728,101097656320,50335744,742846464,4.919,0.809,93.929,0.342,0,111542,3996538
32936030208,101097013248,50335744,742957056,4.786,0.970,93.619,0.626,0,100824,3883392
32935837696,101097103360,50335744,743051264,6.227,0.934,92.466,0.374,0,89902,3685478
32935538688,101097299968,50335744,743153664,4.423,0.695,94.566,0.316,0,85686,3623784
32937713664,101095006208,50343936,743256064,3.814,0.656,94.592,0.938,0,104412,3477644
32937623552,101094977536,50352128,743362560,4.293,0.971,94.265,0.470,0,89102,3879600
32945082368,101087424512,50352128,743456768,6.899,0.839,91.889,0.373,0,91378,3703722
32945455104,101086941184,50352128,743559168,4.995,0.749,93.912,0.343,0,108854,3411972
32948273152,101084008448,50352128,743673856,4.281,0.719,94.281,0.719,0,81572,3491584
32946270208,101085913088,50356224,743768064,4.213,0.843,92.665,2.278,0,81928,3518710
32946884608,101085200384,50360320,743862272,4.267,0.533,92.752,2.447,0,89388,3939658
32947458048,101084524544,50360320,743960576,6.268,0.998,92.329,0.405,0,95104,3892182
32954957824,101076910080,50360320,744075264,5.776,1.180,92.733,0.311,0,118966,3699898
32955617280,101076148224,50360320,744173568,5.652,0.683,93.385,0.280,0,87646,3703386
32957509632,101074132992,50368512,744280064,4.191,0.657,94.495,0.657,0,120236,3663744
29039988736,104990953472,50376704,744394752,5.019,0.904,93.111,0.966,0,90826,3816064
25806000128,108225732608,50376704,743600128,4.173,0.941,94.634,0.251,0,91712,3102262
22632538112,111400243200,50376704,742559744,4.847,0.719,94.121,0.313,0,72840,2443294
19399639040,114633678848,50376704,742096896,2.579,0.566,96.698,0.157,0,84732,2095188
16220368896,117814022144,50388992,741044224,2.990,0.779,95.920,0.311,0,46516,1859822
13000957952,121034264576,50401280,740204544,2.282,0.656,95.123,1.938,0,39212,1572640
9764974592,124271095808,50401280,739360768,2.089,0.904,96.788,0.218,0,27656,1135274
6596018176,127440949248,50401280,738504704,1.319,0.377,98.053,0.251,0,25800,895106
3447869440,130590007296,50401280,737636352,1.623,0.312,97.939,0.125,0,39790,545974
1065926656,132972883968,50401280,736751616,0.188,0.250,99.499,0.063,0,81900,272234
1039577088,132999700480,50413568,736313344,0.094,0.063,99.531,0.313,0,129926,7460
1038901248,133000597504,50421760,736083968,0,0.094,99.781,0.125,0,130994,1000
1038368768,133001121792,50421760,736092160,0.063,0,99.937,0,0,108818,3000
1037594624,133001895936,50421760,736092160,0,0.031,99.969,0,0,82042,1000
1037336576,133002153984,50421760,736092160,0,0,100,0,0,10932,1000
1037066240,133002412032,50434048,736092160,0,0,99.969,0.031,0,33058,3380
1037066240,133002412032,50434048,736092160,0,0,100,0,0,4104,2160
1037066240,133002412032,50434048,736092160,0,0.031,99.969,0,0,11766,0
1036808192,133002670080,50434048,736092160,0,0,100,0,0,3400,0
1036800000,133002678272,50434048,736092160,0,0,100,0,0,2698,0
1036800000,133002678272,50434048,736092160,0,0,100,0,0,30918,0
1036017664,133003452416,50442240,736092160,0,0,99.938,0.062,0,3362,0
1036017664,133003452416,50442240,736092160,0,0,100,0,0,28778,662
1035501568,133003968512,50442240,736092160,0,0,100,0,0,4082,0
1035501568,133003968512,50442240,736092160,0,0,100,0,0,8854,0
1035243520,133004226560,50442240,736092160,0,0,100,0,0,4348,0
1035243520,133004226560,50442240,736092160,0,0,100,0,0,32570,624
1035235328,133004226560,50450432,736092160,0,0,99.969,0.031,0,4192,396
1035235328,133004226560,50450432,736092160,0,0,100,0,0,27328,0
1034977280,133004484608,50450432,736092160,0,0,100,0,0,5290,546
1034977280,133004484608,50450432,736092160,0,0,100,0,0,11372,468
1034977280,133004484608,50450432,736092160,0,0,100,0,0,40118,1390
1034719232,133004742656,50450432,736092160,0,0,100,0,0,11552,234
1034711040,133004742656,50458624,736092160,0.031,0,99.906,0.062,0,66908,1124
1034711040,133004742656,50458624,736092160,0,0,100,0,0,11096,390
1088106496,132951126016,50458624,736092160,1.279,0.530,98.190,0,0,487620,30948
1047658496,132989566976,50458624,736100352,0.500,0.281,98.563,0.656,0,190418,30714
