"Dstat 0.7.3 CSV output"
"Author:","Dag Wieers <dag@wieers.com>",,,,"URL:","http://dag.wieers.com/home-made/dstat/"
"Host:","parasilo-6.rennes.grid5000.fr",,,,"User:","root"
"Cmdline:","dstat -m -c -n -o dstat.csv",,,,"Date:","22 Jun 2020 23:53:36 CEST"
"memory usage",,,,"total cpu usage",,,,,"net/total",
"used","free","buff","cach","usr","sys","idl","wai","stl","recv","send"
847798272,133255999488,47435776,673312768,0.955,0.239,98.598,0.208,0,0,0
844972032,133258354688,47439872,673775616,0.968,0.562,98.189,0.281,0,394820,32556
885391360,133217927168,47439872,673779712,0.625,0.344,99.032,0,0,387812,16048
840171520,133263593472,47439872,673333248,0.530,0.187,99.283,0,0,2302,4464
856338432,133246935040,47464448,673779712,0.469,0.156,99.250,0.125,0,385800,13812
845402112,133258317824,47464448,673333248,0.500,0.375,99.126,0,0,3478,6184
845119488,133258600448,47464448,673333248,0,0.031,99.250,0.719,0,234,0
845119488,133258600448,47464448,673333248,0,0,100,0,0,288,0
844587008,133259132928,47464448,673333248,0,0,100,0,0,348,180
844521472,133259186176,47476736,673333248,0,0,99.969,0.031,0,272,0
844722176,133258960896,47497216,673333248,0.031,0,99.875,0.094,0,106,84
854781952,133248712704,47497216,673521664,0.156,0.156,99.687,0,0,388310,16984
842240000,133261430784,47497216,673337344,0.594,0.625,98.781,0,0,4604,6948
851341312,133252141056,47497216,673525760,0.219,0.094,99.687,0,0,165184,8456
855322624,133247893504,47497216,673787904,0.594,0.313,99.093,0,0,391596,21836
856121344,133247066112,47509504,673787904,0.312,0.344,99.312,0.031,0,1282,2064
857214976,133245964288,47509504,673792000,0.594,0.125,99.280,0,0,386200,24764
846462976,133256704000,47521792,673792000,0.375,0.437,99.157,0.031,0,3014,4872
846155776,133257007104,47521792,673792000,0.876,0.532,98.592,0,0,390912,22712
845864960,133257744384,47521792,673345536,0,0,100,0,0,106,132
877748224,133225717760,47521792,673488896,0.812,0.156,99.032,0,0,223176,9964
848551936,133254967296,47534080,673345536,0.938,0.125,98.438,0.500,0,3390,4972
848543744,133254975488,47534080,673345536,0,0,100,0,0,0,0
855441408,133248069632,47546368,673341440,0.689,0.250,98.998,0.063,0,513778,28706
855056384,133248262144,47546368,673533952,0,0.125,99.875,0,0,5096,5488
854790144,133248528384,47546368,673533952,0,0,100,0,0,5436,5390
854777856,133248528384,47558656,673533952,0,0,99.937,0.063,0,5512,5390
854519808,133248786432,47558656,673533952,0,0,100,0,0,5436,5488
854507520,133248786432,47570944,673533952,0,0,99.969,0.031,0,6686,6650
854507520,133248786432,47570944,673533952,0,0,100,0,0,6398,6482
854507520,133248786432,47570944,673533952,0.031,0,99.969,0,0,4966,5292
854507520,133248786432,47570944,673533952,0,0.031,99.969,0,0,5500,5752
854507520,133248786432,47579136,673525760,0,0.031,99.906,0.063,0,5462,5488
846802944,133256478720,47579136,673538048,0,0,100,0,0,3232,3280
845627392,133257830400,47579136,673357824,0.188,0.125,99.687,0,0,172150,14180
845357056,133258100736,47579136,673357824,0,0,100,0,0,288,0
845099008,133258358784,47579136,673357824,0,0,100,0,0,0,0
845099008,133258358784,47579136,673357824,0,0,100,0,0,288,0
845086720,133258358784,47591424,673357824,0,0,99.938,0.062,0,0,0
844558336,133258874880,47603712,673357824,0,0,99.969,0.031,0,106,0
844558336,133258874880,47603712,673357824,0,0,100,0,0,234,0
844300288,133259132928,47603712,673357824,0,0,100,0,0,106,0
845819904,133257416704,47603712,673546240,0.969,0.563,97.999,0.469,0,391872,34400
845553664,133257871360,47603712,673357824,0,0,100,0,0,288,228
845025280,133258387456,47616000,673357824,0,0,99.938,0.062,0,0,0
844193792,133259218944,47616000,673357824,0,0,100,0,0,574,0
844189696,133259223040,47616000,673357824,0,0.031,99.969,0,0,0,0
843919360,133259481088,47628288,673357824,0,0,99.969,0.031,0,500,168
843919360,133259481088,47628288,673357824,0,0,100,0,0,0,0
843919360,133259481088,47628288,673357824,0,0,100,0,0,340,0
843911168,133259481088,47636480,673357824,0,0,99.938,0.062,0,234,0
843911168,133259481088,47636480,673357824,0,0,100,0,0,106,0
843911168,133259481088,47636480,673357824,0,0,100,0,0,182,0
1772347392,132331110400,47636480,673034240,8.780,3.082,88.138,0,0,1326156,62820
4726423552,129375449088,47636480,674381824,26.762,12.851,60.387,0,0,1332154,66222
7595261952,126505005056,47636480,675876864,32.161,11.401,56.438,0,0,1334110,69824
10583334912,123515240448,47644672,677355520,33.668,12.469,53.769,0.094,0,1333100,64154
13460471808,120636538880,47648768,678825984,34.021,12.902,52.983,0.094,0,1336054,69720
16546459648,117548875776,47734784,680329216,35.449,14.613,48.397,1.540,0,1330688,63182
19305193472,114788683776,47738880,681652224,34.085,11.497,54.323,0.094,0,1340226,478869
22322700288,111769731072,47742976,682967040,38.131,13.703,47.946,0.220,0,1387482,4162933
25215438848,108875493376,47759360,684359680,39.767,12.248,47.764,0.220,0,1417392,4925320
28062138368,106027470848,47775744,685580288,40.684,13.157,45.879,0.280,0,1429002,5798340
30515073024,103573823488,47796224,686194688,34.014,10.459,55.151,0.377,0,106842,5321830
30788898816,103299952640,47796224,686239744,13.917,1.401,84.340,0.342,0,133202,7080239
30978252800,103110516736,47796224,686321664,14.047,1.269,84.375,0.309,0,123274,6359608
31142309888,102946390016,47804416,686383104,15.333,1.570,82.728,0.369,0,135112,6459902
31336271872,102752354304,47804416,686456832,16.360,1.842,81.361,0.437,0,134366,6575680
31509999616,102578536448,47812608,686534656,17.808,1.743,78.954,1.494,0,161158,8318623
31683280896,102405120000,47812608,686637056,16.895,1.711,80.896,0.498,0,175332,8651471
31829118976,102259183616,47812608,686735360,15.518,1.924,82.185,0.372,0,152006,6508254
31990444032,102097715200,47820800,686870528,15.633,2.600,81.140,0.627,0,138316,6348808
32098369536,101989683200,47820800,686972928,17.070,2.545,79.671,0.714,0,141884,6274360
32197287936,101890547712,47820800,687190016,15.754,2.259,81.523,0.464,0,148148,6770068
32148684800,101938798592,47902720,687448064,9.648,1.774,77.684,10.893,0,146512,6761142
32096735232,101990641664,47902720,687550464,8.171,1.764,89.694,0.371,0,153512,6954040
32069648384,102017622016,47910912,687644672,8.248,1.953,89.240,0.558,0,151082,6784282
32032645120,102054518784,47910912,687747072,5.769,0.780,93.078,0.374,0,157498,7294968
32021872640,102065197056,47910912,687833088,7.064,1.099,91.429,0.408,0,143004,6289320
32033427456,102053511168,47919104,687947776,9.539,2.338,87.375,0.748,0,129274,5881180
32031105024,102055739392,47919104,688041984,4.756,1.189,93.711,0.344,0,141892,6456550
32034643968,102052089856,47927296,688140288,8.769,1.213,89.490,0.529,0,144532,6238570
32036937728,102049669120,47927296,688234496,6.221,1.026,92.473,0.280,0,128384,5823398
32037998592,102048509952,47927296,688324608,6.827,1.153,91.615,0.405,0,137232,6331150
32033234944,102053158912,47927296,688435200,5.768,1.191,92.727,0.313,0,148782,6834306
32037011456,102049284096,47927296,688529408,6.925,1.061,91.048,0.967,0,147654,6692666
32052621312,102033387520,47935488,688635904,7.101,1.557,90.875,0.467,0,147932,6427568
32055414784,102030499840,47935488,688721920,6.193,0.970,92.493,0.344,0,144580,6527746
32056131584,102029676544,47935488,688824320,5.823,0.850,92.729,0.598,0,149190,6722718
32061792256,102023929856,47935488,688910336,5.120,1.280,93.194,0.406,0,137704,6176456
32063127552,102022492160,47935488,689012736,5.597,0.818,90.755,2.830,0,135886,6143102
32061489152,102023991296,47951872,689131520,6.092,1.000,92.221,0.687,0,134952,6213132
32064311296,102021087232,47951872,689209344,7.449,0.962,91.310,0.279,0,151390,6969730
32069787648,102015504384,47951872,689315840,6.131,1.095,92.493,0.282,0,150622,6909790
32073895936,102011154432,47951872,689537024,5.720,1.113,92.857,0.309,0,143458,6393012
32079974400,102004969472,47951872,689635328,6.698,1.302,91.194,0.806,0,137922,6412546
32082919424,102001901568,47960064,689741824,5.547,1.402,92.708,0.343,0,153198,6894600
32086020096,101998706688,47968256,689827840,6.816,1.525,91.254,0.405,0,155594,7196724
32089071616,101995544576,47968256,689938432,4.882,1.150,93.688,0.280,0,157794,7213850
32093356032,101991170048,47968256,690028544,4.440,1.282,94.059,0.219,0,152058,7032684
32093884416,101990539264,47968256,690126848,6.865,0.994,91.768,0.373,0,143750,6541398
32095318016,101988999168,47976448,690221056,7.591,0.781,90.222,1.406,0,133442,6079044
32098676736,101985533952,47976448,690327552,4.169,0.909,94.577,0.345,0,138164,6426976
32099409920,101984686080,47976448,690438144,5.289,0.871,93.528,0.311,0,149286,6736610
32105816064,101978198016,47976448,690520064,5.364,1.286,93.005,0.345,0,149036,6941500
32106496000,101977415680,47976448,690622464,5.107,1.308,93.242,0.343,0,147284,6739222
32109924352,101973876736,47992832,690712576,6.598,1.307,91.628,0.467,0,154562,7030440
32111341568,101972361216,47992832,690810880,5.135,1.152,93.495,0.218,0,150018,6869326
32111513600,101972078592,47992832,690921472,5.299,0.873,93.516,0.312,0,162126,7433450
32112054272,101971435520,47992832,691015680,6.414,1.345,91.959,0.282,0,146006,6612374
32113991680,101969391616,47992832,691109888,6.791,1.277,91.620,0.312,0,137926,6303934
32115331072,101967949824,48001024,691200000,5.562,1.188,91.906,1.344,0,141444,6460116
32117346304,101965828096,48001024,691302400,6.544,1.315,91.891,0.250,0,156572,6999434
32120205312,101962858496,48001024,691412992,5.452,1.153,93.115,0.280,0,144056,6627162
32121524224,101961351168,48001024,691621888,7.181,1.311,91.165,0.343,0,151182,6874136
32123097088,101959667712,48001024,691732480,8.531,1.219,89.969,0.281,0,152034,6853736
32128176128,101954494464,48009216,691818496,7.695,1.215,90.685,0.405,0,146326,6704078
32133332992,101949194240,48009216,691920896,7.618,1.254,90.282,0.846,0,151846,6860132
32138862592,101943574528,48009216,692006912,6.540,1.183,91.934,0.343,0,149788,6643426
32141242368,101941084160,48009216,692113408,7.114,1.154,91.388,0.343,0,132240,5832210
32143740928,101938466816,48009216,692224000,7.606,1.777,90.399,0.218,0,132990,6026912
32144809984,101937299456,48017408,692310016,6.518,1.692,91.351,0.439,0,139464,6357072
32146534400,101935390720,48025600,692408320,7.652,1.991,89.331,1.026,0,146200,6617952
32153214976,101928574976,48025600,692543488,6.029,0.906,92.784,0.281,0,138396,6043154
32191328256,101890367488,48025600,692633600,7.632,1.135,90.855,0.378,0,150878,6881814
32229867520,101851721728,48025600,692740096,8.629,1.433,89.688,0.249,0,160992,7338260
32269172736,101812310016,48033792,692834304,8.571,1.036,89.922,0.471,0,156454,7111972
32350400512,101730959360,48033792,692948992,10.875,1.031,86.969,1.125,0,143930,6446578
32411156480,101670117376,48033792,693026816,9.040,0.845,89.865,0.250,0,145076,6473906
32446144512,101635031040,48033792,693125120,8.966,0.778,90.006,0.249,0,160828,7382516
32505602048,101575475200,48033792,693223424,9.595,0.774,89.415,0.217,0,151424,6805432
32542326784,101538631680,48041984,693325824,8.895,1.030,89.669,0.406,0,144356,6597626
32580042752,101500760064,48041984,693444608,9.485,0.905,89.267,0.343,0,149934,6842310
32630362112,101450211328,48050176,693661696,9.051,0.936,88.764,1.248,0,147632,6644858
32625623040,101454860288,48050176,693751808,4.928,0.811,93.949,0.312,0,140772,6526308
32624500736,101455884288,48050176,693846016,6.511,0.654,92.555,0.280,0,144336,6513852
32607907840,101472370688,48058368,693944320,4.380,0.876,94.274,0.469,0,143190,6702288
32596246528,101483917312,48058368,694059008,6.008,0.849,92.891,0.252,0,162964,7618968
32597798912,101482274816,48058368,694149120,6.352,0.782,88.298,4.568,0,156756,7003278
32594538496,101485428736,48058368,694255616,7.098,0.996,91.625,0.280,0,146970,6601322
32587440128,101492436992,48058368,694341632,3.583,0.629,95.506,0.283,0,132436,6096306
32588505088,101491257344,48066560,694439936,5.095,0.563,93.842,0.500,0,138350,6378552
32582967296,101496709120,48066560,694525952,5.526,0.816,93.281,0.377,0,143878,6725820
32575803392,101503754240,48074752,694632448,7.615,0.687,91.355,0.343,0,146678,6612826
32570970112,101508468736,48074752,694747136,5.587,0.931,93.172,0.310,0,134894,6084126
32573255680,101506076672,48091136,694837248,3.672,0.691,93.315,2.323,0,132394,5981764
32574877696,101504364544,48091136,694927360,5.235,0.658,93.856,0.251,0,136702,6186536
32573652992,101505499136,48091136,695017472,5.128,0.782,93.746,0.344,0,146074,6637678
32575721472,101503332352,48091136,695115776,6.492,1.030,92.166,0.312,0,153864,6936978
32576339968,101502595072,48091136,695234560,3.625,0.820,94.262,1.293,0,145426,6490938
32577748992,101501079552,48099328,695320576,4.707,0.784,93.881,0.628,0,141102,6172312
32578064384,101500657664,48099328,695427072,4.445,0.725,94.515,0.315,0,135726,6000824
32578777088,101499846656,48099328,695521280,4.661,1.032,94.026,0.282,0,138388,6153510
32581394432,101497012224,48099328,695738368,5.991,0.847,92.880,0.282,0,140582,6322672
32581672960,101496627200,48099328,695844864,4.044,0.784,94.295,0.878,0,140582,6254818
32582676480,101495525376,48107520,695934976,5.647,1.024,92.926,0.403,0,140238,6308134
32581427200,101496655872,48107520,696037376,4.618,0.691,94.345,0.346,0,143578,6728444
32582733824,101495234560,48107520,696147968,4.934,0.723,94.029,0.314,0,153064,6965234
32582090752,101495783424,48107520,696242176,5.533,0.875,93.248,0.344,0,162624,7531920
32583311360,101494460416,48115712,696336384,5.141,0.878,92.821,1.160,0,151538,6793090
32585146368,101492527104,48123904,696426496,6.236,1.055,92.398,0.310,0,162950,7411160
32585867264,101491687424,48123904,696541184,5.498,0.750,93.440,0.312,0,153572,7013386
32585523200,101491945472,48123904,696623104,4.612,0.690,94.383,0.314,0,135752,6204162
32587083776,101490147328,48123904,696856576,6.238,0.686,92.795,0.281,0,145424,6485648
32588079104,101489045504,48123904,696958976,4.684,0.817,93.178,1.320,0,135918,6134204
32588259328,101488750592,48132096,697061376,4.732,0.564,94.265,0.439,0,140550,6215512
32588820480,101488070656,48132096,697180160,4.863,0.904,93.890,0.343,0,137160,6235850
32587300864,101489508352,48132096,697257984,5.017,1.129,93.540,0.314,0,138256,6343390
32589479936,101487230976,48132096,697352192,4.388,0.852,94.444,0.316,0,151120,6836498
32592658432,101483945984,48132096,697454592,4.811,0.692,94.151,0.346,0,139164,6422824
32593367040,101483106304,48148480,697565184,4.840,0.817,92.898,1.446,0,145148,6612702
32595202048,101481140224,48148480,697688064,4.355,0.757,94.478,0.410,0,145374,6575282
32596729856,101479526400,48148480,697774080,4.905,0.843,93.908,0.344,0,141670,6267710
32597409792,101478752256,48148480,697864192,6.012,1.526,92.118,0.343,0,153094,7050812
32598052864,101478006784,48148480,697962496,4.716,0.812,94.066,0.406,0,155488,7124050
32599126016,101476818944,48156672,698064896,5.291,0.845,87.257,6.606,0,153438,6969058
32601722880,101474107392,48156672,698179584,4.861,0.717,94.048,0.374,0,148374,6665106
32602300416,101473427456,48156672,698281984,5.576,1.090,92.991,0.343,0,144984,6622774
32603160576,101472460800,48156672,698388480,4.983,0.846,93.889,0.282,0,152040,6766656
32603201536,101472329728,48156672,698474496,5.223,0.535,93.927,0.315,0,149452,6746836
32604303360,101471109120,48173056,698572800,5.324,0.841,92.279,1.557,0,142846,6647414
32606097408,101469200384,48173056,698687488,4.143,0.596,95.041,0.220,0,156508,7154518
32608677888,101466525696,48173056,698781696,6.232,0.850,92.666,0.252,0,159996,7297428
32611495936,101463592960,48173056,698896384,3.078,0.660,96.043,0.220,0,156276,7271264
32613175296,101461811200,48173056,698998784,5.207,0.972,93.570,0.251,0,165558,7838746
32613523456,101461356544,48181248,699092992,4.661,0.907,94.057,0.375,0,159400,7048256
32617058304,101457715200,48181248,699187200,5.943,1.220,91.117,1.720,0,136676,6181922
32615424000,101459234816,48181248,699293696,3.611,0.785,95.290,0.314,0,132514,6065948
32617512960,101457043456,48181248,699396096,4.466,1.218,94.035,0.281,0,145494,6748046
32619356160,101455077376,48181248,699510784,5.656,1.169,92.859,0.316,0,156268,7101618
32620453888,101453811712,48189440,699666432,4.194,0.757,94.513,0.536,0,158984,7386678
32621056000,101453107200,48197632,699760640,5.611,0.775,92.715,0.899,0,150442,6988254
32620691456,101453365248,48197632,699863040,5.373,0.994,93.292,0.342,0,152124,6923494
32621019136,101452947456,48197632,699953152,4.367,0.754,94.533,0.346,0,153282,7023212
32621391872,101452435456,48197632,700084224,4.997,0.968,93.660,0.375,0,149122,6862448
32622260224,101451460608,48205824,700178432,4.346,0.750,94.371,0.532,0,143282,6494350
32621862912,101451608064,48205824,700411904,5.115,0.717,91.828,2.339,0,143844,6626590
32624533504,101448830976,48205824,700518400,5.222,1.070,92.734,0.975,0,151244,6832046
32624795648,101448445952,48205824,700608512,4.473,0.907,94.370,0.250,0,146486,6558046
32625491968,101447639040,48205824,700715008,3.981,0.533,95.204,0.282,0,153544,7267240
32626450432,101446574080,48214016,700813312,6.107,1.002,92.578,0.313,0,155036,7024492
32626429952,101446479872,48214016,700923904,4.101,0.820,94.795,0.284,0,145952,6823114
32627167232,101445509120,48222208,701149184,5.034,0.876,92.871,1.220,0,156326,7025336
32627953664,101444608000,48222208,701259776,4.258,0.877,94.646,0.219,0,152758,7091306
32627310592,101445140480,48222208,701366272,5.653,0.812,93.348,0.187,0,150650,6995040
32628301824,101444042752,48230400,701460480,4.342,0.661,94.651,0.346,0,147836,6699446
32628039680,101444202496,48230400,701558784,3.648,0.912,95.157,0.283,0,146878,6639286
32628531200,101443592192,48234496,701673472,6.062,0.933,91.856,1.150,0,139728,6369754
32630452224,101441585152,48234496,701755392,2.754,0.657,96.432,0.156,0,157922,7361714
32634019840,101437911040,48234496,701857792,6.145,1.092,92.514,0.250,0,157614,7144508
32632487936,101439332352,48242688,701960192,5.914,0.980,92.694,0.411,0,154744,7261412
32632541184,101439168512,48242688,702070784,4.650,0.718,94.382,0.250,0,151178,6809464
32632545280,101439045632,48250880,702177280,4.634,0.626,94.458,0.282,0,146732,6724950
32633544704,101437960192,48250880,702263296,4.215,0.912,93.929,0.944,0,138164,6318100
32632832000,101438545920,48250880,702373888,4.762,0.747,94.242,0.249,0,142670,6616258
32633942016,101437329408,48259072,702472192,4.889,0.872,93.771,0.467,0,142872,6429442
32633688064,101437480960,48259072,702574592,4.777,1.226,93.777,0.220,0,138546,6227876
32633286656,101437767680,48259072,702681088,4.426,0.847,94.507,0.220,0,135696,6167020
32633917440,101437030400,48259072,702783488,4.748,0.692,92.579,1.981,0,142626,6516658
32634535936,101436313600,48259072,702881792,4.064,0.907,94.780,0.250,0,137282,6091976
32633638912,101437087744,48267264,702996480,3.760,0.537,95.197,0.506,0,143676,6582658
32635420672,101435219968,48267264,703082496,5.959,0.807,93.017,0.217,0,144188,6422220
32637087744,101433442304,48267264,703188992,3.302,0.723,95.723,0.252,0,130356,5932820
32638201856,101432217600,48275456,703291392,7.632,0.841,89.813,1.713,0,130954,5918862
32637956096,101432217600,48275456,703528960,6.252,0.778,92.659,0.311,0,131452,5907484
32640143360,101429927936,48283648,703623168,4.567,0.938,93.963,0.532,0,138604,6250196
32638693376,101431283712,48283648,703717376,3.569,0.814,95.335,0.282,0,135368,6067370
32638447616,101431410688,48283648,703836160,4.777,0.843,94.131,0.250,0,143450,6545800
32639000576,101430763520,48283648,703926272,5.707,0.878,93.070,0.345,0,142600,6504472
32639262720,101430382592,48283648,704036864,4.469,0.656,93.719,1.156,0,154108,7027662
32639655936,101429858304,48291840,704147456,4.867,0.785,93.689,0.659,0,149062,6665936
32640851968,101428568064,48291840,704233472,4.147,0.785,94.722,0.346,0,143734,6447868
32641650688,101427658752,48291840,704335872,4.180,0.691,94.846,0.283,0,142706,6405200
32642355200,101426855936,48291840,704434176,6.001,0.911,92.806,0.283,0,146050,6748568
32642412544,101426696192,48291840,704536576,4.119,0.849,94.780,0.252,0,148510,6745662
32643788800,101425192960,48308224,704647168,4.886,0.903,93.526,0.685,0,152914,7020574
32644276224,101424607232,48308224,704741376,4.928,0.842,94.042,0.187,0,153118,6834438
32644227072,101424545792,48308224,704851968,5.499,0.932,93.259,0.311,0,154794,7238276
32645165056,101423509504,48308224,704942080,4.396,0.816,94.505,0.283,0,149490,6655656
32645898240,101422678016,48308224,705040384,3.917,0.721,94.140,1.222,0,133868,5918952
32646877184,101421584384,48316416,705146880,5.045,0.877,93.513,0.564,0,138822,6251408
32646840320,101421379584,48316416,705388544,4.665,0.626,94.396,0.313,0,142586,6500024
32646660096,101421449216,48316416,705495040,4.172,0.784,94.793,0.251,0,139320,6426524
32646287360,101421715456,48316416,705597440,3.594,0.788,95.240,0.378,0,140492,6479130
32647221248,101420679168,48316416,705695744,4.433,1.069,90.538,3.961,0,153150,6950782
32648814592,101418975232,48324608,705794048,6.002,0.938,92.216,0.844,0,151026,6932174
32648654848,101419040768,48324608,705888256,4.621,0.812,94.349,0.219,0,156168,7238250
32648859648,101418713088,48324608,706007040,5.053,0.847,93.879,0.220,0,165472,7555104
32650825728,101416648704,48324608,706105344,4.846,1.243,93.569,0.342,0,154240,7036626
32652267520,101415108608,48324608,706199552,5.114,0.842,93.764,0.281,0,146070,6758950
32654577664,101412630528,48340992,706306048,5.660,0.818,92.170,1.352,0,429794,7052804
32659095552,101408018432,48340992,706396160,6.236,0.807,92.585,0.372,0,161682,7393404
32660443136,101406556160,48340992,706510848,5.042,0.846,93.830,0.282,0,162638,7419518
32661413888,101405478912,48340992,706609152,4.662,0.626,94.462,0.250,0,147790,6646060
32663298048,101403496448,48340992,706707456,7.054,0.990,91.584,0.371,0,136238,6139268
32664076288,101402595328,48349184,706818048,4.778,0.718,92.005,2.498,0,132444,5954382
32665395200,101401174016,48349184,706916352,4.689,0.750,94.311,0.250,0,141002,6400850
32664453120,101402021888,48349184,707010560,4.812,0.688,94.250,0.250,0,138486,6202526
32665575424,101400784896,48349184,707125248,5.192,1.095,93.431,0.282,0,132318,5949180
32667123712,101399142400,48349184,707215360,5.296,1.065,93.419,0.219,0,120248,5346972
32667844608,101398175744,48357376,707448832,5.075,0.747,92.870,1.308,0,130774,6102916
32667377664,101398528000,48365568,707551232,4.298,0.601,94.595,0.506,0,145612,6575860
32666243072,101399556096,48365568,707657728,4.194,0.720,94.804,0.282,0,145574,6555860
32666169344,101399527424,48365568,707760128,5.002,0.598,94.149,0.252,0,147852,6844858
32667062272,101398528000,48365568,707862528,5.107,0.872,93.678,0.343,0,141998,6502200
32667521024,101397950464,48373760,707964928,5.016,0.654,93.738,0.592,0,144940,6602884
32668532736,101396828160,48373760,708067328,3.872,0.692,92.414,3.022,0,137640,6094986
32668758016,101396504576,48373760,708161536,3.876,0.599,95.304,0.221,0,120682,5291898
32669245440,101395910656,48373760,708268032,5.230,0.752,93.674,0.345,0,121430,5476772
32669851648,101395226624,48373760,708345856,4.267,0.973,94.478,0.282,0,124420,5535574
32670126080,101394763776,48381952,708526080,4.716,0.843,93.848,0.593,0,127460,5816590
32670883840,101393891328,48390144,708628480,4.568,0.977,93.289,1.166,0,139178,6199358
32670949376,101393731584,48390144,708722688,3.764,0.690,95.263,0.282,0,146568,6677300
32670412800,101394149376,48390144,708833280,3.801,0.628,95.193,0.377,0,152574,6851802
32672219136,101392216064,48390144,708927488,6.430,0.721,92.566,0.282,0,136982,6240624
32672075776,101392244736,48398336,709033984,4.144,0.816,94.443,0.597,0,143976,6618084
32673136640,101391069184,48398336,709148672,3.974,0.939,94.775,0.313,0,151782,6887824
32673333248,101390778368,48398336,709234688,4.637,0.909,92.920,1.535,0,145866,6521262
30731784192,103332220928,48398336,709332992,4.286,1.135,94.233,0.347,0,151928,6752078
27051941888,107012411392,48398336,708980736,4.135,0.971,94.737,0.157,0,126894,5759002
23796473856,110268669952,48410624,708169728,3.393,0.534,95.727,0.346,0,109332,5119292
20600078336,113465737216,48410624,707497984,4.659,1.001,94.090,0.250,0,98938,4332896
17433210880,116633423872,48418816,706662400,1.826,0.661,96.568,0.945,0,77496,3535950
14303559680,119763910656,48418816,705818624,3.175,0.629,96.008,0.189,0,72112,3291776
11118030848,122950279168,48418816,704974848,2.166,0.596,97.112,0.126,0,64446,2907016
7980486656,126088671232,48431104,704114688,1.064,0.470,98.121,0.344,0,36708,1628110
4803575808,129266442240,48431104,703254528,2.154,0.343,97.472,0.031,0,24480,1026110
2450120704,131620777984,48435200,702369792,0.845,0.250,98.342,0.563,0,15002,581914
906059776,133165723648,48435200,701485056,0.219,0.156,99.625,0,0,3604,118122
887877632,133184348160,48435200,701042688,0.031,0.063,99.906,0,0,898,9168
887877632,133184348160,48435200,701042688,0,0,100,0,0,234,0
887865344,133184348160,48447488,701042688,0.031,0,99.938,0.031,0,106,0
887607296,133184606208,48447488,701042688,0,0,100,0,0,106,84
887595008,133184606208,48455680,701046784,0,0,99.969,0.031,0,288,0
887336960,133184864256,48455680,701046784,0,0,100,0,0,234,0
887078912,133185122304,48455680,701046784,0,0,100,0,0,106,0
887078912,133185122304,48455680,701046784,0,0,100,0,0,0,0
886812672,133185380352,48463872,701046784,0,0.031,99.938,0.031,0,288,0
886296576,133185896448,48463872,701046784,0,0,100,0,0,234,0
886296576,133185896448,48463872,701046784,0,0,100,0,0,224,132
886296576,133185896448,48463872,701046784,0,0,100,0,0,0,0
886296576,133185896448,48463872,701046784,0,0,100,0,0,106,0
886296576,133185896448,48463872,701046784,0,0,100,0,0,366,0
886288384,133185896448,48472064,701046784,0,0,99.938,0.062,0,288,1564
888049664,133184028672,48472064,701046784,0.125,0.031,99.844,0,0,398678,23914
900120576,133170700288,48472064,701505536,0.750,0.094,99.156,0,0,2240,1208
884645888,133185728512,48472064,701059072,0.500,0.438,99.062,0,0,13162,29442
