172.16.66.55 : 0.02 0.03 0.03 0.03 0.03 0.03 0.03 0.03 0.05 0.03
172.16.66.56 : 0.25 0.23 0.23 0.19 0.22 0.23 0.23 0.23 0.22 0.16
172.16.66.57 : 24.00 10.39 10.36 10.38 10.36 10.36 10.21 - 10.35 10.28
172.16.66.58 : 14.54 - 10.34 10.28 10.36 10.34 10.34 10.24 10.38 10.40
172.16.66.59 : 14.61 10.27 10.28 10.25 10.29 10.27 10.25 10.21 10.28 10.26
172.16.66.6  : 11.09 10.39 10.38 - 10.36 10.40 10.39 10.37 10.38 10.38
172.16.66.60 : 11.09 10.33 10.31 10.32 10.32 10.32 10.31 10.32 10.32 10.31
172.16.66.61 : 19.93 10.38 10.37 10.36 - - 10.37 10.34 10.34 10.38
172.16.66.62 : 20.06 10.21 10.27 10.27 10.35 10.38 10.34 10.39 10.33 10.32
172.16.66.64 : 20.23 10.39 10.35 10.24 10.25 10.21 10.25 10.29 10.33 10.23
172.16.66.65 : 11.10 10.37 10.35 10.34 10.36 10.31 10.39 10.36 10.38 -
172.16.66.66 : 20.10 10.35 10.43 10.35 10.36 10.33 10.38 10.39 10.30 10.36
172.16.66.67 : - 10.31 10.30 10.26 10.37 10.33 10.35 10.39 10.37 10.35
172.16.66.69 : - 10.42 10.39 10.35 10.39 10.36 10.32 10.41 10.39 10.37
172.16.66.7  : 11.13 4.37 4.39 4.39 4.40 4.40 4.37 4.30 4.39 4.32
172.16.66.70 : 11.15 4.34 4.39 4.38 4.38 4.41 4.36 4.33 4.37 4.29
172.16.66.71 : 19.97 4.30 4.30 4.29 4.27 4.29 4.24 4.31 4.28 4.32
172.16.66.72 : 20.11 4.29 4.42 4.37 4.31 4.39 4.32 4.42 4.36 4.34
172.16.66.73 : 20.07 4.34 4.37 4.33 4.32 4.33 4.29 4.39 4.33 4.29
172.16.66.74 : 20.03 4.37 4.41 4.36 4.37 4.41 4.29 4.40 4.38 4.38
172.16.66.75 : 21.40 4.31 4.40 4.38 4.37 4.42 4.38 4.41 4.31 4.37
172.16.66.76 : 17.43 4.38 4.40 4.32 4.38 4.38 4.36 4.34 4.38 4.37
172.16.66.77 : 16.65 4.38 4.38 4.36 4.35 4.40 4.30 4.34 4.38 4.40
172.16.66.78 : 16.62 4.38 4.38 4.37 4.36 4.34 4.40 4.37 4.39 4.40
172.16.66.79 : 16.54 4.37 4.34 4.33 4.37 4.37 4.36 4.38 4.35 4.32
172.16.66.8  : 16.54 4.37 4.32 4.28 4.37 4.27 4.37 4.36 4.36 4.32
172.16.66.80 : 19.98 4.38 4.38 4.38 4.40 4.36 4.35 4.40 4.38 4.40

      27 targets
      27 alive
       0 unreachable
       0 unknown addresses

       7 timeouts (waiting for response)
     270 ICMP Echos sent
     262 ICMP Echo Replies received
       0 other ICMP received

 0.02 ms (min round trip time)
 7.48 ms (avg round trip time)
 24.0 ms (max round trip time)
       10.150 sec (elapsed real time)

