"Dstat 0.7.3 CSV output"
"Author:","Dag Wieers <dag@wieers.com>",,,,"URL:","http://dag.wieers.com/home-made/dstat/"
"Host:","grisou-28.nancy.grid5000.fr",,,,"User:","root"
"Cmdline:","dstat -m -c -n -o dstat.csv",,,,"Date:","27 May 2020 10:57:51 CEST"
"memory usage",,,,"total cpu usage",,,,,"net/total",
"used","free","buff","cach","usr","sys","idl","wai","stl","recv","send"
1218695168,132320931840,58368000,1198698496,1.362,0.144,98.438,0.056,0,0,0
1231663104,132307636224,58380288,1199038464,0.717,0.250,98.472,0.561,0,390764,14986
1214230528,132325515264,58380288,1198592000,0.843,0.500,98.657,0,0,13348,15920
1237299200,132301987840,58380288,1199042560,0.845,0.250,98.905,0,0,399400,13042
1218764800,132320956416,58392576,1198596096,0.250,0.313,99.375,0.063,0,9510,13612
1231581184,132307689472,58392576,1199042560,0.563,0.219,99.219,0,0,391366,11158
1218822144,132320862208,58404864,1198600192,0.438,0.563,97.717,1.282,0,6590,16704
1218813952,132320870400,58404864,1198600192,0,0,100,0,0,5400,456
1218289664,132321394688,58404864,1198600192,0,0,100,0,0,11176,2380
1218289664,132321394688,58404864,1198600192,0,0,100,0,0,7890,0
1218277376,132321394688,58417152,1198600192,0,0,99.969,0.031,0,16614,220
1218019328,132321652736,58417152,1198600192,0,0,100,0,0,23152,84
1218011136,132321652736,58425344,1198600192,0,0,99.969,0.031,0,10420,496
1218011136,132321652736,58425344,1198600192,0,0,100,0,0,20078,0
1217703936,132321959936,58425344,1198600192,0,0.031,99.969,0,0,46074,0
1217703936,132321959936,58425344,1198600192,0,0,100,0,0,46680,0
1217437696,132322226176,58425344,1198600192,0.031,0,99.969,0,0,27980,0
1217179648,132322484224,58425344,1198600192,0,0,100,0,0,18046,0
1217171456,132322484224,58433536,1198600192,0,0,99.906,0.094,0,14202,0
1233879040,132305776640,58433536,1198600192,0.656,0.188,99.156,0,0,395020,15282
1223053312,132316594176,58433536,1198600192,0.500,0.500,99,0,0,14498,15380
1227309056,132312338432,58433536,1198600192,0.344,0.250,99.406,0,0,180130,15454
1230417920,132309209088,58433536,1198620672,0.125,0.125,99.750,0,0,401872,14368
1224585216,132315037696,58433536,1198620672,0.969,0.532,98.499,0,0,19760,16362
1224232960,132315377664,58445824,1198620672,0,0,99.969,0.031,0,9730,0
1224110080,132315480064,58458112,1198624768,1.125,0.656,98.156,0.062,0,417994,26622
1223536640,132316053504,58458112,1198624768,0,0,100,0,0,68198,84
1225875456,132313432064,58462208,1198895104,1.063,0.626,97.810,0.500,0,445408,26390
1226141696,132313423872,58462208,1198637056,0,0.031,99.969,0,0,28170,0
1226129408,132313436160,58462208,1198637056,0.031,0,99.969,0,0,10170,0
1226735616,132312944640,58486784,1198493696,1.595,0.250,98.030,0.125,0,225436,11488
1225416704,132314087424,58486784,1198637056,0,0.031,99.969,0,0,5972,2668
1225265152,132314238976,58486784,1198637056,0,0,99.844,0.156,0,7202,0
1225265152,132314238976,58486784,1198637056,0,0,99.844,0.156,0,1522,0
1225801728,132313927680,58486784,1198411776,0.438,0.156,99.406,0,0,343998,15020
1230778368,132308508672,58511360,1198829568,0.219,0.063,99.593,0.125,0,186062,20018
1230745600,132308541440,58511360,1198829568,0,0.031,99.969,0,0,15850,13328
1229705216,132309581824,58511360,1198829568,0,0,100,0,0,16644,13328
1229705216,132309581824,58511360,1198829568,0.031,0,99.969,0,0,13330,12936
1229230080,132310044672,58515456,1198837760,0.031,0.031,99.500,0.438,0,36654,13230
1228713984,132310560768,58515456,1198837760,0,0.031,99.969,0,0,19760,18578
1228386304,132310872064,58531840,1198837760,0,0.031,99.906,0.063,0,30998,13202
1228378112,132310880256,58531840,1198837760,0,0,100,0,0,15156,13328
1228361728,132310896640,58531840,1198837760,0.094,0,99.906,0,0,16916,13230
1228095488,132311162880,58531840,1198837760,0,0.031,99.969,0,0,26334,12936
1220194304,132319064064,58531840,1198837760,0.031,0,99.969,0,0,3956,3510
1218617344,132320821248,58531840,1198657536,0.281,0.125,99.594,0,0,172546,14316
1218387968,132321038336,58544128,1198657536,0,0,99.937,0.063,0,6348,220
1218387968,132321038336,58544128,1198657536,0,0,100,0,0,15690,856
1218387968,132321038336,58544128,1198657536,0,0,100,0,0,4558,0
1217470464,132321955840,58544128,1198657536,0,0,99.750,0.250,0,3296,220
1217466368,132321955840,58556416,1198649344,0,0,99.937,0.063,0,22558,0
1217445888,132321964032,58556416,1198661632,0,0,100,0,0,1352,0
1217875968,132321259520,58564608,1198919680,0.970,0.782,98.217,0.031,0,402060,30794
1216806912,132322586624,58564608,1198661632,0,0,100,0,0,6960,264
1216765952,132322627584,58564608,1198661632,0,0,100,0,0,14104,1008
1266556928,132272586752,58585088,1198858240,1.157,0.250,98.187,0.406,0,342884,13288
1371586560,132168224768,58585088,1198223360,1.752,0.188,98.061,0,0,42284,696
1372651520,132167151616,58597376,1198223360,0,0,99.969,0.031,0,12766,168
1372381184,132167409664,58609664,1198223360,0,0,99.937,0.063,0,10314,84
1372123136,132167667712,58609664,1198223360,0.031,0,99.969,0,0,3762,84
1371607040,132168183808,58613760,1198219264,0,0,99.750,0.250,0,4752,0
1450377216,132089397248,58613760,1198235648,3.476,0.345,96.179,0,0,16608,1418
1486606336,132053159936,58621952,1198235648,3.316,0.063,96.591,0.031,0,10248,1754
1515290624,132024475648,58621952,1198235648,3.161,0.063,96.776,0,0,2472,1680
1563709440,131976052736,58621952,1198239744,3.160,0.094,96.746,0,0,23574,2248
1618096128,131921657856,58630144,1198239744,3.223,0.094,96.621,0.063,0,16546,1952
1711677440,131827949568,58630144,1198243840,6.363,0.281,93.356,0,0,4099058,64844
1897283584,131642339328,58630144,1198247936,10.774,0.345,88.882,0,0,15180212,440162
2025197568,131514413056,58638336,1198252032,9.369,0.781,89.819,0.031,0,25632186,780850
2029416448,131510190080,58638336,1198256128,8.430,0.281,91.289,0,0,42076248,1219258
2028490752,131510984704,58646528,1198256128,8.989,0.531,90.449,0.031,0,54961164,1521932
2096582656,131442888704,58646528,1198260224,10.192,1.239,88.569,0,0,66389980,1824328
2121957376,131417509888,58646528,1198264320,10.066,0.844,89.090,0,0,78146956,2126670
2190106624,131349352448,58654720,1198264320,12.656,1.188,86.125,0.031,0,93504984,2469165
2221170688,131318288384,58654720,1198264320,10.310,1.065,88.624,0,0,95107918,2612992
2293829632,131245621248,58662912,1198264320,10.993,1.686,87.289,0.031,0,107948330,2903132
2335125504,131204317184,58662912,1198272512,11.578,1.058,87.364,0,0,116572604,3102496
2406891520,131132547072,58662912,1198276608,11.194,1.689,87.117,0,0,116145288,3075142
2595442688,130943983616,58671104,1198280704,11.315,1.652,86.970,0.062,0,115592294,3143441
2699943936,130839482368,58671104,1198280704,10.990,1.280,87.699,0.031,0,113770726,3103760
2703446016,130835976192,58671104,1198284800,11.423,0.968,87.609,0,0,121479636,3326570
3001741312,130537676800,58671104,1198288896,12.122,1.932,85.946,0,0,116961982,3261222
3004116992,130535297024,58671104,1198292992,10.955,0.657,88.388,0,0,113934338,3231984
3002572800,130536873984,58679296,1198252032,10.442,0.878,88.648,0.031,0,110122802,3261800
3316252672,130223144960,58679296,1198301184,10.875,1.250,87.750,0.125,0,109447158,3158026
3318124544,130221268992,58679296,1198305280,10.736,0.814,88.388,0.063,0,119369062,3271918
3321921536,130217472000,58679296,1198305280,11.990,0.965,87.045,0,0,117801348,3415678
3461554176,130077835264,58679296,1198309376,11.226,1.192,87.582,0,0,112602344,3325070
3724017664,129815359488,58687488,1198313472,11.108,1.092,87.769,0.031,0,112833264,3307214
3724361728,129815011328,58687488,1198317568,11.598,0.933,87.469,0,0,117582500,3432274
3726069760,129813303296,58687488,1198317568,11.305,1.090,87.605,0,0,114475762,3446032
3726602240,129812758528,58687488,1198321664,11.570,0.625,87.649,0.156,0,109701636,3444200
4199350272,129340002304,58687488,1198329856,11.350,1.933,86.717,0,0,120253590,3602450
4198293504,129341046784,58695680,1198333952,11.139,0.811,88.019,0.031,0,108171540,3327292
4200660992,129338675200,58695680,1198338048,10.787,0.784,88.429,0,0,114506202,3414270
4206010368,129333321728,58695680,1198338048,11.389,0.939,87.672,0,0,114761430,3328490
4204740608,129334579200,58703872,1198342144,10.584,1.030,88.230,0.156,0,112849792,3650681
4207542272,129331773440,58703872,1198346240,10.996,1.034,87.970,0,0,114906790,3512202
4209000448,129330298880,58712064,1198354432,11.882,1.337,86.719,0.062,0,117054054,3617334
4208250880,129331044352,58712064,1198358528,11.128,0.717,88.155,0,0,109154994,3430724
4207992832,129331298304,58712064,1198362624,11.128,0.781,88.090,0,0,108599658,3358604
4216455168,129322835968,58712064,1198362624,11.785,0.719,87.496,0,0,115241416,3480134
4214059008,129325223936,58716160,1198366720,11.906,0.750,87.344,0,0,119133066,3711162
4218052608,129321209856,58724352,1198374912,11.677,0.999,87.262,0.062,0,126245496,3850936
4217974784,129321283584,58724352,1198379008,10.882,0.657,88.462,0,0,110727040,3591840
4215537664,129323716608,58724352,1198383104,11.354,0.845,87.801,0,0,108652902,3607476
4214775808,129324474368,58724352,1198387200,11.634,0.998,87.367,0,0,109480210,3588230
4215119872,129324130304,58724352,1198387200,12.270,0.997,86.733,0,0,117666670,3792204
4215103488,129324134400,58732544,1198391296,12.016,0.905,87.047,0.031,0,122406570,3884654
4217446400,129321783296,58732544,1198399488,12.050,1.346,86.604,0,0,120889376,3864984
4217413632,129321811968,58732544,1198403584,11.524,0.906,87.570,0,0,113457990,3738032
4216762368,129322459136,58732544,1198407680,13.072,1.027,85.901,0,0,120368884,3907564
4214579200,129324638208,58732544,1198411776,12.293,0.842,86.864,0,0,116455842,3908800
4536766464,129002442752,58740736,1198411776,12.085,1.534,86.318,0.063,0,113402524,3777300
4643278848,128895926272,58740736,1198415872,11.475,2.370,86.155,0,0,119787100,3858594
5009248256,128529952768,58740736,1198419968,12.215,1.406,86.379,0,0,113957042,3939256
5348548608,128190607360,58740736,1198432256,11.606,1.913,86.481,0,0,120652850,3907058
5418520576,128120602624,58740736,1198432256,11.014,1.533,87.453,0,0,120760144,3965614
5499375616,128039731200,58748928,1198436352,12.976,0.749,86.245,0.031,0,122068380,4017401
6169882624,127369220096,58748928,1198440448,10.372,1.281,88.347,0,0,111294100,3800957
6637707264,126901395456,58748928,1198440448,11.715,2.624,85.661,0,0,115278672,3986374
6639460352,126899634176,58748928,1198448640,11.070,0.967,87.746,0.218,0,120203692,3983894
6679879680,126859210752,58748928,1198452736,11.236,1.436,87.328,0,0,113623148,3900364
6760996864,126778212352,58757120,1198448640,11.619,1.910,86.439,0.031,0,112517474,3796209
6782300160,126756909056,58757120,1198448640,11.118,0.872,88.010,0,0,116024838,3925492
6779441152,126759763968,58757120,1198452736,11.787,0.655,87.558,0,0,115297104,3979284
6779273216,126759927808,58757120,1198456832,10.331,0.968,88.452,0.250,0,113303114,3933363
6778372096,126760816640,58765312,1198460928,12.009,0.624,87.024,0.343,0,114527550,3953872
6779416576,126759755776,58773504,1198469120,10.381,0.876,88.680,0.063,0,116117464,4068871
6777024512,126762143744,58773504,1198473216,10.874,0.877,88.248,0,0,115836360,4001279
6790385664,126748782592,58773504,1198473216,13.176,1.025,85.799,0,0,113578884,3976466
6794883072,126744281088,58773504,1198477312,10.809,0.906,88.285,0,0,118012876,4004908
6825680896,126713470976,58781696,1198481408,12.210,0.939,86.381,0.470,0,118919594,4244449
6827687936,126711451648,58789888,1198485504,13.133,0.993,85.843,0.031,0,123607470,4007259
6824718336,126714417152,58789888,1198489600,10.970,0.870,88.160,0,0,117231960,4253389
6826352640,126712778752,58789888,1198493696,12.290,0.685,87.026,0,0,113936000,4052056
6815633408,126723493888,58789888,1198497792,12.751,0.681,86.568,0,0,116042196,4093220
6815834112,126723280896,58798080,1198501888,11.440,0.810,87.687,0.062,0,114503498,4055992
6815997952,126723104768,58806272,1198505984,11.505,0.815,87.618,0.063,0,118996942,4232054
6815834112,126723497984,58806272,1198276608,11.519,0.809,87.671,0,0,118233430,4171022
6817951744,126721130496,58806272,1198522368,12.546,0.742,86.712,0,0,115463954,4148375
6817304576,126721777664,58806272,1198522368,11.635,0.683,87.682,0,0,115975890,4215243
6820077568,126719000576,58806272,1198526464,11.882,0.938,87.179,0,0,112014272,4102663
6819401728,126719664128,58814464,1198530560,11.038,0.782,88.180,0,0,119118406,4223806
6823256064,126715805696,58814464,1198534656,12.098,0.844,87.058,0,0,113021204,4134249
6837411840,126701645824,58814464,1198538752,15.204,0.874,83.921,0,0,115778356,4166618
6825279488,126713765888,58814464,1198551040,11.211,0.810,87.979,0,0,116149172,4181981
6827356160,126711689216,58814464,1198551040,12.605,1.435,85.741,0.218,0,119237358,4327568
6828216320,126710816768,58822656,1198555136,11.746,1.468,86.535,0.250,0,117906842,4256194
6830137344,126708891648,58822656,1198559232,12.449,0.970,86.581,0,0,117559972,4298549
6831456256,126707568640,58822656,1198563328,11.856,0.780,87.363,0,0,114286130,4084627
6830088192,126708932608,58822656,1198567424,12.383,0.842,86.775,0,0,114120016,3886370
6830260224,126708744192,58830848,1198575616,11.494,0.971,87.128,0.407,0,118875392,4924424
6831308800,126707683328,58839040,1198579712,11.917,1.001,87.050,0.031,0,110987580,4177128
6832078848,126706913280,58839040,1198579712,12.068,0.974,86.958,0,0,110524156,4277024
6850936832,126688051200,58839040,1198583808,15.986,1.099,82.915,0,0,115808564,4363258
6846316544,126692663296,58839040,1198592000,13.005,0.909,86.086,0,0,113435146,4196536
6849277952,126689685504,58847232,1198600192,11.313,1.410,86.901,0.376,0,109867652,4195936
6848434176,126690521088,58855424,1198600192,12.488,0.912,86.537,0.063,0,120883690,4431080
6849220608,126689730560,58855424,1198604288,11.509,0.943,87.547,0,0,114649618,4201030
6850809856,126688137216,58855424,1198608384,13.952,0.872,85.176,0,0,115199970,4443242
6913720320,126625218560,58855424,1198616576,12.208,1.308,86.484,0,0,114290942,4306974
6981152768,126557777920,58863616,1198616576,13.360,1.364,85.028,0.248,0,122924236,4675632
7439654912,126099263488,58871808,1198620672,11.174,2.034,86.761,0.031,0,118371902,4471604
7492628480,126046277632,58871808,1198628864,11.722,1.163,87.115,0,0,120103178,4493394
7492710400,126046191616,58871808,1198632960,11.502,0.849,87.649,0,0,113870070,4426872
7494901760,126043996160,58871808,1198637056,11.606,0.847,87.547,0,0,113958734,4418906
7496183808,126043033600,58880000,1198309376,13.259,0.840,85.496,0.405,0,114409282,4340246
7513849856,126025334784,58888192,1198333952,12.512,1.342,86.115,0.031,0,110461814,4299390
7567335424,125971533824,58888192,1198649344,11.824,1.251,86.925,0,0,117851550,4557456
7640518656,125898338304,58888192,1198653440,11.811,1.963,86.226,0,0,118480992,4504084
7689596928,125849251840,58888192,1198661632,11.724,1.809,86.467,0,0,116044882,4537782
7720849408,125817995264,58888192,1198665728,12.263,1.307,86.430,0,0,114309208,4386892
7792730112,125746098176,58904576,1198665728,13.106,1.845,84.798,0.250,0,115794366,4351596
7839272960,125699551232,58904576,1198669824,11.261,1.286,87.453,0,0,112922460,4488928
7909892096,125628923904,58904576,1198678016,11.735,1.529,86.735,0,0,112921730,4387304
7957049344,125581762560,58904576,1198682112,11.969,1.156,86.875,0,0,116024904,4446830
8004902912,125533904896,58904576,1198686208,12.091,1.246,86.663,0,0,115830928,4457030
8077135872,125461651456,58920960,1198690304,12.414,1.310,85.870,0.405,0,107419032,4182640
8111038464,125427744768,58920960,1198694400,12.852,1.188,85.960,0,0,118960982,4329384
8109297664,125429858304,58920960,1198321664,11.910,0.969,87.121,0,0,116914990,4418926
8134533120,125404241920,58920960,1198702592,13.169,0.809,86.021,0,0,119578584,4449288
8183062528,125355708416,58920960,1198706688,12.624,1.179,86.197,0,0,117561668,4578342
8267313152,125271822336,58937344,1198325760,13.530,1.555,84.386,0.529,0,117560618,4532504
8318459904,125220282368,58937344,1198718976,11.658,1.714,86.627,0,0,116549382,4352412
8369373184,125169364992,58937344,1198723072,11.696,0.909,87.394,0,0,112320252,4319278
8429420544,125109309440,58937344,1198731264,12.249,1.347,86.404,0,0,115894234,4643642
8483270656,125055459328,58937344,1198731264,13.493,1.901,84.606,0,0,113813040,4182394
8537894912,125001220096,58953728,1198329856,12.473,1.403,85.719,0.405,0,115694198,4404622
8620789760,124917915648,58953728,1198739456,13.269,2.331,84.400,0,0,126419520,5008064
8678010880,124860686336,58953728,1198747648,11.654,1.159,87.187,0,0,108483208,4399574
8731340800,124807360512,58953728,1198743552,11.999,1.616,86.385,0,0,119633500,4524364
8788418560,124750274560,58953728,1198751744,12.438,1.454,86.108,0,0,113272552,4397223
8849985536,124688678912,58974208,1198759936,12.228,1.493,85.781,0.498,0,114999312,4355124
8929841152,124608819200,58974208,1198764032,12.131,1.991,85.879,0,0,122256252,4791950
8985124864,124553527296,58974208,1198772224,11.516,1.587,86.897,0,0,111330710,4419820
9036853248,124501794816,58974208,1198776320,12.751,1.393,85.856,0,0,117782556,4413746
9099247616,124439396352,58974208,1198780416,11.979,1.680,86.341,0,0,118516926,4553146
9150906368,124387717120,58990592,1198784512,11.455,1.502,86.667,0.376,0,119604522,4118788
9203408896,124335206400,58990592,1198792704,12.733,1.180,86.087,0,0,119300426,5039264
9265537024,124273078272,58990592,1198792704,11.752,1.746,86.502,0,0,118410116,4421372
9325522944,124213088256,58990592,1198796800,11.683,1.036,87.280,0,0,117014068,4503220
9386496000,124152111104,58990592,1198800896,11.499,1.131,87.370,0,0,113099936,4504232
9448103936,124090482688,59006976,1198804992,11.768,1.377,86.416,0.438,0,118978474,4571810
9508175872,124030402560,59006976,1198813184,12.286,1.154,86.561,0,0,117262782,4505272
9567559680,123971014656,59006976,1198817280,11.889,1.681,86.430,0,0,116056114,4174282
9630863360,123908173824,59006976,1198354432,11.669,1.373,86.958,0,0,111997342,4703802
9695592448,123843444736,59006976,1198354432,11.314,1.069,87.618,0,0,112189546,4349566
9756700672,123781849088,59023360,1198825472,11.509,1.164,86.981,0.346,0,121557614,4636022
9816444928,123722571776,59023360,1198358528,11.719,1.406,86.875,0,0,114226740,4467170
9884594176,123654422528,59023360,1198358528,12.492,1.096,86.412,0,0,111569858,4284473
9933238272,123605295104,59023360,1198841856,12.485,1.425,86.090,0,0,116643630,4547436
9998737408,123539795968,59023360,1198841856,12.277,0.906,86.817,0,0,113173510,4429561
10063769600,123474735104,59039744,1198850048,12.062,1.188,86.500,0.250,0,116598778,4446633
10135375872,123402874880,59039744,1199104000,11.825,1.342,86.583,0.250,0,112160006,4068770
10163945472,123374301184,59039744,1199108096,12.092,1.523,86.385,0,0,115008336,4875010
10233630720,123304611840,59039744,1199112192,12.715,1.531,85.754,0,0,115641762,4416486
10297507840,123240730624,59039744,1199116288,12.670,1.735,85.595,0,0,118355714,4541272
10368585728,123169640448,59047936,1199120384,12.098,1.657,86.214,0.031,0,121364892,4615120
10435588096,123102625792,59056128,1199124480,11.765,1.095,86.577,0.563,0,110869516,4390564
10462597120,123075612672,59056128,1199128576,10.568,1.317,88.115,0,0,115320642,4447785
10535084032,123003121664,59056128,1199132672,11.916,1.411,86.673,0,0,115738958,4531000
10601373696,122936827904,59056128,1199136768,12.273,1.816,85.911,0,0,113899662,4414392
10665381888,122872803328,59064320,1199144960,11.985,1.290,86.694,0.031,0,122416534,4532804
10730905600,122807267328,59072512,1199149056,12,1.219,86.531,0.250,0,116035934,4543684
10768101376,122770063360,59072512,1199157248,12.313,1.153,86.534,0,0,118538832,4596682
10839146496,122699018240,59072512,1199157248,12.247,1.683,86.070,0,0,116272016,4479566
10906755072,122631405568,59072512,1199161344,11.897,1.127,86.976,0,0,114631224,4430488
10947031040,122591113216,59080704,1199169536,10.589,1.065,88.315,0.031,0,117418412,4441260
11020926976,122517204992,59088896,1199173632,11.956,1.315,86.354,0.376,0,113470870,4511008
11084509184,122453618688,59088896,1199177728,11.470,1.630,86.901,0,0,109410398,4363960
11126030336,122412097536,59088896,1199177728,11.617,1.005,87.378,0,0,113210880,4478954
11204825088,122333298688,59088896,1199181824,11.869,1.168,86.963,0,0,115867492,4494425
11280953344,122257154048,59097088,1199190016,10.772,1.134,88.094,0,0,116052960,4490132
11311783936,122226311168,59105280,1199194112,11.971,0.940,86.681,0.407,0,115385818,4510370
11377831936,122160218112,59105280,1199198208,12.422,2.060,85.518,0,0,111735550,4406986
11411501056,122126544896,59105280,1199202304,11.876,1.100,87.025,0,0,116408678,4550032
11495784448,122042257408,59105280,1199206400,12.006,2.208,85.785,0,0,119133034,4535588
11571576832,121967194112,59113472,1198469120,11.370,1.522,87.077,0.031,0,111474032,4390328
11610095616,121927921664,59121664,1199214592,12.170,1.801,85.191,0.838,0,115286592,4524248
11685109760,121852899328,59121664,1199222784,12,1.719,86.281,0,0,116670830,4119346
11725541376,121812459520,59121664,1199230976,12.465,1.057,86.478,0,0,113245698,4588570
11801628672,121736372224,59121664,1199230976,12.725,1.862,85.413,0,0,113718022,4656754
11839754240,121698234368,59129856,1199235072,10.483,0.785,88.701,0.031,0,113635348,4476922
11918442496,121619533824,59138048,1199239168,11.978,1.466,86.057,0.499,0,109618426,4399602
11956944896,121581027328,59138048,1199243264,12.114,1.155,86.731,0,0,116355400,4396598
12039475200,121498492928,59138048,1199247360,12.286,1.559,86.155,0,0,114378668,4514492
12083367936,121454518272,59138048,1199255552,10.467,1.160,88.374,0,0,118225630,4336128
12164026368,121373847552,59146240,1199259648,12.574,1.123,86.271,0.031,0,111134096,4552160
12204236800,121333624832,59154432,1199263744,11.748,1.371,86.039,0.841,0,111490080,4330464
12267630592,121270231040,59154432,1199263744,11.975,1.505,86.520,0,0,113626622,4531434
12305821696,121232031744,59154432,1199271936,10.388,1.158,88.454,0,0,117664254,4493358
12390608896,121147240448,59154432,1199276032,12.395,1.495,86.110,0,0,111846368,4088190
12433412096,121104424960,59162624,1199280128,12.114,1.467,86.388,0.031,0,114922068,4829686
12471808000,121066020864,59166720,1199284224,10.754,1.091,87.843,0.312,0,113101140,4404880
12561895424,120975917056,59170816,1199292416,12.256,1.131,86.518,0.094,0,109784896,4231176
12607053824,120930754560,59170816,1199296512,11.886,1.314,86.800,0,0,110828612,4503132
12695293952,120842514432,59170816,1199296512,12.251,1.808,85.941,0,0,117050196,4572638
12734160896,120803635200,59179008,1199300608,10.472,1.250,88.246,0.031,0,114352806,4481940
12779638784,120758153216,59179008,1199304704,11.741,1.775,86.484,0,0,110530484,4410044
12869775360,120668004352,59187200,1199308800,12.386,1.380,85.952,0.282,0,108583420,4253132
12910751744,120627171328,59187200,1199157248,10.342,1.254,88.405,0,0,115946894,4615886
13008732160,120529027072,59187200,1199321088,15.083,2.132,82.785,0,0,116861060,4507514
13053739008,120484175872,59195392,1199157248,15.442,1.370,83.157,0.031,0,111012804,4350034
13086330880,120451416064,59195392,1199325184,12.633,1.092,86.276,0,0,112925064,4213850
13174976512,120362926080,59203584,1199161344,14.117,1.461,84.391,0.031,0,116645848,4597072
13215252480,120322473984,59203584,1199337472,12.188,1.625,86.188,0,0,121837856,4585953
13263278080,120274444288,59203584,1199341568,10.693,1.243,88.063,0,0,111733200,4431442
13356851200,120180858880,59211776,1199345664,12.644,2.029,85.108,0.219,0,116872984,4542070
13399732224,120138092544,59211776,1199230976,11.920,1.129,86.951,0,0,116955214,4557408
13489471488,120048971776,59211776,1198612480,11.779,1.347,86.873,0,0,116439716,4515708
13536575488,120001122304,59211776,1199357952,11.181,0.879,87.940,0,0,113170266,4285456
13578571776,119959121920,59211776,1199362048,11.867,1.133,87.000,0,0,118411696,4522173
13674496000,119863185408,59219968,1199366144,12.046,2.253,85.670,0.031,0,121338500,4490799
13718626304,119819051008,59219968,1199370240,10.423,1.064,88.513,0,0,111262044,4346062
13769506816,119768371200,59219968,1199169536,11.547,1.318,86.978,0.157,0,111000920,4466255
13788069888,119749595136,59219968,1199382528,10.079,0.819,89.102,0,0,115599272,4365494
13882662912,119655002112,59219968,1199382528,12.496,1.503,86.001,0,0,119436304,4756384
13931458560,119606194176,59228160,1199386624,11.557,0.853,87.559,0.032,0,110151702,4382588
13981450240,119556415488,59228160,1199173632,10.119,1.535,88.346,0,0,116267978,4517022
14077181952,119460450304,59236352,1199398912,12.038,1.787,85.987,0.188,0,114967390,4296918
14131720192,119405899776,59244544,1199403008,12.300,1.035,86.602,0.063,0,116195686,4760618
14177652736,119359963136,59244544,1199407104,10.749,1.222,88.029,0,0,121660216,4623272
14230315008,119307296768,59244544,1199411200,11.917,1.564,86.519,0,0,114424812,4297962
14325125120,119212478464,59244544,1199419392,12.201,1.101,86.698,0,0,112527500,4538392
14374084608,119163510784,59252736,1199419392,10.865,0.999,88.105,0.031,0,116045524,4539194
14423150592,119114436608,59252736,1199427584,11.891,1.061,87.047,0,0,96116876,3978878
14470459392,119067119616,59252736,1199435776,9.681,1.093,89.225,0,0,85071104,3991686
14518231040,119019343872,59252736,1199439872,11.225,0.811,87.964,0,0,75415946,3650074
14518448128,119019122688,59252736,1199443968,8.565,0.531,90.903,0,0,62548722,3193862
14539476992,118998085632,59269120,1199435776,9.012,0.717,90.022,0.249,0,56327150,3128112
14586957824,118951337984,59269120,1198702592,10.171,0.715,89.114,0,0,42203680,2913390
14589022208,118948532224,59269120,1199443968,7.942,0.188,91.870,0,0,29905070,2540136
14589943808,118947602432,59269120,1199452160,7.268,0.187,92.545,0,0,16738738,2481182
14591303680,118946242560,59269120,1199452160,7.322,0.093,92.585,0,0,4598648,2129012
14594191360,118944088064,59285504,1198702592,6.583,0.031,92.699,0.686,0,70492,2117469
14593974272,118943555584,59285504,1199452160,6.502,0.063,93.404,0.031,0,42350,2030172
14595317760,118942212096,59285504,1199452160,6.702,0.062,93.236,0,0,108990,2181752
14598295552,118939971584,59285504,1198714880,7.083,0.093,92.824,0,0,98124,1721316
14628179968,118910341120,59285504,1198460928,6.902,0.187,92.911,0,0,65574,2281756
14629158912,118908358656,59293696,1199456256,6.825,0.062,93.082,0.031,0,72788,2304330
14629662720,118908092416,59301888,1199210496,6.669,0.093,93.175,0.062,0,34008,2046510
14630281216,118907228160,59301888,1199456256,6.529,0.031,93.440,0,0,47130,1788048
14632726528,118904778752,59301888,1199460352,6.818,0.093,93.088,0,0,84656,2443188
14632574976,118904930304,59301888,1199460352,6.967,0,93.033,0,0,110316,2115722
14633291776,118904213504,59310080,1199452160,6.560,0.031,93.377,0.031,0,113116,1954480
14634156032,118903341056,59310080,1199460352,6.354,0.031,93.615,0,0,76710,2111864
14636216320,118901276672,59310080,1199464448,6.554,0.094,93.352,0,0,65682,2061990
14637637632,118899855360,59310080,1199464448,6.938,0.062,92.999,0,0,66110,2051302
14640750592,118897483776,59310080,1198723072,6.412,0.094,93.494,0,0,90538,2026822
14645612544,118892613632,59318272,1198723072,6.527,0.187,93.285,0,0,91726,2188074
14646644736,118891581440,59318272,1198723072,6.523,0.218,93.040,0.218,0,76770,2082538
14648549376,118889672704,59318272,1198727168,6.706,0.125,93.169,0,0,47682,2055250
14652702720,118884777984,59318272,1199468544,6.970,0.062,92.968,0,0,51490,2011418
14655451136,118882029568,59318272,1199468544,7.048,0.062,92.890,0,0,46440,2163750
14660153344,118877319168,59326464,1199468544,6.617,0.031,93.321,0.031,0,75830,2007110
14664192000,118873280512,59326464,1199468544,6.531,0.062,93.406,0,0,79702,2187740
14668189696,118869270528,59334656,1199472640,6.412,0.031,93.525,0.031,0,113584,1996072
14671380480,118866079744,59334656,1199472640,6.646,0.031,93.323,0,0,82988,2020246
14681272320,118856187904,59334656,1199472640,6.904,0.125,92.971,0,0,93410,2178291
14684536832,118852915200,59342848,1199472640,9.654,1.152,89.131,0.062,0,89226,2125497
1192484864,132345212928,59342848,1199226880,0.406,0.219,99.375,0,0,71944,660
1184366592,132353552384,59342848,1199005696,0.031,0.063,99.906,0,0,96952,0
1184079872,132353839104,59342848,1199005696,0.031,0,99.969,0,0,67614,0
1183956992,132353961984,59342848,1199005696,0,0,100,0,0,48382,0
1183956992,132353961984,59342848,1199005696,0,0,100,0,0,34932,0
1183944704,132353961984,59363328,1198997504,0.031,0,99.469,0.500,0,4348,0
1183936512,132353961984,59363328,1199005696,0,0,100,0,0,73236,2380
1183961088,132353863680,59363328,1199005696,0,0,100,0,0,158078,0
1183961088,132353863680,59363328,1199005696,0,0.031,99.969,0,0,147096,1508
1183961088,132353863680,59363328,1199005696,0,0,100,0,0,27260,0
1183961088,132353863680,59371520,1198997504,0,0,99.969,0.031,0,57288,0
1183952896,132353863680,59371520,1199005696,0,0,99.937,0.063,0,17026,0
1183952896,132353863680,59371520,1199005696,0,0,100,0,0,74746,0
1183952896,132353863680,59371520,1199005696,0,0,100,0,0,32536,0
1183952896,132353863680,59371520,1199005696,0,0,100,0,0,74776,0
1183952896,132353863680,59371520,1199005696,0.031,0,99.969,0,0,14938,0
1183821824,132353986560,59379712,1199005696,0,0,99.938,0.062,0,2692,0
1183817728,132353986560,59379712,1199009792,0,0,100,0,0,13282,0
1209630720,132327952384,59379712,1199009792,0.939,0.250,98.811,0,0,455460,22026
1210474496,132325105664,59379712,1199022080,0.469,0.469,99.062,0,0,147000,29074
