172.16.72.21 : 4.25 4.33 4.29 4.28 4.27 4.28 4.27 4.31 4.28 4.30
172.16.72.22 : 4.29 4.32 4.28 4.28 4.29 4.26 4.30 4.29 4.26 4.30
172.16.72.23 : 0.19 0.19 0.20 0.19 0.19 0.21 0.19 0.20 0.21 0.19
172.16.72.24 : 0.19 0.21 0.20 0.18 0.18 0.19 0.20 0.20 0.18 0.18
172.16.72.25 : 0.20 0.20 0.17 0.21 0.21 0.20 0.19 0.19 0.22 0.21
172.16.72.26 : 0.17 0.14 0.19 0.14 0.15 0.16 0.17 0.17 0.19 0.15
172.16.72.27 : 0.20 0.15 0.18 0.17 0.16 0.14 0.14 0.11 0.18 0.15
172.16.72.28 : 0.17 0.16 0.18 0.18 0.18 0.17 0.19 0.18 0.18 0.15
172.16.72.29 : 0.16 0.17 0.20 0.18 0.20 0.17 0.20 0.21 0.17 0.19
172.16.72.3  : 0.14 0.18 0.13 0.19 0.20 0.17 0.17 0.17 0.20 0.20
172.16.72.30 : 0.20 0.20 0.18 0.16 0.20 0.16 0.19 0.19 0.20 0.19
172.16.72.31 : 0.15 0.18 0.19 0.22 0.19 0.17 0.17 0.17 0.12 0.14
172.16.72.32 : 0.20 0.18 0.16 0.19 0.17 0.19 0.20 0.21 0.19 0.21
172.16.72.33 : 0.17 0.15 0.17 0.19 0.17 0.19 0.19 0.17 0.20 0.19
172.16.72.34 : 0.04 0.03 0.03 0.03 0.01 0.03 0.03 0.03 0.01 0.03
172.16.72.35 : 0.27 0.21 0.20 0.18 0.17 0.21 0.21 0.17 0.20 0.20
172.16.72.36 : 0.28 0.21 0.18 0.20 0.20 0.20 0.20 0.21 0.21 0.21
172.16.72.37 : 0.25 0.21 0.20 0.17 0.17 0.19 0.19 0.20 0.21 0.20
172.16.72.38 : 4.35 4.31 4.30 4.28 4.31 4.27 4.28 4.29 4.27 4.26
172.16.72.39 : 4.33 4.29 4.23 4.29 4.27 4.23 4.30 4.26 4.27 4.27
172.16.72.4  : 4.39 4.29 4.28 4.27 4.24 4.25 4.25 4.27 4.27 4.27
172.16.72.40 : 8.59 4.25 4.26 4.27 4.27 4.27 4.29 4.28 4.27 4.25
172.16.72.41 : 4.32 4.29 4.28 4.26 4.29 4.29 4.29 4.25 4.33 4.31
172.16.72.43 : 4.35 4.31 4.29 4.27 4.28 4.26 4.25 4.28 4.30 4.29
172.16.72.44 : 4.41 4.24 4.28 4.27 4.28 4.32 4.29 4.28 4.29 4.29
172.16.72.45 : 4.37 4.31 4.31 4.33 4.30 4.30 4.29 4.28 4.32 4.31
172.16.72.46 : 4.28 4.25 4.27 4.25 4.28 4.31 4.29 4.29 4.30 4.27
172.16.72.47 : 8.41 4.29 4.32 4.29 4.33 4.31 4.31 4.31 4.29 4.32
172.16.72.49 : 4.25 4.25 4.30 4.29 4.29 4.28 4.26 4.28 4.27 4.29
172.16.72.5  : 4.36 - 4.33 4.28 4.30 4.29 4.30 4.30 4.29 4.30
172.16.72.50 : 8.50 4.26 4.23 4.33 4.32 4.29 4.31 4.26 4.30 4.29
172.16.72.51 : 4.27 4.31 4.30 4.31 4.29 4.30 4.31 4.32 4.31 4.30
172.16.72.6  : 4.31 4.30 4.29 4.26 4.30 4.26 4.29 4.30 4.32 4.30
172.16.72.7  : 4.25 4.30 4.28 4.28 4.25 4.24 4.26 4.28 4.26 4.25
172.16.72.8  : 4.40 4.32 4.30 4.29 4.31 4.30 4.31 4.28 4.31 4.30

      35 targets
      35 alive
       0 unreachable
       0 unknown addresses

       1 timeouts (waiting for response)
     350 ICMP Echos sent
     349 ICMP Echo Replies received
       0 other ICMP received

 0.01 ms (min round trip time)
 2.43 ms (avg round trip time)
 8.59 ms (max round trip time)
       10.305 sec (elapsed real time)

