"Dstat 0.7.3 CSV output"
"Author:","Dag Wieers <dag@wieers.com>",,,,"URL:","http://dag.wieers.com/home-made/dstat/"
"Host:","grisou-14.nancy.grid5000.fr",,,,"User:","root"
"Cmdline:","dstat -m -c -n -o dstat.csv",,,,"Date:","27 May 2020 11:12:59 CEST"
"memory usage",,,,"total cpu usage",,,,,"net/total",
"used","free","buff","cach","usr","sys","idl","wai","stl","recv","send"
2860142592,129826934784,77135872,1976659968,0.612,0.251,99.083,0.054,0,0,0
2869702656,129817247744,77135872,1976815616,0.531,0.156,99.312,0,0,387148,14922
2863325184,129823883264,77135872,1976557568,0.532,0.595,98.873,0,0,5572,17632
2873016320,129813741568,77135872,1977004032,0.533,0.251,98.214,1.003,0,383426,11158
2866511872,129820692480,77135872,1976557568,0.688,0.562,98.750,0,0,4762,15396
2877808640,129809108992,77160448,1976815616,0.407,0.125,99.374,0.094,0,382638,10756
2867404800,129819766784,77160448,1976557568,0.657,0.594,98.749,0,0,4894,15914
2867122176,129820049408,77160448,1976557568,0.031,0,99.969,0,0,1562,0
2867122176,129820049408,77160448,1976557568,0.031,0.031,99.937,0,0,628,0
2866933760,129820237824,77160448,1976557568,0.031,0.031,99.937,0,0,970,662
2865946624,129821224960,77160448,1976557568,0.031,0.063,99.906,0,0,1278,0
2865664000,129821483008,77185024,1976557568,0.063,0.031,99.844,0.063,0,1314,0
2865405952,129821741056,77185024,1976557568,0.031,0.031,99.937,0,0,1444,0
2864566272,129822580736,77185024,1976557568,0.125,0.062,99.812,0,0,670,0
2864050176,129823096832,77185024,1976557568,0.063,0.031,99.906,0,0,756,496
2863820800,129823326208,77185024,1976557568,0.063,0.031,99.906,0,0,2192,0
2863407104,129823739904,77185024,1976557568,0.031,0.063,99.906,0,0,5858,0
2863398912,129823739904,77193216,1976557568,0.031,0,99.906,0.063,0,1090,0
2865012736,129822126080,77193216,1976557568,0.125,0.094,99.781,0,0,389394,12844
2868801536,129818333184,77193216,1976557568,0.939,0.720,98.341,0,0,8126,17646
2869522432,129817554944,77193216,1976598528,0.719,0.500,98.781,0,0,344172,25390
2880729088,129805893632,77197312,1977044992,1.092,0.687,98.221,0,0,388350,16802
2871140352,129815928832,77197312,1976598528,0.219,0.156,99.625,0,0,7230,15736
2884747264,129801863168,77209600,1977044992,0.814,0.438,98.717,0.031,0,384492,12794
2872422400,129814622208,77221888,1976598528,0.375,0.281,98.656,0.688,0,5952,13860
2874036224,129812746240,77221888,1976856576,0.125,0.063,99.812,0,0,383394,10840
2873081856,129813958656,77221888,1976598528,0.938,0.719,98.343,0,0,4956,16014
2872807424,129814233088,77221888,1976598528,0.031,0.063,99.906,0,0,4212,0
2875482112,129811505152,77234176,1976598528,1.656,0.344,97.969,0.031,0,222870,11268
2875351040,129811623936,77246464,1976598528,0.063,0.063,99.594,0.281,0,4938,2668
2875334656,129811640320,77246464,1976598528,0.031,0.031,99.937,0,0,586,0
2876293120,129810677760,77246464,1976602624,0.282,0.125,99.593,0,0,169490,6860
2874048512,129812783104,77246464,1976741888,0.281,0.063,99.656,0,0,176096,8050
2886049792,129800577024,77258752,1976934400,0.375,0.156,99.406,0.063,0,179206,21210
2884747264,129801867264,77275136,1976930304,0,0.031,99.499,0.470,0,39812,13132
2884153344,129802448896,77275136,1976942592,0.063,0.031,99.687,0.219,0,12600,13230
2884153344,129802448896,77275136,1976942592,0.031,0.063,99.906,0,0,12478,13132
2883551232,129803051008,77275136,1976942592,0.063,0.031,99.906,0,0,12832,12826
2883035136,129803567104,77275136,1976942592,0.031,0.031,99.937,0,0,19626,18746
2883026944,129803567104,77283328,1976942592,0,0.031,99.906,0.063,0,13188,13328
2882760704,129803825152,77291520,1976942592,0.031,0.063,99.781,0.125,0,13344,13132
2882547712,129804038144,77291520,1976942592,0.031,0.063,99.906,0,0,12884,13034
2882547712,129804038144,77291520,1976942592,0.063,0.031,99.906,0,0,12418,13156
2874765312,129812004864,77291520,1976758272,0.156,0.094,99.750,0,0,16168,5842
2875768832,129810997248,77291520,1976762368,0.313,0.156,99.531,0,0,172516,14284
2875670528,129810608128,77320192,1977217024,1.188,0.750,97.281,0.781,0,391166,30794
2874920960,129594605568,77320192,2188009472,2.033,2.534,95.433,0,0,172468,14080
3016720384,129451819008,77320192,2188034048,4.245,1.155,94.600,0,0,169118,10282
3219136512,129248989184,77406208,2188144640,7.812,1.058,90.321,0.809,0,332,264
3351760896,129062789120,77455360,2240212992,11.943,1.372,85.407,1.278,0,526,0
3413815296,128998621184,77475840,2241904640,14.935,1.958,82.918,0.189,0,2030,2432
3973726208,128385454080,77475840,2292584448,36.530,3.281,60.189,0,0,349058,32590
4005576704,128352940032,77475840,2292822016,6.897,0.696,92.407,0,0,272052,44740
4011302912,128347213824,77475840,2292822016,2.031,0.375,97.595,0,0,169732,6804
4011585536,128346931200,77475840,2292822016,0.377,0.314,99.309,0,0,72378,2626
4014977024,128343523328,77488128,2292822016,0.564,0.438,98.967,0.031,0,62364,876
4014800896,128343687168,77500416,2292822016,0.345,0.626,98.966,0.063,0,62574,960
4013752320,128344735744,77500416,2292822016,0.564,0.501,98.936,0,0,61686,1354
4013453312,128345034752,77500416,2292822016,0.377,0.346,99.277,0,0,88132,1008
4013711360,128344776704,77500416,2292822016,0.533,0.470,98.997,0,0,79758,876
4055543808,128302944256,77500416,2292822016,6.598,0.657,92.745,0,0,78986,3256
4066226176,128292261888,77500416,2292822016,4.862,0.376,94.762,0,0,83654,876
4064600064,128293879808,77508608,2292822016,0.595,0.595,98.779,0.031,0,88406,3514
4063707136,128294772736,77508608,2292822016,0.440,0.314,99.246,0,0,83680,876
4063186944,128295292928,77508608,2292822016,0.502,0.408,99.091,0,0,80146,876
4063178752,128295301120,77508608,2292822016,0.283,0.408,99.309,0,0,71352,876
4062654464,128295825408,77508608,2292822016,0.220,0.533,99.247,0,0,67916,1032
4082655232,128275824640,77508608,2292822016,3.006,0.532,96.462,0,0,351830,4690
4094648320,128263823360,77516800,2292822016,2.073,0.471,97.393,0.063,0,699694,7476
4116340736,128242122752,77516800,2292822016,1.353,0.378,98.269,0,0,549764,60164
4119728128,128238702592,77516800,2292822016,1.411,0.815,97.680,0.094,0,501738,389948
4131373056,128227057664,77516800,2292822016,0.909,0.721,97.899,0.470,0,438038,113612
4160663552,128197767168,77516800,2292822016,1.318,0.879,97.804,0,0,489866,170228
4173438976,128184991744,77516800,2292822016,1.035,0.628,98.337,0,0,693290,117152
4180971520,128177442816,77533184,2292822016,0.817,0.503,98.555,0.126,0,481332,112364
4186488832,128171925504,77533184,2292822016,0.815,0.689,98.496,0,0,431290,56500
4189134848,128169279488,77533184,2292822016,0.533,0.659,96.896,1.913,0,372828,3858
4192894976,128165519360,77533184,2292822016,0.378,0.284,96.563,2.775,0,744152,7882
4207316992,128151097344,77533184,2292822016,0.688,0.844,96.655,1.813,0,917178,8854
4222124032,128136290304,77533184,2292822016,1.161,0.471,98.369,0,0,924902,116618
4251504640,128106901504,77541376,2292822016,1.600,0.596,97.772,0.031,0,1033924,172828
4252303360,128106094592,77549568,2292822016,0.750,0.625,98.562,0.062,0,753380,7446
4252045312,128106352640,77549568,2292822016,0.377,0.471,99.152,0,0,863544,9786
4251013120,128107384832,77549568,2292822016,0.629,0.409,98.963,0,0,870950,62656
4249272320,128109125632,77549568,2292822016,0.565,0.565,98.870,0,0,806214,7362
4248707072,128109690880,77549568,2292822016,0.721,0.658,98.622,0,0,872954,8328
4251312128,128107077632,77557760,2292822016,0.691,0.440,98.807,0.063,0,1022692,8412
4257517568,128100872192,77557760,2292822016,0.721,0.658,98.621,0,0,1573234,14236
4261969920,128096419840,77557760,2292822016,0.781,0.719,98.500,0,0,1442154,13278
4277358592,128081031168,77557760,2292822016,0.879,0.660,98.461,0,0,1508670,125360
4279611392,128078778368,77557760,2292822016,0.816,0.534,98.650,0,0,1340792,12006
4280225792,128078163968,77557760,2292822016,1.158,0.501,98.341,0,0,1342604,11742
4284411904,128073969664,77565952,2292822016,0.943,0.440,98.585,0.031,0,1177844,11038
4291895296,128066486272,77565952,2292822016,1.068,0.440,98.492,0,0,1546974,126350
4292476928,128065904640,77565952,2292822016,0.471,0.565,98.964,0,0,1390368,11784
4292771840,128065609728,77565952,2292822016,0.661,0.566,98.773,0,0,1384424,11916
4293287936,128065093632,77565952,2292822016,0.690,0.721,98.589,0,0,1399724,12972
4293029888,128065351680,77565952,2292822016,0.657,0.657,98.686,0,0,1396426,12130
4302626816,128055746560,77574144,2292822016,0.972,0.565,98.432,0.031,0,1279716,11832
4303462400,128054906880,77574144,2292826112,0.910,0.627,98.463,0,0,1281424,120580
4307140608,128051228672,77574144,2292826112,1.157,0.845,97.998,0,0,1234588,12154
4306915328,128051453952,77574144,2292826112,0.689,0.658,98.652,0,0,1498002,13056
4306399232,128051970048,77574144,2292826112,0.379,0.221,99.401,0,0,1282958,11606
4308312064,128050057216,77574144,2292826112,0.439,0.784,98.776,0,0,1172244,9636
4307787776,128050573312,77582336,2292826112,0.376,0.407,98.746,0.470,0,1341238,12534
4307750912,128050610176,77582336,2292826112,0.408,0.439,99.153,0,0,1506272,13056
4315230208,128043130880,77582336,2292826112,0.661,0.252,99.087,0,0,1603476,16700
4316069888,128042291200,77582336,2292826112,0.971,0.564,98.466,0,0,1428052,121018
4320985088,128037376000,77582336,2292826112,1.346,0.501,98.153,0,0,1333894,11874
4324495360,128033849344,77598720,2292826112,0.407,0.564,98.872,0.157,0,1445146,13146
4342390784,128015953920,77598720,2292826112,1.069,0.534,98.397,0,0,1497394,13320
4370034688,127988310016,77598720,2292826112,1.006,0.440,98.554,0,0,1333302,12570
4391583744,127966760960,77598720,2292826112,1.562,0.781,97.658,0,0,1491376,175096
4393422848,127964921856,77598720,2292826112,0.378,0.283,99.339,0,0,1284540,11304
4377391104,127980953600,77598720,2292826112,0.564,0.596,98.495,0.345,0,1651296,118600
4377120768,127981211648,77606912,2292826112,0.470,0.720,98.716,0.094,0,1388694,12132
4375973888,127982350336,77615104,2292826112,0.566,0.283,99.119,0.031,0,1642394,14982
4383043584,127975280640,77615104,2292826112,0.876,0.595,98.529,0,0,1600392,14014
4383006720,127975317504,77615104,2292826112,0.658,0.689,98.653,0,0,1318392,113820
4384313344,127974006784,77615104,2292826112,0.787,0.409,98.804,0,0,1335816,64456
4386947072,127971373056,77615104,2292826112,0.627,0.564,98.810,0,0,1324592,11346
4411408384,127946903552,77623296,2292826112,0.879,0.565,98.524,0.031,0,1229072,321604
4420280320,127937933312,77623296,2292826112,0.753,0.627,98.620,0,0,1634836,283972
4420304896,127937863680,77623296,2292830208,0.721,0.533,98.746,0,0,1604350,13800
4419014656,127939153920,77623296,2292830208,0.503,0.566,98.932,0,0,1328994,11646
4418654208,127939514368,77623296,2292830208,0.657,0.814,98.528,0,0,1399032,11916
4407255040,127950905344,77631488,2292830208,0.535,0.504,98.898,0.063,0,1316066,11832
4406874112,127951278080,77639680,2292830208,0.441,0.472,99.056,0.031,0,1239778,11608
4406874112,127951278080,77639680,2292830208,0.628,0.471,98.902,0,0,1281590,12132
4406358016,127951794176,77639680,2292830208,0.690,0.721,98.589,0,0,1427028,12576
4412325888,127945826304,77639680,2292830208,0.660,0.566,98.774,0,0,1486748,375576
4422737920,127935414272,77639680,2292830208,0.719,0.907,98.374,0,0,1631460,14502
4432007168,127926145024,77639680,2292830208,0.905,0.874,98.220,0,0,1532512,13840
4438032384,127920111616,77647872,2292830208,0.409,0.598,98.899,0.094,0,1478270,12618
4438032384,127920111616,77647872,2292830208,0.750,0.812,98.438,0,0,1377718,12048
4441698304,127916445696,77647872,2292830208,0.472,0.346,99.182,0,0,1152510,10692
4441378816,127916765184,77647872,2292830208,0.626,0.751,98.622,0,0,1533544,13584
4441894912,127916249088,77647872,2292830208,0.346,0.378,99.276,0,0,1216868,11608
4444508160,127913635840,77647872,2292830208,0.532,0.783,98.685,0,0,1484116,13188
4445016064,127913119744,77656064,2292830208,0.565,0.659,98.745,0.031,0,1485702,13584
4452405248,127905730560,77656064,2292830208,0.786,0.503,98.711,0,0,1743086,17626
4461457408,127896678400,77656064,2292830208,3.067,0.689,96.244,0,0,1583842,14196
4462686208,127895449600,77656064,2292830208,2.286,0.501,97.213,0,0,1645916,16652
4464783360,127893352448,77656064,2292830208,1.315,0.626,98.059,0,0,1325244,12402
4489555968,127868579840,77656064,2292830208,0.941,0.690,98.369,0,0,1306476,11874
4496695296,127861432320,77664256,2292830208,0.409,0.503,99.025,0.063,0,1657416,324742
4498534400,127859593216,77664256,2292830208,0.315,0.410,99.275,0,0,1482346,12882
4504457216,127853629440,77664256,2292830208,0.502,0.659,98.839,0,0,1442470,12964
4509917184,127848169472,77664256,2292830208,0.751,0.845,98.405,0,0,1841942,16254
4516978688,127841103872,77664256,2292834304,1.604,0.535,97.861,0,0,1643438,16482
4528799744,127829274624,77680640,2292826112,3.917,0.501,94.861,0.721,0,1407068,14820
4550488064,127807578112,77680640,2292834304,2.637,0.408,96.954,0,0,1430242,14862
4556304384,127801761792,77680640,2292834304,0.503,0.597,98.900,0,0,1581508,15458
4561518592,127796547584,77680640,2292834304,1.283,0.751,97.966,0,0,1525528,13758
4565266432,127792799744,77680640,2292834304,0.814,0.782,98.404,0,0,1218850,10602
4602257408,127755800576,77688832,2292834304,1.789,0.439,97.678,0.094,0,1481948,14376
4606169088,127751880704,77697024,2292834304,0.410,0.378,99.180,0.032,0,1436430,328120
4618158080,127739891712,77697024,2292834304,1.857,0.346,97.797,0,0,1383354,15514
4628267008,127729782784,77697024,2292834304,0.658,0.627,98.716,0,0,1357244,13236
4600967168,127757082624,77697024,2292834304,0.471,0.660,98.869,0,0,1259602,11784
4607021056,127751028736,77705216,2292826112,1.065,0.846,98.057,0.031,0,1217656,12750
4608757760,127749283840,77705216,2292834304,0.597,0.785,98.619,0,0,1212828,11874
4613468160,127744573440,77705216,2292834304,0.659,0.690,98.651,0,0,1099806,11564
4621852672,127736184832,77705216,2292838400,0.565,0.471,98.964,0,0,1534486,14502
4625981440,127732056064,77705216,2292838400,0.503,0.503,98.994,0,0,1520152,13230
4629876736,127728160768,77705216,2292838400,0.533,0.628,98.839,0,0,1701402,14712
4635873280,127722156032,77713408,2292838400,0.535,0.409,99.024,0.031,0,1541498,13584
4639518720,127718510592,77713408,2292838400,0.502,0.534,98.964,0,0,1553996,14104
4647387136,127710642176,77713408,2292838400,0.721,0.564,98.715,0,0,1469854,13206
4654452736,127703576576,77713408,2292838400,0.783,0.657,98.560,0,0,1637194,15264
4661260288,127696769024,77713408,2292838400,0.754,0.597,98.649,0,0,1670714,14790
4663824384,127694204928,77713408,2292838400,0.503,0.440,99.056,0,0,1428626,13638
4681977856,127676043264,77721600,2292838400,0.945,0.504,98.520,0.031,0,1655772,275856
4691140608,127666880512,77721600,2292838400,1.407,0.688,97.905,0,0,1494226,15074
4695334912,127662686208,77721600,2292838400,0.780,0.811,98.408,0,0,1492914,15300
4703301632,127654719488,77721600,2292838400,0.689,0.658,98.653,0,0,1434932,13186
4709552128,127648468992,77721600,2292838400,1.348,0.658,97.994,0,0,1391490,12402
4718399488,127639621632,77721600,2292838400,0.975,0.440,98.585,0,0,1474610,14326
4722065408,127635947520,77729792,2292838400,0.503,0.503,98.931,0.063,0,1443462,11478
4730388480,127627624448,77729792,2292838400,0.472,0.409,99.118,0,0,1525572,65540
4738957312,127619055616,77729792,2292838400,0.439,0.752,98.809,0,0,1478152,66396
4742631424,127615373312,77737984,2292838400,0.315,0.472,99.182,0.031,0,1369344,11874
4748455936,127609548800,77737984,2292838400,0.533,0.533,98.934,0,0,1160050,12308
4754210816,127603793920,77737984,2292838400,0.564,0.689,98.747,0,0,1047332,9156
4766269440,127591727104,77746176,2292838400,0.502,0.659,98.777,0.063,0,1318962,11346
4771786752,127586209792,77746176,2292838400,0.378,0.315,99.306,0,0,1380508,12762
4773576704,127584419840,77746176,2292838400,0.473,0.253,99.274,0,0,1348430,11790
4779868160,127578128384,77746176,2292838400,0.408,0.565,99.026,0,0,1395396,12340
4790353920,127567642624,77746176,2292838400,0.534,0.659,98.807,0,0,1806234,16818
4796637184,127561351168,77770752,2292822016,0.346,0.534,98.775,0.346,0,1643668,64478
4828995584,127528976384,77770752,2292838400,1.225,0.440,98.335,0,0,1748302,16554
4833083392,127524888576,77770752,2292838400,0.315,0.284,99.401,0,0,1639898,321012
4842729472,127515242496,77770752,2292838400,0.472,0.346,99.182,0,0,1437102,12286
4846665728,127511306240,77770752,2292838400,0.596,0.596,98.808,0,0,1770252,68140
4850855936,127507116032,77770752,2292838400,0.503,0.565,98.932,0,0,1370862,12048
4854837248,127503126528,77778944,2292838400,0.472,0.472,98.994,0.063,0,1635542,14100
4861325312,127496638464,77778944,2292838400,0.471,0.566,98.963,0,0,1569992,13974
4865519616,127492444160,77778944,2292838400,0.471,0.503,99.026,0,0,1511282,13630
4873863168,127484092416,77787136,2292838400,0.657,0.626,98.654,0.063,0,1439902,13098
4888371200,127469580288,77787136,2292842496,0.565,0.628,98.807,0,0,1140414,10140
4895948800,127462002688,77787136,2292842496,0.472,0.440,99.088,0,0,1548348,225324
4904079360,127453872128,77787136,2292842496,0.502,0.721,98.777,0,0,1144014,9110
4910370816,127447580672,77787136,2292842496,0.752,0.658,98.590,0,0,1513920,13972
4915589120,127442362368,77787136,2292842496,0.628,0.722,98.649,0,0,1324798,10818
4919775232,127438168064,77795328,2292842496,0.692,0.472,98.805,0.031,0,1390642,12384
4926324736,127431618560,77795328,2292842496,0.688,0.938,98.374,0,0,1384334,12702
4931751936,127426191360,77795328,2292842496,0.564,0.690,98.746,0,0,1593248,15432
4938002432,127419940864,77795328,2292842496,0.442,0.410,99.149,0,0,1121730,10228
4942168064,127415775232,77795328,2292842496,0.535,0.566,98.899,0,0,1184854,9900
4951056384,127406886912,77795328,2292842496,0.845,0.751,98.405,0,0,1236064,10164
4959825920,127398109184,77803520,2292842496,0.534,0.534,98.900,0.031,0,1459080,12262
4976074752,127381860352,77803520,2292842496,0.409,0.441,99.150,0,0,1467436,12486
4982366208,127375568896,77811712,2292834304,0.690,0.565,98.683,0.063,0,1403172,12940
4988575744,127369351168,77811712,2292842496,0.533,0.565,98.902,0,0,1757846,15294
4991795200,127366131712,77811712,2292842496,0.567,0.315,99.118,0,0,1825648,16686
4998057984,127359868928,77811712,2292842496,0.471,0.534,98.995,0,0,1573984,13362
5004083200,127353835520,77819904,2292842496,0.410,0.473,99.086,0.032,0,1727490,14016
5019144192,127338774528,77819904,2292842496,0.692,0.378,98.930,0,0,1599746,14566
5027233792,127330684928,77819904,2292842496,0.440,0.534,99.026,0,0,1622062,376220
5037887488,127320031232,77819904,2292842496,0.657,0.626,98.716,0,0,1609128,11934
5041819648,127316099072,77819904,2292842496,0.471,0.502,99.027,0,0,1625510,70360
5050068992,127307849728,77819904,2292842496,0.377,0.659,98.964,0,0,1784890,14634
5053059072,127304851456,77828096,2292842496,0.596,0.565,98.776,0.063,0,1535018,14220
5061185536,127296724992,77828096,2292842496,0.660,0.503,98.836,0,0,1611916,13008
5067735040,127290175488,77828096,2292842496,0.630,0.472,98.898,0,0,1515096,12586
5071671296,127286239232,77828096,2292842496,0.976,0.472,98.551,0,0,1322216,12276
5077958656,127279951872,77828096,2292842496,0.719,0.812,98.469,0,0,1354670,11214
5082128384,127275782144,77828096,2292842496,0.315,0.410,99.275,0,0,1487384,12832
5084475392,127273426944,77836288,2292842496,0.439,0.752,98.778,0.031,0,1485412,13378
5088669696,127269232640,77836288,2292842496,0.315,0.472,99.213,0,0,1362782,11168
5097058304,127260844032,77836288,2292842496,0.565,0.565,98.871,0,0,1521152,12966
5109641216,127248261120,77836288,2292842496,0.504,0.378,99.118,0,0,1373388,11346
5112770560,127245131776,77836288,2292842496,0.503,0.628,98.775,0.094,0,1238794,11344
5118803968,127239098368,77836288,2292842496,0.690,0.658,98.652,0,0,1220936,10338
5125066752,127232827392,77844480,2292842496,0.471,0.503,98.995,0.031,0,1561816,13056
5129003008,127228891136,77844480,2292842496,0.440,0.565,98.995,0,0,976400,8544
5137379328,127220514816,77844480,2292842496,0.501,0.595,98.903,0,0,1221856,9462
5154263040,127203631104,77844480,2292842496,0.783,0.470,98.746,0,0,1558330,67888
5170958336,127186935808,77844480,2292842496,0.597,0.346,99.057,0,0,1292660,119532
5176422400,127181471744,77844480,2292842496,0.283,0.597,99.120,0,0,1517010,13230
5183414272,127174471680,77852672,2292842496,0.503,0.440,99.025,0.031,0,1472102,12660
5208924160,127148961792,77852672,2292842496,0.818,0.472,98.710,0,0,1681798,171798
5212979200,127144775680,77860864,2292965376,0.409,0.566,98.962,0.063,0,1379626,117858
5217026048,127140720640,77860864,2292973568,0.503,0.566,98.932,0,0,1420356,13056
5225156608,127132590080,77860864,2292973568,0.284,0.189,99.527,0,0,1392950,13452
5228646400,127129100288,77860864,2292973568,0.471,0.502,99.027,0,0,1104554,9594
5237026816,127120711680,77869056,2292973568,0.409,0.377,99.182,0.031,0,1361676,12084
5241954304,127115784192,77869056,2292973568,0.595,0.627,98.778,0,0,1535246,12700
5246611456,127111118848,77877248,2292973568,0.346,0.504,99.119,0.031,0,1307076,11736
5257060352,127100665856,77877248,2292977664,0.470,0.720,98.810,0,0,1507212,12354
5279346688,127078379520,77877248,2292977664,0.910,0.596,98.493,0,0,1267724,222254
5281443840,127076282368,77877248,2292977664,0.567,0.315,99.118,0,0,1302586,10164
5285613568,127072104448,77885440,2292977664,0.533,0.658,98.777,0.031,0,1448684,12568
5289897984,127067820032,77885440,2292977664,0.472,0.377,99.151,0,0,1260538,10602
5296332800,127061385216,77885440,2292977664,0.377,0.566,99.057,0,0,1449892,11652
5300326400,127057391616,77885440,2292977664,0.879,0.377,98.744,0,0,1515992,12972
5304709120,127053008896,77885440,2292977664,0.783,0.564,98.653,0,0,1138058,9288
5329797120,127027912704,77893632,2292977664,1.037,0.817,98.082,0.063,0,1383260,11782
5338505216,127019196416,77901824,2292977664,1.595,0.625,97.749,0.031,0,1434268,391842
5338505216,127019196416,77901824,2292977664,0.440,0.471,99.089,0,0,1673430,12720
5339992064,127017709568,77901824,2292977664,0.440,0.377,99.182,0,0,1591008,14344
5341290496,127016411136,77901824,2292977664,0.967,0.811,98.222,0,0,1421424,10776
5341757440,127015944192,77901824,2292977664,0.347,0.284,99.369,0,0,1634150,15216
5341650944,127016050688,77901824,2292977664,0.627,0.689,98.684,0,0,1579384,13494
5341216768,127016484864,77910016,2292977664,0.533,0.752,98.652,0.063,0,1820660,29630
5349093376,127008608256,77910016,2292977664,0.630,0.472,98.898,0,0,1469448,16138
5347586048,127010115584,77910016,2292977664,1.034,0.627,98.339,0,0,1544914,324274
5351780352,127005921280,77910016,2292977664,0.534,0.628,98.838,0,0,1516000,12436
5355724800,127001976832,77910016,2292977664,0.378,0.410,99.212,0,0,1524572,12924
5360435200,126997266432,77910016,2292977664,0.911,0.597,98.493,0,0,1634062,14322
5360685056,126997008384,77918208,2292977664,0.566,0.534,98.869,0.031,0,1786848,14850
5370105856,126987587584,77918208,2292977664,1.820,0.471,97.709,0,0,1790984,16524
5369589760,126988103680,77918208,2292977664,0.378,0.409,99.213,0,0,1798414,15938
5368991744,126988701696,77918208,2292977664,0.690,0.471,98.651,0.188,0,1511806,12090
5369778176,126987907072,77926400,2292977664,0.597,0.534,98.806,0.063,0,1658260,13668
5371047936,126986637312,77926400,2292977664,1.470,0.750,97.780,0,0,1869466,542085
5371482112,126986190848,77934592,2292977664,0.472,0.597,98.900,0.031,0,1542120,13077
5371359232,126986313728,77934592,2292977664,0.440,0.566,98.994,0,0,1737512,15022
5373456384,126984216576,77934592,2292977664,0.472,0.378,99.150,0,0,1586140,12924
5373440000,126984232960,77934592,2292977664,0.409,0.504,99.087,0,0,1344918,9900
5373693952,126983979008,77934592,2292977664,0.781,0.812,98.407,0,0,1471598,11826
5375574016,126982090752,77942784,2292977664,0.628,0.628,98.713,0.031,0,1564344,12660
5381083136,126976573440,77950976,2292977664,0.503,0.566,98.868,0.063,0,1479846,118948
5382873088,126974783488,77950976,2292977664,0.535,0.409,99.056,0,0,1493476,11346
5382868992,126974787584,77950976,2292977664,0.534,0.659,98.807,0,0,1423766,64950
5382868992,126974787584,77950976,2292977664,0.533,0.752,98.715,0,0,1357986,10164
5389160448,126968496128,77950976,2292977664,0.628,0.534,98.838,0,0,1366892,11346
5389410304,126968246272,77950976,2292977664,0.691,0.628,98.682,0,0,1220858,62844
5391462400,126966185984,77959168,2292977664,0.658,0.783,98.528,0.031,0,1311860,11346
5391458304,126966190080,77959168,2292977664,0.471,0.659,98.870,0,0,1397002,10950
5393522688,126964125696,77959168,2292977664,0.817,0.597,98.586,0,0,1626550,327888
5409263616,126948384768,77959168,2292977664,1.688,0.688,97.625,0,0,1501900,12798
5409009664,126948638720,77959168,2292977664,0.504,0.378,99.118,0,0,1239208,10906
5408722944,126948925440,77959168,2292977664,0.658,0.783,98.558,0,0,1612056,13362
5409337344,126948302848,77967360,2292977664,0.814,0.689,98.434,0.063,0,1774200,15338
5409316864,126948323328,77967360,2292977664,1.475,0.471,98.054,0,0,1524446,12048
5409095680,126948544512,77967360,2292977664,0.691,0.471,98.838,0,0,1631750,13098
5408739328,126948900864,77967360,2292977664,0.628,0.722,98.651,0,0,1628050,13666
5407961088,126949675008,77967360,2292981760,0.596,0.690,98.714,0,0,1746026,14658
5407526912,126950109184,77967360,2292981760,0.439,0.753,98.807,0,0,1634374,14016
5407748096,126949879808,77975552,2292981760,0.629,0.534,98.806,0.031,0,1703530,172740
5411495936,126946131968,77975552,2292981760,0.502,0.597,98.901,0,0,1550510,12966
5411237888,126946390016,77975552,2292981760,0.345,0.534,99.121,0,0,1259436,11036
5411627008,126946000896,77975552,2292981760,0.345,0.721,98.934,0,0,1419216,11520
5411483648,126946136064,77983744,2292981760,0.409,0.409,99.150,0.031,0,1387516,11916
5411115008,126946504704,77983744,2292981760,0.315,0.409,99.276,0,0,1452938,12222
5411364864,126946246656,77991936,2292981760,0.283,0.598,99.056,0.063,0,1383616,166386
5411131392,126946480128,77991936,2292981760,0.221,0.315,99.464,0,0,1473646,12874
5411131392,126946480128,77991936,2292981760,0.533,0.596,98.871,0,0,1415396,12126
5411127296,126946480128,77996032,2292981760,0.562,0.781,98.657,0,0,1594950,13536
5410869248,126946738176,77996032,2292981760,0.378,0.283,99.339,0,0,1520786,12222
5415804928,126941802496,77996032,2292981760,0.377,0.597,99.027,0,0,1382938,11652
5416054784,126941544448,78004224,2292981760,0.441,0.378,99.150,0.031,0,1456556,12526
5416054784,126941544448,78004224,2292981760,0.252,0.441,99.307,0,0,1418920,11652
5416308736,126941290496,78004224,2292981760,0.593,0.968,98.439,0,0,1290896,11130
5426372608,126931226624,78004224,2292981760,2.165,0.502,97.333,0,0,1615530,14418
5431791616,126925807616,78004224,2292981760,3.071,0.501,96.427,0,0,1444180,15390
5431791616,126925807616,78004224,2292981760,0.565,0.565,98.870,0,0,1479636,13798
5431525376,126926065664,78012416,2292981760,0.472,0.378,99.118,0.031,0,1652380,14634
5431525376,126926065664,78012416,2292981760,0.439,0.596,98.965,0,0,1783252,14370
5431431168,126926159872,78012416,2292981760,0.221,0.378,99.401,0,0,837586,7974
5433253888,126924328960,78020608,2292981760,0.563,0.720,98.654,0.063,0,187736,1008
5432995840,126924587008,78020608,2292981760,0.346,0.346,99.307,0,0,56338,1574
5433249792,126924333056,78020608,2292981760,0.409,0.472,99.119,0,0,149434,876
5434511360,126923063296,78028800,2292981760,0.253,0.190,99.526,0.032,0,102530,876
5434474496,126923100160,78028800,2292981760,0.283,0.441,99.276,0,0,115248,2284
5433950208,126923624448,78028800,2292981760,0.377,0.409,99.214,0,0,77040,876
5433946112,126923628544,78028800,2292981760,0.503,0.534,98.964,0,0,116838,1354
5433946112,126923628544,78028800,2292981760,0.689,0.595,98.715,0,0,59214,876
5433679872,126923886592,78036992,2292981760,0.409,0.378,99.150,0.063,0,52492,876
5432897536,126924660736,78045184,2292981760,0.533,0.721,98.715,0.031,0,89400,960
5432881152,126924677120,78045184,2292981760,0.565,0.659,98.776,0,0,121860,876
5432881152,126924677120,78045184,2292981760,0.440,0.597,98.962,0,0,107414,1354
5432881152,126924677120,78045184,2292981760,0.473,0.315,99.212,0,0,145264,876
5432492032,126925066240,78045184,2292981760,0.875,0.875,98.250,0,0,64646,876
5432467456,126925082624,78053376,2292981760,1.031,0.687,98.220,0.062,0,148560,876
5431717888,126925824000,78061568,2292981760,0.536,0.410,98.992,0.063,0,194270,876
5431717888,126925824000,78061568,2292981760,0.314,0.754,98.932,0,0,102680,1354
5447405568,126910128128,78061568,2292981760,1.034,0.814,98.152,0,0,609280,22116
5460840448,126894735360,78061568,2292989952,1.500,1.562,96.938,0,0,300724,38428
