"Dstat 0.7.3 CSV output"
"Author:","Dag Wieers <dag@wieers.com>",,,,"URL:","http://dag.wieers.com/home-made/dstat/"
"Host:","grisou-21.nancy.grid5000.fr",,,,"User:","root"
"Cmdline:","dstat -m -c -n -o dstat.csv",,,,"Date:","24 May 2020 18:19:52 CEST"
"memory usage",,,,"total cpu usage",,,,,"net/total",
"used","free","buff","cach","usr","sys","idl","wai","stl","recv","send"
2770100224,130055811072,62709760,1871818752,0.296,0.121,99.502,0.081,0,0,0
2779840512,130045706240,62742528,1872179200,0.500,0.312,98.625,0.562,0,389092,15816
2787667968,130038136832,62742528,1871921152,0.907,0.656,98.343,0.094,0,386926,27552
2780196864,130045788160,62742528,1871732736,0.876,0.532,98.593,0,0,5952,15898
2780180480,130045804544,62742528,1871732736,0.063,0.031,99.906,0,0,854,0
2787020800,130038829056,62803968,1871806464,1.001,0.845,97.373,0.782,0,386430,26522
2786074624,130039775232,62803968,1871806464,0.031,0.031,99.937,0,0,2192,180
2785980416,130039857152,62816256,1871806464,0,0.063,98.905,1.032,0,1238,0
2785689600,130040147968,62816256,1871806464,0.031,0.063,99.906,0,0,1626,0
2785689600,130040147968,62816256,1871806464,0,0.031,99.969,0,0,1348,612
2785173504,130040664064,62816256,1871806464,0.094,0.031,99.875,0,0,1200,0
2784870400,130040954880,62828544,1871806464,0.031,0,99.937,0.031,0,4836,168
2783977472,130041847808,62828544,1871806464,0.125,0.031,99.844,0,0,1434,0
2785550336,130040274944,62828544,1871806464,0.031,0.031,99.937,0,0,2930,0
2785030144,130040795136,62828544,1871806464,0.031,0.094,99.875,0,0,854,0
2783997952,130041827328,62828544,1871806464,0.031,0,99.969,0,0,832,0
2783723520,130042101760,62828544,1871806464,0.031,0.031,99.937,0,0,4314,0
2783457280,130042359808,62836736,1871806464,0,0.031,99.937,0.031,0,1162,0
2783199232,130042617856,62836736,1871806464,0,0.031,99.969,0,0,1360,496
2805166080,130020200448,62836736,1872252928,1.002,0.689,98.310,0,0,389692,18328
2788786176,130037026816,62836736,1871806464,0.156,0.125,99.718,0,0,3598,13996
2788818944,130036973568,62836736,1871810560,0.626,0.500,98.874,0,0,339358,22412
2799558656,130025717760,62849024,1872293888,0.720,0.532,98.341,0.407,0,388504,16686
2781040640,130044669952,62853120,1871855616,0.375,0.219,99.218,0.188,0,3910,15648
2794196992,130031054848,62865408,1872302080,0.594,0.219,99.124,0.063,0,384010,11158
2781708288,130043990016,62865408,1871855616,0.532,0.407,99.061,0,0,10958,15364
2795012096,130030497792,62865408,1872044032,0.657,0.188,99.156,0,0,384198,12796
2784518144,130041176064,62865408,1871855616,0.407,0.594,98.999,0,0,4408,15954
2784505856,130041176064,62877696,1871855616,0.031,0.031,99.875,0.063,0,7222,458
2784337920,130041344000,62877696,1871855616,0.063,0.063,99.875,0,0,227304,8618
2786443264,130039169024,62889984,1871863808,1.751,0.219,97.967,0.063,0,4470,2936
2786193408,130039418880,62889984,1871863808,0.063,0.063,99.875,0,0,3310,2652
2785136640,130040475648,62889984,1871863808,0,0.031,99.969,0,0,6714,0
2783334400,130042167296,62906368,1871958016,0.250,0.094,99.624,0.031,0,340654,12462
2790334464,130035212288,62935040,1871884288,0.282,0.156,99.468,0.094,0,169404,11192
2790682624,130034499584,62947328,1872207872,0.188,0.031,99.750,0.031,0,151340,17360
2790682624,130034499584,62947328,1872207872,0,0.031,99.969,0,0,12970,13328
2790166528,130035015680,62947328,1872207872,0.031,0.094,99.875,0,0,10600,13328
2789638144,130035531776,62951424,1872216064,0,0.063,99.499,0.438,0,10804,13328
2789740544,130035417088,62963712,1872216064,0,0.031,99.937,0.031,0,10526,15276
2791313408,130033836032,62971904,1872216064,0.219,0.031,99.719,0.031,0,17576,18276
2791129088,130034020352,62971904,1872216064,0,0.063,99.937,0,0,13576,13328
2790871040,130034278400,62971904,1872216064,0.125,0.031,99.844,0,0,13574,13328
2789580800,130035568640,62971904,1872216064,0.031,0.063,99.593,0.313,0,13426,13508
2781409280,130043883520,62971904,1872031744,0.063,0.094,99.844,0,0,23284,19254
2782392320,130042888192,62984192,1872031744,0.094,0.094,99.750,0.063,0,169088,9168
2783420416,130041815040,62996480,1872031744,0.282,0.156,99.500,0.063,0,10120,11976
2829979648,129994997760,63012864,1872240640,1.408,0.907,97.623,0.063,0,554372,35046
2829705216,129777803264,63012864,2083422208,1.697,2.514,95.632,0.157,0,180342,17022
2959294464,129647718400,63012864,2083459072,4.604,1.096,93.580,0.720,0,1990,516
3176431616,129425354752,63148032,2088230912,11.336,1.308,86.359,0.997,0,692,0
3349610496,129191100416,63172608,2147815424,11.695,1.306,86.159,0.840,0,7076,0
3496144896,129003581440,63172608,2187444224,23.186,2.492,74.290,0.032,0,2688,2600
3915509760,128581873664,63172608,2188259328,31.033,2.741,66.226,0,0,282676,136506
3897217024,128600166400,63172608,2188259328,0.689,0.282,97.054,1.974,0,47090,28164
3897270272,128600100864,63176704,2188267520,0.376,0.345,96.743,2.537,0,46702,28032
3895119872,128602251264,63176704,2188267520,0.220,0.094,99.686,0,0,46544,28164
3895357440,128601985024,63201280,2188267520,0.376,0.063,99.467,0.094,0,56624,28164
3896270848,128601071616,63201280,2188267520,0.846,0.219,98.934,0,0,55024,43460
3898355712,128598986752,63201280,2188267520,0.594,0.125,99.281,0,0,49762,28032
3899969536,128597372928,63201280,2188267520,0.345,0.094,99.561,0,0,44202,29540
3903418368,128593924096,63201280,2188267520,0.313,0.219,99.468,0,0,47632,28164
4015329280,128482013184,63201280,2188267520,11.275,0.470,88.256,0,0,50388,28296
4019257344,128478076928,63209472,2188267520,2.068,0.157,97.713,0.063,0,50900,43328
4011388928,128485945344,63209472,2188267520,5.258,0.063,94.679,0,0,45616,28296
4010848256,128486486016,63209472,2188267520,5.459,0.218,94.323,0,0,45704,28164
4010725376,128486608896,63209472,2188267520,1.002,0.125,98.873,0,0,46270,28296
4010209280,128487124992,63209472,2188267520,0.094,0.063,99.843,0,0,47638,28476
4041469952,128455864320,63209472,2188267520,10.648,0.529,88.823,0,0,1385298,52460
4050546688,128446779392,63217664,2188267520,1.768,0.253,97.948,0.032,0,2079200,41104
4069548032,128427778048,63217664,2188267520,1.979,0.565,97.456,0,0,2567936,45798
4103675904,128393650176,63217664,2188267520,4.095,0.844,95.061,0,0,3192250,162060
4187209728,128310116352,63217664,2188267520,6.350,0.876,92.774,0,0,3653868,114412
4252012544,128245198848,63217664,2188267520,9.102,0.686,90.212,0,0,4022858,792580
4248371200,128248840192,63217664,2188267520,4.570,0.376,95.055,0,0,4257204,180424
4248911872,128248291328,63225856,2188267520,0.693,0.252,98.992,0.063,0,4489924,64836
4325036032,128172167168,63225856,2188267520,7.735,0.715,91.550,0,0,4832192,71556
4357070848,128140124160,63225856,2188267520,3.256,0.532,96.212,0,0,5754432,627854
4398166016,128099028992,63225856,2188267520,4.107,0.502,95.392,0,0,6999846,263032
4435456000,128061665280,63225856,2188267520,4.085,0.748,95.167,0,0,8037334,365706
4442263552,128054857728,63225856,2188267520,0.659,0.691,98.650,0,0,8843458,92800
4467421184,128029691904,63234048,2188267520,0.850,0.504,97.954,0.692,0,9427832,94224
4508631040,127988482048,63234048,2188267520,4.841,0.718,94.441,0,0,10012440,265128
4509147136,127987965952,63234048,2188267520,1.102,0.346,98.552,0,0,10849172,120356
4580626432,127916486656,63234048,2188267520,6.829,0.904,92.267,0,0,11408958,121038
4604432384,127892680704,63234048,2188267520,3.564,0.563,95.874,0,0,11785848,659558
4608618496,127888486400,63242240,2188267520,2.036,0.658,96.367,0.940,0,12524110,130884
4620935168,127876161536,63250432,2188267520,0.976,0.441,96.915,1.668,0,14149400,131088
4691652608,127805444096,63250432,2188267520,3.594,0.875,95.531,0,0,15505312,324196
4744491008,127752605696,63250432,2188267520,1.322,0.661,98.018,0,0,16514708,156588
4839641088,127657455616,63250432,2188267520,7.431,0.593,91.976,0,0,17093886,172824
4902748160,127594348544,63250432,2188267520,4.531,0.906,94.562,0,0,17715040,486092
4987396096,127509692416,63258624,2188267520,5.097,0.813,94.059,0.031,0,18657518,235678
5046386688,127450693632,63266816,2188267520,1.534,0.751,97.653,0.063,0,19363632,196016
5133672448,127363407872,63266816,2188267520,0.915,0.852,98.233,0,0,19993288,181356
5191618560,127305461760,63266816,2188267520,4.903,0.562,94.535,0,0,20486616,264818
5280972800,127216107520,63266816,2188267520,6.303,0.502,93.195,0,0,21704880,282134
5355900928,127141179392,63266816,2188267520,0.725,0.630,98.645,0,0,22398628,258612
5452558336,127044517888,63266816,2188271616,7.219,1.507,91.243,0.031,0,23256392,254048
5463457792,127033610240,63275008,2188271616,6.454,0.313,93.202,0.031,0,23697774,415708
5482684416,127014383616,63275008,2188271616,0.879,0.691,98.430,0,0,24201974,442400
5518594048,126978473984,63275008,2188271616,0.882,0.473,98.645,0,0,24755570,227154
5530746880,126966321152,63275008,2188271616,7.004,0.938,92.058,0,0,25451484,260262
5530918912,126966149120,63275008,2188271616,1.313,0.719,97.967,0,0,26232888,480238
5531635712,126965432320,63275008,2188271616,4.346,0.594,95.059,0,0,26480834,365262
5531693056,126965366784,63283200,2188271616,3.939,0.688,95.342,0.031,0,27111034,370962
5530910720,126966149120,63283200,2188271616,1.096,0.815,98.089,0,0,27695238,263034
5531725824,126965334016,63283200,2188271616,3.855,0.815,95.331,0,0,28068984,376020
5533024256,126963920896,63291392,2188271616,0.882,0.693,98.363,0.063,0,28615202,337184
5559635968,126937309184,63291392,2188271616,6.646,1.118,92.236,0,0,29250342,292098
5558202368,126938742784,63291392,2188271616,4.389,0.596,95.016,0,0,29448820,556886
5558185984,126938750976,63299584,2188271616,1.653,1.091,97.225,0.031,0,30003804,271260
5556895744,126940041216,63299584,2188271616,4.131,1.002,94.867,0,0,30450368,440540
5558034432,126938861568,63299584,2188271616,1.103,0.788,98.109,0,0,31114916,287786
5558034432,126938861568,63299584,2188271616,4.338,0.874,94.788,0,0,31378068,342418
5572198400,126924697600,63299584,2188271616,6.064,0.594,93.342,0,0,31807348,462918
5574295552,126922600448,63299584,2188271616,1.103,0.662,98.235,0,0,32188434,344610
5577965568,126918922240,63307776,2188271616,1.227,0.849,97.861,0.063,0,33058636,295776
5577183232,126919696384,63315968,2188271616,5.288,0.814,93.867,0.031,0,33273190,336284
5577957376,126918922240,63315968,2188271616,1.887,0.535,97.578,0,0,33179384,583230
5578215424,126918664192,63315968,2188271616,1.196,0.913,97.891,0,0,34059248,312244
5580312576,126916567040,63315968,2188271616,1.541,0.849,97.609,0,0,34517488,317112
5582258176,126914621440,63315968,2188271616,1.628,1.033,97.340,0,0,35071868,339396
5581635584,126915235840,63324160,2188271616,3.912,0.876,95.180,0.031,0,35256830,364448
5581119488,126915751936,63324160,2188271616,1.228,0.724,98.048,0,0,35487706,373498
5580603392,126916268032,63324160,2188271616,1.323,0.756,97.921,0,0,35736070,328632
5581119488,126915751936,63324160,2188271616,1.568,1.035,97.396,0,0,36504622,334506
5580337152,126916526080,63332352,2188271616,1.444,0.973,97.552,0.031,0,36623504,335112
5578530816,126918332416,63332352,2188271616,5.576,0.815,93.609,0,0,36832082,381200
5577490432,126919364608,63340544,2188271616,1.920,0.692,97.356,0.031,0,34158510,489360
5576458240,126920396800,63340544,2188271616,1.657,1.219,97.124,0,0,41162792,398352
5576458240,126920396800,63340544,2188271616,6.450,0.877,92.674,0,0,38294178,366468
5579554816,126917300224,63340544,2188271616,7.642,0.655,91.703,0,0,38350032,391194
5580070912,126916784128,63340544,2188271616,5.394,0.904,93.701,0,0,38496342,709902
5580070912,126916784128,63340544,2188271616,3.765,0.753,95.482,0,0,38493842,534230
5579804672,126917042176,63348736,2188271616,1.290,0.849,97.798,0.063,0,39498490,363600
5579804672,126917042176,63348736,2188271616,1.634,0.911,97.455,0,0,39771072,404690
5579288576,126917558272,63348736,2188271616,4.780,0.906,94.314,0,0,39876696,366228
5578256384,126918590464,63348736,2188271616,1.317,1.004,97.302,0.376,0,40235734,491846
5577814016,126918991872,63348736,2188271616,5.815,1.182,93.004,0,0,40795005,379788
5577039872,126919766016,63348736,2188271616,3.004,0.782,96.214,0,0,41221116,552298
5577846784,126918950912,63356928,2188271616,9.208,0.877,89.853,0.063,0,41486744,375930
5722537984,126774259712,63356928,2188271616,2.830,0.912,96.258,0,0,41560228,382234
5813252096,126683545600,63356928,2188271616,1.388,1.230,97.382,0,0,41753654,449116
5812457472,126684340224,63356928,2188271616,1.507,1.067,97.426,0,0,42042018,371364
5814013952,126682783744,63356928,2188271616,1.570,0.973,97.457,0,0,42718948,387498
5813755904,126683041792,63356928,2188271616,5.186,0.719,94.096,0,0,42900122,400972
5813485568,126683299840,63365120,2188275712,5.457,1.178,93.333,0.031,0,43146726,515576
5812969472,126683815936,63365120,2188275712,2.334,1.307,96.360,0,0,43356144,469580
5812703232,126684073984,63373312,2188275712,1.576,0.694,97.699,0.032,0,43538976,383838
5813768192,126683009024,63373312,2188275712,1.577,0.883,97.539,0,0,44010574,440774
5795831808,126700945408,63373312,2188275712,6.450,0.908,92.642,0,0,44533308,416430
5804277760,126692491264,63381504,2188275712,6.811,0.596,92.530,0.063,0,44681627,600820
5804695552,126692073472,63381504,2188275712,1.354,0.693,97.953,0,0,44836421,434432
5804179456,126692589568,63381504,2188275712,1.787,1.066,97.147,0,0,45238410,399166
5803147264,126693621760,63381504,2188275712,1.846,1.252,96.902,0,0,45574986,402390
5824114688,126672646144,63389696,2188275712,1.511,1.794,96.695,0,0,45871656,410808
5825146880,126671613952,63389696,2188275712,6.400,0.874,92.726,0,0,46212586,427620
5824106496,126672646144,63397888,2188275712,5.645,1.334,92.959,0.062,0,46351854,723174
5824466944,126672285696,63397888,2188275712,5.002,0.818,94.181,0,0,46456548,436916
5825503232,126671175680,63397888,2188275712,4.161,0.504,95.334,0,0,46594416,618720
5824987136,126671691776,63397888,2188275712,1.541,0.818,97.641,0,0,47011548,421170
5825245184,126671433728,63397888,2188275712,1.796,0.945,97.259,0,0,47278852,472286
5825503232,126671175680,63397888,2188275712,5.271,1.123,93.606,0,0,47580962,453956
5826011136,126670659584,63406080,2188275712,1.605,0.755,97.576,0.063,0,48089844,566694
5826011136,126670659584,63406080,2188275712,5.281,1.180,93.538,0,0,48340650,466038
5825753088,126670917632,63406080,2188275712,4.312,0.938,94.750,0,0,48444566,565196
5825753088,126670917632,63406080,2188275712,1.108,0.601,98.291,0,0,48613776,557770
5846458368,126650204160,63414272,2188275712,1.819,1.066,97.084,0.031,0,48972288,456758
6002470912,126494191616,63414272,2188275712,2.337,1.839,95.824,0,0,49183376,452658
6001340416,126495313920,63422464,2188275712,1.510,0.975,97.483,0.031,0,49530666,438138
6000590848,126496063488,63422464,2188275712,1.792,0.880,97.328,0,0,49721784,437694
6000332800,126496321536,63422464,2188275712,1.575,0.851,97.574,0,0,50010352,435918
5999816704,126496837632,63422464,2188275712,1.879,1.127,96.993,0,0,50340482,461456
5999816704,126496837632,63422464,2188275712,1.821,1.005,96.954,0.220,0,50785940,449352
5998505984,126498148352,63422464,2188275712,1.608,0.694,97.699,0,0,50701178,450978
5997031424,126499622912,63422464,2188275712,1.726,1.099,97.175,0,0,51115842,447318
5997301760,126499344384,63430656,2188275712,6.843,1.151,91.944,0.062,0,51221284,478290
5997281280,126499364864,63430656,2188275712,9.292,0.717,89.991,0,0,51415490,547766
5996249088,126500397056,63430656,2188275712,3.377,1.063,95.560,0,0,51502950,813488
5996068864,126500569088,63438848,2188275712,1.236,0.570,98.162,0.032,0,51930216,473026
5997121536,126499516416,63438848,2188275712,5.708,0.967,93.325,0,0,52090112,476628
5997875200,126498762752,63438848,2188275712,2.388,1.006,96.574,0.031,0,52351348,550472
5998383104,126498246656,63447040,2188275712,1.506,0.941,97.522,0.031,0,52772764,504830
5998125056,126498504704,63447040,2188275712,5.470,0.875,93.654,0,0,52917502,509502
5998874624,126497755136,63447040,2188275712,5.559,0.999,93.442,0,0,53239164,778490
5998100480,126498529280,63447040,2188275712,3.961,0.692,95.347,0,0,53326056,519210
5997453312,126499168256,63455232,2188275712,1.818,0.940,97.210,0.031,0,53568020,604854
5997195264,126499426304,63455232,2188275712,1.759,1.068,97.173,0,0,53768146,495374
5997371392,126499241984,63463424,2188275712,2.190,1.282,96.497,0.031,0,53909098,478404
5995687936,126500925440,63463424,2188275712,1.889,1.007,97.104,0,0,53854022,482982
5994323968,126502289408,63463424,2188275712,6.049,1.029,92.922,0,0,54554670,517458
5995446272,126501167104,63463424,2188275712,4.345,0.813,94.842,0,0,54724744,709920
5995606016,126501007360,63463424,2188275712,1.230,0.788,97.982,0,0,54780744,543248
5994819584,126501793792,63463424,2188275712,1.948,0.817,97.234,0,0,49363740,468414
5994811392,126501797888,63463424,2188279808,1.641,0.915,97.443,0,0,60662298,562608
5995061248,126501539840,63471616,2188279808,4.765,0.972,94.232,0.031,0,55633450,523608
5995053056,126501548032,63471616,2188279808,1.669,0.945,97.387,0,0,55830952,644676
5995311104,126501289984,63471616,2188279808,2.006,1.128,96.866,0,0,55849072,580790
5994536960,126502064128,63471616,2188279808,2.162,1.253,96.585,0,0,56124162,511786
5994262528,126502338560,63471616,2188279808,2.101,1.160,96.739,0,0,56301544,513202
5994520576,126502080512,63471616,2188279808,2.283,1.376,96.341,0,0,56845244,516988
5994254336,126502338560,63479808,2188279808,2.190,1.470,96.278,0.063,0,56814520,514520
5994254336,126502338560,63479808,2188279808,5.526,0.942,93.532,0,0,57146656,551216
5994790912,126501801984,63479808,2188279808,6.550,0.783,92.667,0,0,57151228,579353
5995270144,126501322752,63479808,2188279808,1.972,1.096,96.932,0,0,57566973,754629
5995786240,126500806656,63479808,2188279808,5.677,1.092,93.231,0,0,57644331,560616
5995995136,126500597760,63479808,2188279808,1.886,0.943,97.172,0,0,57772648,604072
5995986944,126500597760,63488000,2188279808,1.543,0.976,97.450,0.031,0,57953100,597196
5995728896,126500855808,63488000,2188279808,1.823,1.257,96.919,0,0,58405410,520776
5995728896,126500855808,63496192,2188271616,2.138,1.037,96.793,0.031,0,58672214,521730
5995720704,126500855808,63496192,2188279808,5.690,1.368,92.942,0,0,58449340,535554
5995204608,126501371904,63496192,2188279808,5.844,0.781,93.375,0,0,58763930,653052
5995237376,126501306368,63496192,2188279808,2.845,1.125,96.030,0,0,58971380,750836
5995225088,126501306368,63504384,2188279808,1.850,0.909,97.178,0.063,0,59355866,561306
5993979904,126502551552,63508480,2188275712,1.513,0.882,97.605,0,0,59408428,552858
5993484288,126503043072,63508480,2188279808,4.920,1.034,94.046,0,0,59672558,575808
5997547520,126498971648,63516672,2188279808,3.167,0.784,96.018,0.031,0,59745072,626742
5996257280,126500261888,63516672,2188279808,1.823,0.974,97.203,0,0,59908110,620392
5995741184,126500777984,63516672,2188279808,5.439,1.219,93.342,0,0,59922540,570124
5995474944,126501036032,63524864,2188279808,5.086,0.998,93.853,0.062,0,60436146,693880
5994307584,126502203392,63524864,2188279808,2.565,1.126,96.309,0,0,60813684,678810
5995372544,126501138432,63524864,2188279808,1.607,0.945,97.448,0,0,60968112,575940
5995110400,126501400576,63524864,2188279808,4.140,0.822,95.038,0,0,61241456,586238
5994078208,126502432768,63524864,2188279808,2.542,1.004,96.454,0,0,61276042,653272
5993189376,126503321600,63524864,2188279808,1.732,0.850,97.418,0,0,61605146,639992
5991903232,126504599552,63533056,2188279808,1.668,1.102,97.199,0.031,0,61959204,587070
5992054784,126504448000,63533056,2188279808,1.922,1.135,96.943,0,0,62243928,592914
5991280640,126505222144,63533056,2188279808,2.126,1.376,96.498,0,0,62298226,595094
5991280640,126505222144,63533056,2188279808,2.013,1.258,96.729,0,0,62346814,568968
5991280640,126505222144,63533056,2188279808,2.070,1.474,96.457,0,0,62458392,569712
5991022592,126505480192,63533056,2188279808,2.648,1.558,95.794,0,0,62759806,570234
5990969344,126505525248,63541248,2188279808,2.352,1.348,96.237,0.063,0,63087594,564462
5990711296,126505783296,63541248,2188279808,2.476,1.222,96.302,0,0,63058586,593348
5990711296,126505783296,63541248,2188279808,1.896,1.011,97.093,0,0,63430258,578130
5992517632,126503976960,63541248,2188279808,6.506,1.032,92.305,0.156,0,63646868,603246
5996646400,126499848192,63541248,2188279808,9.249,1.121,89.629,0,0,63958216,661080
5996904448,126499590144,63541248,2188279808,4.515,0.663,94.822,0,0,63672858,637212
5999251456,126497234944,63549440,2188279808,5.265,1.065,93.638,0.031,0,64576868,963808
5998993408,126497492992,63549440,2188279808,2.648,0.694,96.658,0,0,64501132,682522
5998993408,126497492992,63549440,2188279808,1.797,0.662,97.541,0,0,63902104,656850
5998600192,126497878016,63557632,2188279808,2.499,1.343,96.126,0.031,0,64701698,593214
6000795648,126495682560,63557632,2188279808,2.413,1.348,96.239,0,0,64767066,590304
6000697344,126495780864,63557632,2188279808,1.805,1.013,97.182,0,0,64714100,597062
5999968256,126496497664,63565824,2188283904,4.940,1.101,93.927,0.031,0,64998428,602394
5999538176,126496927744,63565824,2188283904,3.613,1.464,94.924,0,0,65352822,697724
5999280128,126497185792,63565824,2188283904,1.851,1.130,97.019,0,0,65413812,616902
5999022080,126497443840,63565824,2188283904,2.262,1.131,96.607,0,0,65174812,602676
5999816704,126496649216,63565824,2188283904,2.870,1.497,95.602,0.031,0,65152044,628212
5999501312,126496964608,63574016,2188275712,2.382,1.128,96.459,0.031,0,65416234,595642
5998977024,126497480704,63574016,2188283904,2.076,1.227,96.697,0,0,65597070,598954
5998137344,126498320384,63574016,2188283904,2.013,1.416,96.571,0,0,65777358,602406
5999407104,126497050624,63574016,2188283904,5.669,0.882,93.449,0,0,65633596,619482
5998792704,126497665024,63574016,2188283904,7.702,0.998,91.300,0,0,65499538,672890
5998542848,126497914880,63574016,2188283904,5.374,0.786,93.840,0,0,65791770,903208
6000365568,126496083968,63582208,2188283904,6.133,1.027,92.777,0.062,0,65640290,711234
6001000448,126495449088,63582208,2188283904,2.953,1.005,96.041,0,0,66010608,802150
6001000448,126495449088,63590400,2188275712,1.454,0.885,97.597,0.063,0,65555794,607476
6004072448,126492368896,63590400,2188283904,2.847,1.314,95.839,0,0,66183813,647123
6007148544,126489292800,63590400,2188283904,4.947,1.315,93.738,0,0,61621508,571899
6007922688,126488518656,63590400,2188283904,6.018,1.123,92.859,0,0,69745732,800866
6010494976,126485938176,63598592,2188283904,2.581,0.944,96.443,0.031,0,65631974,732954
6012559360,126483873792,63598592,2188283904,2.006,1.097,96.898,0,0,65742988,625134
6013333504,126483099648,63598592,2188283904,2.068,1.003,96.930,0,0,65578628,653798
6013075456,126483357696,63598592,2188283904,1.454,0.980,97.566,0,0,65746076,612389
6012682240,126483750912,63598592,2188283904,2.388,1.383,96.197,0.031,0,65504170,593883
6011183104,126485291008,63598592,2188283904,2.168,1.288,96.543,0,0,65942466,602048
6010314752,126486151168,63606784,2188283904,5.245,0.848,93.876,0.031,0,65519520,606948
6011346944,126485118976,63606784,2188283904,6.485,1.096,92.419,0,0,65789376,694754
6011346944,126485118976,63606784,2188283904,2.081,0.820,97.100,0,0,65981142,799606
6010351616,126486081536,63606784,2188283904,2.064,1.345,96.592,0,0,65677604,621864
6009065472,126487367680,63606784,2188283904,2.382,1.254,96.365,0,0,65952152,595710
6026235904,126470189056,63614976,2188283904,3.667,1.191,95.080,0.063,0,65703146,646658
6046654464,126449762304,63623168,2188283904,3.728,1.336,94.905,0.031,0,65987764,657254
6045995008,126450421760,63623168,2188283904,4.744,1.280,93.976,0,0,65771152,629640
6045831168,126450585600,63623168,2188283904,2.860,1.288,95.852,0,0,65851956,749488
6045573120,126450843648,63623168,2188283904,1.668,1.133,97.199,0,0,65946888,622442
6045831168,126450585600,63623168,2188283904,1.712,0.919,97.369,0,0,65775048,600690
6072512512,126423904256,63623168,2188283904,3.290,2.173,94.507,0.031,0,65852056,642392
6073278464,126423130112,63631360,2188283904,2.255,1.472,96.242,0.031,0,65973642,611434
6073794560,126422614016,63631360,2188283904,4.882,0.976,94.110,0.031,0,65952518,612742
6073794560,126422614016,63631360,2188283904,3.378,0.694,95.707,0.221,0,65866562,754074
6061830144,126434578432,63631360,2188283904,1.788,1.129,97.083,0,0,65765826,627081
6061473792,126434934784,63631360,2188283904,4.825,1.096,94.079,0,0,65934346,650921
6060650496,126435758080,63631360,2188283904,3.774,1.248,94.978,0,0,65714088,759060
6060347392,126436052992,63639552,2188283904,4.701,0.909,94.359,0.031,0,65940354,648294
6060347392,126436052992,63639552,2188283904,3.377,1.063,95.560,0,0,66012226,700154
6059593728,126436798464,63647744,2188283904,1.827,0.914,97.227,0.032,0,65669652,669764
6057832448,126438559744,63647744,2188283904,2.615,1.681,95.672,0.031,0,65676722,623600
6057172992,126439219200,63647744,2188283904,4.789,1.127,94.085,0,0,65905044,652494
6056222720,126440169472,63647744,2188283904,3.115,0.724,96.161,0,0,65834246,706028
6055649280,126440734720,63655936,2188283904,4.296,1.098,94.575,0.031,0,65938474,648426
6057189376,126439194624,63655936,2188283904,2.936,0.663,96.402,0,0,65861470,743756
6056730624,126439649280,63655936,2188288000,2.371,1.310,96.318,0,0,65670370,676664
6060019712,126436360192,63655936,2188288000,2.907,1.219,95.874,0,0,66026748,604866
6060019712,126436360192,63655936,2188288000,5.340,1.156,93.504,0,0,65975532,613998
6059753472,126436626432,63655936,2188288000,3.382,0.877,95.741,0,0,65931514,753774
6059618304,126436753408,63664128,2188288000,1.736,0.947,97.255,0.063,0,65749126,604302
6059450368,126436921344,63664128,2188288000,4.465,1.006,94.528,0,0,65984826,656144
6059683840,126436687872,63664128,2188288000,6.013,0.814,93.173,0,0,65984518,714888
6059364352,126437007360,63664128,2188288000,3.163,0.908,95.929,0,0,65416786,739990
6059880448,126436491264,63664128,2188288000,2.372,1.217,96.411,0,0,65575540,619362
6059880448,126436491264,63664128,2188288000,2.074,1.100,96.826,0,0,65849530,664452
6060900352,126435459072,63680512,2188283904,4.046,1.043,94.848,0.063,0,65942926,636092
6061412352,126434942976,63680512,2188288000,3.385,1.034,95.581,0,0,65753710,750520
6061436928,126434910208,63688704,2188288000,5.320,1.027,93.591,0.062,0,65811406,636330
6061256704,126435090432,63688704,2188288000,2.273,0.726,97.001,0,0,66074856,701584
6061109248,126435237888,63688704,2188288000,1.611,0.758,97.631,0,0,65327928,666064
6061109248,126435237888,63688704,2188288000,2.043,1.163,96.762,0.031,0,66007362,633404
6060867584,126435479552,63688704,2188288000,1.238,0.540,98.222,0,0,65962462,641304
6061027328,126435180544,63696896,2188279808,1.672,0.820,97.476,0.032,0,65731241,621418
6061850624,126434267136,63696896,2188288000,2.798,1.554,95.648,0,0,65936498,602670
6063849472,126432268288,63696896,2188288000,1.830,1.231,96.939,0,0,65826184,599022
6064721920,126431395840,63696896,2188288000,4.696,0.882,94.422,0,0,65983406,623516
6064324608,126431793152,63696896,2188288000,3.228,1.065,95.707,0,0,65920372,693346
6064033792,126432083968,63696896,2188288000,5.107,1.300,93.593,0,0,65808892,696172
6063759360,126432342016,63713280,2188288000,3.631,0.908,95.368,0.094,0,64919776,687336
6063243264,126432858112,63713280,2188288000,1.857,0.881,97.262,0,0,66003722,632734
6062395392,126433705984,63713280,2188288000,2.138,1.069,96.792,0,0,66016296,634286
6060793856,126435307520,63713280,2188288000,1.335,1.049,97.617,0,0,66109712,660656
6059905024,126436196352,63713280,2188288000,4.375,1.133,94.492,0,0,65934690,614512
6059331584,126436769792,63713280,2188288000,3.528,0.598,95.874,0,0,49351096,599784
6058708992,126437384192,63721472,2188288000,0.628,0.691,98.618,0.063,0,47234,28428
6058807296,126437285888,63721472,2188288000,0.783,0.877,98.340,0,0,53804,44120
6058078208,126438014976,63721472,2188288000,0.597,0.660,98.743,0,0,47132,28164
6058078208,126438014976,63721472,2188288000,0.378,0.504,99.118,0,0,46604,28296
6058078208,126438014976,63721472,2188288000,0.503,0.566,98.931,0,0,47540,28164
6058078208,126438014976,63721472,2188288000,0.440,0.660,98.900,0,0,46310,28164
6058070016,126438014976,63729664,2188288000,0.534,0.597,98.806,0.063,0,53472,43460
6057811968,126438273024,63729664,2188288000,0.565,0.690,98.745,0,0,47360,28312
6057672704,126438412288,63729664,2188288000,0.689,0.751,98.560,0,0,46416,29632
6057414656,126438670336,63729664,2188288000,0.502,0.659,98.839,0,0,46484,28428
6057172992,126438912000,63729664,2188288000,0.410,0.347,99.244,0,0,46714,28560
6057172992,126438912000,63737856,2188279808,0.690,0.690,98.589,0.031,0,56256,43724
6056841216,126439227392,63746048,2188288000,0.471,0.628,98.839,0.063,0,51532,28276
6056816640,126439251968,63746048,2188288000,0.471,0.596,98.933,0,0,46854,28456
6056558592,126439510016,63746048,2188288000,0.751,0.719,98.530,0,0,43848,26412
6056558592,126439510016,63746048,2188288000,0.409,0.503,99.087,0,0,46096,27552
6056849408,126439219200,63750144,2188283904,0.691,0.471,98.493,0.345,0,51450,43856
6056673280,126439387136,63754240,2188288000,0.502,0.596,98.870,0.031,0,46368,28816
6107643904,126387216384,63762432,2188742656,2.182,1.091,96.696,0.031,0,441124,53982
6083031040,126410760192,63762432,2188300288,0.814,1.096,98.090,0,0,54712,52530
