"Dstat 0.7.3 CSV output"
"Author:","Dag Wieers <dag@wieers.com>",,,,"URL:","http://dag.wieers.com/home-made/dstat/"
"Host:","gros-51.nancy.grid5000.fr",,,,"User:","root"
"Cmdline:","dstat -m -c -n -o dstat.csv",,,,"Date:","24 May 2020 21:21:54 CEST"
"memory usage",,,,"total cpu usage",,,,,"net/total",
"used","free","buff","cach","usr","sys","idl","wai","stl","recv","send"
1448255488,96874831872,44597248,1219334144,1.894,0.296,97.724,0.085,0,0,0
1459654656,96863059968,44617728,1219678208,1.027,0.527,98.445,0,0,777482,45228
1441349632,96881344512,44630016,1219682304,0.947,0.529,98.524,0,0,394488,23946
1439621120,96883519488,44630016,1219235840,0,0.056,99.778,0.167,0,6042,784
1439252480,96883433472,44630016,1219682304,0.640,0.445,98.776,0.139,0,395384,21338
1438928896,96884195328,44630016,1219239936,0.889,0.695,98.416,0,0,748844,44594
1458008064,96864653312,44630016,1219686400,0.946,0.696,98.358,0,0,594118,24820
1439297536,96883781632,44654592,1219239936,1.361,0.250,98.361,0.028,0,230688,17508
1447260160,96875593728,44670976,1219444736,0.501,0.167,99.333,0,0,515150,25656
1447292928,96875560960,44670976,1219444736,0,0.028,99.972,0,0,9098,1670
1447292928,96875560960,44670976,1219444736,0,0.028,99.972,0,0,11686,1568
1447292928,96875560960,44670976,1219444736,0.028,0.028,99.944,0,0,5196,1568
1447247872,96875593728,44683264,1219444736,0,0.028,99.972,0,0,7358,1568
1447235584,96875593728,44695552,1219444736,0,0,100,0,0,13660,2824
1447227392,96875601920,44695552,1219444736,0.028,0.028,99.944,0,0,8612,1568
1447227392,96875601920,44695552,1219444736,0,0,100,0,0,3680,1568
1447268352,96875560960,44695552,1219444736,0,0.028,99.972,0,0,7102,2064
1442054144,96880996352,44695552,1219223552,0.250,0.083,99.667,0,0,187796,22036
1440317440,96882683904,44707840,1219260416,0,0,100,0,0,2676,0
1440317440,96882683904,44707840,1219260416,0,0.028,99.972,0,0,2220,0
1440317440,96882683904,44707840,1219260416,0,0,100,0,0,3329,0
1448865792,96874135552,44724224,1219244032,0.167,0.056,99.778,0,0,390580,15524
1594183680,96728469504,44736512,1219575808,2.448,0.612,96.940,0,0,340538,29354
1596563456,96726032384,44748800,1219563520,0.056,0,99.944,0,0,7016,0
1596567552,96726040576,44752896,1219563520,0,0.028,99.972,0,0,7094,2100
1597034496,96725553152,44752896,1219579904,0,0.028,99.972,0,0,7460,2034
1597149184,96725438464,44752896,1219579904,0.028,0.028,99.944,0,0,5282,2520
1599500288,96723083264,44765184,1219571712,0.167,0.028,99.806,0,0,5016,2100
1698263040,96624300032,44773376,1219584000,3.593,0.498,95.909,0,0,6392,2520
1927041024,96395395072,44773376,1219588096,10.116,0.304,89.580,0,0,13597476,225940
2219442176,96102899712,44773376,1219596288,11.019,0.249,88.732,0,0,39314340,722930
2433155072,95889022976,44773376,1219596288,8.165,1.661,90.174,0,0,66980284,1187558
2453139456,95869038592,44773376,1219596288,7.791,1.002,91.208,0,0,93757534,1527380
2522464256,95799705600,44789760,1219588096,9.745,1.360,88.895,0,0,120820116,1875534
2587844608,95734317056,44793856,1219592192,9.385,1.257,89.358,0,0,147271492,2181778
2661449728,95660707840,44793856,1219596288,9.596,1.478,88.926,0,0,173038838,2478758
2948972544,95373185024,44793856,1219596288,10.073,1.562,88.365,0,0,197107826,2746404
2941919232,95380238336,44793856,1219596288,9.678,0.587,89.734,0,0,201671890,2858320
2980630528,95341518848,44802048,1219596288,10.316,0.727,88.957,0,0,201372314,2888847
3000549376,95321600000,44802048,1219596288,10.772,0.583,88.645,0,0,201324670,3025820
3011887104,95310254080,44810240,1219596288,10.476,0.529,88.966,0.028,0,201502364,3016153
3021033472,95301103616,44810240,1219600384,10.165,0.532,89.303,0,0,201454472,3107765
3028156416,95293980672,44810240,1219600384,10.494,0.530,88.976,0,0,201386124,3106621
3041452032,95280676864,44818432,1219600384,11.439,0.529,88.032,0,0,201416568,3270850
3400830976,94921297920,44818432,1219600384,10.800,1.427,87.773,0,0,201484074,3228070
3796062208,94526054400,44826624,1219604480,9.992,2.009,87.999,0,0,201300962,3331020
4490452992,93831663616,44826624,1219604480,9.818,0.923,89.259,0,0,201445618,3335590
4915453952,93406638080,44826624,1219608576,10.097,2.448,87.455,0,0,201478948,3371812
5081919488,93240160256,44834816,1219612672,10.117,1.677,88.206,0,0,201507308,3428832
5096603648,93225476096,44834816,1219612672,10.385,0.419,89.196,0,0,201675606,3409206
5178552320,93143519232,44843008,1219612672,10.329,1.117,88.554,0,0,201279373,3471736
5213097984,93108973568,44843008,1219612672,10.182,1.259,88.559,0,0,201309106,3507694
5246676992,93075394560,44843008,1219612672,10.601,0.529,88.870,0,0,201441446,3595874
5256613888,93065453568,44843008,1219616768,10.302,0.419,89.280,0,0,201194170,3646700
5270188032,93051867136,44851200,1219620864,10.379,0.586,89.035,0,0,201328252,3630820
5280227328,93041819648,44859392,1219620864,10.777,0.446,88.777,0,0,201456962,3623328
5292077056,93029969920,44859392,1219620864,10.210,0.559,89.231,0,0,201315826,3701364
5299404800,93022642176,44859392,1219620864,10.488,0.474,89.038,0,0,201438863,3766662
5314347008,93007695872,44859392,1219624960,10.767,0.558,88.675,0,0,201359835,3769494
5322551296,92999483392,44867584,1219624960,10.970,0.665,88.366,0,0,201501036,3816796
5335969792,92986056704,44875776,1219624960,10.258,0.504,89.238,0,0,201450926,3858376
5344399360,92977627136,44875776,1219624960,10.713,0.531,88.755,0,0,201486081,3830950
5353750528,92968267776,44875776,1219633152,11.384,0.474,88.142,0,0,201275081,3917782
5363904512,92958113792,44875776,1219633152,13.041,0.527,86.432,0,0,201527408,3964614
5373280256,92948725760,44883968,1219633152,11.155,0.643,88.202,0,0,201308802,3950964
5383970816,92938027008,44892160,1219633152,12.081,0.665,87.254,0,0,201427836,4003298
5396619264,92925378560,44892160,1219633152,11.740,0.530,87.730,0,0,201215873,4014426
5793226752,92528766976,44892160,1219637248,11.151,2.091,86.758,0,0,201696901,4031082
5801086976,92520906752,44892160,1219637248,10.916,1.003,88.081,0,0,201297732,4071788
5822763008,92499218432,44900352,1219641344,11.638,1.025,87.337,0,0,201287238,4105392
6409732096,91912241152,44908544,1219641344,11.003,2.178,86.819,0,0,201294616,4120888
6557802496,91764166656,44908544,1219645440,10.240,2.148,87.612,0,0,201256586,4106214
7546114048,90775719936,44908544,1219776512,10.126,1.594,88.280,0,0,201764578,4207880
8157409280,90164350976,44908544,1219776512,9.796,3.014,87.190,0,0,201232338,4215620
8555593728,89766158336,44916736,1219776512,11.673,3.974,84.352,0,0,201409022,4234308
8608460800,89713278976,44924928,1219780608,10.050,0.724,89.226,0,0,201388572,4239718
8648085504,89673654272,44924928,1219780608,10.371,1.617,88.012,0,0,201334546,4304706
9524273152,88797454336,44924928,1219784704,10.550,1.256,88.194,0,0,201401680,4365294
10662490112,87659237376,44924928,1219784704,9.687,0.782,89.531,0,0,201173796,4324362
11441610752,86880104448,44933120,1219788800,9.597,5.344,85.059,0,0,201617174,4304498
11451494400,86870212608,44941312,1219788800,9.586,0.475,89.911,0.028,0,201374793,4391198
11983699968,86338007040,44941312,1219788800,9.802,0.586,89.612,0,0,201533424,4422130
11980255232,86341435392,44941312,1219792896,10.755,0.557,88.688,0,0,201479616,4436082
11988738048,86332952576,44941312,1219792896,9.738,0.642,89.621,0,0,201400081,4417466
11993341952,86328340480,44949504,1219792896,9.914,0.529,89.557,0,0,201394697,4546700
12244000768,86077681664,44949504,1219792896,10.429,4.601,84.969,0,0,201542582,4513922
12251824128,86069841920,44957696,1219801088,9.832,0.447,89.721,0,0,201270882,4526938
12264710144,86056955904,44957696,1219801088,9.777,0.391,89.832,0,0,201087924,4509120
12273496064,86048169984,44957696,1219801088,10.737,0.556,88.707,0,0,201598560,4557606
12279644160,86042009600,44965888,1219805184,9.955,0.418,89.626,0,0,201358502,4629902
12286664704,86034989056,44965888,1219805184,9.785,0.669,89.546,0,0,201297574,4620520
12542771200,85778743296,44974080,1219805184,11.396,3.176,85.428,0,0,201514190,4630731
12544671744,85776871424,44974080,1219801088,9.986,0.669,89.344,0,0,200990028,4622722
12674187264,85647355904,44974080,1219801088,13.978,1.705,84.316,0,0,201654026,4693434
12675895296,85645639680,44982272,1219801088,9.933,0.476,89.591,0,0,201522890,4724363
12678324224,85643210752,44982272,1219801088,10.128,0.391,89.481,0,0,201456868,4679446
12680400896,85641117696,44990464,1219809280,11.189,0.420,88.392,0,0,201402638,4711490
12667240448,85654278144,44990464,1219809280,9.785,0.531,89.684,0,0,201239990,4810228
12671545344,85649973248,44990464,1219809280,10.556,0.391,89.053,0,0,201431066,4798544
12671893504,85649608704,44998656,1219813376,9.835,0.391,89.774,0,0,201603684,4781304
12712800256,85608701952,44998656,1219813376,14.529,0.503,84.968,0,0,201056277,4838768
12716785664,85604708352,45006848,1219813376,12.056,0.476,87.469,0,0,201585921,4850532
12712710144,85608747008,45039616,1219817472,10.441,0.447,89.112,0,0,201245184,4847628
12714770432,85606686720,45039616,1219817472,9.964,0.447,89.590,0,0,201346136,4931461
12714717184,85606739968,45039616,1219817472,11.133,0.559,88.308,0,0,201082312,4916263
12722749440,85598703616,45039616,1219821568,9.749,0.419,89.832,0,0,201542746,4911523
12726337536,85595107328,45047808,1219821568,10.276,0.475,89.249,0,0,201167502,4904188
12728201216,85593235456,45056000,1219821568,11.161,0.446,88.393,0,0,201591003,4896036
12730679296,85590753280,45056000,1219825664,9.964,0.584,89.452,0,0,201313027,5071737
12733034496,85588398080,45056000,1219825664,10.279,0.503,89.218,0,0,201575040,5029065
12735008768,85586423808,45056000,1219825664,10.938,0.586,88.477,0,0,201132715,5030623
12737957888,85583470592,45064192,1219821568,10.061,0.587,89.352,0,0,201367824,5009263
12741226496,85580181504,45072384,1219833856,9.997,0.529,89.474,0,0,201277012,5146124
12743180288,85578227712,45072384,1219833856,10.775,0.476,88.749,0,0,201710537,5138444
12743782400,85577621504,45072384,1219837952,10.231,0.530,89.239,0,0,201148205,5134296
12745981952,85575421952,45072384,1219837952,11.136,0.805,88.059,0,0,202006414,5115982
12745482240,85575913472,45080576,1219837952,10.259,0.613,89.100,0.028,0,201194092,5106176
12748419072,85572964352,45088768,1219842048,10.919,0.780,88.301,0,0,201609606,5129528
12751097856,85570285568,45088768,1219842048,11.343,0.530,88.127,0,0,201377824,5155368
12750225408,85571158016,45088768,1219842048,10.978,0.613,88.409,0,0,201144438,5249756
12750442496,85570928640,45088768,1219850240,11.127,0.558,88.316,0,0,201780999,5268958
12750995456,85570367488,45096960,1219850240,11.621,0.473,87.907,0,0,201193647,5254976
12752347136,85569003520,45105152,1219854336,11.130,0.502,88.368,0,0,201550711,5255174
12753735680,85567606784,45105152,1219854336,11.235,0.640,88.126,0,0,201523623,5165428
12754018304,85567324160,45105152,1219854336,11.142,0.613,88.245,0,0,201344402,5315406
12757348352,85563990016,45105152,1219858432,11.145,0.669,88.186,0,0,201439687,5327322
12760047616,85561290752,45105152,1219858432,10.993,0.558,88.449,0,0,201532793,5347126
12763791360,85557530624,45121536,1219858432,11.550,0.757,87.693,0,0,201481374,5318017
12766498816,85554819072,45121536,1219862528,10.925,0.615,88.460,0,0,201247560,5327995
12766216192,85555101696,45121536,1219862528,11.003,0.531,88.467,0,0,201619274,5397506
12769218560,85552095232,45121536,1219866624,11.840,0.503,87.657,0,0,201397192,5464738
12772220928,85549092864,45121536,1219866624,11.371,0.613,88.016,0,0,201673878,5442279
12772716544,85548580864,45137920,1219866624,11.086,0.531,88.383,0,0,201359179,5393688
12777914368,85543378944,45137920,1219870720,10.784,0.532,88.683,0,0,201411393,5408732
12781121536,85540171776,45137920,1219870720,12.220,0.447,87.332,0,0,201409574,5431818
12782096384,85539192832,45137920,1219874816,11.263,0.585,88.152,0,0,201385223,5509596
12839276544,85482012672,45137920,1219874816,11.232,1.449,87.319,0,0,201701939,5434126
12963467264,85357801472,45154304,1219874816,12.956,1.505,85.539,0,0,201216374,5471336
13049872384,85271392256,45154304,1219878912,11.170,1.508,87.322,0,0,201386971,5562899
13166075904,85155188736,45154304,1219878912,10.881,1.655,87.465,0,0,201248483,5535104
13268406272,85052854272,45154304,1219883008,10.868,1.401,87.731,0,0,201583962,5537847
13363056640,84958199808,45154304,1219887104,11.220,1.563,87.217,0,0,201391968,5644833
13458083840,84863156224,45170688,1219887104,11.244,1.832,86.924,0,0,201510460,5558431
13593665536,84727570432,45170688,1219891200,12.100,2.448,85.452,0,0,201564004,5636435
13686890496,84634341376,45170688,1219895296,11.225,1.940,86.835,0,0,201303914,5630193
13777752064,84543475712,45170688,1219899392,10.921,1.011,88.069,0,0,201244036,5660502
13917913088,84403314688,45170688,1219899392,10.648,2.292,87.060,0,0,201741548,5718584
14013788160,84307423232,45187072,1219899392,11.040,1.397,87.563,0,0,201113042,5768314
14110781440,84210425856,45187072,1219903488,10.927,1.233,87.840,0,0,201588748,5751094
14252576768,84068630528,45187072,1219903488,11.799,2.064,86.137,0,0,201388844,5732544
14322536448,83998666752,45187072,1219907584,11.418,1.563,87.018,0,0,201577540,5702382
14421340160,83899863040,45187072,1219907584,11.319,1.146,87.535,0,0,201583126,5726414
14521606144,83799576576,45203456,1219911680,11.338,1.540,87.122,0,0,201309576,5855766
14645276672,83675832320,45203456,1219911680,14.461,1.755,83.784,0,0,201509537,5870994
14744788992,83576315904,45203456,1219915776,14.147,1.751,84.102,0,0,201470365,5808362
14840958976,83480141824,45203456,1219919872,11.820,1.673,86.507,0,0,201545686,5815092
14980689920,83340410880,45203456,1219919872,11.564,1.760,86.676,0,0,201428582,5858144
15084011520,83237052416,45219840,1219923968,11.374,1.752,86.846,0.028,0,201351638,5883286
15189061632,83132002304,45219840,1219923968,11.080,1.647,87.273,0,0,201557110,5760160
15284924416,83036135424,45219840,1219928064,11.412,1.367,87.221,0,0,201334700,5854266
15390437376,82930622464,45219840,1219928064,11.040,1.485,87.475,0,0,201486626,5759058
15490899968,82830159872,45219840,1219928064,10.928,1.924,87.148,0,0,201499502,5761508
15592124416,82728914944,45236224,1219932160,10.917,2.306,86.778,0,0,201287312,5768403
15702913024,82618118144,45236224,1219932160,11.040,1.840,87.120,0,0,201500296,5793098
15800385536,82520641536,45236224,1219936256,11.683,1.689,86.628,0,0,201384494,5808295
15909380096,82411646976,45236224,1219936256,12.330,1.805,85.865,0,0,201375378,5837704
16022687744,82298335232,45236224,1219940352,11.083,2.144,86.772,0,0,201460620,5748582
16132395008,82188615680,45244416,1219936256,10.958,1.461,87.581,0,0,201815496,5823084
16241905664,82079092736,45252608,1219940352,10.997,2.388,86.615,0,0,201329994,5785728
16352321536,81968668672,45252608,1219948544,11.310,1.568,87.122,0,0,200904578,5819948
16469139456,81851850752,45252608,1219948544,11.275,2.032,86.693,0,0,201760659,5767410
16579694592,81741291520,45252608,1219952640,11.192,2.255,86.553,0,0,201420578,5815144
16694689792,81626279936,45260800,1219952640,11.297,1.729,86.974,0,0,201614881,5856174
16756277248,81564680192,45268992,1219956736,11.164,1.368,87.469,0,0,201571905,5793362
16872984576,81447972864,45268992,1219956736,11.629,1.757,86.615,0,0,201366780,5815042
16988524544,81332432896,45268992,1219956736,11.182,2.064,86.754,0,0,201484966,5855249
17109975040,81210978304,45268992,1219960832,11.653,1.701,86.646,0,0,201675416,5836292
17227501568,81093402624,45277184,1219960832,11.180,1.681,87.139,0,0,201618364,5768750
17307447296,81013444608,45285376,1219964928,11.269,1.669,87.062,0,0,201251284,5835696
17364054016,80956837888,45285376,1219964928,9.997,1.340,88.662,0,0,201250534,5773240
17486950400,80833941504,45285376,1219964928,11.595,2.164,86.241,0,0,201365036,5823504
17600614400,80720273408,45285376,1219969024,11.348,1.541,87.111,0,0,201734578,5826366
17716387840,80604487680,45293568,1219964928,11.454,1.095,87.451,0,0,201311718,5834468
17835823104,80485040128,45293568,1219977216,11.189,1.897,86.914,0,0,201339986,5830442
17897066496,80423788544,45301760,1219977216,11.114,1.365,87.521,0,0,201469027,5811002
18026524672,80294330368,45301760,1219977216,11.130,1.127,87.743,0,0,201486613,5863810
18150334464,80170516480,45301760,1219981312,11.238,2.337,86.426,0,0,201376524,5855834
18215284736,80105377792,45309952,1219981312,9.827,1.392,88.781,0,0,201430704,5861390
18338684928,79981969408,45309952,1219989504,11.518,2.359,86.123,0,0,201382664,5796562
18468794368,79851859968,45309952,1219989504,11.862,1.563,86.575,0,0,201594080,5823172
18592772096,79727878144,45309952,1219993600,11.653,1.176,87.171,0,0,201206314,5847856
18660249600,79660396544,45309952,1219997696,11.655,1.363,86.982,0,0,201376436,5812658
18779049984,79541575680,45326336,1219993600,11.753,1.508,86.739,0,0,201652024,5768451
18901377024,79419240448,45326336,1220001792,9.913,2.122,87.964,0,0,201133186,5791411
18965803008,79354810368,45326336,1220005888,11.324,1.665,87.011,0,0,201515300,5854765
19099205632,79221407744,45326336,1220005888,11.238,2.013,86.749,0,0,201504312,5840016
19162738688,79157874688,45326336,1220005888,11.627,0.866,87.507,0,0,201551766,5836575
19298869248,79021740032,45334528,1220001792,11.676,1.620,86.704,0,0,201418273,5859727
19429171200,78891425792,45338624,1220009984,11.173,1.918,86.909,0,0,201454730,5805387
19497537536,78823055360,45338624,1220014080,10.570,1.091,88.339,0,0,201449718,5858606
19640717312,78679875584,45338624,1220014080,11.750,2.306,85.944,0,0,201500851,5844898
19711451136,78609137664,45338624,1220018176,11.781,1.250,86.969,0,0,201482036,5820586
19856326656,78464253952,45346816,1220018176,11.745,2.153,86.102,0,0,201652384,5842414
19923570688,78397001728,45355008,1220018176,9.695,1.285,88.991,0.028,0,201306992,5831666
20035420160,78285148160,45355008,1220022272,11.464,1.925,86.611,0,0,201583902,5807484
20108832768,78211735552,45355008,1220022272,11.142,1.372,87.486,0,0,201166674,5857442
20244275200,78076289024,45355008,1220026368,11.287,2.530,86.183,0,0,201508368,5856978
20310376448,78010179584,45363200,1220026368,10.039,1.335,88.626,0,0,201617187,5865038
20456013824,77864525824,45371392,1220034560,11.862,1.619,86.520,0,0,201111759,5865138
20533452800,77787086848,45371392,1220034560,11.609,1.531,86.860,0,0,201805406,5826034
20682752000,77637787648,45371392,1220034560,11.878,2.281,85.841,0,0,201159288,5832592
20750790656,77569744896,45371392,1220038656,9.754,1.369,88.876,0,0,201758132,5823086
20894879744,77425647616,45379584,1220038656,11.437,2.287,86.276,0,0,201232278,5861792
20971966464,77348556800,45379584,1220042752,11.986,1.224,86.791,0,0,201367530,5849912
21121130496,77199384576,45387776,1220042752,12.451,1.978,85.571,0,0,201501133,5847262
21198327808,77122183168,45387776,1220046848,9.709,1.315,88.976,0,0,201520239,5843426
21278756864,77041754112,45387776,1220046848,11.911,1.828,86.260,0,0,201435742,5764846
21410836480,76909666304,45395968,1220046848,11.965,1.649,86.385,0,0,201500512,5827122
21483233280,76837265408,45395968,1220050944,10.322,1.443,88.235,0,0,201352756,5834174
21627555840,76692942848,45395968,1220050944,11.409,2.371,86.220,0,0,201407600,5866522
21710061568,76610433024,45395968,1220055040,11.704,1.640,86.656,0,0,201379890,5855980
21856886784,76463607808,45395968,1220055040,10.290,2.175,87.535,0,0,201285422,5841966
21932568576,76387913728,45404160,1220059136,11.269,1.450,87.280,0,0,201673798,5814260
22008918016,76311564288,45404160,1220059136,11.442,1.726,86.832,0,0,201238712,5831782
22166265856,76154208256,45412352,1220059136,11.894,2.717,85.390,0,0,201755190,5846190
22244737024,76075728896,45412352,1220067328,9.829,1.148,89.023,0,0,201430934,5890824
22328123392,75992342528,45412352,1220067328,11.822,1.474,86.704,0,0,201128661,5916348
22484742144,75835711488,45420544,1220071424,11.715,2.287,85.997,0,0,201708785,5843434
22550040576,75770413056,45420544,1220071424,9.955,1.063,88.982,0,0,201054756,5862650
22629064704,75691376640,45428736,1220075520,11.601,1.422,86.977,0,0,201877212,5871982
22791421952,75529019392,45428736,1220075520,12.245,1.813,85.941,0,0,201476869,5854180
22873419776,75447021568,45428736,1220075520,9.914,1.805,88.281,0,0,201348160,5842292
22967177216,75353251840,45436928,1220079616,11.673,1.285,87.043,0,0,201596778,5766012
23129608192,75190820864,45436928,1220079616,10.705,2.453,86.841,0,0,201231848,5851622
23216119808,75104296960,45445120,1220083712,10.736,1.701,87.563,0,0,201853152,5932352
23302209536,75018207232,45445120,1220083712,11.474,1.097,87.430,0,0,201078046,5883948
23376855040,74943557632,45445120,1220087808,9.836,1.862,88.302,0,0,201540998,5875630
23537979392,74782412800,45453312,1220087808,12.018,2.012,85.970,0,0,201397384,5776334
23626989568,74693402624,45453312,1220087808,11.881,1.558,86.561,0,0,201417446,5906774
23692005376,74628378624,45453312,1220096000,9.877,1.395,88.728,0,0,201696648,5863352
23858679808,74461696000,45461504,1220096000,11.945,2.149,85.906,0,0,201208988,5840778
23949692928,74370674688,45461504,1220104192,11.977,1.802,86.221,0,0,201605620,5845548
24029052928,74291306496,45469696,1220104192,9.986,1.506,88.508,0,0,201279994,5768562
24112226304,74208129024,45469696,1220108288,11.989,1.613,86.398,0,0,201349044,5864240
24281681920,74038669312,45469696,1220108288,11.627,2.180,86.193,0,0,201707094,5875518
24361660416,73958690816,45469696,1220108288,10.302,1.173,88.526,0,0,201545244,5837964
24450433024,73869914112,45469696,1220112384,11.847,1.341,86.812,0,0,201442123,5892076
24536555520,73783783424,45477888,1220112384,9.903,1.886,88.211,0,0,201354393,5831096
24711163904,73609170944,45477888,1220116480,11.375,2.935,85.690,0,0,198804044,5843378
24801951744,73518374912,45486080,1220116480,11.868,1.368,86.763,0,0,174465658,5600620
24886091776,73434230784,45486080,1220120576,9.800,1.336,88.864,0,0,147840644,5373812
24973332480,73346985984,45486080,1220124672,11.732,0.646,87.623,0,0,120704994,5152590
25118617600,73201684480,45494272,1220128768,11.750,2.488,85.762,0,0,93895460,4915430
25197850624,73122447360,45494272,1220132864,9.651,1.172,89.177,0,0,67132490,4682938
25269981184,73050316800,45494272,1220132864,11.962,1.110,86.928,0,0,40637710,4461986
25409155072,72911134720,45502464,1220132864,11.680,2.519,85.801,0,0,14295278,4223802
25436647424,72883638272,45502464,1220136960,9.651,1.192,89.157,0,0,22688,4108526
25540603904,72779661312,45510656,1220132864,11.898,1.826,86.276,0,0,16418,4052298
25506779136,72813477888,45510656,1220141056,12.252,1.407,86.341,0,0,15970,4112808
25382424576,72937828352,45510656,1220145152,8.419,1.302,90.280,0,0,20894,4108680
25384337408,72935899136,45518848,1220149248,6.032,0.083,93.885,0,0,19409,4104280
25385639936,72934596608,45518848,1220149248,5.966,0.028,94.007,0,0,21108,4110368
25386987520,72933228544,45527040,1220153344,6.191,0.028,93.781,0,0,21122,4109926
25389436928,72930775040,45527040,1220153344,5.933,0.028,94.039,0,0,28852,4128494
25390624768,72929583104,45527040,1220157440,5.904,0.055,94.041,0,0,18756,4113422
25393459200,72926748672,45527040,1220157440,6.167,0.028,93.805,0,0,21236,4093048
25397755904,72922451968,45527040,1220157440,5.985,0,94.015,0,0,19658,4114306
25402101760,72918077440,45535232,1220161536,6.008,0.111,93.882,0,0,19956,4115328
25407168512,72913010688,45535232,1220161536,6.035,0.111,93.854,0,0,19074,4116744
25411354624,72908820480,45535232,1220165632,5.983,0.055,93.961,0,0,19604,4106694
25417003008,72903172096,45535232,1220165632,6.008,0.055,93.937,0,0,25506,4100878
25420210176,72899960832,45535232,1220169728,5.956,0.111,93.934,0,0,22512,4110510
25440792576,72876752896,45547520,1220177920,7.024,0.470,92.506,0,0,428952,4151072
