"Dstat 0.7.3 CSV output"
"Author:","Dag Wieers <dag@wieers.com>",,,,"URL:","http://dag.wieers.com/home-made/dstat/"
"Host:","grisou-38.nancy.grid5000.fr",,,,"User:","root"
"Cmdline:","dstat -m -c -n -o dstat.csv",,,,"Date:","24 May 2020 18:42:50 CEST"
"memory usage",,,,"total cpu usage",,,,,"net/total",
"used","free","buff","cach","usr","sys","idl","wai","stl","recv","send"
1014910976,132921257984,52498432,830382080,1.447,0.459,97.897,0.197,0,0,0
1024733184,132911022080,52502528,830722048,0.655,0.249,99.096,0,0,386602,15118
1010880512,132925321216,52502528,830275584,0.500,0.344,98.280,0.876,0,4652,15216
1022308352,132913602560,52527104,830537728,0.468,0.125,99.250,0.156,0,382904,11056
1013440512,132922724352,52527104,830279680,0.686,0.530,98.783,0,0,11458,15426
1012850688,132923281408,52527104,830279680,0.031,0,99.969,0,0,3794,2700
1010360320,132925763584,52527104,830283776,1.124,0.531,98.345,0,0,385448,23006
1008943104,132927148032,52527104,830283776,0,0,100,0,0,828,148
1008934912,132927156224,52527104,830283776,0,0,100,0,0,1776,84
1008136192,132927930368,52551680,830283776,0,0,99.906,0.094,0,1112,0
1007362048,132928704512,52551680,830283776,0,0,100,0,0,528,0
1007362048,132928704512,52551680,830283776,0,0,100,0,0,752,148
1007362048,132928704512,52551680,830283776,0,0,100,0,0,704,0
1007104000,132928962560,52551680,830283776,0,0,100,0,0,766,0
1007104000,132928962560,52551680,830283776,0,0,100,0,0,764,0
1006837760,132929220608,52559872,830283776,0,0,99.969,0.031,0,626,180
1006428160,132929630208,52559872,830283776,0,0,100,0,0,3738,676
1006428160,132929630208,52559872,830283776,0,0,100,0,0,6356,0
1006170112,132929888256,52559872,830283776,0,0,100,0,0,6692,220
1005973504,132930084864,52559872,830283776,0,0,100,0,0,5934,0
1012662272,132923346944,52559872,830283776,1.185,0.624,98.191,0,0,396110,33686
1010515968,132925448192,52572160,830283776,0,0,99.938,0.062,0,9504,1048
1014120448,132921868288,52572160,830169088,0.375,0.250,99.375,0,0,172836,11956
1028300800,132906893312,52572160,830754816,1.029,0.499,98.472,0,0,389868,17268
1012826112,132922781696,52572160,830308352,0.156,0.187,99.656,0,0,4538,13712
1023901696,132911468544,52584448,830496768,0.624,0.156,99.157,0.062,0,382814,11126
1015046144,132920512512,52584448,830308352,0.624,0.499,98.877,0,0,4190,14804
1012248576,132923289600,52596736,830312448,1.277,0.623,98.037,0.062,0,386590,26428
1012482048,132923056128,52596736,830312448,0,0,98.906,1.094,0,824,652
1012215808,132923322368,52596736,830312448,0,0,100,0,0,1084,84
1034604544,132900634624,52604928,830562304,1.749,0.250,97.908,0.094,0,222042,9552
1013481472,132921860096,52604928,830443520,0.031,0.031,99.937,0,0,16036,4802
1012944896,132922384384,52617216,830443520,0,0.031,99.938,0.031,0,5056,634
1012428800,132922900480,52617216,830443520,0,0,100,0,0,858,0
1013153792,132922146816,52617216,830472192,0.779,0.125,99.096,0,0,342278,15406
1022468096,132912685056,52617216,830562304,0.250,0.156,99.594,0,0,180056,21488
1022119936,132912959488,52621312,830631936,0,0,99.969,0.031,0,13188,13328
1021591552,132913483776,52621312,830636032,0,0,100,0,0,13474,15708
1021579264,132913483776,52633600,830636032,0.031,0.031,99.500,0.437,0,12782,13548
1021579264,132913483776,52633600,830636032,0,0,100,0,0,13080,13328
1021063168,132913999872,52633600,830636032,0,0,100,0,0,19824,18956
1020547072,132914515968,52633600,830636032,0,0,100,0,0,12994,13412
1020289024,132914774016,52633600,830636032,0,0,100,0,0,12842,13328
1020289024,132914774016,52633600,830636032,0,0,100,0,0,13362,13328
1020022784,132915032064,52645888,830631936,0,0,99.750,0.250,0,13310,13230
1012588544,132922449920,52645888,830648320,0.031,0.031,99.938,0,0,2310,2236
1012350976,132922871808,52645888,830464000,0.343,0.156,99.500,0,0,172484,14188
1011769344,132923453440,52645888,830464000,0,0,100,0,0,1022,458
1011511296,132923711488,52645888,830464000,0,0,100,0,0,864,0
1011511296,132923711488,52645888,830464000,0,0,100,0,0,804,0
1011486720,132923711488,52670464,830464000,0,0,99.906,0.094,0,874,0
1011228672,132923969536,52670464,830464000,0,0,100,0,0,1384,0
1010970624,132924227584,52670464,830464000,0,0,100,0,0,6282,0
1010700288,132924493824,52670464,830468096,0.031,0,99.969,0,0,1370,662
1010425856,132924768256,52670464,830468096,0,0,100,0,0,466,0
1010425856,132924768256,52670464,830468096,0,0,100,0,0,858,0
1010409472,132924776448,52678656,830468096,0,0,99.938,0.062,0,1038,0
1027977216,132906950656,52678656,830726144,0.937,0.312,98.751,0,0,388376,16266
1011937280,132923244544,52678656,830468096,0.250,0.250,99.500,0,0,3576,13984
1011679232,132923502592,52678656,830468096,0,0,100,0,0,764,0
1011421184,132923760640,52678656,830468096,0,0,100,0,0,528,0
2193317888,131741958144,52678656,830316544,10.438,5.405,84.157,0,0,1646186,61908
5355982848,128577220608,52695040,832077824,35.425,14.340,50.173,0.063,0,1325400,57082
8536272896,125395361792,52703232,833585152,38.018,13.080,48.902,0,0,1324220,55720
11735957504,122194075648,52707328,835026944,34.326,14.169,51.473,0.031,0,1453186,61252
14874497024,119054127104,52785152,836288512,35.600,12.653,50.456,1.291,0,1523598,62614
17904680960,116022157312,52809728,837890048,37.822,12.492,49.372,0.314,0,1323728,55990
21237194752,112688099328,52842496,839286784,40.942,15.510,43.391,0.157,0,1390886,7351852
24279461888,109644443648,52846592,840577024,42.898,13.731,43.277,0.095,0,1598112,29011350
27305844736,106616111104,52867072,842354688,44.781,13.497,41.564,0.158,0,1919700,51533817
30260834304,103660195840,52867072,843247616,44.722,14.085,41.037,0.156,0,1128960,72055137
30866751488,103054217216,52867072,843309056,18.113,3.396,73.491,5,0,755306,92777346
31028875264,102892015616,52887552,843362304,13.584,1.690,84.163,0.563,0,920406,113472543
31228772352,102692020224,52887552,843460608,19.183,2.277,78.260,0.281,0,1083790,136114886
31409278976,102511443968,52887552,843522048,19.117,2.492,78.202,0.189,0,1248322,157000562
31572025344,102348591104,52887552,843624448,21.931,2.218,75.539,0.312,0,1390628,176639519
31754862592,102165626880,52887552,843747328,22.246,2.527,71.700,3.526,0,1528370,197365260
31904649216,102015717376,52895744,843853824,23.832,3.010,72.280,0.878,0,1592972,202056494
32022044672,101898203136,52895744,843968512,20.946,2.880,75.736,0.438,0,1560784,202284763
32124731392,101795250176,52895744,844234752,18.250,2.469,78.969,0.312,0,1570658,202104590
32259690496,101660184576,52895744,844341248,18.654,3.271,77.383,0.692,0,1554610,201973062
32269688832,101650051072,52895744,844476416,17.193,3.314,78.868,0.625,0,1553850,202043268
32246697984,101672660992,52989952,844759040,10.925,2.179,79.002,7.894,0,1521668,202221774
32273580032,101645660160,52989952,844869632,11.626,2.876,85.003,0.495,0,1517882,202048343
32289267712,101629833216,52989952,845004800,10.223,2.485,86.788,0.503,0,1545082,202008099
32334741504,101584244736,52989952,845115392,9.636,2.480,87.414,0.471,0,1540286,202245821
32367362048,101551489024,52989952,845246464,8.063,1.606,89.953,0.378,0,1522212,202060136
32434180096,101484539904,52998144,845365248,8.372,2.655,88.254,0.719,0,1492706,202125830
32488353792,101430247424,53006336,845475840,8.398,2.820,88.317,0.465,0,1504990,202138857
32518725632,101399764992,53006336,845582336,7.934,2.271,89.515,0.280,0,1481228,202016267
32538374144,101379973120,53006336,845721600,8.079,1.996,89.707,0.218,0,1515088,202329642
32552067072,101366165504,53006336,845836288,7.312,1.969,90.469,0.250,0,1536118,202089968
32592117760,101325967360,53014528,845975552,7.172,1.824,90.437,0.566,0,1520630,202089585
32605650944,101312319488,53014528,846090240,7.064,2.050,90.634,0.252,0,1532040,202178821
32605184000,101312667648,53014528,846204928,6.135,2.034,91.518,0.313,0,1479590,202107432
32643387392,101274349568,53014528,846319616,8.048,2.263,89.374,0.314,0,1525854,202344185
32659922944,101257547776,53014528,846585856,6.372,2.009,91.306,0.314,0,1460382,202175373
32691793920,101225574400,53022720,846680064,6.821,2.315,90.300,0.563,0,1521834,202036841
32710590464,101206618112,53022720,846831616,6.679,2.226,87.426,3.669,0,1493428,202188908
32713043968,101204070400,53022720,846925824,6.344,1.884,91.489,0.283,0,1508932,202237757
32726196224,101190766592,53022720,847073280,6.681,2.466,90.571,0.281,0,1478706,201975895
32754438144,101162409984,53022720,847187968,8.630,3.127,87.961,0.281,0,1469678,202054626
32772726784,101143994368,53030912,847306752,7.302,2.172,89.959,0.567,0,1501086,202156704
32803840000,101112733696,53030912,847446016,7.334,2.235,87.472,2.959,0,1509594,202057406
32821272576,101095198720,53030912,847544320,7.156,2.085,90.510,0.249,0,1490452,202099338
32826470400,101089869824,53030912,847667200,7.298,3.137,89.193,0.373,0,1478688,202278982
32830267392,101085949952,53030912,847785984,7.422,2.671,89.534,0.373,0,1515788,202198100
32838451200,101077630976,53039104,847908864,5.862,1.702,92.090,0.347,0,1487714,202292433
32862048256,101053898752,53043200,848031744,6.437,2.456,89.055,2.052,0,1507148,202328575
32887459840,101028356096,53047296,848158720,5.113,2.102,92.284,0.502,0,1438748,200826707
32902180864,101013516288,53047296,848273408,6.557,3.045,90.056,0.342,0,1494288,203266299
32908664832,101006913536,53047296,848392192,5.157,2.296,92.233,0.314,0,1449216,202049111
32914849792,101000609792,53055488,848502784,5.233,2.006,92.353,0.407,0,1514780,202102699
32917057536,100998266880,53055488,848633856,5.477,2.128,92.050,0.344,0,1497592,202015169
32923029504,100992188416,53063680,848732160,4.905,2.124,88.566,4.405,0,1417674,199322281
32933609472,100981465088,53063680,848871424,5.895,2.415,91.408,0.282,0,1490888,202853604
32938229760,100976590848,53063680,849117184,6.588,2.331,90.771,0.311,0,1476660,202016343
32939450368,100975161344,53071872,849244160,5.761,2.411,91.327,0.501,0,1451160,202191811
32940531712,100973920256,53071872,849395712,5.726,1.783,92.146,0.344,0,1437536,202063039
32941867008,100972478464,53080064,849489920,5.422,2.026,92.178,0.374,0,1462642,201986021
32941219840,100972998656,53080064,849612800,5.926,2.090,91.609,0.374,0,1497570,201935347
32940310528,100973772800,53080064,849747968,7.174,1.840,90.674,0.312,0,1500884,202071609
32942899200,100971081728,53088256,849838080,8.043,2.342,89.122,0.493,0,1508808,202052091
32947007488,100966834176,53088256,849973248,9.193,1.939,88.618,0.250,0,1518502,202066089
32947601408,100966088704,53088256,850116608,8.924,1.997,86.053,3.027,0,1491472,202312929
32949280768,100964302848,53088256,850219008,8.188,2.646,88.917,0.249,0,1493350,202109574
32949354496,100964106240,53088256,850333696,8.596,2.157,88.934,0.313,0,1462556,201991987
32949526528,100963790848,53096448,850464768,8.614,1.717,89.232,0.437,0,1483372,202336631
32964857856,100948340736,53096448,850579456,9.340,2.024,88.387,0.249,0,1482826,202122735
32979709952,100933349376,53096448,850710528,8.122,2.062,89.566,0.250,0,1506274,202065482
32986603520,100926193664,53096448,850825216,8.265,2.223,83.375,6.137,0,1388670,198603020
33000726528,100911915008,53096448,850948096,7.712,2.154,89.760,0.375,0,1498412,201977200
33017294848,100895199232,53104640,851054592,9.826,2.387,87.229,0.558,0,1802690,202194895
33069678592,100842659840,53104640,851165184,12.765,2.528,84.395,0.312,0,1503066,202084814
33084559360,100827631616,53104640,851312640,9.537,2.033,88.118,0.313,0,1480686,202121781
33096654848,100815405056,53112832,851431424,9.838,2.179,84.838,3.144,0,1473604,202183367
33100906496,100810891264,53112832,851685376,9.898,2.296,87.558,0.248,0,1507710,202335424
33123749888,100787920896,53121024,851800064,10.530,2.087,86.854,0.530,0,1475846,202072895
33136009216,100775534592,53121024,851914752,11.264,2.628,85.763,0.344,0,1506314,202059707
33155555328,100755857408,53121024,852045824,10.333,1.743,87.644,0.280,0,1476364,202034461
33205374976,100705923072,53121024,852160512,11.847,2.052,84.888,1.213,0,1474828,202406314
33201393664,100709797888,53121024,852267008,6.561,2.301,90.827,0.311,0,1485764,202090766
33243582464,100667416576,53129216,852414464,10.062,2.062,87.156,0.719,0,1514432,201939669
33292570624,100618321920,53129216,852520960,10.944,1.819,86.861,0.376,0,1540398,202299698
33350877184,100559876096,53129216,852656128,10.790,2.208,86.660,0.342,0,1504518,202121913
33413980160,100496670720,53133312,852754432,12.703,2.341,83.895,1.061,0,1505844,201248313
33464287232,100446195712,53137408,852918272,10.693,1.989,84.706,2.611,0,1492376,203047065
33519255552,100391120896,53145600,853016576,10.075,2.166,87.382,0.377,0,1480808,202020130
33589424128,100320845824,53145600,853123072,9.947,2.058,87.714,0.281,0,1465836,202121129
33645076480,100265062400,53145600,853254144,9.000,2.258,88.398,0.345,0,1421968,202111256
33676988416,100233015296,53145600,853389312,8.994,1.905,88.788,0.312,0,1467816,202066426
33689837568,100220047360,53145600,853508096,7.492,1.881,88.088,2.539,0,1467570,201510769
33684189184,100225597440,53153792,853594112,4.265,1.631,93.634,0.470,0,1459086,201936719
33678426112,100231208960,53161984,853733376,4.075,1.755,93.887,0.282,0,1442292,202363975
33678204928,100231303168,53161984,853860352,5.651,1.904,92.164,0.281,0,1443272,202049199
33678852096,100230529024,53161984,853983232,5.003,1.782,92.902,0.313,0,1436286,202299960
33682202624,100227059712,53161984,854102016,5.655,2.042,90.795,1.508,0,1464424,202170536
33686351872,100222660608,53170176,854339584,5.902,1.771,91.799,0.528,0,1460586,202157998
33689477120,100219375616,53178368,854482944,5.367,2.122,92.075,0.437,0,1468404,202129162
33694425088,100214304768,53178368,854601728,6.311,1.781,91.596,0.312,0,1482132,202168819
33687597056,100221009920,53178368,854720512,5.077,1.818,92.792,0.313,0,1465724,202382721
33684586496,100223918080,53182464,854814720,4.142,1.851,93.505,0.502,0,1476076,202063230
33684361216,100223979520,53194752,854962176,3.887,1.881,87.649,6.583,0,1458600,202246367
33680502784,100227719168,53194752,855076864,4.768,2.181,92.739,0.312,0,1469074,202147890
33678934016,100229140480,53198848,855212032,4.257,1.878,93.427,0.438,0,1476426,202137568
33679605760,100228333568,53198848,855334912,4.625,2,93.062,0.312,0,1465992,202315470
33679536128,100228268032,53198848,855461888,4.035,1.814,93.869,0.282,0,1445226,202025320
33678856192,100228849664,53207040,855547904,3.933,1.825,93.707,0.535,0,1471670,202137024
33679429632,100228141056,53207040,855678976,3.947,1.848,93.891,0.313,0,1472628,202345688
33679458304,100227960832,53215232,855818240,4.121,1.667,93.866,0.346,0,1470200,202167288
33679761408,100227571712,53215232,855900160,4.105,1.661,93.920,0.313,0,1431342,201912723
33679519744,100227657728,53215232,856051712,4.658,1.782,93.248,0.313,0,1461142,202439253
33680363520,100226691072,53223424,856162304,4.844,2.188,90.281,2.688,0,1451936,202101695
33681059840,100225851392,53223424,856305664,4.642,1.945,93.130,0.282,0,1430736,201948365
33679659008,100227153920,53223424,856403968,4.108,1.631,94.011,0.251,0,1440842,202229269
33679564800,100227108864,53231616,856530944,3.829,1.820,93.974,0.377,0,1464156,202087505
33679802368,100226752512,53231616,856649728,4.284,1.595,93.777,0.344,0,1451656,202330282
33679101952,100227301376,53239808,856793088,4.271,1.933,92.051,1.746,0,1464972,201981797
33679339520,100226957312,53239808,856899584,4.281,1.844,93.250,0.625,0,1414900,202431860
33679437824,100226711552,53239808,857047040,3.957,1.884,93.876,0.283,0,1482148,201951149
33679843328,100226170880,53239808,857178112,4.768,1.776,93.175,0.280,0,1461910,202215165
33682501632,100223397888,53239808,857288704,5.379,2.411,91.901,0.309,0,1459330,202095837
33680715776,100225028096,53248000,857427968,4.207,1.821,93.250,0.722,0,1446910,202187195
33682350080,100223217664,53256192,857563136,4.218,1.731,91.061,2.990,0,1451762,201973669
33682415616,100223037440,53256192,857677824,4.587,2.184,92.886,0.343,0,1477768,202208472
33682477056,100222832640,53256192,857821184,4.130,1.971,93.586,0.313,0,1455834,201916865
33682739200,100222476288,53256192,857911296,4.691,2.672,92.389,0.249,0,1437886,202087115
33682010112,100223004672,53264384,858099712,3.890,1.631,94.103,0.376,0,1454676,202095092
33683714048,100221153280,53272576,858234880,4.271,1.727,91.394,2.607,0,1471376,201887285
33683869696,100220862464,53272576,858365952,4.688,1.938,93.094,0.281,0,1468318,201939206
33684475904,100220121088,53272576,858501120,4.680,1.622,93.385,0.312,0,1441718,202325920
33683238912,100221251584,53272576,858603520,4.608,2.086,92.902,0.405,0,1465600,202108643
33685377024,100218970112,53280768,858738688,5.240,2.308,92.015,0.437,0,1465818,201994730
33685446656,100218638336,53280768,858996736,4.379,1.752,93.619,0.250,0,1454600,202191464
33685835776,100218122240,53288960,859115520,4.565,2.439,88.837,4.159,0,1455846,201988295
33686306816,100217507840,53288960,859250688,4.329,1.725,93.601,0.345,0,1437038,202335181
33689468928,100214218752,53288960,859373568,3.894,1.759,94.095,0.251,0,1445598,202205690
33688887296,100214538240,53297152,859627520,4.551,1.726,93.252,0.471,0,1426610,202175777
33688629248,100214669312,53297152,859750400,4.436,1.781,93.502,0.281,0,1462046,202202288
33689927680,100213186560,53301248,859926528,4.318,1.564,90.207,3.911,0,1434412,201370932
33689378816,100213604352,53309440,860045312,4.292,1.786,93.515,0.407,0,1435690,202039599
33689874432,100212981760,53309440,860172288,4.820,2.114,92.755,0.311,0,1417436,202053146
33690247168,100212432896,53317632,860299264,4.649,1.934,92.917,0.499,0,1426046,202296921
33689985024,100212400128,53317632,860577792,4.637,2.085,93.028,0.249,0,1496132,201974916
33689804800,100212465664,53317632,860688384,3.719,1.513,92.657,2.112,0,1418510,202178799
33688645632,100213497856,53317632,860811264,3.809,1.668,94.208,0.315,0,1474668,202168943
33689694208,100212305920,53325824,860942336,4.520,2.151,92.893,0.436,0,1496488,202134231
33689788416,100212076544,53334016,861061120,4.601,1.628,93.365,0.407,0,1467514,202225741
33690279936,100211466240,53334016,861175808,4.269,1.758,93.628,0.345,0,1466546,202158166
33691488256,100210110464,53334016,861319168,3.920,1.693,94.199,0.188,0,1452730,201969275
33688817664,100212658176,53334016,861442048,4.238,1.994,92.209,1.558,0,1461026,202196935
33689837568,100211499008,53342208,861569024,4.500,1.688,93.531,0.281,0,1451900,202141516
33690808320,100210401280,53350400,861679616,4.622,1.968,92.911,0.500,0,1476844,202148340
33690935296,100210155520,53350400,861794304,5.245,2.328,92.179,0.248,0,1463124,201849135
33691344896,100209610752,53350400,861929472,3.985,1.600,94.164,0.251,0,1456946,202415781
33690517504,100210298880,53350400,862068736,4.207,2.088,93.425,0.280,0,1452670,201909858
33692188672,100208513024,53358592,862175232,4.314,1.813,93.592,0.281,0,1520354,202170803
33693020160,100207521792,53366784,862318592,3.795,1.819,94.072,0.314,0,1483678,202168096
33691865088,100208553984,53366784,862433280,3.829,1.664,94.256,0.251,0,1449132,202196434
33692110848,100208197632,53366784,862543872,4.273,1.903,93.575,0.250,0,1449366,202074094
33691058176,100209102848,53366784,862687232,4.091,1.936,91.693,2.280,0,1449736,202182414
33692655616,100207362048,53366784,862822400,4.837,2.202,92.682,0.279,0,1460876,202053080
33693245440,100206555136,53383168,863023104,3.863,1.696,93.970,0.471,0,1454022,202169431
33693356032,100206342144,53383168,863117312,4.579,2.118,92.991,0.312,0,1437562,202009784
33692696576,100206858240,53383168,863252480,4.365,1.902,93.389,0.343,0,1388816,202035030
33691832320,100207591424,53383168,863383552,4.520,2.151,93.017,0.312,0,1453232,202240672
33690914816,100208394240,53383168,863498240,4.456,2.337,91.617,1.589,0,1407040,202314327
33690742784,100208300032,53391360,863756288,5.050,2.323,92.255,0.372,0,1367976,201802482
33691029504,100207882240,53399552,863875072,4.219,1.906,93.562,0.312,0,1408190,202184674
33690525696,100208267264,53399552,863993856,4.572,1.804,93.344,0.280,0,1454802,202267442
33691201536,100207460352,53399552,864120832,4.695,2.239,92.817,0.249,0,1457660,202065959
33691283456,100207230976,53399552,864268288,3.781,1.764,92.187,2.268,0,1425148,201811120
33691697152,100206686208,53407744,864391168,4.363,1.839,93.269,0.530,0,1447542,202450785
33691443200,100206686208,53415936,864636928,4.090,1.780,93.756,0.375,0,1472988,202088167
33691787264,100206231552,53415936,864743424,4.178,1.933,93.421,0.468,0,1486558,202087607
33691983872,100205912064,53415936,864866304,4.505,2.144,93.041,0.311,0,1457056,202188620
33691934720,100205813760,53415936,865013760,4.126,1.969,92.685,1.219,0,1461214,201944527
33693511680,100204089344,53424128,865144832,3.942,2.034,93.554,0.469,0,1480812,202201776
33692946432,100204539904,53424128,865259520,4.544,1.899,93.308,0.249,0,1452730,202113123
33691955200,100205412352,53424128,865378304,4.083,1.539,94.127,0.251,0,1479236,202100491
33690902528,100206313472,53432320,865517568,4.018,2.072,93.566,0.345,0,1461884,202034411
33695256576,100201828352,53432320,865644544,4.403,1.624,93.629,0.344,0,1484490,202234985
33691631616,100205314048,53440512,865767424,4.243,2.059,89.860,3.838,0,1460992,202052856
33692229632,100204572672,53440512,865902592,4.167,1.660,93.922,0.251,0,1459686,202192097
33693437952,100203233280,53440512,866025472,3.824,1.724,94.169,0.282,0,1481176,202063664
33693655040,100202909696,53440512,866131968,4.330,1.963,93.271,0.436,0,1475000,201872223
33693851648,100202586112,53444608,866254848,3.952,1.694,94.072,0.282,0,1465682,202105247
33693835264,100202459136,53456896,866385920,4.304,1.903,92.576,1.216,0,1459866,202040565
33694552064,100201619456,53456896,866500608,4.289,1.597,93.832,0.282,0,1445584,202109307
33694011392,100202004480,53456896,866648064,4.085,2.120,93.483,0.312,0,1456420,202101362
33694035968,100201717760,53456896,866902016,4.526,2.077,93.087,0.310,0,1465874,202114564
33693040640,100202442752,53456896,867160064,3.824,1.787,94.138,0.251,0,1467406,202304995
33692692480,100202680320,53465088,867262464,3.670,1.945,93.036,1.349,0,1458358,201963291
33693671424,100201553920,53473280,867397632,4.156,1.906,91.906,2.031,0,1469522,202525315
33693851648,100201263104,53473280,867508224,4.015,1.757,93.946,0.282,0,1442168,202141930
33694486528,100200488960,53473280,867647488,4.417,1.441,93.922,0.219,0,1453134,202189393
33694654464,100200198144,53473280,867766272,4.208,1.901,93.641,0.249,0,1474982,202128346
33695092736,100199616512,53481472,867901440,5.002,1.926,92.513,0.559,0,1483584,202062986
33695506432,100199067648,53489664,868028416,3.479,2.037,81.134,13.350,0,1261834,187445690
33696161792,100198293504,53489664,868139008,4.557,1.779,93.321,0.343,0,1423598,202101264
33696280576,100198035456,53489664,868274176,4.245,1.873,93.602,0.281,0,1422450,201814866
33695240192,100198969344,53489664,868380672,3.705,1.947,94.035,0.314,0,1461164,202134913
33696022528,100198035456,53497856,868524032,4.359,2.024,92.870,0.747,0,1463820,202024070
33696477184,100197453824,53506048,868630528,4.159,1.845,93.652,0.344,0,1480582,202269894
33695961088,100197842944,53506048,868757504,4.337,1.872,93.448,0.343,0,1451620,202099038
33695346688,100198322176,53506048,868892672,3.652,1.669,94.395,0.283,0,1451112,202226475
33694765056,100198776832,53506048,869015552,4.025,1.352,94.340,0.283,0,1504954,202218771
33695440896,100197969920,53514240,869126144,4.071,1.910,93.580,0.438,0,1470712,202126657
33695023104,100198260736,53514240,869253120,4.065,1.845,91.526,2.564,0,1482972,202091543
33694633984,100198338560,53514240,869548032,4.487,1.870,91.524,2.119,0,1437344,202077530
33696231424,100196651008,53522432,869629952,4.512,2.116,92.999,0.373,0,1464872,202052442
33696370688,100196360192,53522432,869781504,4.041,1.692,93.954,0.313,0,1455228,202092435
33697779712,100194844672,53530624,869875712,4.143,1.601,93.723,0.534,0,1484088,202136006
33695420416,100197068800,53530624,870010880,4.043,2.037,93.450,0.470,0,1459044,202293473
33695776768,100196577280,53530624,870141952,4.184,1.811,88.480,5.526,0,1408940,200412572
33695993856,100196229120,53530624,870273024,3.945,1.847,93.895,0.313,0,1439251,202157486
33695825920,100196294656,53530624,870375424,4.107,1.599,93.950,0.345,0,1455734,202160355
33695670272,100196294656,53538816,870522880,3.957,1.665,93.970,0.408,0,1435134,202042890
33696481280,100195364864,53538816,870641664,4.842,1.955,92.862,0.341,0,1476232,202021152
33696747520,100194971648,53538816,870760448,4.398,1.747,91.734,2.121,0,1467528,202267508
33696288768,100195274752,53547008,870907904,4.701,1.567,93.137,0.595,0,1491030,202173269
33696153600,100195295232,53547008,871018496,3.862,1.601,94.160,0.377,0,1489438,202056708
33696276480,100195037184,53555200,871141376,4.216,2.030,93.254,0.500,0,1444548,202062430
33697234944,100193935360,53555200,871284736,3.922,1.632,94.101,0.345,0,1495022,202077004
33697304576,100193775616,53555200,871362560,4.143,1.444,92.844,1.569,0,1442798,202228481
33698746368,100192165888,53563392,871514112,3.998,1.905,92.786,1.312,0,1456438,202083803
31185637376,102705123328,53563392,871657472,3.805,2.013,93.836,0.346,0,1446670,197319870
27215466496,106675843072,53571584,871100416,3.611,1.727,93.909,0.754,0,1266934,175022542
23919165440,109972930560,53571584,870309888,3.024,1.543,95.055,0.378,0,1134852,153378806
20722089984,113170665472,53571584,869646336,3.068,1.440,95.085,0.407,0,944700,131412978
17522221056,116371337216,53571584,868843520,2.722,1.252,93.836,2.190,0,805618,110640380
13480747008,120413409280,53579776,868237312,2.288,0.971,96.459,0.282,0,656778,88743320
10182901760,123712299008,53592064,867176448,1.508,0.722,97.362,0.408,0,469004,66691213
6883246080,127013027840,53592064,866103296,1.190,0.689,97.808,0.313,0,289338,45667753
3498278912,130399072256,53592064,865026048,0.719,0.719,98.312,0.250,0,135920,24691253
1076117504,132822114304,53592064,864145408,0.313,0.219,98.966,0.501,0,27102,5034930
1050529792,132848144384,53592064,863703040,0.094,0.031,99.875,0,0,874,0
1050120192,132848775168,53592064,863481856,0,0,100,0,0,918,0
1050107904,132848775168,53604352,863481856,0,0,99.844,0.156,0,1382,1508
1050107904,132848775168,53604352,863481856,0,0,100,0,0,1296,0
1050099712,132848783360,53604352,863481856,0,0,100,0,0,1200,0
1049841664,132849041408,53608448,863477760,0,0,99.906,0.094,0,1642,0
1049837568,132849041408,53608448,863481856,0,0,100,0,0,2062,0
1049579520,132849299456,53608448,863481856,0,0,100,0,0,2858,0
1049571328,132849299456,53616640,863481856,0,0,99.937,0.063,0,1114,0
1049571328,132849299456,53616640,863481856,0,0,100,0,0,2404,550
1049309184,132849557504,53616640,863485952,0,0,100,0,0,812,0
1049051136,132849815552,53616640,863485952,0,0,100,0,0,2434,0
1048793088,132850073600,53616640,863485952,0,0,100,0,0,992,0
1048793088,132850073600,53616640,863485952,0,0,100,0,0,1198,0
1048268800,132850589696,53624832,863485952,0.031,0,99.937,0.031,0,1054,84
1048010752,132850847744,53624832,863485952,0,0,99.312,0.688,0,2074,0
1048010752,132850847744,53624832,863485952,0,0,100,0,0,1574,0
1048010752,132850847744,53624832,863485952,0,0,100,0,0,2284,132
1048010752,132850847744,53624832,863485952,0,0,100,0,0,1040,0
1048010752,132850847744,53624832,863485952,0,0,100,0,0,2200,0
1047486464,132851363840,53633024,863485952,0,0.031,99.938,0.031,0,166,220
1047486464,132851363840,53633024,863485952,0,0,100,0,0,1674,1948
1047228416,132851621888,53633024,863485952,0,0,100,0,0,558,1676
1047228416,132851621888,53633024,863485952,0,0,100,0,0,2080,0
1046970368,132851879936,53633024,863485952,0,0,100,0,0,754,0
1046622208,132852228096,53633024,863485952,0,0,100,0,0,572,0
1046355968,132852486144,53641216,863485952,0,0,99.969,0.031,0,1040,0
1046355968,132852486144,53641216,863485952,0,0,100,0,0,1674,0
1046355968,132852486144,53641216,863485952,0,0,100,0,0,512,0
1045581824,132853260288,53641216,863485952,0,0.031,99.969,0,0,2080,0
1045581824,132853260288,53641216,863485952,0,0,100,0,0,918,0
1045581824,132853260288,53641216,863485952,0,0,100,0,0,1568,0
1045573632,132853260288,53649408,863485952,0,0,99.938,0.062,0,512,0
1045573632,132853260288,53649408,863485952,0,0,100,0,0,1674,0
1045057536,132853776384,53649408,863485952,0,0,100,0,0,988,0
1044541440,132854292480,53649408,863485952,0,0,99.969,0.031,0,1856,0
1044541440,132854292480,53649408,863485952,0,0,99.969,0.031,0,858,0
1044283392,132854550528,53649408,863485952,0,0,100,0,0,512,0
1044275200,132854550528,53657600,863485952,0,0,99.969,0.031,0,870,0
1044275200,132854550528,53657600,863485952,0,0,100,0,0,2772,0
1044275200,132854550528,53657600,863485952,0,0,100,0,0,3838,476
1044275200,132854550528,53657600,863485952,0,0,100,0,0,2080,148
1044275200,132854550528,53657600,863485952,0,0,100,0,0,692,0
1044717568,132854108160,53657600,863485952,0.125,0.062,99.813,0,0,26199,12440
1046138880,132850794496,53665792,863686656,1.374,0.624,97.908,0.094,0,399210,38660
1045176320,132851617792,53665792,863498240,0,0,100,0,0,4044,84
1045176320,132851617792,53665792,863498240,0,0,100,0,0,5356,84
1044910080,132851884032,53665792,863498240,0,0,100,0,0,2380,0
1044389888,132852400128,53665792,863502336,0,0,100,0,0,826,148
1044389888,132852400128,53665792,863502336,0,0,100,0,0,858,84
1043849216,132852916224,53690368,863502336,0,0,99.875,0.125,0,1050,0
1043591168,132853174272,53690368,863502336,0,0,100,0,0,2426,0
1043591168,132853174272,53690368,863502336,0,0,100,0,0,992,652
