"Dstat 0.7.3 CSV output"
"Author:","Dag Wieers <dag@wieers.com>",,,,"URL:","http://dag.wieers.com/home-made/dstat/"
"Host:","gros-64.nancy.grid5000.fr",,,,"User:","root"
"Cmdline:","dstat -m -c -n -o dstat.csv",,,,"Date:","23 May 2020 23:34:41 CEST"
"memory usage",,,,"total cpu usage",,,,,"net/total",
"used","free","buff","cach","usr","sys","idl","wai","stl","recv","send"
1440317440,97061552128,47046656,1041641472,0.312,0.070,99.566,0.052,0,0,0
1436508160,97064857600,47063040,1042120704,0.722,0.444,98.834,0,0,401318,29054
1434370048,97067442176,47063040,1041674240,0,0,100,0,0,7140,552
1432952832,97068810240,47063040,1041674240,0.529,0.445,99.026,0,0,397638,21658
1442988032,97058500608,47075328,1041932288,0.195,0.056,99.750,0,0,385038,11308
1433427968,97068314624,47075328,1041674240,0.472,0.334,99.194,0,0,6688,6202
1433399296,97068331008,47087616,1041674240,0.056,0,99.944,0,0,7234,0
1433399296,97068331008,47087616,1041674240,0,0,100,0,0,8622,0
1433399296,97068331008,47087616,1041674240,0,0,100,0,0,10402,0
1433391104,97068339200,47087616,1041674240,0,0.028,99.972,0,0,3022,0
1433370624,97068347392,47099904,1041674240,0.028,0.028,99.944,0,0,2024,0
1445437440,97056014336,47099904,1041936384,0.306,0.139,99.555,0,0,387660,15210
1432977408,97068519424,47108096,1041883136,0.639,0.751,98.610,0,0,173330,16780
1438437376,97062780928,47108096,1042141184,0.612,0.306,99.082,0,0,389532,18346
1432952832,97068261376,47108096,1042141184,0.749,0.527,98.723,0,0,393516,31110
1431212032,97070448640,47108096,1041694720,0.028,0,99.972,0,0,3764,132
1431629824,97070026752,47108096,1041694720,0.612,0.445,98.915,0.028,0,398867,17874
1462206464,97039282176,47132672,1041838080,0.473,0.056,99.472,0,0,228300,9864
1433608192,97067974656,47132672,1041698816,0.805,0.083,99.111,0,0,15108,5432
1441566720,97059995648,47153152,1041698816,0.306,0.111,99.583,0,0,354094,13528
1442344960,97059028992,47153152,1041887232,0.223,0.306,99.471,0,0,187886,20320
1442689024,97058545664,47153152,1041887232,0.083,0.111,99.806,0,0,41214,10192
1442689024,97058545664,47153152,1041887232,0,0.056,99.944,0,0,12684,10192
1442676736,97058545664,47165440,1041887232,0,0,100,0,0,12722,10192
1442668544,97058553856,47165440,1041887232,0.028,0.056,99.917,0,0,11282,9996
1442656256,97058553856,47177728,1041887232,0,0.028,99.944,0.028,0,16148,14476
1442656256,97058553856,47177728,1041887232,0.028,0.028,99.944,0,0,12630,10526
1442656256,97058553856,47177728,1041887232,0.028,0.028,99.944,0,0,12444,10192
1442656256,97058553856,47177728,1041887232,0.028,0.083,99.889,0,0,12010,10192
1442656256,97058553856,47177728,1041887232,0,0.028,99.972,0,0,11687,9996
1435430912,97065779200,47177728,1041887232,0,0.056,99.944,0,0,2934,3216
1435504640,97065877504,47190016,1041702912,0.195,0.083,99.416,0.306,0,173270,14372
1435475968,97065893888,47202304,1041702912,0,0.056,99.944,0,0,496,0
1435467776,97065902080,47202304,1041702912,0.028,0.028,99.944,0,0,2474,0
1435459584,97065910272,47202304,1041702912,0,0,100,0,0,1926,0
1435451392,97065918464,47202304,1041702912,0.056,0.028,99.917,0,0,1730,0
1443594240,97057312768,47214592,1042149376,0.584,0.472,98.944,0,0,389954,17406
1428082688,97073266688,47214592,1041707008,0,0,100,0,0,2762,13108
1583996928,96916971520,47230976,1042022400,2.248,0.250,97.502,0,0,333454,14636
1586221056,96914890752,47230976,1041903616,0.028,0,99.972,0,0,2536,0
1586221056,96914890752,47230976,1041903616,0,0,100,0,0,28076,3380
1586208768,96914890752,47243264,1041903616,0,0.028,99.972,0,0,19352,764
1586192384,96914890752,47255552,1041907712,0.056,0.028,99.917,0,0,4822,0
1586192384,96914890752,47255552,1041907712,1.334,0.028,98.638,0,0,3360,204
1586192384,96914890752,47255552,1041907712,2.806,0,97.194,0,0,1042,0
1586307072,96914776064,47255552,1041907712,2.778,0.056,97.167,0,0,4232,2100
1586352128,96914726912,47255552,1041911808,2.807,0.028,97.165,0,0,8510,2852
1586540544,96914530304,47263744,1041911808,2.806,0.028,97.167,0,0,6792,2248
1586573312,96914497536,47263744,1041911808,2.779,0.028,97.194,0,0,9634,1680
1586585600,96914481152,47263744,1041915904,2.779,0,97.221,0,0,5064,568
1629556736,96871497728,47271936,1041920000,4.879,0.166,94.954,0,0,7654504,124378
1708752896,96792297472,47271936,1041924096,7.537,0.443,92.020,0,0,22066170,2537610
1871781888,96629248000,47284224,1041932288,5.809,0.973,93.191,0.028,0,42423800,3983908
1877733376,96623296512,47284224,1041932288,3.145,0.111,96.744,0,0,53305440,3319036
1906962432,96594067456,47284224,1041932288,3.336,0.139,96.525,0,0,56927676,3533354
1938186240,96562843648,47284224,1041932288,3.394,0.167,96.439,0,0,61247458,5030144
1970339840,96530685952,47284224,1041936384,3.064,0.195,96.741,0,0,60378722,3701644
2000007168,96501006336,47292416,1041940480,3.333,0.139,96.528,0,0,58317220,4380220
2029944832,96471056384,47300608,1041944576,3.146,0.195,96.659,0,0,56267134,3304616
2061819904,96439181312,47300608,1041944576,3.441,0.166,96.393,0,0,59436083,3842916
2094071808,96406929408,47300608,1041944576,3.362,0.278,96.360,0,0,63994790,4017044
2133237760,96367763456,47300608,1041944576,3.840,0.166,95.994,0,0,59863380,3123600
2227576832,96273416192,47308800,1041944576,4.042,0.664,95.293,0,0,58868254,4464142
2258481152,96242511872,47308800,1041944576,3.572,0.194,96.234,0,0,59624728,4184268
2290257920,96210735104,47308800,1041944576,3.389,0.083,96.528,0,0,62966944,3683992
2323169280,96177823744,47308800,1041944576,3.526,0.139,96.335,0,0,61348980,4207650
2352259072,96148729856,47308800,1041948672,3.844,0.166,95.990,0,0,54903608,4937288
2385506304,96115474432,47316992,1041948672,3.310,0.167,96.523,0,0,63171844,3829286
2416009216,96084971520,47316992,1041948672,3.088,0.167,96.745,0,0,59140520,4068710
2446446592,96054534144,47316992,1041948672,3.281,0.167,96.553,0,0,60206360,4904788
2477867008,96023113728,47316992,1041948672,3.359,0.167,96.474,0,0,59645702,3910224
2508718080,95992262656,47316992,1041948672,3.334,0.167,96.499,0,0,58978504,3946398
2538160128,95962812416,47325184,1041948672,3.308,0.222,96.469,0,0,56666988,4225114
2562772992,95938199552,47325184,1041948672,3.302,0.194,96.504,0,0,55675304,4426358
2622099456,95878873088,47325184,1041948672,3.202,0.585,96.213,0,0,60079486,3879584
2652418048,95848550400,47325184,1041952768,3.411,0.194,96.395,0,0,58001556,4595566
2681446400,95819522048,47325184,1041952768,3.281,0.139,96.580,0,0,56980668,4845742
2711715840,95789244416,47333376,1041952768,3.223,0.167,96.610,0,0,58065718,3711974
2745483264,95755460608,47341568,1041952768,3.331,0.222,96.447,0,0,63347966,3845030
2777645056,95723298816,47341568,1041952768,3.278,0.194,96.528,0,0,61480254,2992114
2809229312,95691714560,47341568,1041952768,3.119,0.139,96.742,0,0,59422418,3802436
2837028864,95663915008,47341568,1041952768,3.142,0.139,96.719,0,0,54038502,3349180
2867535872,95633399808,47349760,1041952768,3.142,0.195,96.663,0,0,57489294,3810170
2896211968,95604723712,47349760,1041952768,3.062,0.139,96.798,0,0,57220462,3070262
2928332800,95572602880,47349760,1041952768,3.195,0.222,96.582,0,0,59422916,3274660
2957262848,95543668736,47349760,1041956864,3.201,0.111,96.688,0,0,55336884,3744226
2985287680,95515643904,47349760,1041956864,3.441,0.194,96.365,0,0,54998208,4906186
3017187328,95483736064,47357952,1041956864,3.278,0.222,96.500,0,0,60367324,3596348
3046465536,95454457856,47357952,1041956864,3.254,0.167,96.580,0,0,56273642,4554110
3074043904,95426879488,47357952,1041956864,3.062,0.167,96.771,0,0,53620697,4148368
3121397760,95379525632,47357952,1041956864,3.224,0.139,96.637,0,0,54814220,4654546
3174432768,95326490624,47357952,1041956864,3.144,0.195,96.661,0,0,59221752,4329968
3227762688,95273152512,47366144,1041956864,3.332,0.139,96.529,0,0,55832742,3443200
3269500928,95231410176,47366144,1041956864,3.168,0.195,96.637,0,0,55765784,3867844
3320664064,95180247040,47366144,1041956864,3.037,0.111,96.851,0,0,55372230,3825682
3376406528,95124500480,47366144,1041960960,3.038,0.139,96.823,0,0,58599430,4124636
3415416832,95085490176,47366144,1041960960,3.332,0.194,96.473,0,0,58625134,3445518
3463065600,95037931520,47374336,1041952768,3.092,0.195,96.713,0,0,61393854,3066824
3505221632,94995775488,47374336,1041952768,3.171,0.111,96.718,0,0,57846776,2438552
3559383040,94941614080,47374336,1041952768,3.314,0.111,96.575,0,0,62179326,3991796
3615346688,94885646336,47374336,1041956864,3.308,0.167,96.525,0,0,65642368,4057802
3660800000,94840193024,47374336,1041956864,3.249,0.194,96.557,0,0,58959522,3405310
3733143552,94767841280,47382528,1041956864,3.174,0.696,96.130,0,0,56344258,4113380
3762692096,94738292736,47382528,1041956864,3.036,0.139,96.825,0,0,57243084,4629454
3793690624,94707294208,47382528,1041956864,3.118,0.139,96.743,0,0,59747600,4444088
3823460352,94677520384,47382528,1041960960,3.339,0.111,96.550,0,0,58438918,4609724
3853570048,94647410688,47382528,1041960960,3.174,0.195,96.631,0,0,58009292,4716652
3883679744,94617292800,47390720,1041960960,3.390,0.167,96.443,0,0,57654096,4308018
3910303744,94590668800,47390720,1041960960,3.309,0.167,96.524,0,0,52293118,3647720
3939631104,94561267712,47398912,1041960960,3.198,0.195,96.607,0,0,55096980,4855526
3973046272,94527852544,47398912,1041960960,3.007,0.195,96.798,0,0,60787666,3478930
4005236736,94495662080,47398912,1041960960,3.173,0.167,96.660,0,0,61313664,3452592
4032774144,94468116480,47407104,1041960960,3.034,0.167,96.799,0,0,55301076,3788832
4061179904,94439710720,47407104,1041960960,3.252,0.111,96.637,0,0,55836074,3741168
4091416576,94409469952,47407104,1041965056,3.010,0.111,96.878,0,0,57904826,3251432
4121411584,94379474944,47407104,1041965056,2.927,0.084,96.989,0,0,59544116,3387520
4148682752,94352203776,47407104,1041965056,3.090,0.167,96.743,0,0,53961520,3708714
4178042880,94322835456,47415296,1041965056,2.981,0.111,96.907,0,0,58622134,4192372
4210946048,94289932288,47415296,1041965056,3.226,0.167,96.607,0,0,57637764,3816876
4240924672,94259953664,47415296,1041965056,3.171,0.195,96.634,0,0,57058993,4207124
4271534080,94229344256,47415296,1041965056,3.116,0.223,96.661,0,0,60349674,4811696
4302536704,94198341632,47415296,1041965056,3.582,0.222,96.196,0,0,58852384,3945206
4333432832,94167437312,47423488,1041965056,3.175,0.167,96.658,0,0,60118518,5096998
4363255808,94137610240,47423488,1041969152,3.231,0.111,96.657,0,0,58238132,4424118
4392767488,94108098560,47423488,1041969152,3.172,0.167,96.661,0,0,57227800,4095916
4419538944,94081327104,47423488,1041969152,3.008,0.223,96.770,0,0,52432854,4288376
4449697792,94051168256,47423488,1041969152,3.306,0.167,96.527,0,0,59036682,4724904
4485464064,94015393792,47431680,1041969152,3.333,0.222,96.444,0,0,60884041,5114192
4528148480,93972709376,47431680,1041969152,3.305,0.250,96.445,0,0,58192412,4217662
4579311616,93921546240,47431680,1041969152,3.222,0.167,96.611,0,0,58785526,3875390
4652994560,93847863296,47431680,1041969152,3.358,0.860,95.781,0,0,57878704,4413882
4683116544,93817737216,47431680,1041973248,3.115,0.195,96.690,0,0,57653347,4304772
4716802048,93784043520,47439872,1041973248,3.142,0.195,96.663,0,0,61876656,3024122
4747460608,93753384960,47439872,1041973248,3.222,0.194,96.583,0,0,59552212,3313386
4785786880,93715058688,47439872,1041973248,3.810,0.167,96.023,0,0,55319128,3293632
4849430528,93651415040,47439872,1041973248,5.291,0.139,94.570,0,0,59265063,3853996
4880584704,93620260864,47439872,1041973248,3.087,0.195,96.719,0,0,60697694,3607850
4910575616,93590261760,47448064,1041973248,3.198,0.167,96.635,0,0,57884314,4859482
4931215360,93569622016,47448064,1041973248,3.388,0.139,96.473,0,0,57177636,3499692
4962103296,93538734080,47456256,1041965056,3.220,0.278,96.502,0,0,57770555,3903480
4992548864,93508280320,47456256,1041973248,3.089,0.195,96.716,0,0,58427174,3322142
5021126656,93479702528,47456256,1041973248,3.455,0.111,96.434,0,0,55712524,4417910
5051510784,93449306112,47464448,1041977344,3.039,0.139,96.822,0,0,58522114,4374552
5080285184,93420531712,47464448,1041977344,4.175,0.167,95.658,0,0,57663818,4781512
5111087104,93389729792,47464448,1041977344,3.115,0.195,96.691,0,0,58716972,3160820
5140606976,93360209920,47464448,1041977344,3.093,0.111,96.796,0,0,57095134,3881820
5172797440,93328019456,47464448,1041977344,3.396,0.167,96.437,0,0,61219596,4390244
5202464768,93298343936,47472640,1041977344,3.093,0.139,96.768,0,0,55356834,2791312
5233819648,93266989056,47472640,1041977344,3.228,0.139,96.633,0,0,59796792,4797038
5266817024,93233987584,47472640,1041981440,3.091,0.167,96.742,0,0,62589714,3317666
5295603712,93205200896,47472640,1041981440,2.982,0.139,96.878,0,0,55962111,3115604
5327642624,93173161984,47472640,1041981440,3.035,0.195,96.770,0,0,58653498,3520706
5354680320,93146112000,47480832,1041985536,3.142,0.111,96.746,0,0,53184102,3935160
5383696384,93117095936,47480832,1041985536,3.117,0.139,96.744,0,0,55881240,5219874
5413076992,93087715328,47480832,1041985536,3.062,0.195,96.743,0,0,58882698,3704094
5442273280,93058519040,47480832,1041985536,3.144,0.195,96.661,0,0,57168278,5657648
5472804864,93027987456,47480832,1041985536,3.118,0.139,96.743,0,0,58507426,4308972
5504176128,92996608000,47489024,1041985536,3.062,0.139,96.798,0,0,59140281,3557744
5532393472,92968390656,47489024,1041985536,3.305,0.167,96.529,0,0,55786994,4256856
5561511936,92939268096,47489024,1041989632,3.634,0.139,96.227,0,0,56869082,3725574
5590364160,92910415872,47489024,1041989632,3.225,0.167,96.608,0,0,58050826,4524492
5620842496,92879937536,47489024,1041989632,3.493,0.166,96.340,0,0,57237205,4155258
5651898368,92848873472,47497216,1041989632,3.387,0.194,96.391,0.028,0,58378774,3393470
5683040256,92817731584,47497216,1041989632,3.467,0.166,96.366,0,0,58593132,3845764
5712719872,92788051968,47497216,1041989632,3.171,0.111,96.718,0,0,55978530,3309550
5741776896,92758994944,47497216,1041989632,3.198,0.139,96.663,0,0,57378866,3824422
5771431936,92729339904,47497216,1041989632,3.306,0.167,96.528,0,0,55905050,5258330
5802803200,92697960448,47505408,1041989632,3.520,0.194,96.286,0,0,60967050,3760446
5831700480,92669059072,47505408,1041993728,3.436,0.222,96.342,0,0,56074654,3551844
5861507072,92639252480,47505408,1041993728,3.422,0.083,96.494,0,0,55987902,4265616
5889818624,92610932736,47513600,1041993728,3.384,0.166,96.449,0,0,57347270,3822770
5922918400,92577828864,47513600,1041993728,3.414,0.139,96.447,0,0,61924986,4202830
5954969600,92545769472,47521792,1041993728,3.254,0.139,96.607,0,0,61598052,3387192
5984485376,92516253696,47521792,1041993728,3.334,0.167,96.499,0,0,57958434,4027012
6014255104,92486483968,47521792,1041993728,3.524,0.139,96.337,0,0,57668914,5121016
6045511680,92455227392,47521792,1041993728,3.520,0.222,96.258,0,0,60385962,4228888
6075666432,92425068544,47521792,1041997824,3.145,0.111,96.744,0,0,59044296,3957240
6102851584,92397875200,47529984,1041997824,3.223,0.167,96.610,0,0,51562712,4829354
6134296576,92366430208,47529984,1041997824,3.544,0.221,96.235,0,0,59591592,3028102
6165884928,92334841856,47529984,1041997824,3.276,0.222,96.502,0,0,58332062,4250562
6195105792,92305620992,47529984,1041997824,3.198,0.167,96.635,0,0,58300911,4812620
6223683584,92277043200,47529984,1041997824,3.413,0.166,96.421,0,0,56970922,3406426
6257512448,92243206144,47538176,1041997824,3.412,0.194,96.394,0,0,63600708,3637626
6287626240,92213092352,47538176,1041997824,3.011,0.139,96.850,0,0,60266430,3298676
6317981696,92182736896,47538176,1041997824,3.439,0.139,96.423,0,0,58190726,3909140
6348812288,92151902208,47538176,1042001920,3.227,0.083,96.690,0,0,59090040,3746880
6379233280,92121481216,47538176,1042001920,3.359,0.167,96.474,0,0,58015124,3843516
6409900032,92090806272,47546368,1042001920,3.465,0.139,96.396,0,0,58057490,4233358
6439964672,92060741632,47546368,1042001920,3.892,0.276,95.832,0,0,57418722,3679456
6469287936,92031418368,47546368,1042001920,3.276,0.194,96.530,0,0,54474686,3433308
6498971648,92001734656,47546368,1042001920,3.280,0.139,96.581,0,0,56251258,3199300
6531031040,91969675264,47546368,1042001920,3.306,0.167,96.527,0,0,60363014,4713216
6558859264,91941838848,47554560,1042001920,3.280,0.139,96.581,0,0,55318199,4900996
6588792832,91911901184,47554560,1042006016,3.359,0.167,96.474,0,0,57728464,4253852
6623592448,91877101568,47554560,1042006016,3.332,0.194,96.473,0,0,64624588,3199968
6651396096,91849297920,47554560,1042006016,3.253,0.111,96.636,0,0,55027998,4630616
6682431488,91818262528,47554560,1042006016,3.174,0.139,96.687,0,0,59873343,3254068
6716252160,91784433664,47562752,1042006016,3.144,0.167,96.689,0,0,63603020,4126850
6746447872,91754237952,47562752,1042006016,3.144,0.223,96.633,0,0,58772450,4054826
6776508416,91724173312,47562752,1042010112,3.145,0.167,96.688,0,0,55336428,3459098
6808031232,91692650496,47562752,1042010112,2.983,0.167,96.850,0,0,60124244,3564038
6839861248,91660812288,47570944,1042010112,2.984,0.112,96.905,0,0,60018908,4313776
6871007232,91629649920,47579136,1042014208,3.142,0.278,96.580,0,0,59765596,4301430
6899580928,91601076224,47579136,1042014208,3.224,0.222,96.554,0,0,57214630,3750882
6932447232,91568209920,47579136,1042014208,3.117,0.195,96.688,0,0,61906142,4471556
6961831936,91538825216,47583232,1042010112,3.278,0.194,96.528,0,0,57182414,4435356
6992310272,91508342784,47583232,1042014208,3.061,0.167,96.772,0,0,57541864,3658762
7021363200,91479281664,47591424,1042014208,3.197,0.167,96.636,0,0,56572440,3480126
7051395072,91449249792,47591424,1042014208,3.115,0.195,96.690,0,0,57737934,4088384
7081390080,91419254784,47591424,1042014208,3.112,0.278,96.610,0,0,57215200,3922590
7112323072,91388317696,47591424,1042018304,3.009,0.139,96.851,0,0,59277293,3678370
7138729984,91361902592,47599616,1042018304,3.167,0.194,96.639,0,0,50906674,3466842
7166976000,91333648384,47607808,1042018304,3.144,0.139,96.717,0,0,56332546,3651924
7196360704,91304263680,47607808,1042018304,3.145,0.167,96.688,0,0,56317042,4651776
7228264448,91272359936,47607808,1042018304,3.009,0.223,96.768,0,0,61250526,4106630
7259426816,91241197568,47607808,1042018304,3.062,0.195,96.743,0,0,60201110,4518034
7290298368,91210326016,47607808,1042018304,3.062,0.139,96.798,0,0,58263766,3146174
7321739264,91178876928,47616000,1042018304,3.043,0.112,96.845,0,0,60993770,4320130
7352770560,91147845632,47616000,1042018304,3.422,0.167,96.411,0,0,59230688,4338858
7379402752,91121201152,47624192,1042022400,3.225,0.139,96.636,0,0,53149638,4598508
7409983488,91090620416,47624192,1042022400,3.225,0.139,96.636,0,0,57675430,3527634
7438757888,91061846016,47624192,1042022400,3.035,0.167,96.798,0,0,54783400,2962286
7467905024,91032690688,47632384,1042022400,2.983,0.139,96.878,0,0,56925540,4437668
7495766016,91004682240,47632384,1042153472,2.955,0.112,96.933,0,0,55688280,4310584
7526014976,90974433280,47632384,1042153472,3.091,0.167,96.742,0,0,56333932,3530270
7553691648,90946756608,47632384,1042153472,3.091,0.139,96.770,0,0,52886794,4305634
7583625216,90916823040,47632384,1042153472,3.255,0.139,96.605,0,0,58699154,4837368
7613181952,90887254016,47640576,1042157568,3.090,0.139,96.771,0,0,55943486,4260826
7642411008,90858024960,47640576,1042157568,2.953,0.111,96.935,0,0,56725228,3996610
7670702080,90829733888,47640576,1042157568,3.168,0.222,96.610,0,0,54320154,3221684
7703216128,90797219840,47640576,1042157568,3.035,0.167,96.798,0,0,60677516,3461986
7731335168,90769092608,47648768,1042157568,3.115,0.222,96.663,0,0,56674526,5127010
7760883712,90739535872,47656960,1042157568,3.250,0.194,96.556,0,0,56362776,4313544
7789969408,90710450176,47656960,1042157568,3.009,0.139,96.851,0,0,56688178,4070418
7821451264,90678968320,47656960,1042157568,3.142,0.222,96.635,0,0,60191298,4424264
7851474944,90648940544,47656960,1042161664,3.008,0.195,96.798,0,0,59598362,3939062
7883124736,90617282560,47665152,1042161664,3.197,0.195,96.608,0,0,59300538,3832262
7914536960,90585862144,47673344,1042161664,2.925,0.223,96.852,0,0,57353982,3833972
7943565312,90556833792,47673344,1042161664,2.983,0.112,96.905,0,0,57170394,3731884
7973371904,90527027200,47673344,1042161664,3.063,0.111,96.825,0,0,55657078,3120144
8006647808,90493751296,47673344,1042161664,2.899,0.223,96.878,0,0,61185555,2485920
8036728832,90463670272,47681536,1042153472,3.037,0.223,96.740,0,0,58203406,5766800
8066756608,90433622016,47689728,1042161664,2.951,0.167,96.854,0.028,0,56020290,3870686
8095526912,90404851712,47689728,1042161664,3.224,0.195,96.581,0,0,56274894,4072938
8126324736,90374049792,47689728,1042165760,3.205,0.084,96.711,0,0,60006710,5452002
8155418624,90344955904,47689728,1042165760,2.953,0.167,96.879,0,0,55549332,3509450
8185835520,90314539008,47697920,1042157568,3.063,0.223,96.714,0,0,59287430,3365654
8217042944,90283315200,47706112,1042165760,3.194,0.222,96.583,0,0,55580376,4314434
8248938496,90251415552,47706112,1042169856,3.144,0.223,96.633,0,0,62847554,4556936
8280260608,90220093440,47706112,1042169856,2.955,0.167,96.878,0,0,60220856,5247732
8311259136,90189094912,47706112,1042169856,3.252,0.222,96.526,0,0,58972522,3234632
8343932928,90156421120,47706112,1042169856,2.981,0.223,96.797,0,0,60465970,3134706
8374063104,90126270464,47722496,1042173952,3.174,0.139,96.687,0,0,60258680,4095378
8406900736,90093432832,47722496,1042173952,3.091,0.139,96.770,0,0,61600034,4751182
8435470336,90064863232,47722496,1042173952,3.066,0.139,96.795,0,0,57051092,4507912
8468471808,90031857664,47722496,1042173952,3.088,0.195,96.718,0,0,61026890,4287468
8498724864,90001604608,47722496,1042173952,3.142,0.195,96.663,0,0,60081228,4954504
8529154048,89971159040,47738880,1042173952,2.981,0.167,96.851,0,0,60040542,3974190
8557166592,89943146496,47738880,1042173952,3.114,0.222,96.664,0,0,55533170,4265458
8588259328,89912049664,47738880,1042178048,3.062,0.167,96.771,0,0,57803972,2940220
8619950080,89880358912,47738880,1042178048,3.142,0.222,96.635,0,0,60871636,3033306
8651730944,89848541184,47738880,1042182144,3.116,0.195,96.689,0,0,59228507,3357192
8686182400,89814073344,47755264,1042182144,3.172,0.167,96.661,0,0,63716476,3616786
8716877824,89783377920,47755264,1042182144,3.088,0.223,96.690,0,0,60481930,3449704
8744939520,89755316224,47755264,1042182144,3.091,0.111,96.798,0,0,53792116,3608548
8773107712,89727148032,47755264,1042182144,3.088,0.167,96.745,0,0,52136972,3170060
8802033664,89698222080,47755264,1042182144,3.062,0.111,96.826,0,0,56604182,2933504
8833462272,89666777088,47771648,1042182144,3.064,0.139,96.797,0,0,59786730,3804398
8864018432,89636220928,47771648,1042182144,2.977,0.278,96.745,0,0,58336584,4213060
8893403136,89606836224,47771648,1042182144,3.149,0.084,96.767,0,0,57714806,4567324
8916238336,89583996928,47771648,1042186240,2.977,0.167,96.856,0,0,44371561,3542204
8929591296,89570643968,47771648,1042186240,2.921,0.139,96.940,0,0,28429944,3428444
8935800832,89564418048,47788032,1042186240,2.890,0.056,97.054,0,0,13746858,3761038
8936968192,89563250688,47788032,1042186240,2.921,0.028,97.051,0,0,2555260,2563708
8936017920,89564200960,47788032,1042186240,2.861,0,97.139,0,0,28874,2860526
8937869312,89562349568,47788032,1042186240,2.863,0.028,97.110,0,0,28838,2854668
8935837696,89564381184,47788032,1042186240,2.863,0,97.137,0,0,34460,3128364
8934932480,89565265920,47804416,1042190336,2.838,0,97.162,0,0,35762,3572416
8936652800,89563545600,47804416,1042190336,2.834,0,97.166,0,0,20260,2069978
8935571456,89564626944,47804416,1042190336,2.834,0.028,97.138,0,0,30114,3042792
8935743488,89564454912,47804416,1042190336,2.917,0.028,97.056,0,0,54172,4348874
8934301696,89565896704,47804416,1042190336,2.888,0.028,97.084,0,0,40188,2768766
8935370752,89564819456,47820800,1042182144,2.836,0,97.164,0,0,31158,3396268
8935010304,89565089792,47820800,1042190336,2.836,0.028,97.137,0,0,34212,3642452
8933961728,89566138368,47820800,1042190336,2.833,0.028,97.139,0,0,26842,2739868
8933203968,89566892032,47820800,1042194432,2.807,0,97.193,0,0,14504,1447674
8934522880,89565573120,47820800,1042194432,2.833,0.056,97.111,0,0,29704,2141066
8933892096,89566195712,47837184,1042186240,2.860,0,97.112,0.028,0,25266,2264488
8933130240,89566949376,47837184,1042194432,2.835,0,97.165,0,0,40518,3405352
8933867520,89566212096,47837184,1042194432,2.836,0,97.164,0,0,36078,3492702
8931934208,89568145408,47837184,1042194432,2.889,0,97.111,0,0,21532,2700112
8931037184,89569042432,47837184,1042194432,2.810,0.056,97.134,0,0,36358,3284756
8929488896,89570582528,47845376,1042194432,2.836,0,97.164,0,0,29684,3558870
8959987712,89537572864,47853568,1042653184,4.314,0.525,95.160,0,0,430014,3120292
8957493248,89540182016,47853568,1042210816,2.834,0.028,97.138,0,0,39558,3699588
