"Dstat 0.7.3 CSV output"
"Author:","Dag Wieers <dag@wieers.com>",,,,"URL:","http://dag.wieers.com/home-made/dstat/"
"Host:","grisou-42.nancy.grid5000.fr",,,,"User:","root"
"Cmdline:","dstat -m -c -n -o dstat.csv",,,,"Date:","27 May 2020 10:04:35 CEST"
"memory usage",,,,"total cpu usage",,,,,"net/total",
"used","free","buff","cach","usr","sys","idl","wai","stl","recv","send"
1014624256,133055934464,50196480,709214208,0.932,0.210,98.722,0.136,0,0,0
1028665344,133041545216,50196480,709558272,0.686,0.249,99.065,0,0,391458,15054
1014763520,133055881216,50208768,709111808,0.500,0.438,98.687,0.375,0,384856,24580
1012736000,133057851392,50212864,709124096,1.371,0.530,97.508,0.592,0,7432,16634
1012637696,133057949696,50212864,709124096,0,0,100,0,0,10806,0
1017839616,133052542976,50225152,709312512,0.938,0.625,98.374,0.063,0,390264,26566
1016569856,133054001152,50225152,709124096,0.062,0,99.938,0,0,6396,84
1016045568,133054525440,50225152,709124096,0,0.031,99.969,0,0,14278,0
1015259136,133055299584,50237440,709124096,0,0,99.969,0.031,0,14806,0
1014996992,133055557632,50237440,709128192,0,0,100,0,0,4608,1008
1014738944,133055815680,50237440,709128192,0,0,100,0,0,4128,0
1014468608,133056073728,50249728,709128192,0,0,99.937,0.063,0,3536,0
1014210560,133056331776,50249728,709128192,0,0,100,0,0,2130,0
1014210560,133056331776,50249728,709128192,0.031,0.031,99.938,0,0,1066,0
1013686272,133056847872,50257920,709128192,0,0,99.969,0.031,0,466,0
1013686272,133056847872,50257920,709128192,0,0,100,0,0,1158,0
1013428224,133057105920,50257920,709128192,0,0,100,0,0,1338,0
1013170176,133057363968,50257920,709128192,0.031,0.031,99.938,0,0,4178,0
1028759552,133041319936,50257920,709574656,1.094,0.500,98.406,0,0,392620,17466
1015345152,133055180800,50257920,709128192,0.031,0.063,99.906,0,0,7612,13228
1019867136,133050535936,50270208,709148672,0.375,0.250,99.313,0.062,0,189172,11932
1035452416,133034688512,50270208,709406720,0.531,0.063,99.406,0,0,410462,14852
1015529472,133054779392,50270208,709148672,0.593,0.624,98.782,0,0,24168,16090
1015894016,133054369792,50282496,709152768,1.031,0.594,96.844,1.531,0,405702,26138
1015033856,133055229952,50282496,709152768,0,0,99.906,0.094,0,22102,0
1030131712,133039685632,50294784,709586944,0.751,0.563,98.623,0.063,0,389344,13174
1016426496,133053825024,50294784,709152768,0.187,0.156,99.656,0,0,36662,13276
1016381440,133053870080,50294784,709152768,0,0,100,0,0,27004,0
1038667776,133031288832,50307072,709402624,1.781,0.188,97.969,0.062,0,223096,9364
1015713792,133054423040,50307072,709152768,0.062,0.031,99.906,0,0,5284,4252
1015705600,133054431232,50307072,709152768,0,0,100,0,0,918,84
1015693312,133054431232,50319360,709152768,0,0,99.938,0.062,0,812,0
1015939072,133053964288,50319360,709373952,0.500,0.094,99.406,0,0,342584,14832
1024577536,133045350400,50319360,709349376,0.156,0.125,99.719,0,0,178576,20720
1023844352,133046075392,50331648,709345280,0,0.031,99.500,0.469,0,12356,12936
1022832640,133047087104,50331648,709345280,0,0.063,99.937,0,0,13006,13230
1022402560,133047517184,50331648,709345280,0,0.031,99.969,0,0,12868,12642
1022390272,133047517184,50343936,709345280,0.031,0,99.938,0.031,0,12660,13132
1022132224,133047775232,50343936,709345280,0.031,0.031,99.937,0,0,19930,19040
1021616128,133048291328,50348032,709341184,0.031,0.031,99.531,0.406,0,12884,13132
1021345792,133048549376,50348032,709353472,0.031,0,99.969,0,0,12746,14786
1021345792,133048549376,50348032,709353472,0,0.031,99.969,0,0,12600,13450
1020821504,133049073664,50348032,709353472,0,0.031,99.969,0,0,12296,12936
1013022720,133056962560,50356224,709251072,0.031,0.031,99.875,0.062,0,1938,2416
1011359744,133058703360,50356224,709173248,0.250,0.156,99.594,0,0,173988,14284
1011073024,133058977792,50368512,709173248,0.031,0.031,99.906,0.031,0,66456,1008
1010544640,133059506176,50368512,709173248,0,0,100,0,0,5438,0
1010282496,133059764224,50368512,709177344,0,0,100,0,0,928,1008
1010274304,133059772416,50368512,709177344,0,0,100,0,0,528,0
1009745920,133060288512,50380800,709177344,0,0,99.969,0.031,0,692,0
1009745920,133060288512,50380800,709177344,0,0,100,0,0,646,0
1009483776,133060546560,50380800,709181440,0,0,100,0,0,346,0
1009483776,133060546560,50380800,709181440,0,0,100,0,0,812,0
1009225728,133060804608,50380800,709181440,0,0,100,0,0,1038,0
1008959488,133061070848,50380800,709181440,0,0,100,0,0,1192,662
1008693248,133061328896,50388992,709181440,0,0,99.938,0.062,0,692,0
1008693248,133061328896,50388992,709181440,0,0,100,0,0,346,0
1027768320,133041975296,50388992,709439488,1.186,0.375,98.439,0,0,391042,16770
1012310016,133057691648,50388992,709181440,0.156,0.094,99.750,0,0,4522,13836
1012191232,133057810432,50388992,709181440,0,0,100,0,0,2602,168
1028567040,133041197056,50388992,709406720,0.406,0.187,99.407,0,0,332282,14428
3178819584,130890825728,50401280,709599232,19.671,8.266,72.001,0.062,0,1651352,64692
5972324352,128095801344,50429952,710852608,30.750,12.488,56.134,0.628,0,1325540,54750
9177276416,124889137152,50442240,712515584,36.648,13.605,49.684,0.063,0,1324310,56299
12125978624,121939132416,50442240,713740288,34.907,13.272,51.790,0.032,0,1487552,61260
15281815552,118781345792,50520064,715456512,37.000,14.781,46.770,1.450,0,1488312,60738
18418794496,115642564608,50524160,717139968,38.696,13.508,47.639,0.157,0,1324342,86540
21493538816,112566190080,50548736,718622720,37.213,12.771,49.670,0.346,0,1343102,887232
24582799360,109475893248,50552832,719544320,38.676,13.896,47.334,0.094,0,1365796,2118788
27704676352,106352443392,50561024,721043456,40.365,13.634,45.844,0.157,0,1395530,3252660
30274007040,103782072320,50561024,721977344,37.689,12.374,49.558,0.379,0,422260,3728157
30673453056,103382573056,50561024,722030592,14.819,2.117,81.196,1.868,0,96422,3906551
30851264512,103204683776,50569216,722100224,14.268,1.052,84.308,0.371,0,100678,4175821
31045832704,103010037760,50581504,722161664,16.667,2.390,80.261,0.683,0,110104,4835133
31236468736,102819328000,50581504,722231296,16.620,1.637,81.372,0.371,0,140488,5626717
31477739520,102577954816,50581504,722325504,19.766,2.032,77.709,0.493,0,141128,5616344
31673999360,102381617152,50581504,722403328,20.350,1.685,77.559,0.406,0,248642,5501129
31819018240,102236475392,50589696,722513920,18.836,1.815,78.849,0.501,0,139800,5238620
31954825216,102100582400,50589696,722599936,17.560,1.734,80.458,0.248,0,228906,4528152
32039075840,102016225280,50589696,722698240,16.718,1.954,80.831,0.496,0,109952,4084968
32143020032,101912109056,50589696,722796544,17.280,1.809,80.443,0.468,0,214040,3471966
32104919040,101950107648,50589696,722898944,12.570,1.800,83.209,2.421,0,101466,3353962
32054951936,101999968256,50597888,722997248,8.053,1.182,90.423,0.342,0,319784,3501812
32027172864,102027661312,50597888,723075072,6.669,1.309,91.711,0.312,0,215226,3496702
32008843264,102045880320,50597888,723177472,8.016,2.259,89.044,0.681,0,124304,3580508
32004616192,102050004992,50597888,723279872,7.659,1.681,90.349,0.311,0,86754,3683768
32017408000,102036975616,50601984,723509248,8.344,1.557,88.823,1.276,0,121706,3872456
32026529792,102027493376,50692096,723767296,5.804,1.893,71.009,21.293,0,90368,3783706
32024154112,102029762560,50692096,723873792,5.958,0.815,92.474,0.753,0,118708,3666422
32007020544,102046789632,50692096,723976192,6.326,1.034,92.296,0.345,0,84356,3430758
32009666560,102044053504,50692096,724062208,5.739,1.372,92.576,0.312,0,118728,3595302
32016371712,102037241856,50692096,724168704,7.880,1.360,90.513,0.247,0,85126,3496174
32026951680,102026563584,50700288,724258816,5.453,1.222,92.918,0.407,0,82394,3492018
32031420416,102021980160,50708480,724361216,6.275,1.062,91.945,0.718,0,77528,3377878
32037089280,102016204800,50708480,724459520,5.722,1.001,92.933,0.344,0,83450,3460730
32040267776,102012928000,50708480,724553728,6.477,1.178,91.912,0.434,0,87932,3581158
32047763456,102005321728,50708480,724660224,6.122,1.224,92.433,0.220,0,83594,3279938
32057659392,101995339776,50716672,724738048,6.592,1.269,91.798,0.340,0,110120,3497376
32059580416,101993312256,50716672,724844544,5.434,1.249,93.004,0.312,0,87670,3701690
32069267456,101983526912,50716672,724938752,7.114,0.874,91.732,0.281,0,114260,3627270
32070852608,101981835264,50716672,725045248,6.965,0.746,91.947,0.342,0,92106,3788152
32073740288,101978849280,50716672,725143552,6.149,0.839,92.733,0.280,0,120010,3626480
32072265728,101980237824,50724864,725217280,5.192,0.594,93.869,0.344,0,91290,3713216
32080257024,101972115456,50724864,725344256,5.763,1.441,91.106,1.691,0,111470,3436790
32081555456,101970718720,50724864,725438464,5.207,1.129,93.381,0.282,0,83978,3567044
32083337216,101968822272,50724864,725549056,5.507,1.001,93.085,0.407,0,82372,3431202
32092622848,101959442432,50724864,725639168,5.390,1.034,93.231,0.345,0,82416,3371370
32097423360,101954560000,50733056,725708800,5.344,0.656,93.594,0.406,0,122180,3494726
32094760960,101956960256,50733056,725966848,4.969,0.938,89.969,4.125,0,88266,3488612
32098254848,101953384448,50733056,726048768,5.197,0.814,93.550,0.438,0,86292,3703650
32101126144,101950410752,50733056,726147072,5.866,1.061,92.761,0.312,0,88774,3641936
32108445696,101942992896,50733056,726241280,5.273,0.967,93.354,0.406,0,119848,3821676
32111345664,101939986432,50741248,726331392,5.042,0.940,93.548,0.470,0,96846,4092916
32111521792,101939699712,50741248,726441984,4.006,0.631,95.016,0.347,0,123430,3779844
32116785152,101934338048,50749440,726532096,7.217,1.600,89.520,1.663,0,90340,3620716
32118976512,101932044288,50749440,726634496,4.173,0.879,94.478,0.471,0,117304,3670462
32120733696,101930192896,50749440,726728704,5.349,1.001,93.400,0.250,0,90572,3690262
32120979456,101929832448,50757632,726831104,5.754,0.933,92.722,0.591,0,91442,3863906
32123207680,101927510016,50757632,726925312,5.587,1.067,93.095,0.251,0,90544,3892932
32124825600,101925789696,50757632,727027712,7.239,1.373,89.860,1.529,0,91344,3630800
32125161472,101925359616,50757632,727117824,5.308,0.999,93.412,0.281,0,90104,3597860
32127946752,101922430976,50757632,727220224,7.762,1.122,90.898,0.218,0,384570,3554218
32131538944,101918711808,50765824,727322624,6.250,0.906,92.500,0.344,0,86864,3531850
32131198976,101918949376,50765824,727425024,6.815,0.974,91.834,0.377,0,87864,3613816
32137850880,101912150016,50765824,727531520,9.034,1.308,89.377,0.280,0,87566,3594626
32140447744,101909565440,50774016,727621632,7.098,0.938,91.557,0.407,0,92520,3573894
32142622720,101907202048,50774016,727707648,7.860,1.123,90.674,0.343,0,99670,3574900
32146575360,101902995456,50782208,727949312,9.085,1.209,89.364,0.341,0,108728,3650706
32157900800,101891571712,50782208,728043520,7.161,1.183,91.376,0.280,0,113212,3769984
32147595264,101901770752,50782208,728145920,8.522,1.147,89.340,0.992,0,103544,3483876
32145408000,101903790080,50782208,728231936,7.061,1.213,90.700,1.026,0,93120,3572114
32197423104,101851672576,50782208,728334336,8.989,1.248,89.451,0.312,0,101712,3748320
32219324416,101829648384,50790400,728444928,7.411,1.395,90.729,0.465,0,108934,4015446
32270270464,101778628608,50790400,728514560,9.991,0.934,88.422,0.654,0,143438,4025882
32319520768,101729247232,50790400,728641536,9.966,1.218,88.535,0.281,0,102242,3783376
32357056512,101691633664,50790400,728719360,8.107,1.341,88.120,2.432,0,131120,3800660
32385212416,101663363072,50790400,728829952,7.143,0.721,91.855,0.282,0,142222,3949216
32470683648,101577805824,50798592,728903680,10.708,1.064,87.821,0.407,0,149460,4023598
32521011200,101527367680,50798592,729014272,9.397,0.911,89.378,0.314,0,106988,3945596
32556261376,101491990528,50798592,729133056,8.688,0.844,90.250,0.219,0,130890,3762912
32609366016,101438795776,50798592,729223168,9.759,0.782,88.051,1.408,0,128672,3516086
32604381184,101443670016,50806784,729321472,3.278,0.567,95.808,0.347,0,97944,3444758
32592027648,101455941632,50814976,729391104,4.656,0.786,94.055,0.503,0,74238,3205666
32589352960,101458505728,50814976,729501696,5.011,0.851,93.791,0.347,0,79708,3473898
32590700544,101457051648,50814976,729604096,5.971,0.566,93.118,0.346,0,80690,3335934
32589484032,101458182144,50814976,729690112,4.652,0.968,94.006,0.375,0,78548,2890764
32590979072,101456564224,50814976,729804800,4.413,0.782,92.833,1.972,0,71852,3037696
32584560640,101462888448,50823168,729882624,6.737,0.745,91.928,0.590,0,76848,3391834
32579010560,101468200960,50823168,730120192,4.661,0.876,94.057,0.407,0,84632,3584794
32578064384,101469044736,50823168,730218496,4.847,0.719,94.153,0.281,0,88658,3737018
32577351680,101469655040,50823168,730316800,4.291,0.720,94.707,0.282,0,98906,3683154
32575741952,101471141888,50831360,730427392,4.983,1.003,92.009,2.006,0,87870,3617656
32569241600,101477523456,50839552,730529792,6.002,0.907,92.560,0.531,0,89200,3612860
32570875904,101475782656,50839552,730628096,4.948,0.783,93.924,0.345,0,82130,3373652
32566644736,101479915520,50839552,730722304,4.640,0.537,94.476,0.347,0,93208,3521462
32566050816,101480431616,50839552,730800128,3.352,0.877,95.395,0.376,0,83904,3549026
32566710272,101479653376,50839552,730918912,5.810,0.817,89.887,3.486,0,86332,3507228
32566874112,101479395328,50847744,731000832,4.240,0.879,94.190,0.691,0,87190,3627678
32566853632,101479305216,50847744,731107328,3.892,0.596,95.166,0.345,0,88642,3631226
32568729600,101477330944,50847744,731197440,6.028,0.722,92.904,0.345,0,85004,3530876
32569602048,101476282368,50847744,731299840,5.009,0.595,94.051,0.344,0,87578,3759278
32570404864,101475381248,50847744,731394048,4.255,0.756,94.674,0.315,0,91372,3830726
32570728448,101474959360,50864128,731475968,4.564,0.755,92.068,2.613,0,89396,3783520
32570429440,101475155968,50864128,731578368,5.303,0.784,93.599,0.314,0,88956,3812924
32570220544,101475254272,50864128,731688960,4.751,0.692,94.305,0.252,0,92464,3930620
32571514880,101473857536,50864128,731787264,4.925,0.717,94.015,0.343,0,92622,3904262
32570748928,101474541568,50864128,731869184,5.430,0.816,93.409,0.345,0,84720,3577704
32572690432,101472473088,50872320,731979776,5.903,0.750,91.568,1.780,0,87604,3674824
32573571072,101471473664,50872320,732090368,4.856,0.846,94.016,0.282,0,89998,3796206
32573927424,101471051776,50872320,732155904,4.574,0.877,94.173,0.376,0,123474,3923682
32574521344,101470322688,50872320,732278784,5.362,0.784,93.603,0.251,0,89380,3725348
32575348736,101469396992,50872320,732372992,5.141,1.003,93.605,0.251,0,118742,3725606
32575873024,101468774400,50880512,732463104,5.066,0.629,93.864,0.441,0,81686,3303418
32577277952,101467238400,50888704,732577792,4.558,0.503,94.561,0.377,0,119626,3523100
32576151552,101468274688,50888704,732663808,4.351,0.567,94.861,0.221,0,86286,3619674
32577007616,101467303936,50888704,732778496,5.158,1.000,93.560,0.281,0,122108,3807956
32577081344,101467144192,50888704,732864512,4.857,0.846,94.014,0.282,0,91052,3718458
32578064384,101466046464,50896896,732971008,6.071,1.276,90.940,1.712,0,85974,3541636
32577605632,101466423296,50896896,733052928,3.736,1.005,94.914,0.345,0,109970,3697148
32577359872,101466492928,50896896,733224960,4.688,0.531,94.500,0.281,0,92868,3630722
32578543616,101465194496,50896896,733331456,4.463,0.723,94.532,0.283,0,86638,3625280
32579436544,101464195072,50896896,733437952,5.382,0.939,93.304,0.375,0,86098,3574196
32579706880,101463801856,50905088,733552640,5.090,0.660,93.779,0.471,0,81570,3363110
32580411392,101462999040,50905088,733646848,4.397,0.817,91.332,3.455,0,83778,3173394
32581140480,101462040576,50905088,733872128,5.006,0.964,93.719,0.311,0,93966,3501388
32581414912,101461655552,50905088,733978624,5.386,0.872,93.306,0.436,0,87730,3515170
32582594560,101460365312,50905088,734085120,4.401,1.069,93.933,0.597,0,97710,3385036
32583745536,101459107840,50913280,734179328,5.624,0.916,92.828,0.632,0,92796,3397516
32584966144,101457784832,50921472,734273536,3.967,0.850,86.713,8.470,0,92294,3819274
32585244672,101457252352,50921472,734502912,3.241,0.629,95.846,0.283,0,90572,3822086
32585736192,101456642048,50921472,734621696,4.544,0.752,94.390,0.313,0,91222,3879008
32587169792,101455093760,50921472,734732288,6.363,0.905,92.452,0.281,0,87392,3631550
32586297344,101455867904,50929664,734810112,4.436,0.875,94.189,0.500,0,87942,3639556
32586670080,101455384576,50929664,734912512,4.781,0.786,94.149,0.283,0,148006,3662592
32588652544,101453279232,50937856,735027200,5.648,1.130,92.564,0.659,0,86936,3701734
32588439552,101453385728,50937856,735129600,4.800,0.935,93.953,0.312,0,149118,3721284
32590118912,101451612160,50937856,735223808,5.408,0.844,93.373,0.375,0,89158,3648922
32591388672,101450223616,50946048,735330304,3.810,0.535,95.309,0.346,0,148592,3297820
32593022976,101448478720,50946048,735440896,4.961,0.942,92.873,1.224,0,77510,2911324
32593014784,101448384512,50946048,735543296,4.749,0.812,94.158,0.281,0,135760,3022676
32595025920,101446209536,50946048,735629312,5.057,0.817,93.876,0.251,0,76474,3138218
32596439040,101444669440,50946048,735752192,5.117,0.998,93.510,0.374,0,77958,3287998
32597868544,101443149824,50954240,735830016,3.775,0.503,95.344,0.377,0,78272,3198674
32598200320,101442695168,50954240,735952896,6.009,1.090,92.590,0.311,0,84312,3438742
32598134784,101442662400,50958336,736047104,3.549,0.660,95.006,0.785,0,94838,3549526
32598478848,101442211840,50958336,736145408,6.203,0.810,92.737,0.249,0,113742,3624272
32599490560,101441110016,50958336,736235520,5.476,0.814,93.398,0.313,0,95418,3593798
32600154112,101440339968,50966528,736333824,3.915,0.940,94.832,0.313,0,207740,3869626
32598728704,101441642496,50966528,736456704,6.910,0.868,91.478,0.744,0,371772,3860568
32601006080,101439275008,50974720,736534528,5.575,0.747,93.117,0.561,0,354936,3805962
32598573056,101441593344,50974720,736649216,4.389,0.596,94.796,0.219,0,132056,3671722
32598884352,101441175552,50974720,736755712,4.768,0.972,94.009,0.251,0,117390,3691242
32599732224,101440110592,50982912,736960512,5.062,0.719,93.594,0.625,0,87048,3605744
32602214400,101437497344,50982912,737091584,5.143,0.847,93.760,0.251,0,96902,3664700
32601387008,101438238720,50982912,737177600,3.550,0.911,93.937,1.602,0,90664,3882154
32601088000,101438386176,50982912,737296384,4.909,0.661,94.179,0.252,0,90196,3721468
32602079232,101437288448,50982912,737398784,4.845,0.719,94.154,0.281,0,90608,3535358
32606306304,101432967168,50991104,737480704,5.829,0.752,92.886,0.533,0,90614,3774146
32604651520,101434515456,50991104,737579008,5.027,0.874,93.693,0.406,0,94282,3721394
32604364800,101434679296,50991104,737693696,5.214,0.624,92.788,1.374,0,99892,3605520
32604082176,101434867712,50991104,737787904,3.727,0.720,95.208,0.345,0,154198,3372534
32604917760,101433913344,50991104,737894400,5.263,0.747,93.647,0.343,0,314722,3540542
32606691328,101432029184,50999296,737992704,5.821,0.692,92.983,0.503,0,493776,3547774
32608497664,101430120448,50999296,738095104,4.463,0.811,94.320,0.406,0,488272,3566346
32608415744,101430087680,50999296,738209792,4.252,0.787,93.764,1.197,0,412846,3634712
32609452032,101428957184,51007488,738291712,5.220,0.844,93.248,0.688,0,254488,3511206
32609529856,101428760576,51007488,738410496,5.294,0.971,93.390,0.345,0,182698,3402628
32610463744,101427716096,51015680,738512896,5.445,0.840,93.124,0.591,0,166508,3406804
32610332672,101427752960,51015680,738603008,3.657,0.781,95.249,0.313,0,112560,3500396
32613736448,101424234496,51015680,738713600,4.838,0.943,93.937,0.283,0,104390,3392386
32616452096,101421424640,51015680,738803712,4.107,1.129,93.417,1.348,0,115016,3468628
32616910848,101420843008,51015680,738922496,4.484,0.659,94.575,0.282,0,84986,3470472
32616087552,101421555712,51023872,739016704,4.258,0.689,94.771,0.282,0,129932,3600498
32619720704,101417811968,51023872,739119104,5.149,0.911,93.752,0.188,0,153466,3578760
32620408832,101416894464,51023872,739348480,5.362,0.810,93.516,0.312,0,233794,3441708
32620711936,101416505344,51023872,739434496,4.056,0.780,94.883,0.281,0,194108,3403134
32621715456,101415378944,51032064,739549184,4.638,1.003,93.983,0.376,0,280886,3646740
32621535232,101415477248,51040256,739622912,4.762,0.752,94.142,0.345,0,185678,3686220
32621121536,101415763968,51040256,739745792,3.926,0.722,95.069,0.283,0,131728,3400302
32620556288,101416218624,51040256,739848192,6.293,0.935,92.555,0.218,0,115080,3427090
32624418816,101412245504,51040256,739958784,4.610,1.286,92.725,1.380,0,117850,3627486
32626094080,101410439168,51040256,740057088,3.838,0.692,95.093,0.377,0,95154,3614656
32626511872,101409923072,51048448,740147200,6.098,0.594,92.902,0.407,0,86242,3695636
32627687424,101408636928,51048448,740253696,5.656,0.777,93.195,0.373,0,87932,3587206
32629420032,101406724096,51048448,740364288,3.576,0.753,95.358,0.314,0,92172,3463610
32629645312,101406404608,51048448,740458496,4.904,0.754,94.027,0.314,0,82664,3232524
32629657600,101406281728,51048448,740569088,4.789,0.720,91.581,2.911,0,81832,3253156
32632782848,101403045888,51056640,740671488,4.886,0.720,93.987,0.407,0,84664,3420420
32633032704,101402697728,51056640,740765696,4.814,1.125,93.686,0.375,0,95394,3358896
32634408960,101401210880,51056640,740872192,2.153,0.570,97.024,0.253,0,81972,3254644
32634908672,101400629248,51056640,740950016,5.507,0.814,93.210,0.469,0,76144,3143756
32635179008,101400113152,51064832,741183488,5.512,0.940,92.985,0.564,0,79666,3497254
32634720256,101400440832,51073024,741302272,4.540,1.190,93.394,0.877,0,81956,3485186
32635830272,101399212032,51073024,741416960,4.131,0.599,94.828,0.442,0,83460,3451274
32640450560,101394501632,51073024,741502976,4.744,0.874,94.195,0.187,0,86686,3510658
32640798720,101394051072,51073024,741605376,3.570,1.034,95.177,0.219,0,84630,3659670
32648790016,101385953280,51073024,741707776,6.868,0.914,90.611,1.607,0,90124,3721270
32648925184,101385699328,51081216,741814272,5.222,0.844,93.496,0.438,0,87108,3373302
32650518528,101384015872,51081216,741904384,3.504,0.694,95.612,0.189,0,80708,3361296
32651464704,101382955008,51081216,742014976,5.639,0.595,93.515,0.251,0,81314,3391952
32650215424,101384081408,51081216,742129664,5.332,0.784,93.601,0.282,0,90374,3840390
32651780096,101382434816,51081216,742211584,6.794,0.564,91.296,1.346,0,95400,3779146
32654028800,101380071424,51089408,742313984,5.376,0.754,93.304,0.566,0,92676,3502606
32653512704,101380489216,51089408,742408192,5.273,0.868,93.486,0.372,0,86626,3375666
32653901824,101379977216,51089408,742531072,3.961,0.723,95.096,0.220,0,91106,3399390
32657661952,101376139264,51089408,742604800,4.942,1.032,93.775,0.250,0,85792,3535706
32658939904,101374746624,51089408,742719488,6.455,0.998,92.205,0.343,0,137848,3612934
32658821120,101374566400,51105792,742858752,3.657,0.662,94.325,1.356,0,102610,3574884
32659881984,101373386752,51105792,742932480,4.597,1.157,94.059,0.188,0,114258,3633614
32660406272,101372743680,51105792,743047168,5.062,0.633,93.958,0.348,0,87422,3637274
32664465408,101367844864,51109888,743276544,3.970,0.750,94.873,0.406,0,117880,3642470
32664952832,101367263232,51109888,743370752,5.910,0.813,93.027,0.250,0,98316,3625532
32664899584,101367169024,51134464,743489536,3.664,0.908,91.982,3.445,0,116662,3463430
32661053440,101370929152,51134464,743567360,5.484,0.783,93.419,0.313,0,97130,3604096
32661282816,101370585088,51134464,743682048,5.176,0.780,93.857,0.187,0,94120,3834132
32662228992,101369520128,51134464,743792640,4.903,1.006,93.683,0.409,0,89196,3682410
32663920640,101367750656,51134464,743870464,4.648,0.749,94.354,0.250,0,84522,3291196
32664936448,101366620160,51142656,743976960,5.672,0.658,93.262,0.407,0,74462,3027240
32664735744,101366718464,51150848,744067072,4.483,0.721,94.295,0.502,0,80944,3279626
32666501120,101364842496,51150848,744177664,4.725,0.751,94.024,0.501,0,82492,3483756
32666308608,101364912128,51150848,744296448,5.182,0.785,93.687,0.345,0,80622,3382072
32668622848,101362503680,51150848,744386560,3.363,0.849,95.443,0.346,0,84704,3477318
32669487104,101361524736,51159040,744493056,5.470,0.688,92.091,1.751,0,87438,3647108
32672104448,101358813184,51159040,744583168,4.862,0.721,94.134,0.282,0,94508,3598904
32678481920,101352329216,51159040,744681472,4.831,0.941,93.977,0.251,0,87582,3364292
32686026752,101344653312,51159040,744808448,5.327,0.877,93.513,0.282,0,81330,3546918
29535518720,104495071232,51159040,744898560,4.560,0.692,94.465,0.283,0,84694,3569158
25656279040,108375085056,51171328,744108032,5.354,0.805,93.377,0.464,0,79968,3132946
22540591104,111491633152,51171328,743284736,4.689,0.750,91.841,2.720,0,64500,2659276
19428081664,114604969984,51171328,742473728,3.319,0.971,95.492,0.219,0,67460,2204512
16287535104,117746495488,51171328,741568512,2.748,0.750,96.252,0.250,0,54868,1885626
12328570880,121706295296,51171328,740732928,2.374,0.562,96.877,0.187,0,59922,1375430
9091842048,124943941632,51183616,739885056,1.918,0.346,97.516,0.220,0,28568,951248
5869154304,128167526400,51183616,739028992,1.533,0.594,97.060,0.813,0,21338,682188
2682490880,131355090944,51191808,738160640,1.157,0.313,98.312,0.219,0,26530,353292
1069228032,132969504768,51191808,737058816,0.250,0.125,99.625,0,0,14918,204750
1051078656,132988104704,51191808,736616448,0.031,0.031,99.937,0,0,4264,162
1050812416,132988370944,51191808,736616448,0,0,100,0,0,5860,0
1050800128,132988370944,51204096,736616448,0,0.031,99.469,0.500,0,28900,0
1050509312,132988661760,51204096,736616448,0,0,100,0,0,812,0
1050251264,132988919808,51204096,736616448,0,0,100,0,0,2864,180
1049993216,132989177856,51204096,736616448,0,0,100,0,0,2766,1508
1049993216,132989177856,51204096,736616448,0,0,100,0,0,32950,264
1049993216,132989177856,51204096,736616448,0,0,100,0,0,3316,0
1049714688,132989444096,51216384,736616448,0,0,99.938,0.062,0,31988,0
1049448448,132989710336,51216384,736616448,0,0,100,0,0,4054,84
1048932352,132990226432,51216384,736616448,0.031,0.031,99.938,0,0,12662,0
1048416256,132990742528,51216384,736616448,0,0,100,0,0,18344,1008
1048158208,132991000576,51216384,736616448,0,0,100,0,0,34702,1008
1048158208,132991000576,51216384,736616448,0,0,100,0,0,4386,0
1047891968,132991258624,51224576,736616448,0,0,99.969,0.031,0,2558,132
1047375872,132991774720,51224576,736616448,0,0,100,0,0,512,0
1047375872,132991774720,51224576,736616448,0,0,100,0,0,3902,0
1047117824,132992032768,51224576,736616448,0,0,100,0,0,25154,0
1047117824,132992032768,51224576,736616448,0,0.031,99.969,0,0,53964,0
1046601728,132992548864,51224576,736616448,0.031,0,99.969,0,0,127888,3192
1045553152,132993589248,51232768,736616448,0.094,0.031,99.844,0.031,0,127136,2016
1045295104,132993847296,51232768,736616448,0.031,0.031,99.937,0,0,111452,2016
1045037056,132994105344,51232768,736616448,0.063,0.031,99.906,0,0,101628,1008
1044516864,132994621440,51232768,736620544,0,0,100,0,0,13728,2016
1044258816,132994879488,51232768,736620544,0,0,100,0,0,33058,3388
1043476480,132995653632,51240960,736620544,0,0,99.969,0.031,0,3924,1508
1042960384,132996169728,51240960,736620544,0.031,0,99.969,0,0,7224,0
1042960384,132996169728,51240960,736620544,0,0,100,0,0,7942,0
1042898944,132996231168,51240960,736620544,0,0,99.594,0.406,0,2518,0
1042640896,132996489216,51240960,736620544,0,0,100,0,0,30738,0
1042382848,132996747264,51240960,736620544,0,0,100,0,0,3182,0
1042374656,132996747264,51249152,736620544,0,0,99.969,0.031,0,29124,662
1042374656,132996747264,51249152,736620544,0,0,100,0,0,3904,0
1042374656,132996747264,51249152,736620544,0,0,100,0,0,8614,0
1042116608,132997005312,51249152,736620544,0,0,100,0,0,3700,0
1042042880,132997079040,51249152,736620544,0,0.031,99.969,0,0,31944,0
1041784832,132997337088,51249152,736620544,0,0,100,0,0,4376,636
1041776640,132997337088,51257344,736620544,0,0,99.938,0.062,0,25034,312
1041776640,132997337088,51257344,736620544,0,0,100,0,0,4924,624
1042034688,132997079040,51257344,736620544,0,0,99.812,0.188,0,12246,390
1041563648,132997550080,51257344,736620544,0.031,0,99.969,0,0,39918,624
1041563648,132997550080,51257344,736620544,0,0,100,0,0,12018,1062
1041563648,132997550080,51257344,736620544,0,0,100,0,0,68158,890
1041555456,132997550080,51265536,736620544,0,0,99.969,0.031,0,11286,718
1059164160,132979867648,51265536,736620544,1.123,0.343,98.534,0,0,480918,22634
1054355456,132982087680,51265536,736632832,0.469,0.594,98.938,0,0,196742,38190
