"Dstat 0.7.3 CSV output"
"Author:","Dag Wieers <dag@wieers.com>",,,,"URL:","http://dag.wieers.com/home-made/dstat/"
"Host:","grisou-50.nancy.grid5000.fr",,,,"User:","root"
"Cmdline:","dstat -m -c -n -o dstat.csv",,,,"Date:","24 May 2020 18:19:52 CEST"
"memory usage",,,,"total cpu usage",,,,,"net/total",
"used","free","buff","cach","usr","sys","idl","wai","stl","recv","send"
1237139456,132810559488,53686272,713629696,0.750,0.233,98.839,0.178,0,0,0
1253330944,132793958400,53686272,713969664,0.749,0.468,98.782,0,0,389236,17388
1243508736,132803887104,53686272,713781248,0.718,0.281,99.001,0,0,386150,24904
1233514496,132814131200,53686272,713527296,0.656,0.625,98.125,0.594,0,5502,16026
1233469440,132814163968,53698560,713527296,0,0.031,99.906,0.063,0,452,0
1234743296,132812869632,53710848,713531392,1.187,0.531,98.251,0.031,0,386966,26798
1234722816,132812890112,53710848,713531392,0,0.031,99.969,0,0,1218,0
1234698240,132812914688,53710848,713531392,0.031,0,99.969,0,0,1762,3252
1234698240,132812914688,53710848,713531392,0.031,0,99.969,0,0,754,0
1234173952,132813438976,53710848,713531392,0,0,100,0,0,1486,148
1233891328,132813697024,53735424,713531392,0,0,99.906,0.094,0,738,0
1233633280,132813955072,53735424,713531392,0,0,100,0,0,3930,0
1233117184,132814471168,53735424,713531392,0,0.031,99.969,0,0,2974,0
1233117184,132814471168,53735424,713531392,0.031,0,99.969,0,0,738,0
1233117184,132814471168,53735424,713531392,0,0,100,0,0,738,0
1233117184,132814471168,53735424,713531392,0,0,100,0,0,3358,0
1233108992,132814471168,53743616,713531392,0.031,0,99.938,0.031,0,1310,0
1232592896,132814987264,53743616,713531392,0,0,100,0,0,998,148
1232334848,132815245312,53743616,713531392,0,0,100,0,0,1474,0
1232723968,132814852096,53743616,713531392,1.093,0.687,98.219,0,0,391286,30538
1230684160,132816891904,53743616,713531392,0.031,0,99.969,0,0,976,550
1231794176,132815704064,53743616,713551872,0.251,0.596,99.154,0,0,170562,11940
1239953408,132807057408,53755904,713998336,1.093,0.562,98.283,0.062,0,388840,16522
1233145856,132814311424,53755904,713551872,0.156,0.031,99.813,0,0,3982,14268
1248292864,132798889984,53768192,713809920,0.500,0.188,99.281,0.031,0,383344,11274
1230024704,132817416192,53768192,713551872,0.562,0.468,98.970,0,0,10012,15460
1244528640,132802461696,53768192,713998336,0.625,0.187,99.188,0,0,384206,11786
1234153472,132813275136,53768192,713551872,0.469,0.407,99.124,0,0,9570,15912
1233858560,132813557760,53780480,713551872,0.031,0.031,99.875,0.063,0,872,0
1233858560,132813557760,53780480,713551872,0,0,99.438,0.562,0,6774,0
1234264064,132813066240,53792768,713555968,1.593,0.312,98.032,0.062,0,223228,11152
1234620416,132812709888,53792768,713555968,0,0.031,99.969,0,0,8440,2668
1233813504,132813516800,53792768,713555968,0.031,0.031,99.938,0,0,752,84
1233780736,132813549568,53792768,713555968,0,0,100,0,0,844,0
1232736256,132814577664,53805056,713560064,0.501,0.250,98.748,0.501,0,407810,19794
1240580096,132806533120,53817344,713748480,0.344,0.250,99.343,0.063,0,241496,22788
1240055808,132807057408,53817344,713748480,0.031,0,99.969,0,0,10980,13328
1240039424,132807073792,53817344,713748480,0,0,100,0,0,11340,13328
1239781376,132807331840,53817344,713748480,0,0,100,0,0,11236,13328
1239511040,132807589888,53829632,713748480,0.031,0,99.906,0.063,0,11842,13748
1239502848,132807589888,53837824,713748480,0,0.031,99.937,0.031,0,15214,15764
1239244800,132807847936,53837824,713748480,0,0,100,0,0,13462,13328
1238978560,132808114176,53837824,713748480,0,0,100,0,0,13070,13328
1238978560,132808114176,53837824,713748480,0.031,0,99.969,0,0,13994,13328
1230946304,132816330752,53837824,713564160,0.062,0.031,99.906,0,0,12282,13588
1230409728,132816855040,53850112,713564160,0,0,99.938,0.062,0,2632,1596
1231097856,132816166912,53850112,713564160,0.281,0.125,99.594,0,0,173532,15228
1231089664,132816175104,53850112,713564160,0,0,100,0,0,1190,2168
1231089664,132816175104,53850112,713564160,0.031,0,99.969,0,0,1040,0
1230831616,132816433152,53850112,713564160,0,0,100,0,0,918,0
1230581760,132816670720,53862400,713564160,0,0,99.969,0.031,0,5630,0
1230303232,132816936960,53874688,713564160,0.062,0.031,99.844,0.062,0,1372,0
1229766656,132817469440,53874688,713568256,0,0,100,0,0,626,0
1229242368,132817993728,53874688,713568256,0,0,100,0,0,1550,0
1229242368,132817993728,53874688,713568256,0,0,100,0,0,1176,662
1228984320,132818251776,53874688,713568256,0.031,0,99.969,0,0,964,0
1228984320,132818251776,53874688,713568256,0,0,100,0,0,8890,0
1229299712,132817928192,53882880,713568256,0.031,0.031,99.875,0.063,0,7069,1848
1230749696,132816474112,53882880,713572352,1.063,0.625,98.312,0,0,391489,29574
1230475264,132816748544,53882880,713572352,0,0,100,0,0,1296,0
1229950976,132817272832,53882880,713572352,0.031,0,99.594,0.375,0,3783,0
1229639680,132817584128,53882880,713572352,0,0,100,0,0,5108,0
1229639680,132817584128,53882880,713572352,0,0,100,0,0,1942,0
1229615104,132817584128,53907456,713572352,0.031,0.031,99.844,0.094,0,2100,560
1229615104,132817584128,53907456,713572352,0,0,100,0,0,738,148
1229615104,132817584128,53907456,713572352,0,0.031,99.781,0.187,0,678,0
1229606912,132817592320,53907456,713572352,0,0,100,0,0,1558,148
1229590528,132817608704,53907456,713572352,0.031,0,99.969,0,0,2948,1508
1229066240,132818132992,53907456,713572352,0,0,100,0,0,2176,252
1229058048,132818132992,53915648,713572352,0,0,99.969,0.031,0,2942,180
1229058048,132818132992,53915648,713572352,0,0.031,99.969,0,0,6496,148
1228541952,132818649088,53915648,713572352,0,0.031,99.969,0,0,2019,0
1228283904,132818907136,53915648,713572352,0,0,100,0,0,866,0
1228283904,132818907136,53915648,713572352,0,0,100,0,0,572,0
1228283904,132818907136,53915648,713572352,0.031,0.031,99.937,0,0,3381,168
1228251136,132818931712,53923840,713572352,0,0,99.906,0.094,0,1024,0
1228251136,132818931712,53923840,713572352,0,0,100,0,0,798,0
1228251136,132818931712,53923840,713572352,0,0,100,0,0,800,0
1228197888,132818984960,53923840,713572352,0,0,100,0,0,1402,148
1264893952,132783083520,53923840,712773632,0.936,0.312,98.752,0,0,668734,28978
3903516672,130143092736,53927936,713994240,23.425,11.852,64.722,0,0,1648488,64120
7006560256,127038304256,53956608,715665408,35.457,13.021,51.025,0.497,0,1327134,57296
10193575936,123850084352,53960704,716754944,37.189,13.215,49.565,0.031,0,1329957,55902
13464776704,120576962560,53964800,718589952,36.233,14.125,49.517,0.125,0,1662904,66714
16517922816,117522071552,53981184,720187392,34.216,14.317,51.246,0.221,0,1327472,56244
19648327680,114390065152,53989376,721625088,38.789,13.665,47.360,0.186,0,1338733,1341779
22803099648,111233466368,54095872,723251200,40.883,13.691,43.817,1.609,0,1625041,17838837
25917587456,108117557248,54116352,724480000,44.577,13.323,41.850,0.251,0,1809356,39083674
28960997376,105072455680,54132736,726069248,47.183,14.353,38.212,0.252,0,1510575,60884228
31014703104,103018307584,54132736,726491136,35.531,10.656,53.406,0.406,0,691738,83257520
31187156992,102845771776,54149120,726556672,13.594,1.688,84.156,0.562,0,804142,103974629
31345111040,102687731712,54153216,726634496,17.121,1.659,80.657,0.563,0,970552,124082194
31534886912,102497865728,54153216,726712320,20.163,2.230,65.421,12.186,0,1162250,146032187
31666524160,102366130176,54153216,726810624,23.795,2.473,73.168,0.564,0,1290432,166108623
31797821440,102234722304,54153216,726917120,24.374,2.534,72.591,0.501,0,1474226,187041234
31937462272,102094958592,54165504,727027712,26.534,3.114,69.729,0.623,0,1562804,201641999
32047333376,101984935936,54169600,727162880,23.278,3.020,72.947,0.755,0,1577714,201943216
32163799040,101868343296,54169600,727285760,22.480,3.319,73.262,0.939,0,1561450,202142901
32271208448,101760851968,54169600,727367680,20.706,3.217,75.422,0.656,0,1519590,202309743
32347566080,101684363264,54169600,727490560,20.580,3.530,74.756,1.135,0,1545322,201846719
32301699072,101730119680,54177792,727592960,14.913,2.970,81.157,0.959,0,1483464,202452517
32326369280,101705285632,54177792,727748608,11.118,1.916,86.369,0.597,0,1413746,202039852
32312651776,101718769664,54222848,727928832,12.153,2.711,83.141,1.994,0,1503628,202136842
32311410688,101719859200,54222848,728080384,9.853,2.214,86.592,1.341,0,1481832,202438944
32349159424,101681872896,54222848,728313856,9.088,2.241,88.266,0.405,0,1504868,202115623
32397168640,101633695744,54226944,728465408,9.797,2.254,87.355,0.595,0,1461226,202415551
32378875904,101651869696,54231040,728576000,7.919,2.516,89.037,0.528,0,1446558,201982217
32385564672,101645049856,54231040,728702976,9.446,2.199,88.015,0.341,0,1445804,202339299
32386666496,101643849728,54239232,728793088,7.850,2.079,88.489,1.582,0,1459490,202096228
32391892992,101638488064,54239232,728928256,7.080,1.723,90.852,0.345,0,1459264,202123148
32419631104,101610618880,54243328,729051136,7.200,2.173,90.161,0.466,0,1425628,202013716
32454365184,101575753728,54247424,729178112,8.014,2.290,89.264,0.433,0,1429224,202244388
32465416192,101564583936,54247424,729296896,7.597,1.798,90.140,0.465,0,1449734,202213501
32491450368,101538430976,54247424,729411584,7.198,1.986,90.320,0.496,0,1482972,202210246
32518389760,101511356416,54247424,729542656,7.259,2.586,89.657,0.498,0,1497894,202013537
32532635648,101496995840,54251520,729653248,7.360,2.329,89.627,0.683,0,1451182,202242249
32538537984,101490962432,54255616,729780224,7.475,2.667,89.144,0.713,0,1476194,202140682
32566099968,101463269376,54255616,729903104,7.582,2.839,89.017,0.562,0,1441446,202052541
32599810048,101429526528,54255616,730021888,7.234,2.339,88.556,1.871,0,1480604,202189457
32617693184,101411459072,54255616,730165248,8.074,2.681,88.653,0.592,0,1440264,202065484
32642482176,101386571776,54259712,730255360,7.252,2.376,89.684,0.688,0,1453478,202194951
32676704256,101352226816,54263808,730374144,6.997,2.228,90.022,0.753,0,1434994,201966748
32696025088,101332770816,54263808,730509312,6.360,2.361,90.617,0.661,0,1458094,202372704
32714014720,101314666496,54263808,730624000,6.710,2.103,90.662,0.526,0,1439434,202297630
32721850368,101306699776,54272000,730738688,7.030,2.168,88.789,2.013,0,1437740,202216606
32747081728,101281144832,54276096,731013120,6.773,2.216,90.512,0.499,0,1460802,202087949
32763224064,101264883712,54280192,731123712,7.218,2.645,89.452,0.685,0,1401950,202268409
32776048640,101251936256,54280192,731246592,6.307,2.404,90.821,0.468,0,1459662,202112227
32789614592,101238239232,54280192,731369472,5.842,2.300,91.454,0.404,0,1437638,202086416
32801173504,101226590208,54280192,731455488,5.621,1.832,92.050,0.497,0,1441056,202138851
32801300480,101226315776,54284288,731590656,4.953,1.818,92.727,0.502,0,1467104,202153830
32801906688,101225504768,54288384,731721728,5.823,2.473,91.202,0.501,0,1443532,202176536
32812531712,101214736384,54304768,731848704,5.519,2.432,88.930,3.118,0,1436908,202146498
32824090624,101203046400,54304768,731975680,4.875,1.719,93.062,0.344,0,1439770,202297846
32825012224,101202014208,54304768,732082176,5.869,2.228,91.494,0.408,0,1446464,202212939
32825389056,101201498112,54304768,732217344,6.879,2.689,89.994,0.438,0,1480772,202140164
32825761792,101201002496,54304768,732340224,6.083,1.893,91.589,0.435,0,1461050,202139984
32827015168,101199618048,54312960,732454912,6.138,2.380,90.886,0.595,0,1443520,202342908
32826839040,101199683584,54312960,732561408,5.961,1.779,91.916,0.343,0,1458016,202102553
32827719680,101198684160,54312960,732680192,7.322,1.792,89.218,1.668,0,1445640,202105849
32826585088,101199683584,54312960,732815360,6.135,1.909,91.518,0.438,0,1442792,202164970
32841682944,101184483328,54312960,732917760,8.717,1.913,88.743,0.627,0,1448610,202274963
32844496896,101181513728,54321152,733061120,9.481,2.269,87.597,0.653,0,1457250,202230333
32845877248,101180022784,54321152,733167616,9.221,2.422,87.892,0.466,0,1486310,202046934
32847482880,101178269696,54321152,733315072,8.654,2.605,87.903,0.837,0,1387718,202121919
32851419136,101174091776,54329344,733544448,8.424,2.028,88.955,0.593,0,1441756,202167585
32852783104,101172604928,54329344,733659136,8.409,1.993,89.069,0.529,0,1439162,202037109
32863059968,101162196992,54337536,733777920,8.505,1.931,88.785,0.779,0,1437378,202211632
32867991552,101157105664,54337536,733900800,9.299,2.224,87.921,0.556,0,1408386,202281475
32877162496,101147799552,54337536,734035968,8.163,2.204,89.044,0.590,0,1424578,202195026
32907108352,101117714432,54337536,734175232,10.160,1.976,87.426,0.439,0,1433280,202036806
32928018432,101096685568,54337536,734285824,10.267,2.171,87.035,0.527,0,1464902,201981667
32953135104,101071462400,54345728,734384128,9.850,1.939,87.523,0.688,0,1459238,202503966
32966885376,101057568768,54345728,734527488,10.006,2.144,87.508,0.342,0,1428537,201997270
32972922880,101051404288,54345728,734650368,9.441,2.112,87.888,0.559,0,1438082,202366561
32976486400,101047709696,54345728,734781440,10.109,2.233,85.519,2.140,0,1457690,202224305
32991862784,101032214528,54345728,734896128,9.216,2.038,88.339,0.408,0,1452940,202082735
33009291264,101014515712,54353920,735141888,9.714,2.235,87.399,0.652,0,1454012,202078152
33021882368,101001805824,54353920,735256576,8.184,1.850,89.432,0.533,0,1436724,202328460
33036382208,100987174912,54353920,735383552,8.774,1.854,89.002,0.371,0,1412078,202156256
33067851776,100955566080,54362112,735510528,10.277,1.931,87.013,0.779,0,1433050,202097509
33104257024,100919050240,54362112,735621120,9.545,1.809,88.241,0.405,0,1462040,202346629
33157107712,100866068480,54370304,735739904,11.845,2.481,85.147,0.527,0,1414786,201981605
33225908224,100797140992,54370304,735866880,10.877,1.983,86.768,0.372,0,1458406,202208028
33303842816,100719095808,54370304,735977472,11.274,1.993,86.328,0.405,0,1478299,202547641
33387028480,100635774976,54370304,736112640,13.329,2.678,83.525,0.467,0,1482596,202158677
33459965952,100562710528,54378496,736227328,11.066,2.077,86.330,0.527,0,1425648,202007102
33524584448,100497969152,54386688,736333824,10.990,2.266,86.247,0.497,0,1405522,202219208
33577558016,100444864512,54386688,736464896,10.603,1.866,87.096,0.435,0,1402071,202392692
33632149504,100390141952,54386688,736595968,11.191,2.176,86.229,0.404,0,1449566,202236213
33614663680,100407504896,54386688,736714752,5.410,2.114,90.609,1.866,0,1424806,202194610
33607548928,100414504960,54386688,736821248,4.797,2.259,92.603,0.340,0,1429378,202214832
33610174464,100411756544,54394880,736931840,6.469,1.969,91.094,0.469,0,1447178,202261453
33609039872,100412731392,54394880,737083392,5.769,1.923,91.967,0.341,0,1416724,202072310
33608732672,100412923904,54394880,737193984,6.042,2.118,91.529,0.311,0,1417366,202128877
33616191488,100405342208,54403072,737300480,5.368,1.810,92.478,0.343,0,1425468,202176456
33617682432,100403728384,54403072,737423360,5.750,2.071,91.654,0.526,0,1429378,202217854
33622712320,100398542848,54411264,737566720,6.069,2.272,90.819,0.840,0,1443130,202111695
33620660224,100400496640,54411264,737665024,5.937,2.176,91.576,0.311,0,1425978,202049138
33620500480,100400398336,54411264,737918976,4.661,1.512,93.480,0.346,0,1402634,201204074
33621827584,100398915584,54411264,738070528,5.083,2.027,92.516,0.374,0,1436338,203171790
33619156992,100401463296,54419456,738185216,3.823,1.818,85.490,8.869,0,1265272,192249225
33619329024,100401176576,54427648,738279424,5.008,2.022,92.411,0.560,0,1401026,202392679
33618894848,100401463296,54427648,738422784,4.201,1.850,93.636,0.313,0,1395278,201796082
33615667200,100404576256,54427648,738533376,4.520,2.089,93.017,0.374,0,1381720,202359679
33615667200,100404416512,54427648,738652160,4.574,1.660,93.452,0.313,0,1409672,202257200
33617629184,100402315264,54435840,738783232,4.658,2.081,91.863,1.398,0,1386676,202116343
33617829888,100401852416,54444032,739028992,5.005,2.145,92.260,0.591,0,1360476,202175638
33616756736,100402823168,54444032,739131392,4.594,2.219,92.875,0.312,0,1371918,202131223
33616367616,100403056640,54444032,739287040,5.198,1.836,92.686,0.280,0,1393450,202271052
33617006592,100402315264,54444032,739389440,4.725,1.989,93.006,0.280,0,1365010,201994576
33648922624,100370264064,54444032,739524608,7.788,2.336,87.882,1.994,0,1330962,202050761
33648910336,100370165760,54452224,739622912,5.051,2.200,92.315,0.434,0,1372838,202292886
33650442240,100368429056,54452224,739778560,4.571,2.035,92.987,0.407,0,1324178,201959819
33650290688,100368465920,54460416,739880960,4.851,1.897,92.879,0.373,0,1382862,202288686
33631260672,100387356672,54460416,740016128,4.451,1.836,93.371,0.342,0,1385572,202166192
33629040640,100389429248,54460416,740159488,4.303,2.120,93.078,0.499,0,1427094,202239122
33629224960,100389117952,54468608,740270080,4.245,1.667,93.396,0.692,0,1471778,201938426
33630416896,100387782656,54468608,740405248,3.880,1.640,94.164,0.315,0,1516414,202238220
33629454336,100388622336,54468608,740519936,4.772,2.045,92.780,0.403,0,1445584,202052012
33629147136,100388794368,54476800,740642816,4.704,2.087,92.741,0.467,0,1457244,201985214
33628741632,100389064704,54476800,740777984,4.571,2.239,92.755,0.435,0,1456946,202421871
33629331456,100388364288,54484992,740880384,4.224,1.690,92.428,1.658,0,1446364,202208136
33630081024,100387491840,54484992,740995072,3.982,1.756,93.917,0.345,0,1448928,202342558
33631051776,100386365440,54484992,741146624,5.198,2.444,91.986,0.371,0,1450902,202099405
33632059392,100385247232,54484992,741257216,4.548,2.212,92.897,0.343,0,1461460,202177542
33631920128,100385263616,54493184,741363712,6.256,2.013,91.329,0.403,0,1486784,202246204
33632624640,100384399360,54505472,741507072,5.068,2.132,89.802,2.998,0,1452578,202248430
33633968128,100382912512,54505472,741646336,4.340,1.967,93.350,0.343,0,1408666,202044449
33634848768,100381913088,54505472,741761024,4.585,1.903,93.138,0.374,0,1442844,201955412
33634377728,100382244864,54505472,741896192,5.388,1.993,92.214,0.405,0,1448378,202404794
33635946496,100380532736,54513664,742027264,5.275,2.216,91.916,0.593,0,1478906,202179149
33635598336,100380766208,54521856,742129664,4.635,1.723,92.139,1.503,0,1437818,202122722
33636675584,100379541504,54521856,742277120,5.616,2.160,91.824,0.401,0,1460412,202319459
33637650432,100378456064,54521856,742387712,4.355,1.754,93.484,0.407,0,1458724,202249436
33638875136,100377120768,54521856,742498304,4.753,2.019,92.762,0.466,0,1452606,202269074
33639137280,100376702976,54530048,742637568,4.818,1.896,92.726,0.560,0,1439352,201955374
33638617088,100377088000,54542336,742760448,4.220,2.032,92.748,1.000,0,1450282,202150068
33624965120,100390604800,54542336,742891520,4.821,1.960,92.255,0.964,0,1432652,202148302
33624543232,100390895616,54542336,743022592,4.605,1.991,93.030,0.373,0,1457400,202181368
33626247168,100389056512,54542336,743149568,4.857,1.712,93.026,0.405,0,1457384,202119068
33625997312,100389187584,54542336,743268352,4.548,1.851,93.256,0.345,0,1457908,202192064
33626456064,100388532224,54558720,743440384,4.780,1.800,92.800,0.621,0,1421310,202203385
33627250688,100387598336,54562816,743575552,4.103,1.691,92.264,1.942,0,1432928,201989747
33627852800,100386856960,54562816,743714816,4.399,2.028,93.167,0.406,0,1443926,202143014
33628151808,100386447360,54562816,743821312,4.863,1.964,92.768,0.405,0,1451748,201920753
33628602368,100385857536,54562816,743960576,4.624,2.312,92.596,0.469,0,1499648,202251019
33629167616,100385157120,54571008,744083456,4.302,1.839,93.236,0.623,0,1404288,202197309
33627664384,100386435072,54611968,744267776,5.005,2.008,91.412,1.576,0,1412980,202037378
33626968064,100387004416,54611968,744386560,4.412,1.658,93.461,0.469,0,1444280,202418150
33628078080,100385775616,54611968,744488960,4.239,1.964,93.423,0.374,0,1449632,202100269
33629683712,100384006144,54611968,744644608,4.455,2.181,92.991,0.374,0,1446874,202054609
33629282304,100384284672,54620160,744759296,6.669,2.624,90.182,0.525,0,1394434,202175640
33630441472,100382965760,54628352,744906752,4.141,2.070,91.876,1.913,0,1428420,202355108
33630302208,100382998528,54628352,745013248,4.330,1.869,93.427,0.374,0,1445366,202261026
33630576640,100382609408,54628352,745127936,4.983,2.074,92.665,0.279,0,1440102,202083133
33629003776,100384030720,54628352,745271296,4.741,2.076,92.873,0.310,0,1449602,202090646
33629921280,100382998528,54636544,745377792,4.043,1.974,93.356,0.627,0,1452640,202343704
33630359552,100382425088,54636544,745512960,4.679,2.138,92.780,0.403,0,1437188,201959007
33630302208,100382359552,54636544,745635840,4.815,1.864,92.824,0.497,0,1382288,202335483
33630801920,100381716480,54644736,745771008,5.344,2.132,92.061,0.463,0,1443482,201014132
33630519296,100381876224,54644736,745893888,4.276,1.717,93.633,0.375,0,1462962,203586133
33629827072,100382425088,54652928,746020864,4.059,2.092,93.131,0.718,0,1437204,201839457
33630564352,100381466624,54652928,746221568,4.530,1.687,93.440,0.344,0,1380298,202156087
33632354304,100379561984,54652928,746336256,4.435,1.985,91.191,2.388,0,1485166,202211939
33631498240,100380303360,54661120,746442752,4.128,1.751,93.684,0.438,0,1448718,202271868
33631567872,100380078080,54661120,746594304,4.531,2.266,92.862,0.341,0,1459856,202024699
33631019008,100380422144,54669312,746717184,4.641,2.228,92.698,0.433,0,1488552,202110887
33630212096,100380971008,54669312,746971136,4.459,1.933,93.171,0.437,0,1450068,202231102
33630380032,100380684288,54669312,747085824,4.332,2.088,93.051,0.530,0,1621532,202008437
33630724096,100380213248,54669312,747208704,4.133,1.785,93.832,0.250,0,1443765,201972914
33632616448,100378169344,54677504,747352064,4.485,1.900,93.055,0.561,0,1469839,202466642
33632501760,100378136576,54685696,747487232,4.277,1.904,93.225,0.593,0,1432111,202043597
33632817152,100377714688,54685696,747593728,4.329,2.024,93.273,0.374,0,1430440,201946747
33632161792,100378103808,54685696,747855872,4.568,1.958,91.765,1.709,0,1412271,202256433
33632325632,100377812992,54685696,747982848,4.341,2.419,92.837,0.403,0,1390506,202162509
33631318016,100378685440,54693888,748105728,4.375,1.656,93.219,0.750,0,1431618,202021524
33630187520,100379697152,54702080,748208128,4.540,1.897,93.097,0.466,0,1399152,201998449
33631649792,100378103808,54702080,748335104,4.271,2.026,93.236,0.468,0,1428392,202291413
33632436224,100377169920,54702080,748478464,4.487,1.870,92.988,0.654,0,1430878,202029362
33632149504,100377329664,54702080,748605440,3.882,1.879,93.863,0.376,0,1449892,202124544
33632264192,100377071616,54702080,748744704,4.357,1.930,93.340,0.373,0,1471860,202562531
33631617024,100377595904,54718464,748843008,3.830,1.664,93.689,0.816,0,1420408,201981848
33630687232,100378382336,54718464,748974080,4.091,1.780,93.785,0.344,0,1476830,202189477
33631825920,100377112576,54718464,749105152,4.215,1.780,93.662,0.343,0,1459060,202328337
33632456704,100376371200,54718464,749215744,4.265,1.930,91.843,1.961,0,1452832,202058763
33633116160,100375564288,54718464,749355008,3.893,1.601,94.129,0.377,0,1442472,202199258
33634136064,100374401024,54726656,749481984,4.459,1.871,92.922,0.748,0,1458972,201947929
33633484800,100374917120,54726656,749604864,4.400,2.169,93.059,0.372,0,1469664,202372159
33633062912,100375207936,54734848,749723648,4.606,1.836,93.091,0.467,0,1400314,201944904
33633198080,100374949888,54734848,749842432,4.427,2.260,92.477,0.836,0,1448254,202470249
33633423360,100374466560,54734848,750100480,4.271,1.995,93.329,0.405,0,1457408,202110920
33633968128,100373733376,54743040,750239744,4.544,1.867,93.153,0.436,0,1470382,202202685
33633492992,100374085632,54743040,750358528,4.247,1.686,93.754,0.312,0,1441086,202166238
33633841152,100373602304,54751232,750485504,4.189,1.907,93.373,0.531,0,1469582,202085762
33634070528,100373245952,54751232,750612480,4.537,1.865,93.288,0.311,0,1458592,202280720
33634918400,100372279296,54751232,750731264,4.379,1.814,93.525,0.282,0,1439210,202044514
33635446784,100371603456,54759424,750862336,4.069,2.034,93.459,0.438,0,1425278,202153992
33636077568,100370857984,54759424,750972928,4.332,2.026,92.739,0.904,0,1378874,202260204
33636069376,100370731008,54759424,751108096,4.502,2.018,93.170,0.310,0,1454948,202090810
33635909632,100370755584,54767616,751235072,4.332,1.994,91.929,1.745,0,1384158,201933026
33637109760,100369408000,54767616,751374336,4.338,1.873,93.414,0.375,0,1430386,202431748
33636933632,100369473536,54775808,751476736,4.602,1.835,92.942,0.622,0,1414772,202187883
33636188160,100370083840,54775808,751607808,4.384,1.897,93.252,0.466,0,1439811,202014163
33636728832,100369412096,54775808,751734784,4.045,1.693,93.823,0.439,0,1398566,202037992
33636110336,100369891328,54784000,751865856,5.039,2.133,92.334,0.495,0,1375784,202138127
33634934784,100370956288,54784000,751976448,3.979,1.629,93.076,1.316,0,1446996,202357182
33635147776,100370591744,54792192,752115712,4.137,1.692,93.419,0.752,0,1451108,201937531
33634611200,100371021824,54792192,752222208,3.992,1.289,94.279,0.440,0,1385518,201960205
33634324480,100371148800,54792192,752373760,4.558,2.016,93.085,0.341,0,1439644,202231580
33635024896,100370182144,54792192,752640000,4.691,2.253,92.747,0.309,0,1451936,202210756
33634398208,100370681856,54792192,752758784,4.434,2.140,93.054,0.372,0,1438606,202245555
33635090432,100369874944,54808576,752852992,4.560,1.936,92.723,0.781,0,1455321,202054101
33636642816,100368183296,54808576,752992256,4.747,2.110,92.740,0.403,0,1424058,202128648
33637421056,100367278080,54808576,753119232,4.859,2.167,92.510,0.464,0,1498192,202301175
33638039552,100366536704,54808576,753242112,4.367,1.871,93.107,0.655,0,1446238,202057921
33637584896,100366860288,54808576,753373184,4.319,2.020,91.889,1.771,0,1454828,202206948
33638461440,100365869056,54816768,753475584,4.365,1.715,93.202,0.717,0,1478750,201884350
33637736448,100366438400,54824960,753623040,4.065,1.720,93.621,0.594,0,1447836,202289384
33637584896,100366471168,54824960,753737728,3.905,2.093,93.533,0.469,0,1441496,202141480
33637732352,100366184448,54824960,753876992,4.290,2.176,93.068,0.466,0,1452712,202335378
33639038976,100364763136,54824960,753991680,4.718,2.235,92.210,0.838,0,1404600,201985484
33640390656,100363280384,54833152,754110464,4.565,1.957,92.919,0.559,0,1417418,202355295
33639886848,100363636736,54833152,754253824,4.762,1.867,93.028,0.342,0,1443344,202182935
33639596032,100363796480,54841344,754364416,4.322,2.052,93.252,0.373,0,1434570,202036322
29538762752,104464498688,54841344,754495488,4.957,1.766,92.720,0.558,0,1374048,187910721
25602576384,108401680384,54841344,753491968,3.994,1.747,92.917,1.342,0,1202630,165094075
22378328064,111626698752,54853632,752709632,2.801,1.291,95.153,0.755,0,1018406,142774473
19157180416,114848665600,54853632,751890432,3.029,1.405,95.440,0.125,0,880348,121336663
15125016576,118881320960,54853632,751185920,3.051,1.837,94.801,0.311,0,773134,99482593
11943501824,122063880192,54861824,750133248,2.159,0.845,96.683,0.313,0,557918,77032791
8607281152,125400731648,54861824,749502464,1.600,1.474,96.361,0.565,0,397008,55783469
5383434240,128625864704,54874112,748204032,0.785,0.471,98.431,0.314,0,212142,34139741
2139500544,131870679040,54874112,747323392,0.440,0.251,99.246,0.063,0,81575,13616014
1276153856,132734910464,54874112,746438656,0.125,0.094,99.781,0,0,2516,206255
1267560448,132743725056,54874112,746217472,0.031,0,99.969,0,0,1392,550
1267036160,132744241152,54882304,746217472,0.031,0,99.906,0.062,0,572,0
1267036160,132744241152,54882304,746217472,0,0,100,0,0,572,458
1266765824,132744499200,54894592,746217472,0,0,99.875,0.125,0,814,0
1266507776,132744757248,54894592,746217472,0,0,100,0,0,740,0
1266507776,132744757248,54894592,746217472,0,0,100,0,0,844,168
1266507776,132744757248,54894592,746217472,0,0.031,99.969,0,0,746,0
1266507776,132744757248,54894592,746217472,0.031,0,99.969,0,0,858,0
1265991680,132745273344,54894592,746217472,0,0,100,0,0,1340,0
1265725440,132745531392,54902784,746217472,0,0,99.969,0.031,0,392,458
1265725440,132745531392,54902784,746217472,0,0,100,0,0,286,0
1265725440,132745531392,54902784,746217472,0,0,100,0,0,632,0
1265725440,132745531392,54902784,746217472,0,0,100,0,0,286,3032
1265467392,132745789440,54902784,746217472,0,0,100,0,0,1100,1508
1265209344,132746047488,54902784,746217472,0,0,100,0,0,286,0
1264943104,132746305536,54910976,746217472,0.031,0,99.875,0.094,0,286,0
1264685056,132746563584,54910976,746217472,0,0,100,0,0,806,0
1264418816,132746829824,54910976,746217472,0,0,100,0,0,468,0
1263935488,132747313152,54910976,746217472,0,0,100,0,0,7345,1026
1263935488,132747313152,54910976,746217472,0,0,100,0,0,2610,1196
1263677440,132747571200,54910976,746217472,0,0,100,0,0,664,1598
1263669248,132747571200,54919168,746217472,0,0,99.938,0.062,0,452,458
1263411200,132747829248,54919168,746217472,0,0.031,99.281,0.688,0,534,132
1263153152,132748087296,54919168,746217472,0,0,99.875,0.125,0,634,542
1262895104,132748345344,54919168,746217472,0,0,100,0,0,120,0
1263173632,132746088448,54919168,746672128,1.312,0.781,97.906,0,0,403682,47390
1262604288,132746588160,54919168,746225664,0,0,100,0,0,754,590
