172.16.36.7  : 20.61 13.92 13.90 - 13.80 13.81 13.85 13.85 13.83 13.80
172.16.66.46 : 0.16 0.21 0.21 0.21 0.21 0.20 0.20 0.21 0.20 0.18
172.16.66.47 : 0.21 0.20 0.21 0.17 0.22 0.20 0.21 0.20 0.21 0.18
172.16.66.48 : 0.20 0.21 0.20 0.21 0.20 0.20 0.22 0.21 0.20 0.20
172.16.66.49 : 0.22 0.20 0.20 0.21 0.20 0.15 0.20 0.20 0.22 0.19
172.16.66.5  : 0.18 0.21 0.19 0.20 0.21 0.21 0.20 0.21 0.20 0.20
172.16.66.50 : 0.22 0.22 0.21 0.21 0.21 0.21 0.21 0.20 0.22 0.20
172.16.66.51 : 0.21 0.20 0.19 0.20 0.20 0.20 0.19 0.21 0.21 0.21
172.16.66.52 : 0.23 0.22 0.20 0.19 0.21 0.20 0.16 0.22 0.20 0.17
172.16.66.53 : 0.12 0.20 0.22 0.20 0.21 0.21 0.21 0.19 0.19 0.19
172.16.66.54 : 0.23 0.22 0.22 0.21 0.21 0.20 0.21 0.20 0.20 0.18
172.16.66.55 : 0.22 0.21 0.22 0.21 0.19 0.21 0.21 0.21 0.21 0.17
172.16.66.56 : 0.13 0.21 0.20 0.21 0.21 0.20 0.21 0.21 0.21 0.16
172.16.66.57 : 0.22 0.20 0.21 0.21 0.20 0.21 0.21 0.21 0.21 0.20
172.16.66.58 : 0.22 0.20 0.19 0.22 0.21 0.20 0.20 0.20 0.23 0.20
172.16.66.59 : 0.18 0.16 0.15 0.16 0.17 0.15 0.16 0.17 0.15 0.15
172.16.66.6  : 0.23 0.23 0.21 0.21 0.22 0.20 0.20 0.21 0.20 0.20
172.16.66.60 : 0.23 0.19 0.22 0.21 0.18 0.21 0.22 0.22 0.21 0.21
172.16.66.61 : 0.20 0.19 0.21 0.20 0.21 0.20 0.20 0.22 0.19 0.21
172.16.66.62 : 0.22 0.19 0.20 0.21 0.21 0.18 0.22 0.21 0.20 0.21
172.16.66.63 : 0.19 0.19 0.21 0.20 0.18 0.22 0.20 0.20 0.21 0.22
172.16.66.64 : 0.23 0.20 0.21 0.21 0.21 0.21 0.21 0.21 0.21 0.22
172.16.66.65 : 0.20 0.20 0.20 0.21 0.20 0.18 0.20 0.20 0.22 0.20
172.16.66.66 : 0.22 0.20 0.21 0.21 0.20 0.20 0.20 0.20 0.21 0.21
172.16.66.67 : 0.20 0.20 0.21 0.20 0.21 0.20 0.17 0.21 0.20 0.20
172.16.66.68 : 0.19 0.17 0.19 0.20 0.18 0.17 0.17 0.19 0.17 0.18
172.16.66.69 : 0.22 0.18 0.19 0.21 0.21 0.20 0.20 0.20 0.21 0.20
172.16.66.7  : 0.17 0.13 0.16 0.15 0.16 0.10 0.15 0.16 0.16 0.16
172.16.66.70 : 0.23 0.20 0.21 0.22 0.21 0.20 0.20 0.20 0.22 0.22
172.16.66.71 : 0.20 0.21 0.21 0.22 0.22 0.21 0.16 0.22 0.21 0.21
172.16.66.72 : 0.21 0.21 0.19 0.18 0.18 0.19 0.19 0.20 0.21 0.20
172.16.66.73 : 0.04 0.03 0.03 0.03 0.03 0.03 0.03 0.03 0.03 0.03
172.16.66.74 : 0.40 0.21 0.16 0.21 0.21 0.20 0.20 0.21 0.19 0.20
172.16.66.75 : 0.36 0.12 0.19 0.20 0.12 0.22 0.20 0.21 0.21 0.21
172.16.66.76 : 0.37 0.21 0.22 0.21 0.21 0.21 0.20 0.21 0.21 0.21
172.16.66.77 : 0.38 0.21 0.21 0.21 0.20 0.20 0.17 0.22 0.19 0.20
172.16.66.78 : 0.39 0.21 0.21 0.18 0.20 0.21 0.18 0.19 0.21 0.20
172.16.66.79 : 0.35 0.17 0.16 0.17 0.15 0.17 0.16 0.16 0.17 0.16
172.16.66.8  : 0.27 0.20 0.20 0.21 0.22 0.21 0.21 0.20 0.20 0.23
172.16.66.80 : 0.32 0.20 0.20 0.21 0.20 0.20 0.21 0.20 0.20 0.17
172.16.66.81 : 0.30 0.15 0.16 0.15 0.16 0.16 0.16 0.16 0.16 0.15
172.16.66.97 : 0.39 0.21 0.20 0.18 0.21 0.21 0.20 0.21 0.19 0.22

      42 targets
      42 alive
       0 unreachable
       0 unknown addresses

       1 timeouts (waiting for response)
     420 ICMP Echos sent
     419 ICMP Echo Replies received
       0 other ICMP received

 0.03 ms (min round trip time)
 0.50 ms (avg round trip time)
 20.6 ms (max round trip time)
       10.011 sec (elapsed real time)

