172.16.36.8   : 24.61 13.81 13.84 13.81 13.84 13.87 13.84 13.84 13.84 13.82
172.16.66.109 : 0.19 0.14 0.20 0.19 0.16 0.17 0.20 0.18 0.19 0.20
172.16.66.11  : 0.17 0.17 0.22 0.13 0.21 0.21 0.21 0.22 0.20 0.21
172.16.66.110 : 0.22 0.20 0.22 0.20 0.21 0.20 0.20 0.20 0.22 0.20
172.16.66.111 : 0.16 0.19 0.14 0.16 0.17 0.14 0.15 0.18 0.16 0.16
172.16.66.112 : 0.23 0.21 0.21 0.20 0.21 0.20 0.20 0.21 0.20 0.21
172.16.66.113 : 0.21 0.22 0.20 0.20 0.21 0.20 0.20 0.21 0.21 0.20
172.16.66.114 : 0.25 0.21 0.19 0.20 0.21 0.21 0.21 0.21 0.20 0.18
172.16.66.115 : 0.21 0.15 0.20 0.20 0.21 0.21 0.20 0.21 0.21 0.21
172.16.66.116 : 0.22 0.24 0.21 0.19 0.22 0.20 0.21 0.22 0.21 0.21
172.16.66.117 : 0.20 0.19 0.18 0.17 0.20 0.18 0.18 0.22 0.19 0.20
172.16.66.118 : 0.21 0.20 0.20 0.21 0.21 0.21 0.20 0.20 0.19 0.20
172.16.66.119 : 0.22 0.22 0.18 0.18 0.22 0.21 0.21 0.22 0.22 0.20
172.16.66.12  : 0.22 0.21 0.21 0.20 0.22 0.19 0.20 0.21 0.21 0.20
172.16.66.120 : 0.22 0.22 0.20 0.20 0.21 0.19 0.19 0.20 0.19 0.16
172.16.66.121 : 0.23 0.21 0.15 0.15 0.16 0.16 0.13 0.16 0.13 0.13
172.16.66.122 : 0.04 0.03 0.03 0.03 0.03 0.03 0.03 0.03 0.03 0.03
172.16.66.123 : 0.16 0.08 0.09 0.12 0.11 0.10 0.10 0.10 0.13 0.11
172.16.66.124 : 0.21 0.21 0.21 0.20 0.21 0.19 0.20 0.20 0.21 0.21
172.16.66.13  : 0.14 0.14 0.13 0.08 0.13 0.13 0.13 0.12 0.13 0.11
172.16.66.14  : 0.23 0.20 0.18 0.20 0.21 0.20 0.19 0.21 0.20 0.20
172.16.66.15  : 0.26 0.20 0.21 0.22 0.19 0.14 0.21 0.22 0.21 0.22
172.16.66.16  : 0.22 0.18 0.18 0.19 0.18 0.18 0.19 0.17 0.18 0.17
172.16.66.17  : 0.20 0.19 0.20 0.21 0.20 0.20 0.21 0.20 0.20 0.21
172.16.66.18  : 0.24 0.21 0.20 0.21 0.21 0.21 0.22 0.20 0.20 0.22
172.16.66.19  : 0.25 0.16 0.20 0.13 0.21 0.19 0.20 0.19 0.20 0.18
172.16.66.2   : 0.20 0.18 0.20 0.21 0.23 0.20 0.21 0.21 0.20 0.20
172.16.66.20  : 0.24 0.19 0.21 0.21 0.20 0.18 0.20 0.19 0.21 0.20
172.16.66.21  : 0.24 0.17 0.11 0.16 0.15 0.16 0.17 0.13 0.16 0.16
172.16.66.22  : 0.22 0.21 0.18 0.21 0.21 0.21 0.22 0.22 0.20 0.20
172.16.66.23  : 0.23 0.21 0.21 0.20 0.18 0.23 0.20 0.17 0.20 0.23
172.16.66.24  : 0.20 0.19 0.20 0.19 0.19 0.16 0.19 0.18 0.18 0.19
172.16.66.25  : 0.21 0.21 0.21 0.22 0.22 0.21 0.21 0.22 0.21 0.21
172.16.66.27  : 0.22 0.20 0.20 0.21 0.21 0.21 0.21 0.20 0.24 0.19
172.16.66.28  : 0.24 0.20 0.21 0.21 0.21 0.20 0.18 0.20 0.20 0.20
172.16.66.41  : 0.21 0.20 0.19 0.18 0.21 0.20 0.18 0.20 0.19 0.18
172.16.66.80  : 0.23 0.20 0.21 0.21 0.20 0.21 0.21 0.20 0.21 0.21
172.16.66.81  : 0.24 0.21 0.21 0.22 0.21 0.20 0.21 0.21 0.18 0.21
172.16.66.82  : 0.22 0.21 0.18 0.21 0.21 0.21 0.22 0.20 0.20 0.21
172.16.66.83  : 0.18 0.20 0.21 0.22 0.18 0.20 0.21 0.20 0.21 0.21
172.16.66.84  : 0.21 0.20 0.20 0.21 0.20 0.19 0.19 0.21 0.21 0.19

      41 targets
      41 alive
       0 unreachable
       0 unknown addresses

       0 timeouts (waiting for response)
     410 ICMP Echos sent
     410 ICMP Echo Replies received
       0 other ICMP received

 0.03 ms (min round trip time)
 0.54 ms (avg round trip time)
 24.6 ms (max round trip time)
        9.412 sec (elapsed real time)

