172.16.36.8 : 12.86 4.35 4.32 4.35 4.40 4.34 4.26 4.36 4.36 4.32
172.16.38.6 : 0.02 0.03 0.01 0.03 0.01 0.03 0.01 0.01 0.02 0.01
172.16.38.5 : 0.18 0.19 0.17 0.17 0.18 0.18 0.18 0.19 0.19 0.19

       3 targets
       3 alive
       0 unreachable
       0 unknown addresses

       0 timeouts (waiting for response)
      30 ICMP Echos sent
      30 ICMP Echo Replies received
       0 other ICMP received

 0.01 ms (min round trip time)
 1.79 ms (avg round trip time)
 12.8 ms (max round trip time)
        9.022 sec (elapsed real time)

