# # # HOSTS
# # # cloud.plantnetengine.*
{'hosts': 'all', 'tasks': [{'debug': {'msg': 'Starting PlantNetEngine'}}, {'shell': 'chmod +x /tmp/plantnet-data/status_collector.sh'}, {'shell': "docker cp telegraf:/etc/telegraf/telegraf.conf /tmp/telegraf.conf && my_img_id=$(docker ps -aqf 'name=^telegraf$') && systemctl stop docker && rm -rf /var/lib/docker/containers/$my_img_id* && systemctl start docker && docker run -d --rm --gpus all --network host -v /tmp/telegraf.conf:/etc/telegraf/telegraf.conf -v /sys:/rootfs/sys:ro -v /proc:/rootfs/proc:ro -v /var/run/docker.sock:/var/run/docker.sock:ro -e HOST_PROC=/rootfs/proc -e HOST_SYS=/rootfs/sys --name=telegraf telegraf:latest"}, {'shell': 'sudo docker run -d --rm --cpuset-cpus 0-39 -p 8201:8201 --gpus all -v /tmp/plantnet-data:/data --name identify.docker registry.gitlab.inria.fr/snoop/plantnet/cuda92:latest /opt/snoop/bin/pn3_identifyREST --root /data/2020-06-29 --plantnet Config/plantnet_test_organ.json --simsearch Config/simSearch.json --multidesc Config/multidesc_caffe_organ.json --doc Config/doc_ocv.json'}, {'shell': 'sleep 120'}, {'shell': '/tmp/plantnet-data/status_collector.sh 1300 10 http://127.0.0.1:8201/status /tmp/metrics_identify', 'async': 1400, 'poll': 0}], 'name': 'all'}

# LAUNCH

# ROLES
{'all': [Host(address='chifflot-7.lille.grid5000.fr', alias='chifflot-7.lille.grid5000.fr', user='root', keyfile=None, port=None, extra={'self': {'_id': '1_1', '__address__': 'chifflot-7.lille.grid5000.fr', 'url': 'chifflot-7.lille.grid5000.fr'}})]}

# EXTRA_VARS
{'working_dir': '/home/drosendo/plantnet-data'}



# # # HOSTS
# # # edge.*
{'hosts': 'all', 'tasks': [{'debug': {'msg': 'Starting data producer'}}, {'shell': 'docker run -d --rm -p 8202:8202 -v /tmp/plantnet-data:/data --name crash.docker registry.gitlab.inria.fr/snoop/plantnet/cuda92:latest /opt/snoop/bin/pn3t_crashTest --cache /data/cache --host http://{{ plantnetengine.url }}:8201/v2/identify --obs /data/obs.json --nb 80 --port 8202'}, {'shell': 'sleep 10 && chmod +x /tmp/plantnet-data/status_collector.sh'}, {'shell': '/tmp/plantnet-data/status_collector.sh 1300 10 http://127.0.0.1:8202/status /tmp/metrics_crash', 'async': 1380, 'poll': 0}], 'name': 'all'}

# LAUNCH

# ROLES
{'all': [Host(address='chiclet-8.lille.grid5000.fr', alias='chiclet-8.lille.grid5000.fr', user='root', keyfile=None, port=None, extra={'my_lille_network': 'enp98s0f0', 'my_lille_network_dev': 'enp98s0f0', 'my_lille_network_ip': '172.16.39.8', 'enos_devices': ['enp98s0f0'], 'plantnetengine': {'_id': '1_1', '__address__': 'chifflot-7.lille.grid5000.fr', 'url': 'chifflot-7.lille.grid5000.fr'}, 'self': {'_id': '2_1', '__address__': 'chiclet-8.lille.grid5000.fr', 'url': 'chiclet-8.lille.grid5000.fr'}})]}

# EXTRA_VARS
{'working_dir': '/home/drosendo/plantnet-data'}



# # # HOSTS
# # # cloud.plantnetengine.*
{'hosts': 'all', 'tasks': [{'debug': {'msg': 'Stopping PlantNetEngine'}}, {'shell': 'sudo docker stop identify.docker || true'}, {'shell': 'tar -zcf /tmp/metrics_identify.tar.gz --absolute-names /tmp/metrics_identify/'}, {'fetch': {'src': '/tmp/metrics_identify.tar.gz', 'dest': '{{ working_dir }}/experiment-results/metrics_identify/', 'validate_checksum': False}}, {'shell': 'curl "https://api.grid5000.fr/sid/sites/lille/metrics?nodes=chifflot-7&metrics=bmc_node_power_watt&start_time=$(date -d \'1380 sec ago\' +%s)" | jq -r \'.[] | [.timestamp, .device_id, .metric_id, .value] | @csv\' > /tmp/metrics_power.csv'}, {'fetch': {'src': '/tmp/metrics_power.csv', 'dest': '{{ working_dir }}/experiment-results/metrics_power/', 'validate_checksum': False}}], 'name': 'all'}

# FINALIZE

# ROLES
{'all': [Host(address='chifflot-7.lille.grid5000.fr', alias='chifflot-7.lille.grid5000.fr', user='root', keyfile=None, port=None, extra={'self': {'_id': '1_1', '__address__': 'chifflot-7.lille.grid5000.fr', 'url': 'chifflot-7.lille.grid5000.fr'}})]}

# EXTRA_VARS
{'working_dir': '/home/drosendo/git/e2clab-examples/plantnet/getting_started/GPU/v1/scenario_40/20210324-024512'}



# # # HOSTS
# # # edge.*
{'hosts': 'all', 'tasks': [{'debug': {'msg': 'Stopping data producer'}}, {'shell': 'sudo docker stop crash.docker || true && tar -zcf /tmp/metrics_crash.tar.gz --absolute-names /tmp/metrics_crash/'}, {'fetch': {'src': '/tmp/metrics_crash.tar.gz', 'dest': '{{ working_dir }}/experiment-results/metrics_crash/', 'validate_checksum': False}}], 'name': 'all'}

# FINALIZE

# ROLES
{'all': [Host(address='chiclet-8.lille.grid5000.fr', alias='chiclet-8.lille.grid5000.fr', user='root', keyfile=None, port=None, extra={'my_lille_network': 'enp98s0f0', 'my_lille_network_dev': 'enp98s0f0', 'my_lille_network_ip': '172.16.39.8', 'enos_devices': ['enp98s0f0'], 'plantnetengine': {'_id': '1_1', '__address__': 'chifflot-7.lille.grid5000.fr', 'url': 'chifflot-7.lille.grid5000.fr'}, 'self': {'_id': '2_1', '__address__': 'chiclet-8.lille.grid5000.fr', 'url': 'chiclet-8.lille.grid5000.fr'}})]}

# EXTRA_VARS
{'working_dir': '/home/drosendo/git/e2clab-examples/plantnet/getting_started/GPU/v1/scenario_40/20210324-024512'}



