172.16.36.7  : 20.99 13.92 13.89 13.89 13.88 13.91 13.90 13.91 13.90 13.83
172.16.66.62 : 0.21 0.22 0.20 0.20 0.16 0.18 0.19 0.19 0.18 0.21
172.16.66.63 : 0.17 0.16 0.16 0.16 0.18 0.15 0.14 0.16 0.14 0.15
172.16.66.64 : 0.21 0.22 0.20 0.20 0.21 0.21 0.21 0.18 0.20 0.19
172.16.66.65 : 0.22 0.22 0.21 0.19 0.21 0.21 0.22 0.21 0.20 0.21
172.16.66.66 : 0.22 0.21 0.19 0.21 0.22 0.20 0.22 0.22 0.21 0.21
172.16.66.67 : 0.22 0.22 0.20 0.20 0.21 0.20 0.20 0.20 0.20 0.21
172.16.66.68 : 0.02 0.03 0.03 0.03 0.03 0.04 0.03 0.03 0.03 0.03
172.16.66.69 : 0.17 0.22 0.21 0.21 0.21 0.21 0.20 0.21 0.20 0.21
172.16.66.7  : 0.24 0.20 0.20 0.21 0.20 0.19 0.21 0.22 0.20 0.20
172.16.66.70 : 0.23 0.17 0.18 0.17 0.18 0.19 0.22 0.18 0.17 0.18
172.16.66.71 : 0.23 0.21 0.20 0.21 0.20 0.20 0.20 0.21 0.20 0.21
172.16.66.72 : 0.23 0.18 0.18 0.18 0.18 0.19 0.18 0.18 0.19 0.21
172.16.66.73 : 0.24 0.20 0.19 0.21 0.20 0.20 0.21 0.21 0.21 0.21
172.16.66.74 : 0.22 0.20 0.22 0.21 0.22 0.21 0.22 0.22 0.22 0.22
172.16.66.75 : 0.18 0.13 0.13 0.14 0.12 0.16 0.16 0.15 0.12 0.16
172.16.66.76 : 3.00 0.20 0.21 0.19 0.21 0.20 0.21 0.20 0.21 0.21
172.16.66.77 : 6.65 0.19 0.21 0.19 0.21 0.21 0.23 0.18 0.14 0.22
172.16.66.78 : 0.20 0.19 0.21 0.21 0.21 0.21 0.22 0.21 0.21 0.21
172.16.66.79 : 0.15 0.20 0.19 0.21 0.22 0.21 0.21 0.21 0.20 0.21
172.16.66.8  : 0.19 0.21 0.21 0.21 0.20 0.21 0.20 0.21 0.20 0.20
172.16.66.80 : 0.20 0.24 0.22 0.20 0.20 0.19 0.22 0.21 0.21 0.22
172.16.66.81 : 0.20 0.20 0.18 0.21 0.20 0.20 0.21 0.21 0.22 0.21
172.16.66.82 : 0.20 0.21 0.21 0.22 0.20 0.22 0.22 0.20 0.20 0.22
172.16.66.83 : 0.21 0.22 0.20 0.17 0.20 0.21 0.20 0.22 0.19 0.21
172.16.66.84 : 0.23 0.20 0.21 0.22 0.20 0.20 0.21 0.20 0.20 0.21
172.16.66.85 : 0.23 0.20 0.20 0.21 0.20 0.20 0.22 0.21 0.20 0.22
172.16.66.86 : 0.15 0.21 0.21 0.21 0.20 0.21 0.22 0.20 0.20 0.22
172.16.66.87 : 0.24 0.21 0.20 0.22 0.22 0.20 0.21 0.20 0.20 0.21
172.16.66.88 : 0.24 0.20 0.21 0.20 0.21 0.21 0.22 0.20 0.21 0.22
172.16.66.89 : 0.19 0.21 0.21 0.21 0.11 0.21 0.20 0.21 0.21 0.22
172.16.66.9  : 0.24 0.21 0.21 0.21 0.21 0.19 0.21 0.21 0.19 0.21
172.16.66.90 : 0.24 0.20 0.21 0.20 0.20 0.20 0.18 0.20 0.21 0.22
172.16.66.91 : 0.23 0.21 0.21 0.21 0.18 0.21 0.21 0.21 0.21 0.20
172.16.66.92 : 0.25 0.20 0.21 0.22 0.20 0.20 0.21 0.19 0.21 0.22
172.16.66.93 : 0.22 0.20 0.20 0.21 0.21 0.19 0.21 0.21 0.20 0.21
172.16.66.94 : 0.24 0.21 0.18 0.21 0.20 0.20 0.20 0.21 0.20 0.22
172.16.66.95 : 0.24 0.23 0.20 0.21 0.22 0.20 0.21 0.21 0.21 0.21
172.16.66.96 : 0.22 0.21 0.22 0.21 0.21 0.20 0.21 0.21 0.21 0.21
172.16.66.97 : 0.24 0.21 0.21 0.21 0.21 0.22 0.20 0.21 0.20 0.21
172.16.66.98 : 0.25 0.21 0.21 0.20 0.21 0.20 0.21 0.20 0.21 0.21
172.16.66.99 : 0.23 0.20 0.20 0.21 0.21 0.14 0.20 0.19 0.20 0.21

      42 targets
      42 alive
       0 unreachable
       0 unknown addresses

       0 timeouts (waiting for response)
     420 ICMP Echos sent
     420 ICMP Echo Replies received
       0 other ICMP received

 0.02 ms (min round trip time)
 0.56 ms (avg round trip time)
 20.9 ms (max round trip time)
        9.417 sec (elapsed real time)

