172.16.36.7  : 0.02 0.04 0.04 0.03 0.03 0.03 0.03 0.03 0.01 0.04
172.16.66.62 : 14.47 9.78 9.75 9.77 9.76 9.74 9.69 9.67 9.72 9.72
172.16.66.63 : 13.83 13.86 13.82 - 13.85 13.76 13.66 13.85 13.75 13.69
172.16.66.64 : 13.87 13.95 13.94 13.90 13.91 13.91 13.89 13.95 13.90 13.83
172.16.66.65 : 15.07 13.91 13.90 13.92 13.90 13.92 13.88 13.95 13.88 13.93
172.16.66.66 : 17.38 13.93 13.93 13.89 13.90 13.87 13.91 13.84 13.83 13.82
172.16.66.67 : 17.40 13.88 13.93 13.89 13.87 13.90 13.90 13.88 13.88 13.90
172.16.66.68 : 17.83 13.90 13.91 13.96 13.88 13.84 13.85 - 13.83 13.81
172.16.66.69 : 13.93 13.91 13.93 13.88 13.89 13.92 13.92 13.91 - 13.92
172.16.66.7  : 16.82 13.90 13.93 13.86 13.73 13.84 13.83 13.84 13.85 13.90
172.16.66.70 : 13.91 13.91 13.89 13.85 13.89 13.90 13.90 13.90 13.90 13.85
172.16.66.71 : 13.84 13.84 13.77 13.78 13.74 13.82 13.86 13.83 13.79 13.85
172.16.66.72 : 13.90 13.86 13.86 13.84 13.89 13.78 13.84 13.82 13.74 13.83
172.16.66.73 : 18.66 13.83 13.82 13.83 13.87 13.91 13.92 13.92 13.84 13.95
172.16.66.74 : 13.91 13.81 13.87 13.86 13.91 13.86 13.85 13.94 13.94 13.89
172.16.66.75 : 13.83 13.77 13.81 13.83 13.81 13.85 13.92 13.93 13.87 13.95
172.16.66.76 : 19.04 13.88 13.90 13.95 13.86 13.89 13.88 13.90 13.88 13.92
172.16.66.77 : 13.80 13.84 - 13.86 13.81 13.88 13.78 13.91 13.75 13.87
172.16.66.78 : 13.82 13.76 13.76 13.80 13.81 13.76 13.78 13.90 13.81 13.75
172.16.66.79 : 14.03 13.85 13.87 13.90 13.83 13.88 13.89 13.89 13.86 13.92
172.16.66.8  : 15.34 13.90 13.89 13.85 13.75 13.91 13.90 13.93 13.81 13.82
172.16.66.80 : 13.78 13.81 13.90 13.91 13.84 13.90 13.87 13.91 13.83 13.83
172.16.66.81 : 13.78 13.83 13.94 13.92 13.86 13.91 - 13.80 13.80 13.79
172.16.66.82 : 13.89 13.92 13.93 13.91 13.92 13.89 13.85 13.83 13.84 13.83
172.16.66.83 : 15.63 13.95 13.89 13.93 13.85 13.84 13.84 13.84 13.84 13.84
172.16.66.84 : 13.78 13.90 13.85 13.85 13.90 13.91 13.88 13.86 13.90 13.91
172.16.66.85 : 21.08 13.92 13.83 13.81 13.80 13.80 13.82 13.84 13.79 13.84
172.16.66.86 : 20.45 13.92 13.92 13.88 13.90 13.90 13.85 13.91 13.84 13.84
172.16.66.87 : 20.85 13.86 13.85 13.86 13.83 13.86 13.84 13.92 13.86 13.89
172.16.66.88 : 23.80 13.92 13.88 13.90 13.89 13.91 13.94 13.92 13.89 13.91
172.16.66.89 : 20.87 13.82 13.82 13.84 13.84 13.76 13.91 13.91 13.88 13.82
172.16.66.9  : 23.81 13.91 13.92 13.91 13.88 13.88 13.94 13.89 13.80 13.84
172.16.66.90 : 20.49 13.87 13.84 13.89 13.89 13.91 13.92 13.82 13.86 13.83
172.16.66.91 : 20.44 13.93 13.90 13.88 13.91 13.91 13.88 13.94 13.91 13.88
172.16.66.92 : 20.48 13.81 13.91 13.86 13.90 13.87 13.86 13.91 13.82 13.84
172.16.66.93 : 23.82 13.91 - 13.94 13.89 13.89 13.85 13.80 13.90 13.83
172.16.66.94 : 20.52 13.85 - 13.91 13.92 13.95 13.81 13.92 13.88 13.92
172.16.66.95 : 20.77 13.90 13.89 13.92 13.89 13.89 13.78 13.91 13.83 13.84
172.16.66.96 : 23.85 13.91 13.91 13.89 13.91 13.94 - 13.91 13.91 13.92
172.16.66.97 : 23.80 13.93 13.92 13.87 13.88 13.93 13.84 13.85 13.86 13.84
172.16.66.98 : 20.90 13.91 13.94 13.92 13.92 13.93 13.94 13.82 13.91 13.90
172.16.66.99 : 24.71 13.85 13.85 13.84 13.84 13.84 13.84 13.82 13.87 -

      42 targets
      42 alive
       0 unreachable
       0 unknown addresses

       9 timeouts (waiting for response)
     420 ICMP Echos sent
     411 ICMP Echo Replies received
       0 other ICMP received

 0.01 ms (min round trip time)
 13.8 ms (avg round trip time)
 24.7 ms (max round trip time)
       10.431 sec (elapsed real time)

