172.16.36.7 : 0.21 0.14 0.13 0.14 0.15 0.14 0.14 0.15 0.14 0.11
172.16.39.5 : 0.17 0.12 0.13 0.11 0.12 0.10 0.10 0.12 0.11 0.11
172.16.39.3 : 0.03 0.01 0.01 0.01 0.01 0.01 0.01 0.01 0.01 0.01

       3 targets
       3 alive
       0 unreachable
       0 unknown addresses

       0 timeouts (waiting for response)
      30 ICMP Echos sent
      30 ICMP Echo Replies received
       0 other ICMP received

 0.01 ms (min round trip time)
 0.09 ms (avg round trip time)
 0.21 ms (max round trip time)
        9.021 sec (elapsed real time)

