172.16.36.7  : 20.58 13.91 13.89 13.89 13.94 13.88 13.87 13.86 13.85 -
172.16.66.51 : 0.20 0.21 0.16 0.20 0.20 0.06 0.18 0.20 0.20 0.21
172.16.66.53 : 0.28 0.14 0.13 0.13 0.14 0.15 0.13 0.15 0.16 0.13
172.16.66.54 : 0.04 0.03 0.03 0.03 0.03 0.03 0.03 0.03 0.04 0.03
172.16.66.55 : 0.40 0.20 0.20 0.22 0.17 0.20 0.22 0.21 0.19 0.22
172.16.66.56 : 0.38 0.20 0.21 0.21 0.21 0.21 0.20 0.21 0.16 0.21
172.16.66.57 : 0.38 0.20 0.21 0.19 0.21 0.22 0.20 0.21 0.20 0.21
172.16.66.58 : 0.33 0.20 0.20 0.20 0.21 0.20 0.20 0.21 0.20 0.20
172.16.66.59 : 0.40 0.18 0.18 0.20 0.21 0.21 0.20 0.20 0.21 0.20
172.16.66.6  : 0.33 0.21 0.22 0.20 0.20 0.19 0.21 0.20 0.20 0.21
172.16.66.60 : 0.41 0.20 0.20 0.21 0.21 0.23 0.20 0.20 0.18 0.20
172.16.66.61 : 0.33 0.20 0.20 0.20 0.21 0.21 0.21 0.20 0.18 0.18
172.16.66.62 : 0.33 0.20 0.20 0.21 0.20 0.22 0.20 0.22 0.17 0.21
172.16.66.63 : 0.97 0.19 0.21 0.20 0.20 0.23 0.19 0.18 0.21 0.16
172.16.66.64 : 0.38 0.17 0.22 0.20 0.20 0.20 0.22 0.21 0.20 0.21
172.16.66.65 : 0.32 0.18 0.22 0.19 0.20 0.21 0.21 0.20 0.20 0.20
172.16.66.66 : 6.45 0.18 0.19 0.18 0.18 0.18 0.18 0.17 0.16 0.20
172.16.66.67 : 0.26 0.21 0.21 0.21 0.21 0.18 0.21 0.21 0.21 0.20
172.16.66.68 : 4.25 0.21 0.18 0.19 0.22 0.21 0.19 0.18 0.18 0.20
172.16.66.69 : 0.35 0.21 0.20 0.22 0.18 0.20 0.20 0.21 0.20 0.20
172.16.66.7  : 0.27 0.18 0.21 0.21 0.21 0.21 0.21 0.20 0.21 0.22
172.16.66.70 : 0.30 0.20 0.20 0.21 0.20 0.20 0.21 0.18 0.21 0.22
172.16.66.71 : 0.29 0.17 0.23 0.20 0.21 0.16 0.22 0.21 0.20 0.20
172.16.66.72 : 0.22 0.22 0.21 0.21 0.21 0.21 0.21 0.20 0.21 0.21
172.16.66.73 : 0.34 0.21 0.20 0.21 0.21 0.21 0.21 0.21 0.20 0.21
172.16.66.74 : 0.28 0.19 0.21 0.21 0.21 0.20 0.21 0.20 0.20 0.21
172.16.66.75 : 0.31 0.20 0.20 0.22 0.20 0.20 0.21 0.21 0.21 0.22
172.16.66.76 : 0.35 0.20 0.20 0.20 0.20 0.21 0.21 0.21 0.20 0.21
172.16.66.77 : 0.29 0.22 0.21 0.21 0.21 0.20 0.20 0.20 0.22 0.22
172.16.66.78 : 0.32 0.20 0.18 0.20 0.20 0.20 0.21 0.21 0.21 0.20
172.16.66.79 : 0.32 0.21 0.21 0.20 0.20 0.22 0.21 0.21 0.20 0.20
172.16.66.8  : 0.34 0.20 0.20 0.18 0.21 0.21 0.21 0.20 0.20 0.20
172.16.66.80 : 0.23 0.20 0.22 0.21 0.20 0.20 0.21 0.20 0.19 0.21
172.16.66.81 : 0.28 0.21 0.21 0.22 0.20 0.20 0.21 0.21 0.20 0.18
172.16.66.82 : 0.28 0.20 0.18 0.21 0.18 0.20 0.21 0.21 0.20 0.22
172.16.66.83 : 0.23 0.20 0.20 0.21 0.20 0.21 0.21 0.20 0.20 0.21
172.16.66.84 : 0.36 0.21 0.18 0.19 0.19 0.20 0.21 0.21 0.20 0.20
172.16.66.85 : 0.29 0.21 0.20 0.20 0.21 0.20 0.22 0.21 0.21 0.22
172.16.66.86 : 0.34 0.20 0.20 0.22 0.21 0.21 0.21 0.20 0.20 0.22
172.16.66.87 : 0.36 0.22 0.21 0.21 0.20 0.19 0.21 0.21 0.21 0.21
172.16.66.88 : 0.31 0.21 0.20 0.21 0.21 0.20 0.21 0.20 0.20 0.21
172.16.66.9  : 0.27 0.22 0.21 0.21 0.20 0.20 0.22 0.22 0.20 0.21

      42 targets
      42 alive
       0 unreachable
       0 unknown addresses

       1 timeouts (waiting for response)
     420 ICMP Echos sent
     419 ICMP Echo Replies received
       0 other ICMP received

 0.03 ms (min round trip time)
 0.54 ms (avg round trip time)
 20.5 ms (max round trip time)
       10.012 sec (elapsed real time)

