172.16.36.7  : 0.03 0.01 0.01 0.01 0.00 0.02 0.01 0.01 0.01 0.01
172.16.66.62 : 9.77 9.74 9.75 9.68 9.76 9.76 9.75 9.74 9.74 9.73
172.16.66.63 : 21.02 13.77 13.86 13.84 13.96 13.92 13.83 13.84 13.82 13.86
172.16.66.64 : 24.73 13.93 13.91 13.87 13.89 13.90 13.89 13.90 13.86 13.85
172.16.66.65 : 20.94 13.84 13.85 13.84 13.84 13.85 13.84 13.81 13.86 13.81
172.16.66.66 : 20.91 13.91 13.88 13.92 13.85 13.89 13.88 13.85 13.87 13.85
172.16.66.67 : 20.92 13.91 13.90 13.90 13.82 13.92 13.92 13.93 13.91 13.92
172.16.66.68 : 24.63 13.92 13.90 13.92 13.90 13.92 13.91 13.81 13.84 13.79
172.16.66.69 : 24.85 13.87 13.90 13.93 13.88 13.96 13.90 13.89 13.85 13.89
172.16.66.7  : 20.86 13.80 13.79 13.79 13.80 13.77 13.78 13.80 13.79 13.79
172.16.66.70 : 20.92 13.90 13.92 13.83 13.89 13.89 13.89 13.92 13.84 13.83
172.16.66.71 : 20.87 13.87 13.89 13.89 13.78 13.89 13.88 13.89 13.88 13.88
172.16.66.72 : 21.00 13.89 13.84 13.83 13.86 13.90 13.90 13.85 13.78 13.83
172.16.66.73 : 20.83 13.84 13.87 13.89 13.87 13.88 13.86 13.88 13.89 13.86
172.16.66.74 : 24.65 13.95 13.92 13.85 13.88 13.82 13.84 13.90 13.90 13.92
172.16.66.75 : 20.88 13.92 13.88 13.89 13.85 13.89 13.90 13.88 13.91 13.91
172.16.66.76 : 24.72 13.90 13.89 13.89 13.90 13.84 13.89 13.86 13.81 13.89
172.16.66.77 : 17.48 13.88 13.83 13.80 - 13.83 13.82 13.91 13.79 13.93
172.16.66.78 : 17.45 13.81 13.84 13.80 13.79 13.82 13.85 13.84 13.83 13.85
172.16.66.79 : 25.36 13.83 13.82 13.83 13.83 13.83 13.90 13.92 13.94 13.92
172.16.66.8  : 20.89 13.89 13.92 13.88 13.88 13.87 13.91 13.93 13.89 13.91
172.16.66.80 : 20.87 13.80 13.81 13.82 13.89 13.89 13.85 13.91 13.92 13.89
172.16.66.81 : 20.93 13.92 13.83 13.89 13.93 13.94 13.92 13.92 13.85 13.85
172.16.66.82 : 20.88 13.82 - 13.90 13.90 13.88 13.90 13.80 13.89 13.88
172.16.66.83 : 20.88 13.86 13.85 13.81 13.86 13.85 13.84 13.87 13.81 13.88
172.16.66.84 : 25.66 13.85 13.90 13.92 13.90 13.92 13.90 13.91 13.92 13.92
172.16.66.85 : 20.89 13.89 13.92 13.94 13.90 13.84 13.84 13.83 13.77 13.87
172.16.66.86 : 20.88 13.91 13.87 13.90 13.92 13.91 13.90 13.91 13.91 13.90
172.16.66.87 : 20.90 13.88 13.92 13.91 13.93 13.88 13.81 13.83 13.81 13.83
172.16.66.88 : 20.90 13.91 13.86 13.93 13.91 13.81 13.88 13.92 13.90 13.88
172.16.66.89 : 20.92 13.87 13.93 13.75 13.83 13.84 13.82 13.85 13.85 13.83
172.16.66.9  : 20.87 13.93 13.85 13.89 13.87 13.88 13.88 13.92 13.91 13.92
172.16.66.90 : 20.90 13.89 13.87 13.84 13.83 13.84 13.81 13.87 13.84 13.85
172.16.66.91 : 20.93 13.91 - - 13.91 13.89 13.86 13.92 13.89 13.89
172.16.66.92 : 20.87 13.84 13.77 13.83 13.83 13.84 13.83 13.83 13.81 13.89
172.16.66.93 : 20.96 13.92 13.89 13.87 13.89 13.85 13.88 13.90 13.85 13.88
172.16.66.94 : 20.90 13.77 13.78 13.84 13.84 13.85 13.85 13.84 13.83 13.84
172.16.66.95 : 24.60 13.92 13.91 13.90 13.87 13.86 13.91 13.91 13.91 13.87
172.16.66.96 : 20.83 13.84 13.92 13.90 13.92 13.90 13.92 13.90 13.87 13.91
172.16.66.97 : 24.65 13.88 13.92 13.88 13.91 13.89 - 13.85 13.92 13.81
172.16.66.98 : 20.83 13.82 13.84 13.91 13.85 13.83 13.79 13.86 13.86 13.78
172.16.66.99 : 24.63 13.88 13.87 13.90 13.88 13.91 13.90 13.83 13.83 13.84

      42 targets
      42 alive
       0 unreachable
       0 unknown addresses

       4 timeouts (waiting for response)
     420 ICMP Echos sent
     415 ICMP Echo Replies received
       0 other ICMP received

 0.01 ms (min round trip time)
 14.1 ms (avg round trip time)
 25.6 ms (max round trip time)
       10.428 sec (elapsed real time)

