"2021-03-23T11:49:12.912093+01:00","chifflot-8","bmc_node_power_watt",494
"2021-03-23T11:49:17.913478+01:00","chifflot-8","bmc_node_power_watt",494
"2021-03-23T11:49:22.913714+01:00","chifflot-8","bmc_node_power_watt",494
"2021-03-23T11:49:27.915482+01:00","chifflot-8","bmc_node_power_watt",494
"2021-03-23T11:49:32.916312+01:00","chifflot-8","bmc_node_power_watt",494
"2021-03-23T11:49:37.916611+01:00","chifflot-8","bmc_node_power_watt",494
"2021-03-23T11:49:42.918196+01:00","chifflot-8","bmc_node_power_watt",494
"2021-03-23T11:49:47.918974+01:00","chifflot-8","bmc_node_power_watt",494
"2021-03-23T11:49:52.920942+01:00","chifflot-8","bmc_node_power_watt",494
"2021-03-23T11:49:57.921306+01:00","chifflot-8","bmc_node_power_watt",494
"2021-03-23T11:50:02.921827+01:00","chifflot-8","bmc_node_power_watt",494
"2021-03-23T11:50:07.923442+01:00","chifflot-8","bmc_node_power_watt",494
"2021-03-23T11:50:12.925677+01:00","chifflot-8","bmc_node_power_watt",494
"2021-03-23T11:50:17.926409+01:00","chifflot-8","bmc_node_power_watt",494
"2021-03-23T11:50:22.92693+01:00","chifflot-8","bmc_node_power_watt",494
"2021-03-23T11:50:27.929733+01:00","chifflot-8","bmc_node_power_watt",494
"2021-03-23T11:50:32.931139+01:00","chifflot-8","bmc_node_power_watt",494
"2021-03-23T11:50:37.932341+01:00","chifflot-8","bmc_node_power_watt",494
"2021-03-23T11:50:42.933379+01:00","chifflot-8","bmc_node_power_watt",494
"2021-03-23T11:50:47.935077+01:00","chifflot-8","bmc_node_power_watt",494
"2021-03-23T11:50:52.935616+01:00","chifflot-8","bmc_node_power_watt",494
"2021-03-23T11:50:57.939057+01:00","chifflot-8","bmc_node_power_watt",520
"2021-03-23T11:51:02.939257+01:00","chifflot-8","bmc_node_power_watt",520
"2021-03-23T11:51:07.943151+01:00","chifflot-8","bmc_node_power_watt",520
"2021-03-23T11:51:12.94295+01:00","chifflot-8","bmc_node_power_watt",520
"2021-03-23T11:51:17.946551+01:00","chifflot-8","bmc_node_power_watt",520
"2021-03-23T11:51:22.947138+01:00","chifflot-8","bmc_node_power_watt",520
"2021-03-23T11:51:27.948985+01:00","chifflot-8","bmc_node_power_watt",520
"2021-03-23T11:51:32.951023+01:00","chifflot-8","bmc_node_power_watt",520
"2021-03-23T11:51:37.955067+01:00","chifflot-8","bmc_node_power_watt",520
"2021-03-23T11:51:42.955621+01:00","chifflot-8","bmc_node_power_watt",520
"2021-03-23T11:51:47.962629+01:00","chifflot-8","bmc_node_power_watt",520
"2021-03-23T11:51:52.96237+01:00","chifflot-8","bmc_node_power_watt",520
"2021-03-23T11:51:57.965778+01:00","chifflot-8","bmc_node_power_watt",520
"2021-03-23T11:52:02.964285+01:00","chifflot-8","bmc_node_power_watt",520
"2021-03-23T11:52:07.968145+01:00","chifflot-8","bmc_node_power_watt",520
"2021-03-23T11:52:12.967782+01:00","chifflot-8","bmc_node_power_watt",494
"2021-03-23T11:52:17.96819+01:00","chifflot-8","bmc_node_power_watt",494
"2021-03-23T11:52:22.968845+01:00","chifflot-8","bmc_node_power_watt",494
"2021-03-23T11:52:27.969929+01:00","chifflot-8","bmc_node_power_watt",494
"2021-03-23T11:52:32.970167+01:00","chifflot-8","bmc_node_power_watt",520
"2021-03-23T11:52:37.971122+01:00","chifflot-8","bmc_node_power_watt",520
"2021-03-23T11:52:42.9712+01:00","chifflot-8","bmc_node_power_watt",520
"2021-03-23T11:52:47.971437+01:00","chifflot-8","bmc_node_power_watt",520
"2021-03-23T11:52:52.972412+01:00","chifflot-8","bmc_node_power_watt",520
"2021-03-23T11:52:57.973228+01:00","chifflot-8","bmc_node_power_watt",494
"2021-03-23T11:53:02.97384+01:00","chifflot-8","bmc_node_power_watt",494
"2021-03-23T11:53:07.974984+01:00","chifflot-8","bmc_node_power_watt",494
"2021-03-23T11:53:12.975283+01:00","chifflot-8","bmc_node_power_watt",494
"2021-03-23T11:53:17.976432+01:00","chifflot-8","bmc_node_power_watt",494
"2021-03-23T11:53:22.977722+01:00","chifflot-8","bmc_node_power_watt",494
"2021-03-23T11:53:27.97866+01:00","chifflot-8","bmc_node_power_watt",494
"2021-03-23T11:53:32.979366+01:00","chifflot-8","bmc_node_power_watt",494
"2021-03-23T11:53:37.980132+01:00","chifflot-8","bmc_node_power_watt",494
"2021-03-23T11:53:42.981467+01:00","chifflot-8","bmc_node_power_watt",494
"2021-03-23T11:53:47.982002+01:00","chifflot-8","bmc_node_power_watt",494
"2021-03-23T11:53:52.98319+01:00","chifflot-8","bmc_node_power_watt",494
"2021-03-23T11:53:57.983479+01:00","chifflot-8","bmc_node_power_watt",494
"2021-03-23T11:54:02.984084+01:00","chifflot-8","bmc_node_power_watt",494
"2021-03-23T11:54:07.984932+01:00","chifflot-8","bmc_node_power_watt",494
"2021-03-23T11:54:12.985677+01:00","chifflot-8","bmc_node_power_watt",494
"2021-03-23T11:54:17.986345+01:00","chifflot-8","bmc_node_power_watt",494
"2021-03-23T11:54:22.986619+01:00","chifflot-8","bmc_node_power_watt",494
"2021-03-23T11:54:27.986734+01:00","chifflot-8","bmc_node_power_watt",494
"2021-03-23T11:54:32.988305+01:00","chifflot-8","bmc_node_power_watt",494
"2021-03-23T11:54:37.9891+01:00","chifflot-8","bmc_node_power_watt",494
"2021-03-23T11:54:42.988704+01:00","chifflot-8","bmc_node_power_watt",494
"2021-03-23T11:54:47.99016+01:00","chifflot-8","bmc_node_power_watt",494
"2021-03-23T11:54:52.991136+01:00","chifflot-8","bmc_node_power_watt",494
"2021-03-23T11:54:57.993501+01:00","chifflot-8","bmc_node_power_watt",494
"2021-03-23T11:55:02.994993+01:00","chifflot-8","bmc_node_power_watt",494
"2021-03-23T11:55:08.003812+01:00","chifflot-8","bmc_node_power_watt",494
"2021-03-23T11:55:13.002892+01:00","chifflot-8","bmc_node_power_watt",494
"2021-03-23T11:55:18.003272+01:00","chifflot-8","bmc_node_power_watt",494
"2021-03-23T11:55:23.017052+01:00","chifflot-8","bmc_node_power_watt",494
"2021-03-23T11:55:28.017112+01:00","chifflot-8","bmc_node_power_watt",494
"2021-03-23T11:55:33.017664+01:00","chifflot-8","bmc_node_power_watt",494
"2021-03-23T11:55:38.017958+01:00","chifflot-8","bmc_node_power_watt",494
"2021-03-23T11:55:43.018163+01:00","chifflot-8","bmc_node_power_watt",494
"2021-03-23T11:55:48.018615+01:00","chifflot-8","bmc_node_power_watt",494
"2021-03-23T11:55:53.033534+01:00","chifflot-8","bmc_node_power_watt",494
"2021-03-23T11:55:58.033274+01:00","chifflot-8","bmc_node_power_watt",494
"2021-03-23T11:56:03.03353+01:00","chifflot-8","bmc_node_power_watt",494
"2021-03-23T11:56:08.038164+01:00","chifflot-8","bmc_node_power_watt",520
"2021-03-23T11:56:13.038592+01:00","chifflot-8","bmc_node_power_watt",520
"2021-03-23T11:56:18.03962+01:00","chifflot-8","bmc_node_power_watt",520
"2021-03-23T11:56:23.045461+01:00","chifflot-8","bmc_node_power_watt",520
"2021-03-23T11:56:28.046123+01:00","chifflot-8","bmc_node_power_watt",520
"2021-03-23T11:56:33.046957+01:00","chifflot-8","bmc_node_power_watt",494
"2021-03-23T11:56:38.047376+01:00","chifflot-8","bmc_node_power_watt",494
"2021-03-23T11:56:43.048404+01:00","chifflot-8","bmc_node_power_watt",494
"2021-03-23T11:56:48.049022+01:00","chifflot-8","bmc_node_power_watt",494
"2021-03-23T11:56:53.049762+01:00","chifflot-8","bmc_node_power_watt",494
"2021-03-23T11:56:58.050387+01:00","chifflot-8","bmc_node_power_watt",520
"2021-03-23T11:57:03.050436+01:00","chifflot-8","bmc_node_power_watt",520
"2021-03-23T11:57:08.051894+01:00","chifflot-8","bmc_node_power_watt",520
"2021-03-23T11:57:13.051853+01:00","chifflot-8","bmc_node_power_watt",520
"2021-03-23T11:57:18.052847+01:00","chifflot-8","bmc_node_power_watt",520
"2021-03-23T11:57:23.053931+01:00","chifflot-8","bmc_node_power_watt",520
"2021-03-23T11:57:28.054021+01:00","chifflot-8","bmc_node_power_watt",520
"2021-03-23T11:57:33.054735+01:00","chifflot-8","bmc_node_power_watt",520
"2021-03-23T11:57:38.055376+01:00","chifflot-8","bmc_node_power_watt",520
"2021-03-23T11:57:43.055803+01:00","chifflot-8","bmc_node_power_watt",520
"2021-03-23T11:57:48.05669+01:00","chifflot-8","bmc_node_power_watt",520
"2021-03-23T11:57:53.06395+01:00","chifflot-8","bmc_node_power_watt",520
"2021-03-23T11:57:58.064126+01:00","chifflot-8","bmc_node_power_watt",520
"2021-03-23T11:58:03.065071+01:00","chifflot-8","bmc_node_power_watt",520
"2021-03-23T11:58:08.065416+01:00","chifflot-8","bmc_node_power_watt",520
"2021-03-23T11:58:13.065803+01:00","chifflot-8","bmc_node_power_watt",520
"2021-03-23T11:58:18.066873+01:00","chifflot-8","bmc_node_power_watt",520
"2021-03-23T11:58:23.066996+01:00","chifflot-8","bmc_node_power_watt",520
"2021-03-23T11:58:28.06793+01:00","chifflot-8","bmc_node_power_watt",520
"2021-03-23T11:58:33.068978+01:00","chifflot-8","bmc_node_power_watt",494
"2021-03-23T11:58:38.074544+01:00","chifflot-8","bmc_node_power_watt",494
"2021-03-23T11:58:43.074545+01:00","chifflot-8","bmc_node_power_watt",494
"2021-03-23T11:58:48.074298+01:00","chifflot-8","bmc_node_power_watt",494
"2021-03-23T11:58:53.074484+01:00","chifflot-8","bmc_node_power_watt",494
"2021-03-23T11:58:58.075678+01:00","chifflot-8","bmc_node_power_watt",494
"2021-03-23T11:59:03.076043+01:00","chifflot-8","bmc_node_power_watt",494
"2021-03-23T11:59:08.076238+01:00","chifflot-8","bmc_node_power_watt",494
"2021-03-23T11:59:13.077101+01:00","chifflot-8","bmc_node_power_watt",494
"2021-03-23T11:59:18.079271+01:00","chifflot-8","bmc_node_power_watt",520
"2021-03-23T11:59:23.080068+01:00","chifflot-8","bmc_node_power_watt",520
"2021-03-23T11:59:28.079865+01:00","chifflot-8","bmc_node_power_watt",520
"2021-03-23T11:59:33.080738+01:00","chifflot-8","bmc_node_power_watt",520
"2021-03-23T11:59:38.081524+01:00","chifflot-8","bmc_node_power_watt",520
"2021-03-23T11:59:43.082684+01:00","chifflot-8","bmc_node_power_watt",494
"2021-03-23T11:59:48.082658+01:00","chifflot-8","bmc_node_power_watt",494
"2021-03-23T11:59:53.08511+01:00","chifflot-8","bmc_node_power_watt",494
"2021-03-23T11:59:58.087068+01:00","chifflot-8","bmc_node_power_watt",494
"2021-03-23T12:00:03.090727+01:00","chifflot-8","bmc_node_power_watt",520
"2021-03-23T12:00:08.090395+01:00","chifflot-8","bmc_node_power_watt",520
"2021-03-23T12:00:13.091264+01:00","chifflot-8","bmc_node_power_watt",520
"2021-03-23T12:00:18.093594+01:00","chifflot-8","bmc_node_power_watt",520
"2021-03-23T12:00:23.09424+01:00","chifflot-8","bmc_node_power_watt",520
"2021-03-23T12:00:28.095996+01:00","chifflot-8","bmc_node_power_watt",494
"2021-03-23T12:00:33.096166+01:00","chifflot-8","bmc_node_power_watt",494
"2021-03-23T12:00:38.096935+01:00","chifflot-8","bmc_node_power_watt",494
"2021-03-23T12:00:43.099388+01:00","chifflot-8","bmc_node_power_watt",494
"2021-03-23T12:00:48.100838+01:00","chifflot-8","bmc_node_power_watt",494
"2021-03-23T12:00:53.100848+01:00","chifflot-8","bmc_node_power_watt",494
"2021-03-23T12:00:58.101824+01:00","chifflot-8","bmc_node_power_watt",494
"2021-03-23T12:01:03.102129+01:00","chifflot-8","bmc_node_power_watt",494
"2021-03-23T12:01:08.103378+01:00","chifflot-8","bmc_node_power_watt",494
"2021-03-23T12:01:13.104304+01:00","chifflot-8","bmc_node_power_watt",494
"2021-03-23T12:01:18.104676+01:00","chifflot-8","bmc_node_power_watt",494
"2021-03-23T12:01:23.106981+01:00","chifflot-8","bmc_node_power_watt",494
"2021-03-23T12:01:28.107233+01:00","chifflot-8","bmc_node_power_watt",494
"2021-03-23T12:01:33.108309+01:00","chifflot-8","bmc_node_power_watt",494
"2021-03-23T12:01:38.11199+01:00","chifflot-8","bmc_node_power_watt",494
"2021-03-23T12:01:43.113843+01:00","chifflot-8","bmc_node_power_watt",494
"2021-03-23T12:01:48.113797+01:00","chifflot-8","bmc_node_power_watt",494
"2021-03-23T12:01:53.114569+01:00","chifflot-8","bmc_node_power_watt",494
"2021-03-23T12:01:58.114963+01:00","chifflot-8","bmc_node_power_watt",494
"2021-03-23T12:02:03.115564+01:00","chifflot-8","bmc_node_power_watt",494
"2021-03-23T12:02:08.115849+01:00","chifflot-8","bmc_node_power_watt",494
"2021-03-23T12:02:13.120221+01:00","chifflot-8","bmc_node_power_watt",494
"2021-03-23T12:02:18.119753+01:00","chifflot-8","bmc_node_power_watt",494
"2021-03-23T12:02:23.121697+01:00","chifflot-8","bmc_node_power_watt",494
"2021-03-23T12:02:28.12295+01:00","chifflot-8","bmc_node_power_watt",494
"2021-03-23T12:02:33.123138+01:00","chifflot-8","bmc_node_power_watt",494
"2021-03-23T12:02:38.123608+01:00","chifflot-8","bmc_node_power_watt",494
"2021-03-23T12:02:43.124973+01:00","chifflot-8","bmc_node_power_watt",494
"2021-03-23T12:02:48.125616+01:00","chifflot-8","bmc_node_power_watt",494
"2021-03-23T12:02:53.125822+01:00","chifflot-8","bmc_node_power_watt",494
"2021-03-23T12:02:58.126859+01:00","chifflot-8","bmc_node_power_watt",494
"2021-03-23T12:03:03.127998+01:00","chifflot-8","bmc_node_power_watt",494
"2021-03-23T12:03:08.128233+01:00","chifflot-8","bmc_node_power_watt",494
"2021-03-23T12:03:13.129671+01:00","chifflot-8","bmc_node_power_watt",494
"2021-03-23T12:03:18.129713+01:00","chifflot-8","bmc_node_power_watt",494
"2021-03-23T12:03:23.130465+01:00","chifflot-8","bmc_node_power_watt",494
"2021-03-23T12:03:28.131966+01:00","chifflot-8","bmc_node_power_watt",494
"2021-03-23T12:03:33.134032+01:00","chifflot-8","bmc_node_power_watt",494
"2021-03-23T12:03:38.135069+01:00","chifflot-8","bmc_node_power_watt",494
"2021-03-23T12:03:43.135899+01:00","chifflot-8","bmc_node_power_watt",494
"2021-03-23T12:03:48.136089+01:00","chifflot-8","bmc_node_power_watt",494
"2021-03-23T12:03:53.137367+01:00","chifflot-8","bmc_node_power_watt",494
"2021-03-23T12:03:58.139577+01:00","chifflot-8","bmc_node_power_watt",494
"2021-03-23T12:04:03.139796+01:00","chifflot-8","bmc_node_power_watt",494
"2021-03-23T12:04:08.140331+01:00","chifflot-8","bmc_node_power_watt",494
"2021-03-23T12:04:13.141398+01:00","chifflot-8","bmc_node_power_watt",494
"2021-03-23T12:04:18.142338+01:00","chifflot-8","bmc_node_power_watt",494
"2021-03-23T12:04:23.142731+01:00","chifflot-8","bmc_node_power_watt",494
"2021-03-23T12:04:28.143737+01:00","chifflot-8","bmc_node_power_watt",520
"2021-03-23T12:04:33.143414+01:00","chifflot-8","bmc_node_power_watt",520
"2021-03-23T12:04:38.145657+01:00","chifflot-8","bmc_node_power_watt",520
"2021-03-23T12:04:43.146054+01:00","chifflot-8","bmc_node_power_watt",520
"2021-03-23T12:04:48.149118+01:00","chifflot-8","bmc_node_power_watt",494
"2021-03-23T12:04:53.149861+01:00","chifflot-8","bmc_node_power_watt",494
"2021-03-23T12:04:58.150184+01:00","chifflot-8","bmc_node_power_watt",494
"2021-03-23T12:05:03.150999+01:00","chifflot-8","bmc_node_power_watt",494
"2021-03-23T12:05:08.152219+01:00","chifflot-8","bmc_node_power_watt",494
"2021-03-23T12:05:13.154206+01:00","chifflot-8","bmc_node_power_watt",494
"2021-03-23T12:05:18.155675+01:00","chifflot-8","bmc_node_power_watt",494
"2021-03-23T12:05:23.1564+01:00","chifflot-8","bmc_node_power_watt",494
"2021-03-23T12:05:28.158088+01:00","chifflot-8","bmc_node_power_watt",494
"2021-03-23T12:05:33.158936+01:00","chifflot-8","bmc_node_power_watt",494
"2021-03-23T12:05:38.159995+01:00","chifflot-8","bmc_node_power_watt",520
"2021-03-23T12:05:43.160529+01:00","chifflot-8","bmc_node_power_watt",520
"2021-03-23T12:05:48.162345+01:00","chifflot-8","bmc_node_power_watt",520
"2021-03-23T12:05:53.163666+01:00","chifflot-8","bmc_node_power_watt",520
"2021-03-23T12:05:58.164454+01:00","chifflot-8","bmc_node_power_watt",520
"2021-03-23T12:06:03.164759+01:00","chifflot-8","bmc_node_power_watt",494
"2021-03-23T12:06:08.165243+01:00","chifflot-8","bmc_node_power_watt",494
"2021-03-23T12:06:13.16684+01:00","chifflot-8","bmc_node_power_watt",494
"2021-03-23T12:06:18.167346+01:00","chifflot-8","bmc_node_power_watt",494
"2021-03-23T12:06:23.168023+01:00","chifflot-8","bmc_node_power_watt",520
"2021-03-23T12:06:28.170445+01:00","chifflot-8","bmc_node_power_watt",520
"2021-03-23T12:06:33.170385+01:00","chifflot-8","bmc_node_power_watt",520
"2021-03-23T12:06:38.170821+01:00","chifflot-8","bmc_node_power_watt",520
"2021-03-23T12:06:43.171952+01:00","chifflot-8","bmc_node_power_watt",520
"2021-03-23T12:06:48.17215+01:00","chifflot-8","bmc_node_power_watt",520
"2021-03-23T12:06:53.172388+01:00","chifflot-8","bmc_node_power_watt",520
"2021-03-23T12:06:58.173398+01:00","chifflot-8","bmc_node_power_watt",520
"2021-03-23T12:07:03.174885+01:00","chifflot-8","bmc_node_power_watt",520
"2021-03-23T12:07:08.175009+01:00","chifflot-8","bmc_node_power_watt",520
"2021-03-23T12:07:13.176185+01:00","chifflot-8","bmc_node_power_watt",494
"2021-03-23T12:07:18.176251+01:00","chifflot-8","bmc_node_power_watt",494
"2021-03-23T12:07:23.177654+01:00","chifflot-8","bmc_node_power_watt",494
"2021-03-23T12:07:28.177495+01:00","chifflot-8","bmc_node_power_watt",494
"2021-03-23T12:07:33.177582+01:00","chifflot-8","bmc_node_power_watt",494
"2021-03-23T12:07:38.178986+01:00","chifflot-8","bmc_node_power_watt",520
"2021-03-23T12:07:43.179968+01:00","chifflot-8","bmc_node_power_watt",520
"2021-03-23T12:07:48.18263+01:00","chifflot-8","bmc_node_power_watt",520
"2021-03-23T12:07:53.184263+01:00","chifflot-8","bmc_node_power_watt",520
"2021-03-23T12:07:58.186482+01:00","chifflot-8","bmc_node_power_watt",520
"2021-03-23T12:08:03.1877+01:00","chifflot-8","bmc_node_power_watt",520
"2021-03-23T12:08:08.188366+01:00","chifflot-8","bmc_node_power_watt",520
"2021-03-23T12:08:13.194018+01:00","chifflot-8","bmc_node_power_watt",520
"2021-03-23T12:08:18.195873+01:00","chifflot-8","bmc_node_power_watt",520
"2021-03-23T12:08:23.200015+01:00","chifflot-8","bmc_node_power_watt",520
"2021-03-23T12:08:28.20088+01:00","chifflot-8","bmc_node_power_watt",520
"2021-03-23T12:08:33.207603+01:00","chifflot-8","bmc_node_power_watt",520
"2021-03-23T12:08:38.207604+01:00","chifflot-8","bmc_node_power_watt",520
"2021-03-23T12:08:43.214421+01:00","chifflot-8","bmc_node_power_watt",520
"2021-03-23T12:08:48.227297+01:00","chifflot-8","bmc_node_power_watt",494
"2021-03-23T12:08:53.223487+01:00","chifflot-8","bmc_node_power_watt",494
"2021-03-23T12:08:58.225576+01:00","chifflot-8","bmc_node_power_watt",494
"2021-03-23T12:09:03.229885+01:00","chifflot-8","bmc_node_power_watt",494
"2021-03-23T12:09:08.22832+01:00","chifflot-8","bmc_node_power_watt",520
"2021-03-23T12:09:13.228809+01:00","chifflot-8","bmc_node_power_watt",520
"2021-03-23T12:09:18.231117+01:00","chifflot-8","bmc_node_power_watt",520
"2021-03-23T12:09:23.234571+01:00","chifflot-8","bmc_node_power_watt",520
"2021-03-23T12:09:28.239989+01:00","chifflot-8","bmc_node_power_watt",520
"2021-03-23T12:09:33.24257+01:00","chifflot-8","bmc_node_power_watt",520
"2021-03-23T12:09:38.24264+01:00","chifflot-8","bmc_node_power_watt",520
"2021-03-23T12:09:43.243001+01:00","chifflot-8","bmc_node_power_watt",520
"2021-03-23T12:09:48.243467+01:00","chifflot-8","bmc_node_power_watt",520
"2021-03-23T12:09:53.244331+01:00","chifflot-8","bmc_node_power_watt",520
"2021-03-23T12:09:58.245486+01:00","chifflot-8","bmc_node_power_watt",494
"2021-03-23T12:10:03.246422+01:00","chifflot-8","bmc_node_power_watt",494
"2021-03-23T12:10:08.248645+01:00","chifflot-8","bmc_node_power_watt",494
"2021-03-23T12:10:13.250081+01:00","chifflot-8","bmc_node_power_watt",494
"2021-03-23T12:10:18.250034+01:00","chifflot-8","bmc_node_power_watt",494
"2021-03-23T12:10:23.250808+01:00","chifflot-8","bmc_node_power_watt",520
"2021-03-23T12:10:28.251791+01:00","chifflot-8","bmc_node_power_watt",520
"2021-03-23T12:10:33.253184+01:00","chifflot-8","bmc_node_power_watt",520
"2021-03-23T12:10:38.254185+01:00","chifflot-8","bmc_node_power_watt",520
"2021-03-23T12:10:43.254725+01:00","chifflot-8","bmc_node_power_watt",494
"2021-03-23T12:10:48.255701+01:00","chifflot-8","bmc_node_power_watt",494
"2021-03-23T12:10:53.255803+01:00","chifflot-8","bmc_node_power_watt",494
"2021-03-23T12:10:58.256299+01:00","chifflot-8","bmc_node_power_watt",494
"2021-03-23T12:11:03.257266+01:00","chifflot-8","bmc_node_power_watt",494
"2021-03-23T12:11:08.258219+01:00","chifflot-8","bmc_node_power_watt",520
"2021-03-23T12:11:13.258768+01:00","chifflot-8","bmc_node_power_watt",520
"2021-03-23T12:11:18.260374+01:00","chifflot-8","bmc_node_power_watt",520
"2021-03-23T12:11:23.261065+01:00","chifflot-8","bmc_node_power_watt",520
"2021-03-23T12:11:28.261643+01:00","chifflot-8","bmc_node_power_watt",520
"2021-03-23T12:11:33.261842+01:00","chifflot-8","bmc_node_power_watt",520
"2021-03-23T12:11:38.263922+01:00","chifflot-8","bmc_node_power_watt",520
"2021-03-23T12:11:43.264753+01:00","chifflot-8","bmc_node_power_watt",520
"2021-03-23T12:11:48.265704+01:00","chifflot-8","bmc_node_power_watt",520
"2021-03-23T12:11:53.266631+01:00","chifflot-8","bmc_node_power_watt",520
"2021-03-23T12:11:58.267963+01:00","chifflot-8","bmc_node_power_watt",494
"2021-03-23T12:12:03.269574+01:00","chifflot-8","bmc_node_power_watt",494
"2021-03-23T12:12:08.269845+01:00","chifflot-8","bmc_node_power_watt",494
