172.16.36.7  : 20.94 13.84 13.81 13.87 13.88 13.92 13.89 13.87 13.88 13.85
172.16.66.62 : 0.23 0.20 0.18 0.19 0.18 0.20 0.18 0.18 0.19 0.19
172.16.66.63 : 0.15 0.21 0.21 0.16 0.22 0.20 0.20 0.18 0.20 0.20
172.16.66.64 : 0.15 0.16 0.16 0.16 0.16 0.15 0.20 0.20 0.21 0.20
172.16.66.65 : 0.19 0.21 0.20 0.21 0.20 0.20 0.22 0.20 0.22 0.21
172.16.66.66 : 0.22 0.22 0.21 0.20 0.22 0.21 0.20 0.22 0.19 0.20
172.16.66.67 : 0.19 0.19 0.19 0.20 0.22 0.20 0.20 0.23 0.21 0.21
172.16.66.68 : 0.20 0.19 0.18 0.18 0.18 0.20 0.21 0.21 0.20 0.20
172.16.66.69 : 0.21 0.20 0.22 0.20 0.20 0.20 0.21 0.20 0.20 0.22
172.16.66.7  : 0.22 0.19 0.19 0.21 0.20 0.21 0.22 0.19 0.21 0.20
172.16.66.70 : 0.17 0.21 0.21 0.18 0.21 0.20 0.22 0.22 0.21 0.20
172.16.66.71 : 0.04 0.03 0.03 0.03 0.03 0.03 0.03 0.03 0.03 0.03
172.16.66.72 : 0.20 0.19 0.14 0.19 0.19 0.18 0.19 0.19 0.21 0.20
172.16.66.73 : 0.24 0.22 0.20 0.21 0.21 0.20 0.16 0.15 0.16 0.16
172.16.66.74 : 0.22 0.20 0.20 0.21 0.18 0.19 0.21 0.22 0.21 0.20
172.16.66.75 : 0.20 0.21 0.21 0.22 0.21 0.16 0.20 0.20 0.18 0.20
172.16.66.76 : 0.24 0.21 0.21 0.21 0.20 0.21 0.21 0.20 0.20 0.21
172.16.66.77 : 0.24 0.21 0.20 0.22 0.21 0.21 0.22 0.20 0.20 0.23
172.16.66.78 : 0.24 0.21 0.21 0.21 0.21 0.20 0.21 0.21 0.21 0.22
172.16.66.79 : 0.23 0.20 0.18 0.21 0.18 0.20 0.21 0.20 0.20 0.21
172.16.66.8  : 3.18 0.17 0.16 0.16 0.16 0.21 0.21 0.21 0.14 0.20
172.16.66.80 : 0.28 0.22 0.21 0.21 0.22 0.21 0.21 0.20 0.20 0.14
172.16.66.81 : 3.09 0.21 0.20 0.20 0.20 0.20 0.22 0.21 0.21 0.22
172.16.66.82 : 5.10 0.20 0.21 0.22 0.21 0.20 0.20 0.22 0.20 0.22
172.16.66.83 : 8.78 0.19 0.20 0.21 0.19 0.20 0.18 0.19 0.21 0.22
172.16.66.84 : 8.83 0.20 0.20 0.20 0.20 0.21 0.22 0.21 0.21 0.21
172.16.66.85 : 0.19 0.21 0.21 0.21 0.20 0.21 0.22 0.20 0.20 0.21
172.16.66.86 : 8.75 0.21 0.16 0.22 0.18 0.21 0.21 0.20 0.20 0.20
172.16.66.87 : 8.63 0.21 0.21 0.21 0.20 0.17 0.15 0.21 0.20 0.21
172.16.66.88 : 4.93 0.19 0.19 0.21 0.20 0.18 0.20 0.20 0.20 0.21
172.16.66.89 : 1.45 0.25 0.21 0.21 0.19 0.21 0.22 0.21 0.21 0.21
172.16.66.9  : 1.43 0.21 0.17 0.21 0.21 0.20 0.21 0.22 0.21 0.21
172.16.66.90 : 0.21 0.21 0.22 0.22 0.20 0.20 0.22 0.20 0.21 0.21
172.16.66.91 : 5.19 0.20 0.21 0.20 0.20 0.22 0.21 0.21 0.20 0.20
172.16.66.92 : 5.20 0.20 0.20 0.21 0.18 0.20 0.22 0.21 0.21 0.21
172.16.66.93 : 8.98 0.20 0.21 0.21 0.20 0.17 0.22 0.20 0.21 0.22
172.16.66.94 : 5.25 0.16 0.16 0.16 0.16 0.20 0.22 0.20 0.20 0.16
172.16.66.95 : 5.24 0.17 0.21 0.21 0.21 0.20 0.22 0.20 0.21 0.22
172.16.66.96 : 5.35 0.20 0.21 0.20 0.18 0.21 0.21 0.22 0.20 0.14
172.16.66.97 : 5.33 0.20 0.18 0.19 0.22 0.18 0.20 0.22 0.20 0.20
172.16.66.98 : 5.35 0.20 0.21 0.20 0.21 0.20 0.21 0.22 0.21 0.21
172.16.66.99 : 5.28 0.22 0.21 0.21 0.20 0.20 0.20 0.21 0.20 0.21

      42 targets
      42 alive
       0 unreachable
       0 unknown addresses

       0 timeouts (waiting for response)
     420 ICMP Echos sent
     420 ICMP Echo Replies received
       0 other ICMP received

 0.03 ms (min round trip time)
 0.78 ms (avg round trip time)
 20.9 ms (max round trip time)
        9.422 sec (elapsed real time)

