"2021-03-23T17:58:38.171657+01:00","chifflot-8","bmc_node_power_watt",468
"2021-03-23T17:58:43.17295+01:00","chifflot-8","bmc_node_power_watt",468
"2021-03-23T17:58:48.17463+01:00","chifflot-8","bmc_node_power_watt",468
"2021-03-23T17:58:53.175931+01:00","chifflot-8","bmc_node_power_watt",468
"2021-03-23T17:58:58.178245+01:00","chifflot-8","bmc_node_power_watt",468
"2021-03-23T17:59:03.177988+01:00","chifflot-8","bmc_node_power_watt",468
"2021-03-23T17:59:08.178662+01:00","chifflot-8","bmc_node_power_watt",468
"2021-03-23T17:59:13.17974+01:00","chifflot-8","bmc_node_power_watt",468
"2021-03-23T17:59:18.180367+01:00","chifflot-8","bmc_node_power_watt",468
"2021-03-23T17:59:23.181665+01:00","chifflot-8","bmc_node_power_watt",468
"2021-03-23T17:59:28.185546+01:00","chifflot-8","bmc_node_power_watt",468
"2021-03-23T17:59:33.186258+01:00","chifflot-8","bmc_node_power_watt",468
"2021-03-23T17:59:38.188106+01:00","chifflot-8","bmc_node_power_watt",494
"2021-03-23T17:59:43.188198+01:00","chifflot-8","bmc_node_power_watt",494
"2021-03-23T17:59:48.189927+01:00","chifflot-8","bmc_node_power_watt",494
"2021-03-23T17:59:53.190904+01:00","chifflot-8","bmc_node_power_watt",494
"2021-03-23T17:59:58.191415+01:00","chifflot-8","bmc_node_power_watt",494
"2021-03-23T18:00:03.192342+01:00","chifflot-8","bmc_node_power_watt",494
"2021-03-23T18:00:08.195121+01:00","chifflot-8","bmc_node_power_watt",494
"2021-03-23T18:00:13.194072+01:00","chifflot-8","bmc_node_power_watt",494
"2021-03-23T18:00:18.194545+01:00","chifflot-8","bmc_node_power_watt",494
"2021-03-23T18:00:23.195524+01:00","chifflot-8","bmc_node_power_watt",494
"2021-03-23T18:00:28.199361+01:00","chifflot-8","bmc_node_power_watt",494
"2021-03-23T18:00:33.19862+01:00","chifflot-8","bmc_node_power_watt",494
"2021-03-23T18:00:38.199913+01:00","chifflot-8","bmc_node_power_watt",494
"2021-03-23T18:00:43.200475+01:00","chifflot-8","bmc_node_power_watt",494
"2021-03-23T18:00:48.201352+01:00","chifflot-8","bmc_node_power_watt",494
"2021-03-23T18:00:53.201984+01:00","chifflot-8","bmc_node_power_watt",494
"2021-03-23T18:00:58.202553+01:00","chifflot-8","bmc_node_power_watt",494
"2021-03-23T18:01:03.205086+01:00","chifflot-8","bmc_node_power_watt",494
"2021-03-23T18:01:08.205331+01:00","chifflot-8","bmc_node_power_watt",494
"2021-03-23T18:01:13.207188+01:00","chifflot-8","bmc_node_power_watt",494
"2021-03-23T18:01:18.207587+01:00","chifflot-8","bmc_node_power_watt",494
"2021-03-23T18:01:23.209842+01:00","chifflot-8","bmc_node_power_watt",494
"2021-03-23T18:01:28.212151+01:00","chifflot-8","bmc_node_power_watt",494
"2021-03-23T18:01:33.212463+01:00","chifflot-8","bmc_node_power_watt",494
"2021-03-23T18:01:38.213096+01:00","chifflot-8","bmc_node_power_watt",494
"2021-03-23T18:01:43.214338+01:00","chifflot-8","bmc_node_power_watt",494
"2021-03-23T18:01:48.215963+01:00","chifflot-8","bmc_node_power_watt",494
"2021-03-23T18:01:53.217007+01:00","chifflot-8","bmc_node_power_watt",494
"2021-03-23T18:01:58.217813+01:00","chifflot-8","bmc_node_power_watt",468
"2021-03-23T18:02:03.218095+01:00","chifflot-8","bmc_node_power_watt",468
"2021-03-23T18:02:08.220204+01:00","chifflot-8","bmc_node_power_watt",468
"2021-03-23T18:02:13.220143+01:00","chifflot-8","bmc_node_power_watt",468
"2021-03-23T18:02:18.221225+01:00","chifflot-8","bmc_node_power_watt",468
"2021-03-23T18:02:23.222831+01:00","chifflot-8","bmc_node_power_watt",468
"2021-03-23T18:02:28.222905+01:00","chifflot-8","bmc_node_power_watt",468
"2021-03-23T18:02:33.22434+01:00","chifflot-8","bmc_node_power_watt",468
"2021-03-23T18:02:38.224739+01:00","chifflot-8","bmc_node_power_watt",468
"2021-03-23T18:02:43.228561+01:00","chifflot-8","bmc_node_power_watt",468
"2021-03-23T18:02:48.228832+01:00","chifflot-8","bmc_node_power_watt",468
"2021-03-23T18:02:53.229764+01:00","chifflot-8","bmc_node_power_watt",468
"2021-03-23T18:02:58.22997+01:00","chifflot-8","bmc_node_power_watt",468
"2021-03-23T18:03:03.230422+01:00","chifflot-8","bmc_node_power_watt",468
"2021-03-23T18:03:08.231522+01:00","chifflot-8","bmc_node_power_watt",468
"2021-03-23T18:03:13.232499+01:00","chifflot-8","bmc_node_power_watt",468
"2021-03-23T18:03:18.23339+01:00","chifflot-8","bmc_node_power_watt",468
"2021-03-23T18:03:23.235521+01:00","chifflot-8","bmc_node_power_watt",468
"2021-03-23T18:03:28.235549+01:00","chifflot-8","bmc_node_power_watt",468
"2021-03-23T18:03:33.239598+01:00","chifflot-8","bmc_node_power_watt",494
"2021-03-23T18:03:38.242608+01:00","chifflot-8","bmc_node_power_watt",494
"2021-03-23T18:03:43.244768+01:00","chifflot-8","bmc_node_power_watt",494
"2021-03-23T18:03:48.247665+01:00","chifflot-8","bmc_node_power_watt",494
"2021-03-23T18:03:53.255347+01:00","chifflot-8","bmc_node_power_watt",494
"2021-03-23T18:03:58.254185+01:00","chifflot-8","bmc_node_power_watt",494
"2021-03-23T18:04:03.256636+01:00","chifflot-8","bmc_node_power_watt",494
"2021-03-23T18:04:08.262274+01:00","chifflot-8","bmc_node_power_watt",494
"2021-03-23T18:04:13.262625+01:00","chifflot-8","bmc_node_power_watt",494
"2021-03-23T18:04:18.261581+01:00","chifflot-8","bmc_node_power_watt",494
"2021-03-23T18:04:23.2615+01:00","chifflot-8","bmc_node_power_watt",494
"2021-03-23T18:04:28.262319+01:00","chifflot-8","bmc_node_power_watt",494
"2021-03-23T18:04:33.263448+01:00","chifflot-8","bmc_node_power_watt",494
"2021-03-23T18:04:38.263571+01:00","chifflot-8","bmc_node_power_watt",494
"2021-03-23T18:04:43.26495+01:00","chifflot-8","bmc_node_power_watt",494
"2021-03-23T18:04:48.265472+01:00","chifflot-8","bmc_node_power_watt",494
"2021-03-23T18:04:53.266368+01:00","chifflot-8","bmc_node_power_watt",494
"2021-03-23T18:04:58.267277+01:00","chifflot-8","bmc_node_power_watt",494
"2021-03-23T18:05:03.268432+01:00","chifflot-8","bmc_node_power_watt",494
"2021-03-23T18:05:08.268946+01:00","chifflot-8","bmc_node_power_watt",494
"2021-03-23T18:05:13.26922+01:00","chifflot-8","bmc_node_power_watt",494
"2021-03-23T18:05:18.269512+01:00","chifflot-8","bmc_node_power_watt",494
"2021-03-23T18:05:23.270303+01:00","chifflot-8","bmc_node_power_watt",494
"2021-03-23T18:05:28.270826+01:00","chifflot-8","bmc_node_power_watt",494
"2021-03-23T18:05:33.270911+01:00","chifflot-8","bmc_node_power_watt",468
"2021-03-23T18:05:38.272602+01:00","chifflot-8","bmc_node_power_watt",468
"2021-03-23T18:05:43.273829+01:00","chifflot-8","bmc_node_power_watt",468
"2021-03-23T18:05:48.273786+01:00","chifflot-8","bmc_node_power_watt",468
"2021-03-23T18:05:53.273883+01:00","chifflot-8","bmc_node_power_watt",468
"2021-03-23T18:05:58.274846+01:00","chifflot-8","bmc_node_power_watt",468
"2021-03-23T18:06:03.275094+01:00","chifflot-8","bmc_node_power_watt",468
"2021-03-23T18:06:08.278326+01:00","chifflot-8","bmc_node_power_watt",468
"2021-03-23T18:06:13.278094+01:00","chifflot-8","bmc_node_power_watt",468
"2021-03-23T18:06:18.279297+01:00","chifflot-8","bmc_node_power_watt",494
"2021-03-23T18:06:23.279978+01:00","chifflot-8","bmc_node_power_watt",494
"2021-03-23T18:06:28.28087+01:00","chifflot-8","bmc_node_power_watt",494
"2021-03-23T18:06:33.281225+01:00","chifflot-8","bmc_node_power_watt",494
"2021-03-23T18:06:38.28253+01:00","chifflot-8","bmc_node_power_watt",494
"2021-03-23T18:06:43.282859+01:00","chifflot-8","bmc_node_power_watt",494
"2021-03-23T18:06:48.283245+01:00","chifflot-8","bmc_node_power_watt",494
"2021-03-23T18:06:53.28357+01:00","chifflot-8","bmc_node_power_watt",494
"2021-03-23T18:06:58.286214+01:00","chifflot-8","bmc_node_power_watt",494
"2021-03-23T18:07:03.286015+01:00","chifflot-8","bmc_node_power_watt",494
"2021-03-23T18:07:08.286808+01:00","chifflot-8","bmc_node_power_watt",494
"2021-03-23T18:07:13.28693+01:00","chifflot-8","bmc_node_power_watt",494
"2021-03-23T18:07:18.288102+01:00","chifflot-8","bmc_node_power_watt",494
"2021-03-23T18:07:23.28908+01:00","chifflot-8","bmc_node_power_watt",494
"2021-03-23T18:07:28.290709+01:00","chifflot-8","bmc_node_power_watt",494
"2021-03-23T18:07:33.293865+01:00","chifflot-8","bmc_node_power_watt",468
"2021-03-23T18:07:38.297275+01:00","chifflot-8","bmc_node_power_watt",468
"2021-03-23T18:07:43.297354+01:00","chifflot-8","bmc_node_power_watt",468
"2021-03-23T18:07:48.29792+01:00","chifflot-8","bmc_node_power_watt",468
"2021-03-23T18:07:53.299932+01:00","chifflot-8","bmc_node_power_watt",468
"2021-03-23T18:07:58.300736+01:00","chifflot-8","bmc_node_power_watt",468
"2021-03-23T18:08:03.303825+01:00","chifflot-8","bmc_node_power_watt",468
"2021-03-23T18:08:08.304336+01:00","chifflot-8","bmc_node_power_watt",468
"2021-03-23T18:08:13.30426+01:00","chifflot-8","bmc_node_power_watt",468
"2021-03-23T18:08:18.304734+01:00","chifflot-8","bmc_node_power_watt",468
"2021-03-23T18:08:23.30601+01:00","chifflot-8","bmc_node_power_watt",468
"2021-03-23T18:08:28.306504+01:00","chifflot-8","bmc_node_power_watt",468
"2021-03-23T18:08:33.307516+01:00","chifflot-8","bmc_node_power_watt",468
"2021-03-23T18:08:38.308859+01:00","chifflot-8","bmc_node_power_watt",468
"2021-03-23T18:08:43.310319+01:00","chifflot-8","bmc_node_power_watt",468
"2021-03-23T18:08:48.31188+01:00","chifflot-8","bmc_node_power_watt",468
"2021-03-23T18:08:53.313098+01:00","chifflot-8","bmc_node_power_watt",468
"2021-03-23T18:08:58.314955+01:00","chifflot-8","bmc_node_power_watt",468
"2021-03-23T18:09:03.315378+01:00","chifflot-8","bmc_node_power_watt",468
"2021-03-23T18:09:08.315418+01:00","chifflot-8","bmc_node_power_watt",468
"2021-03-23T18:09:13.316485+01:00","chifflot-8","bmc_node_power_watt",468
"2021-03-23T18:09:18.318533+01:00","chifflot-8","bmc_node_power_watt",468
"2021-03-23T18:09:23.319587+01:00","chifflot-8","bmc_node_power_watt",468
"2021-03-23T18:09:28.320367+01:00","chifflot-8","bmc_node_power_watt",468
"2021-03-23T18:09:33.32403+01:00","chifflot-8","bmc_node_power_watt",468
"2021-03-23T18:09:38.325496+01:00","chifflot-8","bmc_node_power_watt",468
"2021-03-23T18:09:43.326709+01:00","chifflot-8","bmc_node_power_watt",468
"2021-03-23T18:09:48.327891+01:00","chifflot-8","bmc_node_power_watt",468
"2021-03-23T18:09:53.32952+01:00","chifflot-8","bmc_node_power_watt",468
"2021-03-23T18:09:58.329458+01:00","chifflot-8","bmc_node_power_watt",468
"2021-03-23T18:10:03.330983+01:00","chifflot-8","bmc_node_power_watt",468
"2021-03-23T18:10:08.332426+01:00","chifflot-8","bmc_node_power_watt",468
"2021-03-23T18:10:13.333631+01:00","chifflot-8","bmc_node_power_watt",468
"2021-03-23T18:10:18.336584+01:00","chifflot-8","bmc_node_power_watt",468
"2021-03-23T18:10:23.338548+01:00","chifflot-8","bmc_node_power_watt",468
"2021-03-23T18:10:28.339499+01:00","chifflot-8","bmc_node_power_watt",468
"2021-03-23T18:10:33.339635+01:00","chifflot-8","bmc_node_power_watt",468
"2021-03-23T18:10:38.341473+01:00","chifflot-8","bmc_node_power_watt",468
"2021-03-23T18:10:43.341686+01:00","chifflot-8","bmc_node_power_watt",468
"2021-03-23T18:10:48.343079+01:00","chifflot-8","bmc_node_power_watt",468
"2021-03-23T18:10:53.344161+01:00","chifflot-8","bmc_node_power_watt",468
"2021-03-23T18:10:58.3452+01:00","chifflot-8","bmc_node_power_watt",468
"2021-03-23T18:11:03.346115+01:00","chifflot-8","bmc_node_power_watt",468
"2021-03-23T18:11:08.347365+01:00","chifflot-8","bmc_node_power_watt",468
"2021-03-23T18:11:13.347884+01:00","chifflot-8","bmc_node_power_watt",468
"2021-03-23T18:11:18.349089+01:00","chifflot-8","bmc_node_power_watt",468
"2021-03-23T18:11:23.349729+01:00","chifflot-8","bmc_node_power_watt",468
"2021-03-23T18:11:28.350003+01:00","chifflot-8","bmc_node_power_watt",494
"2021-03-23T18:11:33.350851+01:00","chifflot-8","bmc_node_power_watt",494
"2021-03-23T18:11:38.35259+01:00","chifflot-8","bmc_node_power_watt",494
"2021-03-23T18:11:43.352733+01:00","chifflot-8","bmc_node_power_watt",494
"2021-03-23T18:11:48.354441+01:00","chifflot-8","bmc_node_power_watt",494
"2021-03-23T18:11:53.355601+01:00","chifflot-8","bmc_node_power_watt",468
"2021-03-23T18:11:58.357189+01:00","chifflot-8","bmc_node_power_watt",468
"2021-03-23T18:12:03.35864+01:00","chifflot-8","bmc_node_power_watt",468
"2021-03-23T18:12:08.358941+01:00","chifflot-8","bmc_node_power_watt",468
"2021-03-23T18:12:13.361498+01:00","chifflot-8","bmc_node_power_watt",468
"2021-03-23T18:12:18.36264+01:00","chifflot-8","bmc_node_power_watt",494
"2021-03-23T18:12:23.364376+01:00","chifflot-8","bmc_node_power_watt",494
"2021-03-23T18:12:28.364771+01:00","chifflot-8","bmc_node_power_watt",494
"2021-03-23T18:12:33.365024+01:00","chifflot-8","bmc_node_power_watt",494
"2021-03-23T18:12:38.367077+01:00","chifflot-8","bmc_node_power_watt",494
"2021-03-23T18:12:43.368386+01:00","chifflot-8","bmc_node_power_watt",494
"2021-03-23T18:12:48.369592+01:00","chifflot-8","bmc_node_power_watt",494
"2021-03-23T18:12:53.37024+01:00","chifflot-8","bmc_node_power_watt",494
"2021-03-23T18:12:58.374243+01:00","chifflot-8","bmc_node_power_watt",494
"2021-03-23T18:13:03.375274+01:00","chifflot-8","bmc_node_power_watt",468
"2021-03-23T18:13:08.375661+01:00","chifflot-8","bmc_node_power_watt",468
"2021-03-23T18:13:13.376481+01:00","chifflot-8","bmc_node_power_watt",468
"2021-03-23T18:13:18.377647+01:00","chifflot-8","bmc_node_power_watt",468
"2021-03-23T18:13:23.379145+01:00","chifflot-8","bmc_node_power_watt",468
"2021-03-23T18:13:28.380311+01:00","chifflot-8","bmc_node_power_watt",468
"2021-03-23T18:13:33.381714+01:00","chifflot-8","bmc_node_power_watt",468
"2021-03-23T18:13:38.382034+01:00","chifflot-8","bmc_node_power_watt",468
"2021-03-23T18:13:43.384798+01:00","chifflot-8","bmc_node_power_watt",468
"2021-03-23T18:13:48.384886+01:00","chifflot-8","bmc_node_power_watt",468
"2021-03-23T18:13:53.386405+01:00","chifflot-8","bmc_node_power_watt",468
"2021-03-23T18:13:58.387861+01:00","chifflot-8","bmc_node_power_watt",468
"2021-03-23T18:14:03.388997+01:00","chifflot-8","bmc_node_power_watt",468
"2021-03-23T18:14:08.389841+01:00","chifflot-8","bmc_node_power_watt",468
"2021-03-23T18:14:13.390433+01:00","chifflot-8","bmc_node_power_watt",494
"2021-03-23T18:14:18.391337+01:00","chifflot-8","bmc_node_power_watt",494
"2021-03-23T18:14:23.39263+01:00","chifflot-8","bmc_node_power_watt",494
"2021-03-23T18:14:28.393439+01:00","chifflot-8","bmc_node_power_watt",494
"2021-03-23T18:14:33.394431+01:00","chifflot-8","bmc_node_power_watt",494
"2021-03-23T18:14:38.395511+01:00","chifflot-8","bmc_node_power_watt",494
"2021-03-23T18:14:43.396678+01:00","chifflot-8","bmc_node_power_watt",494
"2021-03-23T18:14:48.397831+01:00","chifflot-8","bmc_node_power_watt",494
"2021-03-23T18:14:53.398455+01:00","chifflot-8","bmc_node_power_watt",494
"2021-03-23T18:14:58.399707+01:00","chifflot-8","bmc_node_power_watt",494
"2021-03-23T18:15:03.400682+01:00","chifflot-8","bmc_node_power_watt",494
"2021-03-23T18:15:08.40102+01:00","chifflot-8","bmc_node_power_watt",494
"2021-03-23T18:15:13.40211+01:00","chifflot-8","bmc_node_power_watt",494
"2021-03-23T18:15:18.40456+01:00","chifflot-8","bmc_node_power_watt",494
"2021-03-23T18:15:23.404933+01:00","chifflot-8","bmc_node_power_watt",494
"2021-03-23T18:15:28.407499+01:00","chifflot-8","bmc_node_power_watt",494
"2021-03-23T18:15:33.409809+01:00","chifflot-8","bmc_node_power_watt",494
"2021-03-23T18:15:38.410266+01:00","chifflot-8","bmc_node_power_watt",494
"2021-03-23T18:15:43.411139+01:00","chifflot-8","bmc_node_power_watt",494
"2021-03-23T18:15:48.411628+01:00","chifflot-8","bmc_node_power_watt",468
"2021-03-23T18:15:53.412655+01:00","chifflot-8","bmc_node_power_watt",468
"2021-03-23T18:15:58.413821+01:00","chifflot-8","bmc_node_power_watt",468
"2021-03-23T18:16:03.414221+01:00","chifflot-8","bmc_node_power_watt",468
"2021-03-23T18:16:08.415451+01:00","chifflot-8","bmc_node_power_watt",468
"2021-03-23T18:16:13.416182+01:00","chifflot-8","bmc_node_power_watt",468
"2021-03-23T18:16:18.416905+01:00","chifflot-8","bmc_node_power_watt",468
"2021-03-23T18:16:23.417787+01:00","chifflot-8","bmc_node_power_watt",468
"2021-03-23T18:16:28.418544+01:00","chifflot-8","bmc_node_power_watt",468
"2021-03-23T18:16:33.419317+01:00","chifflot-8","bmc_node_power_watt",468
"2021-03-23T18:16:38.420811+01:00","chifflot-8","bmc_node_power_watt",494
"2021-03-23T18:16:43.421972+01:00","chifflot-8","bmc_node_power_watt",494
"2021-03-23T18:16:48.423041+01:00","chifflot-8","bmc_node_power_watt",494
"2021-03-23T18:16:53.425409+01:00","chifflot-8","bmc_node_power_watt",494
"2021-03-23T18:16:58.426197+01:00","chifflot-8","bmc_node_power_watt",468
"2021-03-23T18:17:03.427415+01:00","chifflot-8","bmc_node_power_watt",468
"2021-03-23T18:17:08.429283+01:00","chifflot-8","bmc_node_power_watt",468
"2021-03-23T18:17:13.429565+01:00","chifflot-8","bmc_node_power_watt",468
"2021-03-23T18:17:18.430737+01:00","chifflot-8","bmc_node_power_watt",468
"2021-03-23T18:17:23.431095+01:00","chifflot-8","bmc_node_power_watt",468
"2021-03-23T18:17:28.431888+01:00","chifflot-8","bmc_node_power_watt",468
"2021-03-23T18:17:33.43313+01:00","chifflot-8","bmc_node_power_watt",468
"2021-03-23T18:17:38.434386+01:00","chifflot-8","bmc_node_power_watt",468
"2021-03-23T18:17:43.434775+01:00","chifflot-8","bmc_node_power_watt",468
"2021-03-23T18:17:48.43543+01:00","chifflot-8","bmc_node_power_watt",494
"2021-03-23T18:17:53.435744+01:00","chifflot-8","bmc_node_power_watt",494
"2021-03-23T18:17:58.437232+01:00","chifflot-8","bmc_node_power_watt",494
"2021-03-23T18:18:03.438877+01:00","chifflot-8","bmc_node_power_watt",494
"2021-03-23T18:18:08.4409+01:00","chifflot-8","bmc_node_power_watt",494
"2021-03-23T18:18:13.441803+01:00","chifflot-8","bmc_node_power_watt",494
"2021-03-23T18:18:18.442101+01:00","chifflot-8","bmc_node_power_watt",494
"2021-03-23T18:18:23.442903+01:00","chifflot-8","bmc_node_power_watt",494
"2021-03-23T18:18:28.444621+01:00","chifflot-8","bmc_node_power_watt",494
"2021-03-23T18:18:33.44581+01:00","chifflot-8","bmc_node_power_watt",494
"2021-03-23T18:18:38.44636+01:00","chifflot-8","bmc_node_power_watt",494
"2021-03-23T18:18:43.447816+01:00","chifflot-8","bmc_node_power_watt",494
"2021-03-23T18:18:48.449099+01:00","chifflot-8","bmc_node_power_watt",494
"2021-03-23T18:18:53.450832+01:00","chifflot-8","bmc_node_power_watt",494
"2021-03-23T18:18:58.452005+01:00","chifflot-8","bmc_node_power_watt",494
"2021-03-23T18:19:03.452483+01:00","chifflot-8","bmc_node_power_watt",494
"2021-03-23T18:19:08.453448+01:00","chifflot-8","bmc_node_power_watt",494
"2021-03-23T18:19:13.456366+01:00","chifflot-8","bmc_node_power_watt",494
"2021-03-23T18:19:18.457223+01:00","chifflot-8","bmc_node_power_watt",494
"2021-03-23T18:19:23.459636+01:00","chifflot-8","bmc_node_power_watt",494
"2021-03-23T18:19:28.459837+01:00","chifflot-8","bmc_node_power_watt",494
"2021-03-23T18:19:33.460558+01:00","chifflot-8","bmc_node_power_watt",494
"2021-03-23T18:19:38.462595+01:00","chifflot-8","bmc_node_power_watt",494
"2021-03-23T18:19:43.466774+01:00","chifflot-8","bmc_node_power_watt",494
"2021-03-23T18:19:48.471304+01:00","chifflot-8","bmc_node_power_watt",494
"2021-03-23T18:19:53.472918+01:00","chifflot-8","bmc_node_power_watt",494
"2021-03-23T18:19:58.477947+01:00","chifflot-8","bmc_node_power_watt",494
"2021-03-23T18:20:03.480053+01:00","chifflot-8","bmc_node_power_watt",494
"2021-03-23T18:20:08.482726+01:00","chifflot-8","bmc_node_power_watt",494
"2021-03-23T18:20:13.484076+01:00","chifflot-8","bmc_node_power_watt",494
"2021-03-23T18:20:18.487061+01:00","chifflot-8","bmc_node_power_watt",494
"2021-03-23T18:20:23.489074+01:00","chifflot-8","bmc_node_power_watt",494
"2021-03-23T18:20:28.489751+01:00","chifflot-8","bmc_node_power_watt",494
"2021-03-23T18:20:33.492767+01:00","chifflot-8","bmc_node_power_watt",494
"2021-03-23T18:20:38.493801+01:00","chifflot-8","bmc_node_power_watt",494
"2021-03-23T18:20:43.49369+01:00","chifflot-8","bmc_node_power_watt",494
"2021-03-23T18:20:48.494328+01:00","chifflot-8","bmc_node_power_watt",494
"2021-03-23T18:20:53.49474+01:00","chifflot-8","bmc_node_power_watt",494
"2021-03-23T18:20:58.495009+01:00","chifflot-8","bmc_node_power_watt",494
"2021-03-23T18:21:03.495572+01:00","chifflot-8","bmc_node_power_watt",494
"2021-03-23T18:21:08.496091+01:00","chifflot-8","bmc_node_power_watt",494
"2021-03-23T18:21:13.496845+01:00","chifflot-8","bmc_node_power_watt",494
"2021-03-23T18:21:18.49737+01:00","chifflot-8","bmc_node_power_watt",494
"2021-03-23T18:21:23.497808+01:00","chifflot-8","bmc_node_power_watt",494
"2021-03-23T18:21:28.498723+01:00","chifflot-8","bmc_node_power_watt",494
"2021-03-23T18:21:33.499243+01:00","chifflot-8","bmc_node_power_watt",494
"2021-03-23T18:21:38.500679+01:00","chifflot-8","bmc_node_power_watt",494
