"2021-03-23T09:30:36.084546+01:00","chifflot-8","bmc_node_power_watt",494
"2021-03-23T09:30:41.085244+01:00","chifflot-8","bmc_node_power_watt",494
"2021-03-23T09:30:46.086521+01:00","chifflot-8","bmc_node_power_watt",494
"2021-03-23T09:30:51.086582+01:00","chifflot-8","bmc_node_power_watt",494
"2021-03-23T09:30:56.086999+01:00","chifflot-8","bmc_node_power_watt",494
"2021-03-23T09:31:01.088279+01:00","chifflot-8","bmc_node_power_watt",494
"2021-03-23T09:31:06.088084+01:00","chifflot-8","bmc_node_power_watt",494
"2021-03-23T09:31:11.08834+01:00","chifflot-8","bmc_node_power_watt",494
"2021-03-23T09:31:16.090719+01:00","chifflot-8","bmc_node_power_watt",494
"2021-03-23T09:31:21.091139+01:00","chifflot-8","bmc_node_power_watt",494
"2021-03-23T09:31:26.091886+01:00","chifflot-8","bmc_node_power_watt",494
"2021-03-23T09:31:31.092311+01:00","chifflot-8","bmc_node_power_watt",494
"2021-03-23T09:31:36.09528+01:00","chifflot-8","bmc_node_power_watt",494
"2021-03-23T09:31:41.09482+01:00","chifflot-8","bmc_node_power_watt",494
"2021-03-23T09:31:46.098247+01:00","chifflot-8","bmc_node_power_watt",494
"2021-03-23T09:31:51.099931+01:00","chifflot-8","bmc_node_power_watt",494
"2021-03-23T09:31:56.100383+01:00","chifflot-8","bmc_node_power_watt",494
"2021-03-23T09:32:01.101249+01:00","chifflot-8","bmc_node_power_watt",494
"2021-03-23T09:32:06.10197+01:00","chifflot-8","bmc_node_power_watt",494
"2021-03-23T09:32:11.103235+01:00","chifflot-8","bmc_node_power_watt",494
"2021-03-23T09:32:16.106209+01:00","chifflot-8","bmc_node_power_watt",494
"2021-03-23T09:32:21.106277+01:00","chifflot-8","bmc_node_power_watt",494
"2021-03-23T09:32:26.107183+01:00","chifflot-8","bmc_node_power_watt",494
"2021-03-23T09:32:31.109275+01:00","chifflot-8","bmc_node_power_watt",494
"2021-03-23T09:32:36.109182+01:00","chifflot-8","bmc_node_power_watt",494
"2021-03-23T09:32:41.110594+01:00","chifflot-8","bmc_node_power_watt",494
"2021-03-23T09:32:46.11331+01:00","chifflot-8","bmc_node_power_watt",494
"2021-03-23T09:32:51.116173+01:00","chifflot-8","bmc_node_power_watt",494
"2021-03-23T09:32:56.120589+01:00","chifflot-8","bmc_node_power_watt",494
"2021-03-23T09:33:01.12052+01:00","chifflot-8","bmc_node_power_watt",494
"2021-03-23T09:33:06.122419+01:00","chifflot-8","bmc_node_power_watt",494
"2021-03-23T09:33:11.12395+01:00","chifflot-8","bmc_node_power_watt",494
"2021-03-23T09:33:16.124422+01:00","chifflot-8","bmc_node_power_watt",494
"2021-03-23T09:33:21.125606+01:00","chifflot-8","bmc_node_power_watt",494
"2021-03-23T09:33:26.126818+01:00","chifflot-8","bmc_node_power_watt",494
"2021-03-23T09:33:31.126493+01:00","chifflot-8","bmc_node_power_watt",494
"2021-03-23T09:33:36.127409+01:00","chifflot-8","bmc_node_power_watt",494
"2021-03-23T09:33:41.128281+01:00","chifflot-8","bmc_node_power_watt",494
"2021-03-23T09:33:46.129034+01:00","chifflot-8","bmc_node_power_watt",494
"2021-03-23T09:33:51.130555+01:00","chifflot-8","bmc_node_power_watt",494
"2021-03-23T09:33:56.132727+01:00","chifflot-8","bmc_node_power_watt",494
"2021-03-23T09:34:01.133427+01:00","chifflot-8","bmc_node_power_watt",494
"2021-03-23T09:34:06.134166+01:00","chifflot-8","bmc_node_power_watt",494
"2021-03-23T09:34:11.136502+01:00","chifflot-8","bmc_node_power_watt",494
"2021-03-23T09:34:16.136699+01:00","chifflot-8","bmc_node_power_watt",494
"2021-03-23T09:34:21.137228+01:00","chifflot-8","bmc_node_power_watt",494
"2021-03-23T09:34:26.137646+01:00","chifflot-8","bmc_node_power_watt",494
"2021-03-23T09:34:31.139284+01:00","chifflot-8","bmc_node_power_watt",494
"2021-03-23T09:34:36.138423+01:00","chifflot-8","bmc_node_power_watt",494
"2021-03-23T09:34:41.141122+01:00","chifflot-8","bmc_node_power_watt",494
"2021-03-23T09:34:46.142199+01:00","chifflot-8","bmc_node_power_watt",494
"2021-03-23T09:34:51.143648+01:00","chifflot-8","bmc_node_power_watt",494
"2021-03-23T09:34:56.144199+01:00","chifflot-8","bmc_node_power_watt",494
"2021-03-23T09:35:01.145287+01:00","chifflot-8","bmc_node_power_watt",494
"2021-03-23T09:35:06.146006+01:00","chifflot-8","bmc_node_power_watt",494
"2021-03-23T09:35:11.147519+01:00","chifflot-8","bmc_node_power_watt",494
"2021-03-23T09:35:16.148379+01:00","chifflot-8","bmc_node_power_watt",494
"2021-03-23T09:35:21.148382+01:00","chifflot-8","bmc_node_power_watt",520
"2021-03-23T09:35:26.149053+01:00","chifflot-8","bmc_node_power_watt",520
"2021-03-23T09:35:31.150462+01:00","chifflot-8","bmc_node_power_watt",520
"2021-03-23T09:35:36.150698+01:00","chifflot-8","bmc_node_power_watt",520
"2021-03-23T09:35:41.153796+01:00","chifflot-8","bmc_node_power_watt",520
"2021-03-23T09:35:46.152972+01:00","chifflot-8","bmc_node_power_watt",520
"2021-03-23T09:35:51.154475+01:00","chifflot-8","bmc_node_power_watt",520
"2021-03-23T09:35:56.156363+01:00","chifflot-8","bmc_node_power_watt",520
"2021-03-23T09:36:01.155287+01:00","chifflot-8","bmc_node_power_watt",520
"2021-03-23T09:36:06.156828+01:00","chifflot-8","bmc_node_power_watt",494
"2021-03-23T09:36:11.157699+01:00","chifflot-8","bmc_node_power_watt",494
"2021-03-23T09:36:16.159182+01:00","chifflot-8","bmc_node_power_watt",494
"2021-03-23T09:36:21.160421+01:00","chifflot-8","bmc_node_power_watt",494
"2021-03-23T09:36:26.161411+01:00","chifflot-8","bmc_node_power_watt",494
"2021-03-23T09:36:31.162432+01:00","chifflot-8","bmc_node_power_watt",494
"2021-03-23T09:36:36.162899+01:00","chifflot-8","bmc_node_power_watt",494
"2021-03-23T09:36:41.165215+01:00","chifflot-8","bmc_node_power_watt",494
"2021-03-23T09:36:46.166261+01:00","chifflot-8","bmc_node_power_watt",494
"2021-03-23T09:36:51.166724+01:00","chifflot-8","bmc_node_power_watt",494
"2021-03-23T09:36:56.168451+01:00","chifflot-8","bmc_node_power_watt",494
"2021-03-23T09:37:01.16978+01:00","chifflot-8","bmc_node_power_watt",494
"2021-03-23T09:37:06.175699+01:00","chifflot-8","bmc_node_power_watt",494
"2021-03-23T09:37:11.174264+01:00","chifflot-8","bmc_node_power_watt",494
"2021-03-23T09:37:16.175427+01:00","chifflot-8","bmc_node_power_watt",494
"2021-03-23T09:37:21.176063+01:00","chifflot-8","bmc_node_power_watt",494
"2021-03-23T09:37:26.176402+01:00","chifflot-8","bmc_node_power_watt",494
"2021-03-23T09:37:31.177842+01:00","chifflot-8","bmc_node_power_watt",494
"2021-03-23T09:37:36.178087+01:00","chifflot-8","bmc_node_power_watt",494
"2021-03-23T09:37:41.178816+01:00","chifflot-8","bmc_node_power_watt",494
"2021-03-23T09:37:46.180407+01:00","chifflot-8","bmc_node_power_watt",494
"2021-03-23T09:37:51.180983+01:00","chifflot-8","bmc_node_power_watt",494
"2021-03-23T09:37:56.181123+01:00","chifflot-8","bmc_node_power_watt",494
"2021-03-23T09:38:01.181419+01:00","chifflot-8","bmc_node_power_watt",494
"2021-03-23T09:38:06.182093+01:00","chifflot-8","bmc_node_power_watt",494
"2021-03-23T09:38:11.184364+01:00","chifflot-8","bmc_node_power_watt",494
"2021-03-23T09:38:16.188579+01:00","chifflot-8","bmc_node_power_watt",494
"2021-03-23T09:38:21.190287+01:00","chifflot-8","bmc_node_power_watt",494
"2021-03-23T09:38:26.193843+01:00","chifflot-8","bmc_node_power_watt",494
"2021-03-23T09:38:31.195377+01:00","chifflot-8","bmc_node_power_watt",494
"2021-03-23T09:38:36.195244+01:00","chifflot-8","bmc_node_power_watt",494
"2021-03-23T09:38:41.195281+01:00","chifflot-8","bmc_node_power_watt",494
"2021-03-23T09:38:46.19755+01:00","chifflot-8","bmc_node_power_watt",494
"2021-03-23T09:38:51.197417+01:00","chifflot-8","bmc_node_power_watt",494
"2021-03-23T09:38:56.198894+01:00","chifflot-8","bmc_node_power_watt",494
"2021-03-23T09:39:01.19964+01:00","chifflot-8","bmc_node_power_watt",494
"2021-03-23T09:39:06.19986+01:00","chifflot-8","bmc_node_power_watt",494
"2021-03-23T09:39:11.200948+01:00","chifflot-8","bmc_node_power_watt",494
"2021-03-23T09:39:16.20265+01:00","chifflot-8","bmc_node_power_watt",494
"2021-03-23T09:39:21.2041+01:00","chifflot-8","bmc_node_power_watt",494
"2021-03-23T09:39:26.205518+01:00","chifflot-8","bmc_node_power_watt",494
"2021-03-23T09:39:31.205952+01:00","chifflot-8","bmc_node_power_watt",494
"2021-03-23T09:39:36.207127+01:00","chifflot-8","bmc_node_power_watt",494
"2021-03-23T09:39:41.20785+01:00","chifflot-8","bmc_node_power_watt",494
"2021-03-23T09:39:46.208485+01:00","chifflot-8","bmc_node_power_watt",494
"2021-03-23T09:39:51.211481+01:00","chifflot-8","bmc_node_power_watt",494
"2021-03-23T09:39:56.211756+01:00","chifflot-8","bmc_node_power_watt",494
"2021-03-23T09:40:01.213348+01:00","chifflot-8","bmc_node_power_watt",494
"2021-03-23T09:40:06.213966+01:00","chifflot-8","bmc_node_power_watt",520
"2021-03-23T09:40:11.215128+01:00","chifflot-8","bmc_node_power_watt",520
"2021-03-23T09:40:16.216088+01:00","chifflot-8","bmc_node_power_watt",520
"2021-03-23T09:40:21.219508+01:00","chifflot-8","bmc_node_power_watt",520
"2021-03-23T09:40:26.218813+01:00","chifflot-8","bmc_node_power_watt",520
"2021-03-23T09:40:31.219496+01:00","chifflot-8","bmc_node_power_watt",494
"2021-03-23T09:40:36.221197+01:00","chifflot-8","bmc_node_power_watt",494
"2021-03-23T09:40:41.22449+01:00","chifflot-8","bmc_node_power_watt",494
"2021-03-23T09:40:46.226093+01:00","chifflot-8","bmc_node_power_watt",494
"2021-03-23T09:40:51.229743+01:00","chifflot-8","bmc_node_power_watt",520
"2021-03-23T09:40:56.232163+01:00","chifflot-8","bmc_node_power_watt",520
"2021-03-23T09:41:01.232877+01:00","chifflot-8","bmc_node_power_watt",520
"2021-03-23T09:41:06.235846+01:00","chifflot-8","bmc_node_power_watt",520
"2021-03-23T09:41:11.23596+01:00","chifflot-8","bmc_node_power_watt",520
"2021-03-23T09:41:16.236032+01:00","chifflot-8","bmc_node_power_watt",494
"2021-03-23T09:41:21.236563+01:00","chifflot-8","bmc_node_power_watt",494
"2021-03-23T09:41:26.238205+01:00","chifflot-8","bmc_node_power_watt",494
"2021-03-23T09:41:31.238128+01:00","chifflot-8","bmc_node_power_watt",494
"2021-03-23T09:41:36.238975+01:00","chifflot-8","bmc_node_power_watt",494
"2021-03-23T09:41:41.240539+01:00","chifflot-8","bmc_node_power_watt",494
"2021-03-23T09:41:46.24025+01:00","chifflot-8","bmc_node_power_watt",494
"2021-03-23T09:41:51.241178+01:00","chifflot-8","bmc_node_power_watt",494
"2021-03-23T09:41:56.242512+01:00","chifflot-8","bmc_node_power_watt",494
"2021-03-23T09:42:01.242017+01:00","chifflot-8","bmc_node_power_watt",494
"2021-03-23T09:42:06.242245+01:00","chifflot-8","bmc_node_power_watt",494
"2021-03-23T09:42:11.24723+01:00","chifflot-8","bmc_node_power_watt",494
"2021-03-23T09:42:16.246088+01:00","chifflot-8","bmc_node_power_watt",494
"2021-03-23T09:42:21.24582+01:00","chifflot-8","bmc_node_power_watt",494
"2021-03-23T09:42:26.246364+01:00","chifflot-8","bmc_node_power_watt",520
"2021-03-23T09:42:31.248664+01:00","chifflot-8","bmc_node_power_watt",520
"2021-03-23T09:42:36.25085+01:00","chifflot-8","bmc_node_power_watt",520
"2021-03-23T09:42:41.252522+01:00","chifflot-8","bmc_node_power_watt",520
"2021-03-23T09:42:46.253083+01:00","chifflot-8","bmc_node_power_watt",520
"2021-03-23T09:42:51.258271+01:00","chifflot-8","bmc_node_power_watt",494
"2021-03-23T09:42:56.266464+01:00","chifflot-8","bmc_node_power_watt",494
"2021-03-23T09:43:01.26391+01:00","chifflot-8","bmc_node_power_watt",494
"2021-03-23T09:43:06.266005+01:00","chifflot-8","bmc_node_power_watt",494
"2021-03-23T09:43:11.270263+01:00","chifflot-8","bmc_node_power_watt",494
"2021-03-23T09:43:16.268294+01:00","chifflot-8","bmc_node_power_watt",520
"2021-03-23T09:43:21.272736+01:00","chifflot-8","bmc_node_power_watt",520
"2021-03-23T09:43:26.274562+01:00","chifflot-8","bmc_node_power_watt",520
"2021-03-23T09:43:31.276079+01:00","chifflot-8","bmc_node_power_watt",520
"2021-03-23T09:43:36.27785+01:00","chifflot-8","bmc_node_power_watt",520
"2021-03-23T09:43:41.285107+01:00","chifflot-8","bmc_node_power_watt",494
"2021-03-23T09:43:46.27985+01:00","chifflot-8","bmc_node_power_watt",494
"2021-03-23T09:43:51.279917+01:00","chifflot-8","bmc_node_power_watt",494
"2021-03-23T09:43:56.282333+01:00","chifflot-8","bmc_node_power_watt",494
"2021-03-23T09:44:01.282642+01:00","chifflot-8","bmc_node_power_watt",520
"2021-03-23T09:44:06.283306+01:00","chifflot-8","bmc_node_power_watt",520
"2021-03-23T09:44:11.284132+01:00","chifflot-8","bmc_node_power_watt",520
"2021-03-23T09:44:16.285808+01:00","chifflot-8","bmc_node_power_watt",520
"2021-03-23T09:44:21.286038+01:00","chifflot-8","bmc_node_power_watt",520
"2021-03-23T09:44:26.287066+01:00","chifflot-8","bmc_node_power_watt",494
"2021-03-23T09:44:31.287318+01:00","chifflot-8","bmc_node_power_watt",494
"2021-03-23T09:44:36.287786+01:00","chifflot-8","bmc_node_power_watt",494
"2021-03-23T09:44:41.292168+01:00","chifflot-8","bmc_node_power_watt",494
"2021-03-23T09:44:46.289101+01:00","chifflot-8","bmc_node_power_watt",494
"2021-03-23T09:44:51.28926+01:00","chifflot-8","bmc_node_power_watt",494
"2021-03-23T09:44:56.290099+01:00","chifflot-8","bmc_node_power_watt",494
"2021-03-23T09:45:01.291005+01:00","chifflot-8","bmc_node_power_watt",494
"2021-03-23T09:45:06.292918+01:00","chifflot-8","bmc_node_power_watt",494
"2021-03-23T09:45:11.293934+01:00","chifflot-8","bmc_node_power_watt",494
"2021-03-23T09:45:16.295827+01:00","chifflot-8","bmc_node_power_watt",494
"2021-03-23T09:45:21.296131+01:00","chifflot-8","bmc_node_power_watt",494
"2021-03-23T09:45:26.296445+01:00","chifflot-8","bmc_node_power_watt",494
"2021-03-23T09:45:31.296848+01:00","chifflot-8","bmc_node_power_watt",494
"2021-03-23T09:45:36.300566+01:00","chifflot-8","bmc_node_power_watt",494
"2021-03-23T09:45:41.300653+01:00","chifflot-8","bmc_node_power_watt",494
"2021-03-23T09:45:46.301008+01:00","chifflot-8","bmc_node_power_watt",494
"2021-03-23T09:45:51.301885+01:00","chifflot-8","bmc_node_power_watt",494
"2021-03-23T09:45:56.304908+01:00","chifflot-8","bmc_node_power_watt",494
"2021-03-23T09:46:01.305407+01:00","chifflot-8","bmc_node_power_watt",520
"2021-03-23T09:46:06.306618+01:00","chifflot-8","bmc_node_power_watt",520
"2021-03-23T09:46:11.307667+01:00","chifflot-8","bmc_node_power_watt",520
"2021-03-23T09:46:16.308067+01:00","chifflot-8","bmc_node_power_watt",520
"2021-03-23T09:46:21.309238+01:00","chifflot-8","bmc_node_power_watt",520
"2021-03-23T09:46:26.310656+01:00","chifflot-8","bmc_node_power_watt",494
"2021-03-23T09:46:31.310801+01:00","chifflot-8","bmc_node_power_watt",494
"2021-03-23T09:46:36.311+01:00","chifflot-8","bmc_node_power_watt",494
"2021-03-23T09:46:41.314951+01:00","chifflot-8","bmc_node_power_watt",494
"2021-03-23T09:46:46.314829+01:00","chifflot-8","bmc_node_power_watt",494
"2021-03-23T09:46:51.316035+01:00","chifflot-8","bmc_node_power_watt",494
"2021-03-23T09:46:56.317173+01:00","chifflot-8","bmc_node_power_watt",494
"2021-03-23T09:47:01.318248+01:00","chifflot-8","bmc_node_power_watt",494
"2021-03-23T09:47:06.319868+01:00","chifflot-8","bmc_node_power_watt",494
"2021-03-23T09:47:11.320049+01:00","chifflot-8","bmc_node_power_watt",520
"2021-03-23T09:47:16.321078+01:00","chifflot-8","bmc_node_power_watt",520
"2021-03-23T09:47:21.321078+01:00","chifflot-8","bmc_node_power_watt",520
"2021-03-23T09:47:26.32135+01:00","chifflot-8","bmc_node_power_watt",520
"2021-03-23T09:47:31.322795+01:00","chifflot-8","bmc_node_power_watt",520
"2021-03-23T09:47:36.322856+01:00","chifflot-8","bmc_node_power_watt",494
"2021-03-23T09:47:41.32718+01:00","chifflot-8","bmc_node_power_watt",494
"2021-03-23T09:47:46.328725+01:00","chifflot-8","bmc_node_power_watt",494
"2021-03-23T09:47:51.330661+01:00","chifflot-8","bmc_node_power_watt",494
"2021-03-23T09:47:56.333067+01:00","chifflot-8","bmc_node_power_watt",494
"2021-03-23T09:48:01.333193+01:00","chifflot-8","bmc_node_power_watt",494
"2021-03-23T09:48:06.333766+01:00","chifflot-8","bmc_node_power_watt",494
"2021-03-23T09:48:11.33484+01:00","chifflot-8","bmc_node_power_watt",494
"2021-03-23T09:48:16.338787+01:00","chifflot-8","bmc_node_power_watt",494
"2021-03-23T09:48:21.339185+01:00","chifflot-8","bmc_node_power_watt",494
"2021-03-23T09:48:26.339554+01:00","chifflot-8","bmc_node_power_watt",520
"2021-03-23T09:48:31.340845+01:00","chifflot-8","bmc_node_power_watt",520
"2021-03-23T09:48:36.341987+01:00","chifflot-8","bmc_node_power_watt",520
"2021-03-23T09:48:41.342964+01:00","chifflot-8","bmc_node_power_watt",520
"2021-03-23T09:48:46.342566+01:00","chifflot-8","bmc_node_power_watt",520
"2021-03-23T09:48:51.343023+01:00","chifflot-8","bmc_node_power_watt",520
"2021-03-23T09:48:56.343895+01:00","chifflot-8","bmc_node_power_watt",520
"2021-03-23T09:49:01.345777+01:00","chifflot-8","bmc_node_power_watt",520
"2021-03-23T09:49:06.346786+01:00","chifflot-8","bmc_node_power_watt",520
"2021-03-23T09:49:11.347851+01:00","chifflot-8","bmc_node_power_watt",494
"2021-03-23T09:49:16.348351+01:00","chifflot-8","bmc_node_power_watt",494
"2021-03-23T09:49:21.349046+01:00","chifflot-8","bmc_node_power_watt",494
"2021-03-23T09:49:26.350666+01:00","chifflot-8","bmc_node_power_watt",494
"2021-03-23T09:49:31.350403+01:00","chifflot-8","bmc_node_power_watt",494
"2021-03-23T09:49:36.35097+01:00","chifflot-8","bmc_node_power_watt",520
"2021-03-23T09:49:41.352314+01:00","chifflot-8","bmc_node_power_watt",520
"2021-03-23T09:49:46.352852+01:00","chifflot-8","bmc_node_power_watt",520
"2021-03-23T09:49:51.353646+01:00","chifflot-8","bmc_node_power_watt",520
"2021-03-23T09:49:56.354207+01:00","chifflot-8","bmc_node_power_watt",520
"2021-03-23T09:50:01.354387+01:00","chifflot-8","bmc_node_power_watt",494
"2021-03-23T09:50:06.355015+01:00","chifflot-8","bmc_node_power_watt",494
"2021-03-23T09:50:11.356888+01:00","chifflot-8","bmc_node_power_watt",494
"2021-03-23T09:50:16.356945+01:00","chifflot-8","bmc_node_power_watt",494
"2021-03-23T09:50:21.360696+01:00","chifflot-8","bmc_node_power_watt",494
"2021-03-23T09:50:26.362699+01:00","chifflot-8","bmc_node_power_watt",494
"2021-03-23T09:50:31.364054+01:00","chifflot-8","bmc_node_power_watt",494
"2021-03-23T09:50:36.364591+01:00","chifflot-8","bmc_node_power_watt",494
"2021-03-23T09:50:41.365383+01:00","chifflot-8","bmc_node_power_watt",494
"2021-03-23T09:50:46.36692+01:00","chifflot-8","bmc_node_power_watt",520
"2021-03-23T09:50:51.36803+01:00","chifflot-8","bmc_node_power_watt",520
"2021-03-23T09:50:56.368848+01:00","chifflot-8","bmc_node_power_watt",520
"2021-03-23T09:51:01.370418+01:00","chifflot-8","bmc_node_power_watt",520
"2021-03-23T09:51:06.372465+01:00","chifflot-8","bmc_node_power_watt",520
"2021-03-23T09:51:11.372615+01:00","chifflot-8","bmc_node_power_watt",520
"2021-03-23T09:51:16.372417+01:00","chifflot-8","bmc_node_power_watt",520
"2021-03-23T09:51:21.374687+01:00","chifflot-8","bmc_node_power_watt",520
"2021-03-23T09:51:26.374685+01:00","chifflot-8","bmc_node_power_watt",520
"2021-03-23T09:51:31.3772+01:00","chifflot-8","bmc_node_power_watt",520
"2021-03-23T09:51:36.386661+01:00","chifflot-8","bmc_node_power_watt",520
"2021-03-23T09:51:41.385281+01:00","chifflot-8","bmc_node_power_watt",520
"2021-03-23T09:51:46.386086+01:00","chifflot-8","bmc_node_power_watt",520
"2021-03-23T09:51:51.387173+01:00","chifflot-8","bmc_node_power_watt",520
"2021-03-23T09:51:56.387783+01:00","chifflot-8","bmc_node_power_watt",520
"2021-03-23T09:52:01.388103+01:00","chifflot-8","bmc_node_power_watt",520
"2021-03-23T09:52:06.388975+01:00","chifflot-8","bmc_node_power_watt",520
"2021-03-23T09:52:11.389778+01:00","chifflot-8","bmc_node_power_watt",520
"2021-03-23T09:52:16.390461+01:00","chifflot-8","bmc_node_power_watt",520
"2021-03-23T09:52:21.391311+01:00","chifflot-8","bmc_node_power_watt",494
"2021-03-23T09:52:26.392086+01:00","chifflot-8","bmc_node_power_watt",494
"2021-03-23T09:52:31.392683+01:00","chifflot-8","bmc_node_power_watt",494
"2021-03-23T09:52:36.393715+01:00","chifflot-8","bmc_node_power_watt",494
"2021-03-23T09:52:41.394548+01:00","chifflot-8","bmc_node_power_watt",494
"2021-03-23T09:52:46.394867+01:00","chifflot-8","bmc_node_power_watt",494
"2021-03-23T09:52:51.39549+01:00","chifflot-8","bmc_node_power_watt",494
"2021-03-23T09:52:56.395986+01:00","chifflot-8","bmc_node_power_watt",494
"2021-03-23T09:53:01.39641+01:00","chifflot-8","bmc_node_power_watt",494
"2021-03-23T09:53:06.397088+01:00","chifflot-8","bmc_node_power_watt",494
"2021-03-23T09:53:11.398095+01:00","chifflot-8","bmc_node_power_watt",494
"2021-03-23T09:53:16.399287+01:00","chifflot-8","bmc_node_power_watt",494
"2021-03-23T09:53:21.399501+01:00","chifflot-8","bmc_node_power_watt",494
"2021-03-23T09:53:26.400542+01:00","chifflot-8","bmc_node_power_watt",494
"2021-03-23T09:53:31.401634+01:00","chifflot-8","bmc_node_power_watt",494
