172.16.36.8 : 0.03 0.03 0.03 0.03 0.05 0.03 0.03 0.03 0.03 0.03
172.16.38.6 : - 4.26 4.24 4.26 4.22 4.36 4.31 4.32 4.28 4.31
172.16.38.5 : 0.20 0.17 0.19 0.12 0.19 0.20 0.20 0.15 0.17 0.18

       3 targets
       3 alive
       0 unreachable
       0 unknown addresses

       1 timeouts (waiting for response)
      30 ICMP Echos sent
      29 ICMP Echo Replies received
       0 other ICMP received

 0.03 ms (min round trip time)
 1.40 ms (avg round trip time)
 4.36 ms (max round trip time)
       10.030 sec (elapsed real time)

