172.16.36.8 : 0.22 0.12 0.13 0.09 0.08 0.09 0.10 0.18 0.13 0.15
172.16.37.7 : 0.18 0.18 0.18 0.13 0.13 0.17 0.19 0.15 0.14 0.14
172.16.37.2 : 0.02 0.03 0.01 0.03 0.03 0.01 0.01 0.01 0.03 0.01

       3 targets
       3 alive
       0 unreachable
       0 unknown addresses

       0 timeouts (waiting for response)
      30 ICMP Echos sent
      30 ICMP Echo Replies received
       0 other ICMP received

 0.01 ms (min round trip time)
 0.10 ms (avg round trip time)
 0.22 ms (max round trip time)
        9.027 sec (elapsed real time)

