172.16.36.7  : 0.02 0.03 0.03 0.03 0.03 0.03 0.03 0.03 0.03 0.03
172.16.66.25 : 10.15 9.73 9.76 9.75 9.72 9.73 9.74 9.75 9.76 9.76
172.16.66.26 : 23.88 13.83 13.82 13.83 13.87 13.89 13.86 13.89 13.84 13.86
172.16.66.27 : 19.16 - 13.81 13.81 13.73 13.89 13.82 13.80 13.88 13.88
172.16.66.28 : 13.76 13.85 13.80 13.78 13.81 13.78 13.83 13.77 13.83 13.84
172.16.66.29 : 13.79 13.92 13.89 13.92 13.88 13.95 13.89 13.89 13.94 13.91
172.16.66.3  : 13.79 13.82 13.82 13.86 - 13.92 13.88 13.89 13.82 13.75
172.16.66.30 : 13.85 13.86 13.93 13.82 13.89 13.85 13.90 13.89 13.93 -
172.16.66.31 : 13.79 13.85 13.88 13.87 13.83 13.87 13.83 13.84 13.83 13.82
172.16.66.32 : 13.82 13.92 13.88 13.86 13.88 13.87 13.86 13.83 13.88 13.86
172.16.66.33 : 17.46 13.88 13.87 13.85 13.83 13.88 13.86 - 13.83 13.89
172.16.66.34 : 13.88 13.88 13.91 13.87 13.86 13.83 13.87 13.87 13.88 13.84
172.16.66.35 : 13.87 13.80 13.86 13.78 - 13.90 13.86 13.90 13.87 13.87
172.16.66.36 : 13.82 13.91 13.79 13.92 - 13.89 13.86 13.83 13.84 13.87
172.16.66.37 : 13.76 13.89 13.88 13.82 13.89 13.84 13.89 13.90 13.85 13.75
172.16.66.38 : 18.36 13.90 13.89 13.88 13.87 13.87 13.90 13.91 13.91 13.91
172.16.66.39 : 13.93 13.90 13.90 13.80 13.76 13.83 13.84 13.82 13.82 13.79
172.16.66.4  : 16.71 - 13.89 13.89 13.89 13.89 13.88 13.90 13.94 13.91
172.16.66.40 : 15.20 13.89 13.92 13.92 13.94 13.93 13.92 13.92 13.83 13.92
172.16.66.41 : 18.86 13.86 13.91 13.94 13.91 13.92 13.90 13.87 13.86 13.92
172.16.66.42 : 13.93 13.87 13.92 13.92 13.94 13.89 13.92 13.83 13.91 13.90
172.16.66.43 : 13.88 - 13.84 13.84 13.84 13.86 13.84 13.82 - 13.83
172.16.66.44 : 13.85 13.90 13.90 13.92 13.94 13.89 13.91 13.92 13.92 13.91
172.16.66.45 : 22.67 13.82 13.82 13.79 13.83 13.82 - 13.85 13.84 13.85
172.16.66.46 : 13.86 13.90 13.87 13.86 13.90 13.85 13.89 13.88 13.93 13.89
172.16.66.47 : 17.22 13.86 13.90 13.89 13.88 13.85 13.79 13.85 13.83 13.82
172.16.66.48 : 17.21 13.89 13.86 13.88 13.89 13.85 13.88 13.90 13.88 13.80
172.16.66.49 : 20.50 13.84 13.89 13.92 13.84 13.89 13.88 13.89 13.91 13.89
172.16.66.5  : 20.44 13.93 13.88 13.94 13.93 13.89 13.91 13.91 13.91 13.93
172.16.66.50 : 23.90 13.93 13.90 13.91 13.89 13.92 13.91 13.91 13.93 13.87
172.16.66.51 : 20.49 13.81 13.85 13.73 13.82 13.82 13.82 13.81 13.82 13.83
172.16.66.52 : 23.77 13.91 13.90 13.90 13.90 13.91 13.86 13.91 13.86 13.90
172.16.66.53 : 23.80 13.84 13.81 13.84 13.83 13.79 13.84 13.83 13.85 13.79
172.16.66.54 : 23.85 13.87 13.89 13.85 13.90 13.88 13.85 13.89 13.90 13.89
172.16.66.55 : 23.81 13.81 13.83 13.86 13.86 13.86 13.81 13.82 13.84 13.82
172.16.66.56 : 23.85 13.90 13.87 13.91 13.89 13.90 13.90 13.89 13.85 13.83
172.16.66.57 : 23.84 13.89 13.89 13.87 13.88 13.89 13.88 13.90 13.91 13.91
172.16.66.58 : 23.81 13.85 13.83 13.84 13.84 13.85 - 13.86 13.90 13.87
172.16.66.59 : 20.49 13.87 13.92 13.89 13.89 13.92 - 13.93 13.89 13.94
172.16.66.6  : 20.53 13.92 13.87 13.94 13.81 13.92 13.81 13.92 13.83 13.90
172.16.66.60 : 20.51 13.90 13.90 13.83 13.82 13.84 13.80 13.85 13.80 13.85
172.16.66.61 : 20.54 13.83 13.88 13.90 13.78 13.92 13.78 13.88 13.80 13.88

      42 targets
      42 alive
       0 unreachable
       0 unknown addresses

      11 timeouts (waiting for response)
     420 ICMP Echos sent
     408 ICMP Echo Replies received
       0 other ICMP received

 0.02 ms (min round trip time)
 13.8 ms (avg round trip time)
 23.9 ms (max round trip time)
       10.403 sec (elapsed real time)

