"2021-03-24T00:59:49.146045+01:00","chifflot-8","bmc_node_power_watt",468
"2021-03-24T00:59:54.146866+01:00","chifflot-8","bmc_node_power_watt",468
"2021-03-24T00:59:59.148381+01:00","chifflot-8","bmc_node_power_watt",494
"2021-03-24T01:00:04.150633+01:00","chifflot-8","bmc_node_power_watt",494
"2021-03-24T01:00:09.152252+01:00","chifflot-8","bmc_node_power_watt",494
"2021-03-24T01:00:14.153135+01:00","chifflot-8","bmc_node_power_watt",494
"2021-03-24T01:00:19.154476+01:00","chifflot-8","bmc_node_power_watt",494
"2021-03-24T01:00:24.154845+01:00","chifflot-8","bmc_node_power_watt",494
"2021-03-24T01:00:29.155567+01:00","chifflot-8","bmc_node_power_watt",494
"2021-03-24T01:00:34.157079+01:00","chifflot-8","bmc_node_power_watt",494
"2021-03-24T01:00:39.157581+01:00","chifflot-8","bmc_node_power_watt",494
"2021-03-24T01:00:44.159927+01:00","chifflot-8","bmc_node_power_watt",494
"2021-03-24T01:00:49.160275+01:00","chifflot-8","bmc_node_power_watt",494
"2021-03-24T01:00:54.162134+01:00","chifflot-8","bmc_node_power_watt",494
"2021-03-24T01:00:59.162723+01:00","chifflot-8","bmc_node_power_watt",494
"2021-03-24T01:01:04.163418+01:00","chifflot-8","bmc_node_power_watt",494
"2021-03-24T01:01:09.165401+01:00","chifflot-8","bmc_node_power_watt",468
"2021-03-24T01:01:14.166081+01:00","chifflot-8","bmc_node_power_watt",468
"2021-03-24T01:01:19.167391+01:00","chifflot-8","bmc_node_power_watt",468
"2021-03-24T01:01:24.169543+01:00","chifflot-8","bmc_node_power_watt",468
"2021-03-24T01:01:29.171787+01:00","chifflot-8","bmc_node_power_watt",468
"2021-03-24T01:01:34.173537+01:00","chifflot-8","bmc_node_power_watt",494
"2021-03-24T01:01:39.17529+01:00","chifflot-8","bmc_node_power_watt",494
"2021-03-24T01:01:44.175552+01:00","chifflot-8","bmc_node_power_watt",494
"2021-03-24T01:01:49.176624+01:00","chifflot-8","bmc_node_power_watt",494
"2021-03-24T01:01:54.177952+01:00","chifflot-8","bmc_node_power_watt",494
"2021-03-24T01:01:59.178841+01:00","chifflot-8","bmc_node_power_watt",494
"2021-03-24T01:02:04.181976+01:00","chifflot-8","bmc_node_power_watt",494
"2021-03-24T01:02:09.181595+01:00","chifflot-8","bmc_node_power_watt",494
"2021-03-24T01:02:14.181816+01:00","chifflot-8","bmc_node_power_watt",494
"2021-03-24T01:02:19.182781+01:00","chifflot-8","bmc_node_power_watt",494
"2021-03-24T01:02:24.184037+01:00","chifflot-8","bmc_node_power_watt",494
"2021-03-24T01:02:29.185079+01:00","chifflot-8","bmc_node_power_watt",494
"2021-03-24T01:02:34.186046+01:00","chifflot-8","bmc_node_power_watt",494
"2021-03-24T01:02:39.189048+01:00","chifflot-8","bmc_node_power_watt",494
"2021-03-24T01:02:44.189072+01:00","chifflot-8","bmc_node_power_watt",494
"2021-03-24T01:02:49.190271+01:00","chifflot-8","bmc_node_power_watt",494
"2021-03-24T01:02:54.190593+01:00","chifflot-8","bmc_node_power_watt",494
"2021-03-24T01:02:59.193103+01:00","chifflot-8","bmc_node_power_watt",494
"2021-03-24T01:03:04.194753+01:00","chifflot-8","bmc_node_power_watt",494
"2021-03-24T01:03:09.196484+01:00","chifflot-8","bmc_node_power_watt",468
"2021-03-24T01:03:14.196852+01:00","chifflot-8","bmc_node_power_watt",468
"2021-03-24T01:03:19.19865+01:00","chifflot-8","bmc_node_power_watt",468
"2021-03-24T01:03:24.199792+01:00","chifflot-8","bmc_node_power_watt",468
"2021-03-24T01:03:29.201414+01:00","chifflot-8","bmc_node_power_watt",468
"2021-03-24T01:03:34.203202+01:00","chifflot-8","bmc_node_power_watt",468
"2021-03-24T01:03:39.203888+01:00","chifflot-8","bmc_node_power_watt",468
"2021-03-24T01:03:44.205898+01:00","chifflot-8","bmc_node_power_watt",468
"2021-03-24T01:03:49.206215+01:00","chifflot-8","bmc_node_power_watt",468
"2021-03-24T01:03:54.208355+01:00","chifflot-8","bmc_node_power_watt",468
"2021-03-24T01:03:59.208724+01:00","chifflot-8","bmc_node_power_watt",468
"2021-03-24T01:04:04.210502+01:00","chifflot-8","bmc_node_power_watt",468
"2021-03-24T01:04:09.211584+01:00","chifflot-8","bmc_node_power_watt",468
"2021-03-24T01:04:14.212373+01:00","chifflot-8","bmc_node_power_watt",468
"2021-03-24T01:04:19.212881+01:00","chifflot-8","bmc_node_power_watt",494
"2021-03-24T01:04:24.213532+01:00","chifflot-8","bmc_node_power_watt",494
"2021-03-24T01:04:29.21538+01:00","chifflot-8","bmc_node_power_watt",494
"2021-03-24T01:04:34.215555+01:00","chifflot-8","bmc_node_power_watt",494
"2021-03-24T01:04:39.217268+01:00","chifflot-8","bmc_node_power_watt",494
"2021-03-24T01:04:44.217935+01:00","chifflot-8","bmc_node_power_watt",494
"2021-03-24T01:04:49.219274+01:00","chifflot-8","bmc_node_power_watt",494
"2021-03-24T01:04:54.219759+01:00","chifflot-8","bmc_node_power_watt",494
"2021-03-24T01:04:59.219991+01:00","chifflot-8","bmc_node_power_watt",494
"2021-03-24T01:05:04.220357+01:00","chifflot-8","bmc_node_power_watt",494
"2021-03-24T01:05:09.221969+01:00","chifflot-8","bmc_node_power_watt",468
"2021-03-24T01:05:14.223152+01:00","chifflot-8","bmc_node_power_watt",468
"2021-03-24T01:05:19.224127+01:00","chifflot-8","bmc_node_power_watt",468
"2021-03-24T01:05:24.225561+01:00","chifflot-8","bmc_node_power_watt",468
"2021-03-24T01:05:29.230664+01:00","chifflot-8","bmc_node_power_watt",468
"2021-03-24T01:05:34.229294+01:00","chifflot-8","bmc_node_power_watt",468
"2021-03-24T01:05:39.230747+01:00","chifflot-8","bmc_node_power_watt",468
"2021-03-24T01:05:44.231951+01:00","chifflot-8","bmc_node_power_watt",468
"2021-03-24T01:05:49.233091+01:00","chifflot-8","bmc_node_power_watt",468
"2021-03-24T01:05:54.233956+01:00","chifflot-8","bmc_node_power_watt",468
"2021-03-24T01:05:59.235073+01:00","chifflot-8","bmc_node_power_watt",468
"2021-03-24T01:06:04.235985+01:00","chifflot-8","bmc_node_power_watt",468
"2021-03-24T01:06:09.237414+01:00","chifflot-8","bmc_node_power_watt",468
"2021-03-24T01:06:14.237656+01:00","chifflot-8","bmc_node_power_watt",468
"2021-03-24T01:06:19.237298+01:00","chifflot-8","bmc_node_power_watt",468
"2021-03-24T01:06:24.23793+01:00","chifflot-8","bmc_node_power_watt",468
"2021-03-24T01:06:29.238572+01:00","chifflot-8","bmc_node_power_watt",468
"2021-03-24T01:06:34.239018+01:00","chifflot-8","bmc_node_power_watt",468
"2021-03-24T01:06:39.241346+01:00","chifflot-8","bmc_node_power_watt",468
"2021-03-24T01:06:44.241503+01:00","chifflot-8","bmc_node_power_watt",468
"2021-03-24T01:06:49.242548+01:00","chifflot-8","bmc_node_power_watt",468
"2021-03-24T01:06:54.244441+01:00","chifflot-8","bmc_node_power_watt",468
"2021-03-24T01:06:59.243773+01:00","chifflot-8","bmc_node_power_watt",468
"2021-03-24T01:07:04.245688+01:00","chifflot-8","bmc_node_power_watt",494
"2021-03-24T01:07:09.249698+01:00","chifflot-8","bmc_node_power_watt",494
"2021-03-24T01:07:14.253015+01:00","chifflot-8","bmc_node_power_watt",494
"2021-03-24T01:07:19.254729+01:00","chifflot-8","bmc_node_power_watt",494
"2021-03-24T01:07:24.258064+01:00","chifflot-8","bmc_node_power_watt",494
"2021-03-24T01:07:29.2605+01:00","chifflot-8","bmc_node_power_watt",494
"2021-03-24T01:07:34.261159+01:00","chifflot-8","bmc_node_power_watt",494
"2021-03-24T01:07:39.265174+01:00","chifflot-8","bmc_node_power_watt",494
"2021-03-24T01:07:44.269602+01:00","chifflot-8","bmc_node_power_watt",494
"2021-03-24T01:07:49.272859+01:00","chifflot-8","bmc_node_power_watt",494
"2021-03-24T01:07:54.275986+01:00","chifflot-8","bmc_node_power_watt",494
"2021-03-24T01:07:59.275794+01:00","chifflot-8","bmc_node_power_watt",494
"2021-03-24T01:08:04.276922+01:00","chifflot-8","bmc_node_power_watt",494
"2021-03-24T01:08:09.277+01:00","chifflot-8","bmc_node_power_watt",494
"2021-03-24T01:08:14.278001+01:00","chifflot-8","bmc_node_power_watt",494
"2021-03-24T01:08:19.27872+01:00","chifflot-8","bmc_node_power_watt",468
"2021-03-24T01:08:24.280077+01:00","chifflot-8","bmc_node_power_watt",468
"2021-03-24T01:08:29.280861+01:00","chifflot-8","bmc_node_power_watt",468
"2021-03-24T01:08:34.281438+01:00","chifflot-8","bmc_node_power_watt",468
"2021-03-24T01:08:39.282676+01:00","chifflot-8","bmc_node_power_watt",468
"2021-03-24T01:08:44.282735+01:00","chifflot-8","bmc_node_power_watt",468
"2021-03-24T01:08:49.283625+01:00","chifflot-8","bmc_node_power_watt",468
"2021-03-24T01:08:54.28469+01:00","chifflot-8","bmc_node_power_watt",468
"2021-03-24T01:08:59.285416+01:00","chifflot-8","bmc_node_power_watt",468
"2021-03-24T01:09:04.286293+01:00","chifflot-8","bmc_node_power_watt",468
"2021-03-24T01:09:09.286769+01:00","chifflot-8","bmc_node_power_watt",468
"2021-03-24T01:09:14.287963+01:00","chifflot-8","bmc_node_power_watt",468
"2021-03-24T01:09:19.288915+01:00","chifflot-8","bmc_node_power_watt",468
"2021-03-24T01:09:24.289171+01:00","chifflot-8","bmc_node_power_watt",468
"2021-03-24T01:09:29.289854+01:00","chifflot-8","bmc_node_power_watt",468
"2021-03-24T01:09:34.290493+01:00","chifflot-8","bmc_node_power_watt",468
"2021-03-24T01:09:39.291123+01:00","chifflot-8","bmc_node_power_watt",468
"2021-03-24T01:09:44.291571+01:00","chifflot-8","bmc_node_power_watt",468
"2021-03-24T01:09:49.293388+01:00","chifflot-8","bmc_node_power_watt",468
"2021-03-24T01:09:54.294636+01:00","chifflot-8","bmc_node_power_watt",468
"2021-03-24T01:09:59.295702+01:00","chifflot-8","bmc_node_power_watt",468
"2021-03-24T01:10:04.297395+01:00","chifflot-8","bmc_node_power_watt",468
"2021-03-24T01:10:09.299242+01:00","chifflot-8","bmc_node_power_watt",468
"2021-03-24T01:10:14.300548+01:00","chifflot-8","bmc_node_power_watt",468
"2021-03-24T01:10:19.300002+01:00","chifflot-8","bmc_node_power_watt",468
"2021-03-24T01:10:24.301195+01:00","chifflot-8","bmc_node_power_watt",468
"2021-03-24T01:10:29.305462+01:00","chifflot-8","bmc_node_power_watt",468
"2021-03-24T01:10:34.305683+01:00","chifflot-8","bmc_node_power_watt",468
"2021-03-24T01:10:39.306571+01:00","chifflot-8","bmc_node_power_watt",468
"2021-03-24T01:10:44.307424+01:00","chifflot-8","bmc_node_power_watt",468
"2021-03-24T01:10:49.309534+01:00","chifflot-8","bmc_node_power_watt",468
"2021-03-24T01:10:54.310872+01:00","chifflot-8","bmc_node_power_watt",468
"2021-03-24T01:10:59.313101+01:00","chifflot-8","bmc_node_power_watt",468
"2021-03-24T01:11:04.313951+01:00","chifflot-8","bmc_node_power_watt",468
"2021-03-24T01:11:09.315895+01:00","chifflot-8","bmc_node_power_watt",468
"2021-03-24T01:11:14.316437+01:00","chifflot-8","bmc_node_power_watt",468
"2021-03-24T01:11:19.318454+01:00","chifflot-8","bmc_node_power_watt",468
"2021-03-24T01:11:24.319028+01:00","chifflot-8","bmc_node_power_watt",468
"2021-03-24T01:11:29.320127+01:00","chifflot-8","bmc_node_power_watt",468
"2021-03-24T01:11:34.321726+01:00","chifflot-8","bmc_node_power_watt",468
"2021-03-24T01:11:39.322675+01:00","chifflot-8","bmc_node_power_watt",468
"2021-03-24T01:11:44.323096+01:00","chifflot-8","bmc_node_power_watt",468
"2021-03-24T01:11:49.32613+01:00","chifflot-8","bmc_node_power_watt",468
"2021-03-24T01:11:54.32674+01:00","chifflot-8","bmc_node_power_watt",468
"2021-03-24T01:11:59.32812+01:00","chifflot-8","bmc_node_power_watt",468
"2021-03-24T01:12:04.33029+01:00","chifflot-8","bmc_node_power_watt",468
"2021-03-24T01:12:09.332375+01:00","chifflot-8","bmc_node_power_watt",468
"2021-03-24T01:12:14.332584+01:00","chifflot-8","bmc_node_power_watt",468
"2021-03-24T01:12:19.334611+01:00","chifflot-8","bmc_node_power_watt",468
"2021-03-24T01:12:24.335413+01:00","chifflot-8","bmc_node_power_watt",468
"2021-03-24T01:12:29.336804+01:00","chifflot-8","bmc_node_power_watt",468
"2021-03-24T01:12:34.337555+01:00","chifflot-8","bmc_node_power_watt",468
"2021-03-24T01:12:39.34139+01:00","chifflot-8","bmc_node_power_watt",468
"2021-03-24T01:12:44.342339+01:00","chifflot-8","bmc_node_power_watt",468
"2021-03-24T01:12:49.342852+01:00","chifflot-8","bmc_node_power_watt",468
"2021-03-24T01:12:54.34421+01:00","chifflot-8","bmc_node_power_watt",468
"2021-03-24T01:12:59.345698+01:00","chifflot-8","bmc_node_power_watt",494
"2021-03-24T01:13:04.346734+01:00","chifflot-8","bmc_node_power_watt",494
"2021-03-24T01:13:09.349138+01:00","chifflot-8","bmc_node_power_watt",494
"2021-03-24T01:13:14.349592+01:00","chifflot-8","bmc_node_power_watt",494
"2021-03-24T01:13:19.350401+01:00","chifflot-8","bmc_node_power_watt",494
"2021-03-24T01:13:24.35252+01:00","chifflot-8","bmc_node_power_watt",494
"2021-03-24T01:13:29.354012+01:00","chifflot-8","bmc_node_power_watt",494
"2021-03-24T01:13:34.354922+01:00","chifflot-8","bmc_node_power_watt",494
"2021-03-24T01:13:39.356061+01:00","chifflot-8","bmc_node_power_watt",494
"2021-03-24T01:13:44.357775+01:00","chifflot-8","bmc_node_power_watt",494
"2021-03-24T01:13:49.358539+01:00","chifflot-8","bmc_node_power_watt",494
"2021-03-24T01:13:54.359493+01:00","chifflot-8","bmc_node_power_watt",494
"2021-03-24T01:13:59.361353+01:00","chifflot-8","bmc_node_power_watt",494
"2021-03-24T01:14:04.362265+01:00","chifflot-8","bmc_node_power_watt",494
"2021-03-24T01:14:09.36492+01:00","chifflot-8","bmc_node_power_watt",494
"2021-03-24T01:14:14.365357+01:00","chifflot-8","bmc_node_power_watt",494
"2021-03-24T01:14:19.366891+01:00","chifflot-8","bmc_node_power_watt",494
"2021-03-24T01:14:24.3669+01:00","chifflot-8","bmc_node_power_watt",494
"2021-03-24T01:14:29.368155+01:00","chifflot-8","bmc_node_power_watt",494
"2021-03-24T01:14:34.369163+01:00","chifflot-8","bmc_node_power_watt",494
"2021-03-24T01:14:39.371163+01:00","chifflot-8","bmc_node_power_watt",494
"2021-03-24T01:14:44.371836+01:00","chifflot-8","bmc_node_power_watt",494
"2021-03-24T01:14:49.373848+01:00","chifflot-8","bmc_node_power_watt",494
"2021-03-24T01:14:54.374164+01:00","chifflot-8","bmc_node_power_watt",494
"2021-03-24T01:14:59.376219+01:00","chifflot-8","bmc_node_power_watt",494
"2021-03-24T01:15:04.378944+01:00","chifflot-8","bmc_node_power_watt",494
"2021-03-24T01:15:09.380236+01:00","chifflot-8","bmc_node_power_watt",494
"2021-03-24T01:15:14.382296+01:00","chifflot-8","bmc_node_power_watt",494
"2021-03-24T01:15:19.383301+01:00","chifflot-8","bmc_node_power_watt",494
"2021-03-24T01:15:24.385956+01:00","chifflot-8","bmc_node_power_watt",468
"2021-03-24T01:15:29.387013+01:00","chifflot-8","bmc_node_power_watt",468
"2021-03-24T01:15:34.3879+01:00","chifflot-8","bmc_node_power_watt",468
"2021-03-24T01:15:39.38825+01:00","chifflot-8","bmc_node_power_watt",468
"2021-03-24T01:15:44.389019+01:00","chifflot-8","bmc_node_power_watt",468
"2021-03-24T01:15:49.389364+01:00","chifflot-8","bmc_node_power_watt",494
"2021-03-24T01:15:54.389443+01:00","chifflot-8","bmc_node_power_watt",494
"2021-03-24T01:15:59.391215+01:00","chifflot-8","bmc_node_power_watt",494
"2021-03-24T01:16:04.391614+01:00","chifflot-8","bmc_node_power_watt",494
"2021-03-24T01:16:09.393058+01:00","chifflot-8","bmc_node_power_watt",468
"2021-03-24T01:16:14.394126+01:00","chifflot-8","bmc_node_power_watt",468
"2021-03-24T01:16:19.394351+01:00","chifflot-8","bmc_node_power_watt",468
"2021-03-24T01:16:24.395727+01:00","chifflot-8","bmc_node_power_watt",468
"2021-03-24T01:16:29.396395+01:00","chifflot-8","bmc_node_power_watt",468
"2021-03-24T01:16:34.399352+01:00","chifflot-8","bmc_node_power_watt",494
"2021-03-24T01:16:39.403153+01:00","chifflot-8","bmc_node_power_watt",494
"2021-03-24T01:16:44.402616+01:00","chifflot-8","bmc_node_power_watt",494
"2021-03-24T01:16:49.403156+01:00","chifflot-8","bmc_node_power_watt",494
"2021-03-24T01:16:54.403906+01:00","chifflot-8","bmc_node_power_watt",494
"2021-03-24T01:16:59.404463+01:00","chifflot-8","bmc_node_power_watt",494
"2021-03-24T01:17:04.405418+01:00","chifflot-8","bmc_node_power_watt",494
"2021-03-24T01:17:09.406466+01:00","chifflot-8","bmc_node_power_watt",494
"2021-03-24T01:17:14.408264+01:00","chifflot-8","bmc_node_power_watt",494
"2021-03-24T01:17:19.408238+01:00","chifflot-8","bmc_node_power_watt",468
"2021-03-24T01:17:24.409374+01:00","chifflot-8","bmc_node_power_watt",468
"2021-03-24T01:17:29.410939+01:00","chifflot-8","bmc_node_power_watt",468
"2021-03-24T01:17:34.412966+01:00","chifflot-8","bmc_node_power_watt",468
"2021-03-24T01:17:39.415731+01:00","chifflot-8","bmc_node_power_watt",468
"2021-03-24T01:17:44.416877+01:00","chifflot-8","bmc_node_power_watt",468
"2021-03-24T01:17:49.417439+01:00","chifflot-8","bmc_node_power_watt",468
"2021-03-24T01:17:54.417938+01:00","chifflot-8","bmc_node_power_watt",468
"2021-03-24T01:17:59.418032+01:00","chifflot-8","bmc_node_power_watt",468
"2021-03-24T01:18:04.420384+01:00","chifflot-8","bmc_node_power_watt",468
"2021-03-24T01:18:09.421082+01:00","chifflot-8","bmc_node_power_watt",494
"2021-03-24T01:18:14.422663+01:00","chifflot-8","bmc_node_power_watt",494
"2021-03-24T01:18:19.422589+01:00","chifflot-8","bmc_node_power_watt",494
"2021-03-24T01:18:24.423824+01:00","chifflot-8","bmc_node_power_watt",494
"2021-03-24T01:18:29.424371+01:00","chifflot-8","bmc_node_power_watt",494
"2021-03-24T01:18:34.425654+01:00","chifflot-8","bmc_node_power_watt",468
"2021-03-24T01:18:39.426777+01:00","chifflot-8","bmc_node_power_watt",468
"2021-03-24T01:18:44.426911+01:00","chifflot-8","bmc_node_power_watt",468
"2021-03-24T01:18:49.429261+01:00","chifflot-8","bmc_node_power_watt",468
"2021-03-24T01:18:54.431609+01:00","chifflot-8","bmc_node_power_watt",494
"2021-03-24T01:18:59.432115+01:00","chifflot-8","bmc_node_power_watt",494
"2021-03-24T01:19:04.43197+01:00","chifflot-8","bmc_node_power_watt",494
"2021-03-24T01:19:09.433806+01:00","chifflot-8","bmc_node_power_watt",494
"2021-03-24T01:19:14.435255+01:00","chifflot-8","bmc_node_power_watt",494
"2021-03-24T01:19:19.436093+01:00","chifflot-8","bmc_node_power_watt",494
"2021-03-24T01:19:24.437973+01:00","chifflot-8","bmc_node_power_watt",494
"2021-03-24T01:19:29.438714+01:00","chifflot-8","bmc_node_power_watt",494
"2021-03-24T01:19:34.438775+01:00","chifflot-8","bmc_node_power_watt",494
"2021-03-24T01:19:39.440085+01:00","chifflot-8","bmc_node_power_watt",494
"2021-03-24T01:19:44.440847+01:00","chifflot-8","bmc_node_power_watt",494
"2021-03-24T01:19:49.441691+01:00","chifflot-8","bmc_node_power_watt",494
"2021-03-24T01:19:54.441939+01:00","chifflot-8","bmc_node_power_watt",494
"2021-03-24T01:19:59.443012+01:00","chifflot-8","bmc_node_power_watt",494
"2021-03-24T01:20:04.443448+01:00","chifflot-8","bmc_node_power_watt",494
"2021-03-24T01:20:09.446743+01:00","chifflot-8","bmc_node_power_watt",494
"2021-03-24T01:20:14.44738+01:00","chifflot-8","bmc_node_power_watt",494
"2021-03-24T01:20:19.44703+01:00","chifflot-8","bmc_node_power_watt",494
"2021-03-24T01:20:24.449323+01:00","chifflot-8","bmc_node_power_watt",494
"2021-03-24T01:20:29.450163+01:00","chifflot-8","bmc_node_power_watt",468
"2021-03-24T01:20:34.450916+01:00","chifflot-8","bmc_node_power_watt",468
"2021-03-24T01:20:39.452978+01:00","chifflot-8","bmc_node_power_watt",468
"2021-03-24T01:20:44.452995+01:00","chifflot-8","bmc_node_power_watt",468
"2021-03-24T01:20:49.454107+01:00","chifflot-8","bmc_node_power_watt",468
"2021-03-24T01:20:54.455381+01:00","chifflot-8","bmc_node_power_watt",468
"2021-03-24T01:20:59.455592+01:00","chifflot-8","bmc_node_power_watt",468
"2021-03-24T01:21:04.458068+01:00","chifflot-8","bmc_node_power_watt",468
"2021-03-24T01:21:09.458328+01:00","chifflot-8","bmc_node_power_watt",468
"2021-03-24T01:21:14.459359+01:00","chifflot-8","bmc_node_power_watt",468
"2021-03-24T01:21:19.460297+01:00","chifflot-8","bmc_node_power_watt",494
"2021-03-24T01:21:24.46112+01:00","chifflot-8","bmc_node_power_watt",494
"2021-03-24T01:21:29.462444+01:00","chifflot-8","bmc_node_power_watt",494
"2021-03-24T01:21:34.463202+01:00","chifflot-8","bmc_node_power_watt",494
"2021-03-24T01:21:39.46314+01:00","chifflot-8","bmc_node_power_watt",494
"2021-03-24T01:21:44.46454+01:00","chifflot-8","bmc_node_power_watt",494
"2021-03-24T01:21:49.465435+01:00","chifflot-8","bmc_node_power_watt",494
"2021-03-24T01:21:54.466374+01:00","chifflot-8","bmc_node_power_watt",494
"2021-03-24T01:21:59.467965+01:00","chifflot-8","bmc_node_power_watt",494
"2021-03-24T01:22:04.468968+01:00","chifflot-8","bmc_node_power_watt",468
"2021-03-24T01:22:09.470027+01:00","chifflot-8","bmc_node_power_watt",468
"2021-03-24T01:22:14.471124+01:00","chifflot-8","bmc_node_power_watt",468
"2021-03-24T01:22:19.473471+01:00","chifflot-8","bmc_node_power_watt",468
"2021-03-24T01:22:24.474258+01:00","chifflot-8","bmc_node_power_watt",468
"2021-03-24T01:22:29.47753+01:00","chifflot-8","bmc_node_power_watt",494
"2021-03-24T01:22:34.479106+01:00","chifflot-8","bmc_node_power_watt",494
"2021-03-24T01:22:39.479732+01:00","chifflot-8","bmc_node_power_watt",494
"2021-03-24T01:22:44.484284+01:00","chifflot-8","bmc_node_power_watt",494
