172.16.36.7 : 0.03 0.03 0.03 0.03 0.03 0.03 0.03 0.03 0.03 0.03
172.16.39.8 : 16.15 4.33 4.28 4.32 4.22 4.26 4.27 4.28 4.26 4.20
172.16.39.6 : 0.21 0.17 0.15 0.17 0.16 0.15 0.20 0.18 0.18 0.18

       3 targets
       3 alive
       0 unreachable
       0 unknown addresses

       0 timeouts (waiting for response)
      30 ICMP Echos sent
      30 ICMP Echo Replies received
       0 other ICMP received

 0.03 ms (min round trip time)
 1.88 ms (avg round trip time)
 16.1 ms (max round trip time)
        9.030 sec (elapsed real time)

