172.16.36.7  : 20.66 13.89 13.86 13.87 13.84 13.93 13.92 13.88 13.92 13.90
172.16.66.25 : 0.20 0.21 0.20 0.18 0.19 0.20 0.20 0.12 0.18 0.21
172.16.66.26 : 0.22 0.19 0.13 0.17 0.15 0.21 0.21 0.20 0.20 0.20
172.16.66.27 : 0.22 0.22 0.18 0.20 0.21 0.20 0.19 0.22 0.20 0.21
172.16.66.28 : 0.20 0.18 0.19 0.19 0.18 0.19 0.19 0.20 0.21 0.21
172.16.66.29 : 0.21 0.21 0.20 0.20 0.22 0.21 0.21 0.22 0.20 0.20
172.16.66.3  : 0.04 0.03 0.03 0.03 0.03 0.03 0.03 0.03 0.03 0.03
172.16.66.30 : 0.41 0.20 0.21 0.21 0.20 0.21 0.22 0.19 0.21 0.22
172.16.66.31 : 0.35 0.21 0.21 0.20 0.21 0.21 0.21 0.20 0.21 0.22
172.16.66.32 : 0.40 0.20 0.21 0.21 0.21 0.21 0.20 0.17 0.20 0.21
172.16.66.33 : 0.40 0.21 0.20 0.22 0.21 0.20 0.22 0.21 0.21 0.22
172.16.66.34 : 0.39 0.20 0.20 0.21 0.20 0.19 0.18 0.20 0.21 0.22
172.16.66.35 : 0.22 0.18 0.19 0.19 0.19 0.17 0.18 0.18 0.20 0.19
172.16.66.36 : 0.32 0.20 0.21 0.21 0.20 0.21 0.19 0.21 0.21 0.21
172.16.66.37 : 0.27 0.20 0.20 0.22 0.20 0.21 0.20 0.21 0.20 0.22
172.16.66.38 : 0.26 0.21 0.20 0.21 0.18 0.22 0.20 0.21 0.21 0.22
172.16.66.39 : 0.15 0.21 0.22 0.21 0.20 0.21 0.22 0.21 0.22 0.21
172.16.66.4  : 0.29 0.22 0.20 0.20 0.16 0.20 0.20 0.21 0.19 0.20
172.16.66.40 : 0.27 0.21 0.21 0.20 0.20 0.21 0.21 0.22 0.19 0.20
172.16.66.41 : 0.23 0.21 0.20 0.20 0.21 0.21 0.22 0.20 0.20 0.21
172.16.66.42 : 0.28 0.21 0.20 0.20 0.16 0.17 0.17 0.17 0.16 0.17
172.16.66.43 : 0.34 0.16 0.06 0.16 0.21 0.21 0.21 0.20 0.21 0.21
172.16.66.44 : 0.32 0.21 0.20 0.22 0.16 0.21 0.22 0.20 0.21 0.21
172.16.66.45 : 0.27 0.20 0.19 0.21 0.21 0.20 0.20 0.21 0.21 0.21
172.16.66.46 : 0.32 0.18 0.18 0.21 0.21 0.21 0.19 0.21 0.21 0.21
172.16.66.47 : 0.35 0.20 0.21 0.21 0.20 0.20 0.21 0.20 0.21 0.21
172.16.66.48 : 0.32 0.25 0.21 0.18 0.22 0.21 0.20 0.22 0.22 0.21
172.16.66.49 : 0.33 0.20 0.21 0.22 0.20 0.21 0.22 0.21 0.21 0.22
172.16.66.5  : 0.30 0.22 0.20 0.21 0.20 0.20 0.21 0.21 0.21 0.21
172.16.66.50 : 0.42 0.21 0.21 0.22 0.21 0.20 0.21 0.22 0.20 0.21
172.16.66.51 : 0.33 0.20 0.22 0.21 0.18 0.20 0.20 0.21 0.21 0.20
172.16.66.52 : 0.36 0.21 0.21 0.21 0.20 0.23 0.21 0.21 0.21 0.21
172.16.66.53 : 0.17 0.21 0.21 0.22 0.20 0.21 0.22 0.21 0.21 0.21
172.16.66.54 : 0.26 0.18 0.21 0.22 0.18 0.20 0.22 0.20 0.20 0.22
172.16.66.55 : 0.26 0.18 0.20 0.21 0.20 0.20 0.22 0.21 0.20 0.21
172.16.66.56 : 0.34 0.21 0.21 0.17 0.16 0.16 0.17 0.17 0.14 0.16
172.16.66.57 : 0.25 0.17 0.09 0.21 0.21 0.23 0.20 0.21 0.21 0.21
172.16.66.58 : 0.21 0.21 0.21 0.21 0.21 0.21 0.22 0.20 0.20 0.22
172.16.66.59 : 0.36 0.20 0.20 0.21 0.18 0.21 0.21 0.20 0.20 0.22
172.16.66.6  : 0.34 0.22 0.21 0.17 0.18 0.16 0.16 0.17 0.17 0.16
172.16.66.60 : 0.32 0.17 0.20 0.21 0.21 0.21 0.22 0.21 0.21 0.22
172.16.66.61 : 0.34 0.21 0.21 0.20 0.21 0.21 0.20 0.16 0.19 0.21

      42 targets
      42 alive
       0 unreachable
       0 unknown addresses

       0 timeouts (waiting for response)
     420 ICMP Echos sent
     420 ICMP Echo Replies received
       0 other ICMP received

 0.03 ms (min round trip time)
 0.54 ms (avg round trip time)
 20.6 ms (max round trip time)
        9.417 sec (elapsed real time)

