172.16.36.7 : 0.04 0.04 0.03 0.03 0.03 0.03 0.03 0.03 0.03 0.03
172.16.39.5 : 11.19 4.38 4.33 4.26 4.27 4.40 4.31 4.35 4.24 4.28
172.16.39.3 : 0.37 0.20 0.19 0.20 0.20 0.19 0.15 0.20 0.21 0.19

       3 targets
       3 alive
       0 unreachable
       0 unknown addresses

       0 timeouts (waiting for response)
      30 ICMP Echos sent
      30 ICMP Echo Replies received
       0 other ICMP received

 0.03 ms (min round trip time)
 1.74 ms (avg round trip time)
 11.1 ms (max round trip time)
        9.030 sec (elapsed real time)

