172.16.36.7  : 0.02 0.01 0.01 0.01 0.01 0.01 0.01 0.01 0.01 0.01
172.16.66.62 : 9.75 9.76 9.74 9.76 9.76 9.76 9.75 9.76 9.73 9.74
172.16.66.63 : 15.47 13.79 13.86 13.86 13.86 13.82 13.80 13.83 13.84 13.84
172.16.66.64 : 13.90 13.81 13.80 13.83 13.84 13.83 13.82 13.83 13.80 13.83
172.16.66.65 : - 13.90 13.84 13.84 13.85 13.84 13.88 13.84 13.82 13.82
172.16.66.66 : 13.90 13.91 13.92 13.93 13.88 13.91 13.88 13.91 13.90 13.90
172.16.66.67 : 17.08 13.84 13.83 13.83 13.80 13.83 13.81 13.82 13.82 13.84
172.16.66.68 : 13.89 13.93 13.92 13.92 13.86 13.90 13.87 13.90 13.90 -
172.16.66.69 : 17.33 13.86 13.84 13.84 13.82 13.81 13.83 13.78 13.85 13.82
172.16.66.7  : 17.11 13.92 13.93 13.91 13.92 13.88 13.82 13.92 13.91 13.93
172.16.66.70 : 18.62 13.91 13.93 13.93 13.88 13.91 13.93 13.89 13.88 13.91
172.16.66.71 : 13.86 13.90 13.88 13.92 13.93 13.90 13.90 13.89 13.90 13.90
172.16.66.72 : 18.98 13.88 13.84 13.82 13.91 13.95 13.86 13.91 13.91 13.89
172.16.66.73 : 13.91 13.82 13.88 13.87 13.90 13.91 13.86 13.89 13.89 13.91
172.16.66.74 : 13.68 13.86 13.88 13.92 13.92 13.90 13.89 13.87 13.88 13.89
172.16.66.75 : 19.18 13.92 13.90 13.85 13.93 13.90 13.92 13.93 13.93 13.92
172.16.66.76 : 13.85 13.92 13.91 13.91 13.88 13.85 13.85 13.86 13.86 13.85
172.16.66.77 : 13.82 13.89 13.88 13.83 13.91 13.87 13.89 13.90 13.89 13.86
172.16.66.78 : 13.84 13.88 13.88 13.87 13.88 13.89 13.89 13.91 13.89 13.90
172.16.66.79 : 24.66 13.92 13.81 13.85 13.75 13.75 13.74 13.77 13.77 13.81
172.16.66.8  : 13.92 13.84 13.84 13.92 13.91 13.91 13.89 13.90 13.87 13.92
172.16.66.80 : 13.90 13.86 13.85 13.83 13.84 13.87 13.83 13.81 13.82 13.85
172.16.66.81 : 24.68 13.88 13.83 13.92 13.89 13.93 13.88 13.85 13.87 13.90
172.16.66.82 : 18.37 13.86 13.82 13.80 13.85 13.83 13.79 13.75 13.82 13.82
172.16.66.83 : 13.89 13.93 13.87 13.90 - 13.91 13.88 13.81 - 13.75
172.16.66.84 : 13.80 13.85 - 13.92 13.92 13.90 13.88 13.89 13.89 13.93
172.16.66.85 : 17.20 13.88 13.90 13.85 13.89 13.89 13.93 13.85 13.85 13.86
172.16.66.86 : 17.25 13.88 13.91 13.93 13.86 13.92 13.84 13.88 13.91 13.91
172.16.66.87 : 28.47 13.78 13.83 13.77 13.75 13.86 13.82 - 13.84 13.85
172.16.66.88 : 21.08 13.87 13.92 13.90 13.91 13.93 13.89 13.92 13.90 13.78
172.16.66.89 : 24.59 13.85 13.85 13.82 13.83 13.83 13.87 13.88 13.85 13.88
172.16.66.9  : 24.66 13.84 13.82 13.85 13.84 13.83 13.84 13.82 13.84 13.85
172.16.66.90 : 24.68 13.88 13.87 13.79 13.88 13.87 13.88 13.89 13.85 13.89
172.16.66.91 : 20.83 13.83 13.85 13.83 13.89 13.89 13.91 13.77 13.91 13.83
172.16.66.92 : 20.84 13.91 13.91 13.93 13.89 13.87 13.92 13.91 13.90 13.91
172.16.66.93 : 24.55 13.88 13.90 13.91 13.94 13.92 13.93 13.81 13.90 13.85
172.16.66.94 : 20.89 13.92 13.92 13.90 13.93 13.85 13.90 13.91 13.93 13.91
172.16.66.95 : 21.30 13.86 13.90 13.92 13.92 13.89 13.90 13.87 13.90 13.93
172.16.66.96 : 17.39 13.85 13.91 13.87 13.82 13.89 13.92 13.90 13.93 13.92
172.16.66.97 : 31.16 13.86 13.90 - 13.93 13.93 13.84 13.87 13.90 13.88
172.16.66.98 : 20.88 13.88 13.77 13.88 13.87 13.88 13.89 13.84 13.83 13.89
172.16.66.99 : 20.90 13.88 13.89 13.89 13.88 13.83 13.93 13.86 13.90 13.86

      42 targets
      42 alive
       0 unreachable
       0 unknown addresses

       6 timeouts (waiting for response)
     420 ICMP Echos sent
     413 ICMP Echo Replies received
       0 other ICMP received

 0.01 ms (min round trip time)
 13.8 ms (avg round trip time)
 31.1 ms (max round trip time)
       10.414 sec (elapsed real time)

