"2021-04-05T10:27:49.102227+02:00","chifflot-7","bmc_node_power_watt",520
"2021-04-05T10:27:54.103379+02:00","chifflot-7","bmc_node_power_watt",520
"2021-04-05T10:27:59.104671+02:00","chifflot-7","bmc_node_power_watt",520
"2021-04-05T10:28:04.105394+02:00","chifflot-7","bmc_node_power_watt",520
"2021-04-05T10:28:09.106269+02:00","chifflot-7","bmc_node_power_watt",520
"2021-04-05T10:28:14.107191+02:00","chifflot-7","bmc_node_power_watt",494
"2021-04-05T10:28:19.107865+02:00","chifflot-7","bmc_node_power_watt",494
"2021-04-05T10:28:24.108822+02:00","chifflot-7","bmc_node_power_watt",494
"2021-04-05T10:28:29.109893+02:00","chifflot-7","bmc_node_power_watt",494
"2021-04-05T10:28:34.110713+02:00","chifflot-7","bmc_node_power_watt",494
"2021-04-05T10:28:39.111833+02:00","chifflot-7","bmc_node_power_watt",494
"2021-04-05T10:28:44.112639+02:00","chifflot-7","bmc_node_power_watt",494
"2021-04-05T10:28:49.114628+02:00","chifflot-7","bmc_node_power_watt",494
"2021-04-05T10:28:54.115216+02:00","chifflot-7","bmc_node_power_watt",494
"2021-04-05T10:28:59.116448+02:00","chifflot-7","bmc_node_power_watt",494
"2021-04-05T10:29:04.117798+02:00","chifflot-7","bmc_node_power_watt",520
"2021-04-05T10:29:09.12025+02:00","chifflot-7","bmc_node_power_watt",520
"2021-04-05T10:29:14.12134+02:00","chifflot-7","bmc_node_power_watt",520
"2021-04-05T10:29:19.122067+02:00","chifflot-7","bmc_node_power_watt",520
"2021-04-05T10:29:24.123344+02:00","chifflot-7","bmc_node_power_watt",494
"2021-04-05T10:29:29.124039+02:00","chifflot-7","bmc_node_power_watt",494
"2021-04-05T10:29:34.124927+02:00","chifflot-7","bmc_node_power_watt",494
"2021-04-05T10:29:39.126466+02:00","chifflot-7","bmc_node_power_watt",494
"2021-04-05T10:29:44.127632+02:00","chifflot-7","bmc_node_power_watt",494
"2021-04-05T10:29:49.129184+02:00","chifflot-7","bmc_node_power_watt",494
"2021-04-05T10:29:54.131361+02:00","chifflot-7","bmc_node_power_watt",494
"2021-04-05T10:29:59.132244+02:00","chifflot-7","bmc_node_power_watt",494
"2021-04-05T10:30:04.134285+02:00","chifflot-7","bmc_node_power_watt",494
"2021-04-05T10:30:09.135224+02:00","chifflot-7","bmc_node_power_watt",494
"2021-04-05T10:30:14.136314+02:00","chifflot-7","bmc_node_power_watt",520
"2021-04-05T10:30:19.137779+02:00","chifflot-7","bmc_node_power_watt",520
"2021-04-05T10:30:24.140071+02:00","chifflot-7","bmc_node_power_watt",520
"2021-04-05T10:30:29.141228+02:00","chifflot-7","bmc_node_power_watt",520
"2021-04-05T10:30:34.142866+02:00","chifflot-7","bmc_node_power_watt",520
"2021-04-05T10:30:39.143931+02:00","chifflot-7","bmc_node_power_watt",520
"2021-04-05T10:30:44.144322+02:00","chifflot-7","bmc_node_power_watt",520
"2021-04-05T10:30:49.145212+02:00","chifflot-7","bmc_node_power_watt",520
"2021-04-05T10:30:54.146012+02:00","chifflot-7","bmc_node_power_watt",520
"2021-04-05T10:30:59.146965+02:00","chifflot-7","bmc_node_power_watt",494
"2021-04-05T10:31:04.149119+02:00","chifflot-7","bmc_node_power_watt",494
"2021-04-05T10:31:09.149841+02:00","chifflot-7","bmc_node_power_watt",494
"2021-04-05T10:31:14.15086+02:00","chifflot-7","bmc_node_power_watt",494
"2021-04-05T10:31:19.152372+02:00","chifflot-7","bmc_node_power_watt",494
"2021-04-05T10:31:24.153809+02:00","chifflot-7","bmc_node_power_watt",494
"2021-04-05T10:31:29.15498+02:00","chifflot-7","bmc_node_power_watt",494
"2021-04-05T10:31:34.156245+02:00","chifflot-7","bmc_node_power_watt",494
"2021-04-05T10:31:39.156725+02:00","chifflot-7","bmc_node_power_watt",494
"2021-04-05T10:31:44.158151+02:00","chifflot-7","bmc_node_power_watt",494
"2021-04-05T10:31:49.159508+02:00","chifflot-7","bmc_node_power_watt",494
"2021-04-05T10:31:54.160017+02:00","chifflot-7","bmc_node_power_watt",494
"2021-04-05T10:31:59.16198+02:00","chifflot-7","bmc_node_power_watt",494
"2021-04-05T10:32:04.164127+02:00","chifflot-7","bmc_node_power_watt",494
"2021-04-05T10:32:09.16628+02:00","chifflot-7","bmc_node_power_watt",494
"2021-04-05T10:32:14.168283+02:00","chifflot-7","bmc_node_power_watt",520
"2021-04-05T10:32:19.169099+02:00","chifflot-7","bmc_node_power_watt",520
"2021-04-05T10:32:24.170375+02:00","chifflot-7","bmc_node_power_watt",520
"2021-04-05T10:32:29.171176+02:00","chifflot-7","bmc_node_power_watt",520
"2021-04-05T10:32:34.172648+02:00","chifflot-7","bmc_node_power_watt",494
"2021-04-05T10:32:39.173077+02:00","chifflot-7","bmc_node_power_watt",494
"2021-04-05T10:32:44.173859+02:00","chifflot-7","bmc_node_power_watt",494
"2021-04-05T10:32:49.174974+02:00","chifflot-7","bmc_node_power_watt",494
"2021-04-05T10:32:54.176153+02:00","chifflot-7","bmc_node_power_watt",494
"2021-04-05T10:32:59.177467+02:00","chifflot-7","bmc_node_power_watt",494
"2021-04-05T10:33:04.179594+02:00","chifflot-7","bmc_node_power_watt",494
"2021-04-05T10:33:09.18067+02:00","chifflot-7","bmc_node_power_watt",494
"2021-04-05T10:33:14.181344+02:00","chifflot-7","bmc_node_power_watt",494
"2021-04-05T10:33:19.182333+02:00","chifflot-7","bmc_node_power_watt",494
"2021-04-05T10:33:24.18309+02:00","chifflot-7","bmc_node_power_watt",494
"2021-04-05T10:33:29.184026+02:00","chifflot-7","bmc_node_power_watt",494
"2021-04-05T10:33:34.184814+02:00","chifflot-7","bmc_node_power_watt",494
"2021-04-05T10:33:39.185458+02:00","chifflot-7","bmc_node_power_watt",494
"2021-04-05T10:33:44.18692+02:00","chifflot-7","bmc_node_power_watt",494
"2021-04-05T10:33:49.188157+02:00","chifflot-7","bmc_node_power_watt",494
"2021-04-05T10:33:54.189384+02:00","chifflot-7","bmc_node_power_watt",494
"2021-04-05T10:33:59.190772+02:00","chifflot-7","bmc_node_power_watt",494
"2021-04-05T10:34:04.191623+02:00","chifflot-7","bmc_node_power_watt",494
"2021-04-05T10:34:09.192605+02:00","chifflot-7","bmc_node_power_watt",494
"2021-04-05T10:34:14.193582+02:00","chifflot-7","bmc_node_power_watt",494
"2021-04-05T10:34:19.193899+02:00","chifflot-7","bmc_node_power_watt",494
"2021-04-05T10:34:24.194494+02:00","chifflot-7","bmc_node_power_watt",494
"2021-04-05T10:34:29.196327+02:00","chifflot-7","bmc_node_power_watt",494
"2021-04-05T10:34:34.198342+02:00","chifflot-7","bmc_node_power_watt",494
"2021-04-05T10:34:39.199809+02:00","chifflot-7","bmc_node_power_watt",494
"2021-04-05T10:34:44.200546+02:00","chifflot-7","bmc_node_power_watt",494
"2021-04-05T10:34:49.201595+02:00","chifflot-7","bmc_node_power_watt",494
"2021-04-05T10:34:54.202895+02:00","chifflot-7","bmc_node_power_watt",494
"2021-04-05T10:34:59.204064+02:00","chifflot-7","bmc_node_power_watt",494
"2021-04-05T10:35:04.205436+02:00","chifflot-7","bmc_node_power_watt",494
"2021-04-05T10:35:09.206778+02:00","chifflot-7","bmc_node_power_watt",494
"2021-04-05T10:35:14.207921+02:00","chifflot-7","bmc_node_power_watt",494
"2021-04-05T10:35:19.208686+02:00","chifflot-7","bmc_node_power_watt",494
"2021-04-05T10:35:24.209677+02:00","chifflot-7","bmc_node_power_watt",494
"2021-04-05T10:35:29.21076+02:00","chifflot-7","bmc_node_power_watt",494
"2021-04-05T10:35:34.212049+02:00","chifflot-7","bmc_node_power_watt",494
"2021-04-05T10:35:39.213529+02:00","chifflot-7","bmc_node_power_watt",494
"2021-04-05T10:35:44.213851+02:00","chifflot-7","bmc_node_power_watt",494
"2021-04-05T10:35:49.215391+02:00","chifflot-7","bmc_node_power_watt",494
"2021-04-05T10:35:54.216479+02:00","chifflot-7","bmc_node_power_watt",494
"2021-04-05T10:35:59.217122+02:00","chifflot-7","bmc_node_power_watt",494
"2021-04-05T10:36:04.218351+02:00","chifflot-7","bmc_node_power_watt",494
"2021-04-05T10:36:09.219329+02:00","chifflot-7","bmc_node_power_watt",494
"2021-04-05T10:36:14.219761+02:00","chifflot-7","bmc_node_power_watt",494
"2021-04-05T10:36:19.220787+02:00","chifflot-7","bmc_node_power_watt",494
"2021-04-05T10:36:24.221796+02:00","chifflot-7","bmc_node_power_watt",494
"2021-04-05T10:36:29.222393+02:00","chifflot-7","bmc_node_power_watt",494
"2021-04-05T10:36:34.222644+02:00","chifflot-7","bmc_node_power_watt",494
"2021-04-05T10:36:39.223933+02:00","chifflot-7","bmc_node_power_watt",494
"2021-04-05T10:36:44.224933+02:00","chifflot-7","bmc_node_power_watt",494
"2021-04-05T10:36:49.225718+02:00","chifflot-7","bmc_node_power_watt",494
"2021-04-05T10:36:54.226771+02:00","chifflot-7","bmc_node_power_watt",494
"2021-04-05T10:36:59.227525+02:00","chifflot-7","bmc_node_power_watt",520
"2021-04-05T10:37:04.228472+02:00","chifflot-7","bmc_node_power_watt",520
"2021-04-05T10:37:09.229897+02:00","chifflot-7","bmc_node_power_watt",520
"2021-04-05T10:37:14.23079+02:00","chifflot-7","bmc_node_power_watt",520
"2021-04-05T10:37:19.232122+02:00","chifflot-7","bmc_node_power_watt",520
"2021-04-05T10:37:24.233444+02:00","chifflot-7","bmc_node_power_watt",520
"2021-04-05T10:37:29.233929+02:00","chifflot-7","bmc_node_power_watt",520
"2021-04-05T10:37:34.234879+02:00","chifflot-7","bmc_node_power_watt",520
"2021-04-05T10:37:39.23567+02:00","chifflot-7","bmc_node_power_watt",520
"2021-04-05T10:37:44.236611+02:00","chifflot-7","bmc_node_power_watt",494
"2021-04-05T10:37:49.238181+02:00","chifflot-7","bmc_node_power_watt",494
"2021-04-05T10:37:54.238063+02:00","chifflot-7","bmc_node_power_watt",494
"2021-04-05T10:37:59.239195+02:00","chifflot-7","bmc_node_power_watt",494
"2021-04-05T10:38:04.242329+02:00","chifflot-7","bmc_node_power_watt",494
"2021-04-05T10:38:09.249884+02:00","chifflot-7","bmc_node_power_watt",520
"2021-04-05T10:38:14.253075+02:00","chifflot-7","bmc_node_power_watt",520
"2021-04-05T10:38:19.254989+02:00","chifflot-7","bmc_node_power_watt",520
"2021-04-05T10:38:24.25551+02:00","chifflot-7","bmc_node_power_watt",520
"2021-04-05T10:38:29.257401+02:00","chifflot-7","bmc_node_power_watt",520
"2021-04-05T10:38:34.25965+02:00","chifflot-7","bmc_node_power_watt",520
"2021-04-05T10:38:39.261068+02:00","chifflot-7","bmc_node_power_watt",520
"2021-04-05T10:38:44.261793+02:00","chifflot-7","bmc_node_power_watt",520
"2021-04-05T10:38:49.263575+02:00","chifflot-7","bmc_node_power_watt",520
"2021-04-05T10:38:54.26425+02:00","chifflot-7","bmc_node_power_watt",494
"2021-04-05T10:38:59.265958+02:00","chifflot-7","bmc_node_power_watt",494
"2021-04-05T10:39:04.267293+02:00","chifflot-7","bmc_node_power_watt",494
"2021-04-05T10:39:09.268912+02:00","chifflot-7","bmc_node_power_watt",494
"2021-04-05T10:39:14.270251+02:00","chifflot-7","bmc_node_power_watt",494
"2021-04-05T10:39:19.271729+02:00","chifflot-7","bmc_node_power_watt",520
"2021-04-05T10:39:24.27251+02:00","chifflot-7","bmc_node_power_watt",520
"2021-04-05T10:39:29.274179+02:00","chifflot-7","bmc_node_power_watt",520
"2021-04-05T10:39:34.276081+02:00","chifflot-7","bmc_node_power_watt",520
"2021-04-05T10:39:39.277212+02:00","chifflot-7","bmc_node_power_watt",520
"2021-04-05T10:39:44.278825+02:00","chifflot-7","bmc_node_power_watt",520
"2021-04-05T10:39:49.280488+02:00","chifflot-7","bmc_node_power_watt",520
"2021-04-05T10:39:54.281188+02:00","chifflot-7","bmc_node_power_watt",520
"2021-04-05T10:39:59.282393+02:00","chifflot-7","bmc_node_power_watt",520
"2021-04-05T10:40:04.285156+02:00","chifflot-7","bmc_node_power_watt",520
"2021-04-05T10:40:09.287032+02:00","chifflot-7","bmc_node_power_watt",494
"2021-04-05T10:40:14.288332+02:00","chifflot-7","bmc_node_power_watt",494
"2021-04-05T10:40:19.289766+02:00","chifflot-7","bmc_node_power_watt",494
"2021-04-05T10:40:24.291044+02:00","chifflot-7","bmc_node_power_watt",494
"2021-04-05T10:40:29.292828+02:00","chifflot-7","bmc_node_power_watt",494
"2021-04-05T10:40:34.29468+02:00","chifflot-7","bmc_node_power_watt",494
"2021-04-05T10:40:39.295907+02:00","chifflot-7","bmc_node_power_watt",494
"2021-04-05T10:40:44.297298+02:00","chifflot-7","bmc_node_power_watt",494
"2021-04-05T10:40:49.297776+02:00","chifflot-7","bmc_node_power_watt",494
"2021-04-05T10:40:54.298383+02:00","chifflot-7","bmc_node_power_watt",520
"2021-04-05T10:40:59.299766+02:00","chifflot-7","bmc_node_power_watt",520
"2021-04-05T10:41:04.300868+02:00","chifflot-7","bmc_node_power_watt",520
"2021-04-05T10:41:09.302486+02:00","chifflot-7","bmc_node_power_watt",520
"2021-04-05T10:41:14.303725+02:00","chifflot-7","bmc_node_power_watt",520
"2021-04-05T10:41:19.304942+02:00","chifflot-7","bmc_node_power_watt",494
"2021-04-05T10:41:24.306444+02:00","chifflot-7","bmc_node_power_watt",494
"2021-04-05T10:41:29.308066+02:00","chifflot-7","bmc_node_power_watt",494
"2021-04-05T10:41:34.309062+02:00","chifflot-7","bmc_node_power_watt",494
"2021-04-05T10:41:39.309419+02:00","chifflot-7","bmc_node_power_watt",494
"2021-04-05T10:41:44.310515+02:00","chifflot-7","bmc_node_power_watt",520
"2021-04-05T10:41:49.311491+02:00","chifflot-7","bmc_node_power_watt",520
"2021-04-05T10:41:54.312211+02:00","chifflot-7","bmc_node_power_watt",520
"2021-04-05T10:41:59.312976+02:00","chifflot-7","bmc_node_power_watt",520
"2021-04-05T10:42:04.31494+02:00","chifflot-7","bmc_node_power_watt",494
"2021-04-05T10:42:09.316402+02:00","chifflot-7","bmc_node_power_watt",494
"2021-04-05T10:42:14.317783+02:00","chifflot-7","bmc_node_power_watt",494
"2021-04-05T10:42:19.31903+02:00","chifflot-7","bmc_node_power_watt",494
"2021-04-05T10:42:24.320292+02:00","chifflot-7","bmc_node_power_watt",494
"2021-04-05T10:42:29.321583+02:00","chifflot-7","bmc_node_power_watt",520
"2021-04-05T10:42:34.323368+02:00","chifflot-7","bmc_node_power_watt",520
"2021-04-05T10:42:39.324873+02:00","chifflot-7","bmc_node_power_watt",520
"2021-04-05T10:42:44.325911+02:00","chifflot-7","bmc_node_power_watt",520
"2021-04-05T10:42:49.326959+02:00","chifflot-7","bmc_node_power_watt",520
"2021-04-05T10:42:54.327927+02:00","chifflot-7","bmc_node_power_watt",494
"2021-04-05T10:42:59.329269+02:00","chifflot-7","bmc_node_power_watt",494
"2021-04-05T10:43:04.33048+02:00","chifflot-7","bmc_node_power_watt",494
"2021-04-05T10:43:09.331861+02:00","chifflot-7","bmc_node_power_watt",494
"2021-04-05T10:43:14.332576+02:00","chifflot-7","bmc_node_power_watt",494
"2021-04-05T10:43:19.333367+02:00","chifflot-7","bmc_node_power_watt",494
"2021-04-05T10:43:24.334847+02:00","chifflot-7","bmc_node_power_watt",494
"2021-04-05T10:43:29.335995+02:00","chifflot-7","bmc_node_power_watt",494
"2021-04-05T10:43:34.337672+02:00","chifflot-7","bmc_node_power_watt",494
"2021-04-05T10:43:39.33911+02:00","chifflot-7","bmc_node_power_watt",494
"2021-04-05T10:43:44.341488+02:00","chifflot-7","bmc_node_power_watt",494
"2021-04-05T10:43:49.342666+02:00","chifflot-7","bmc_node_power_watt",494
"2021-04-05T10:43:54.34357+02:00","chifflot-7","bmc_node_power_watt",494
"2021-04-05T10:43:59.344193+02:00","chifflot-7","bmc_node_power_watt",494
"2021-04-05T10:44:04.346831+02:00","chifflot-7","bmc_node_power_watt",520
"2021-04-05T10:44:09.347908+02:00","chifflot-7","bmc_node_power_watt",520
"2021-04-05T10:44:14.348334+02:00","chifflot-7","bmc_node_power_watt",520
"2021-04-05T10:44:19.349874+02:00","chifflot-7","bmc_node_power_watt",520
"2021-04-05T10:44:24.350572+02:00","chifflot-7","bmc_node_power_watt",520
"2021-04-05T10:44:29.351865+02:00","chifflot-7","bmc_node_power_watt",494
"2021-04-05T10:44:34.352908+02:00","chifflot-7","bmc_node_power_watt",494
"2021-04-05T10:44:39.354412+02:00","chifflot-7","bmc_node_power_watt",494
"2021-04-05T10:44:44.355242+02:00","chifflot-7","bmc_node_power_watt",494
"2021-04-05T10:44:49.355424+02:00","chifflot-7","bmc_node_power_watt",494
"2021-04-05T10:44:54.356208+02:00","chifflot-7","bmc_node_power_watt",520
"2021-04-05T10:44:59.358534+02:00","chifflot-7","bmc_node_power_watt",520
"2021-04-05T10:45:04.360111+02:00","chifflot-7","bmc_node_power_watt",520
"2021-04-05T10:45:09.360437+02:00","chifflot-7","bmc_node_power_watt",520
"2021-04-05T10:45:14.361231+02:00","chifflot-7","bmc_node_power_watt",494
"2021-04-05T10:45:19.361813+02:00","chifflot-7","bmc_node_power_watt",494
"2021-04-05T10:45:24.363389+02:00","chifflot-7","bmc_node_power_watt",494
"2021-04-05T10:45:29.365645+02:00","chifflot-7","bmc_node_power_watt",494
"2021-04-05T10:45:34.367335+02:00","chifflot-7","bmc_node_power_watt",494
"2021-04-05T10:45:39.368525+02:00","chifflot-7","bmc_node_power_watt",520
"2021-04-05T10:45:44.369736+02:00","chifflot-7","bmc_node_power_watt",520
"2021-04-05T10:45:49.370164+02:00","chifflot-7","bmc_node_power_watt",520
"2021-04-05T10:45:54.372837+02:00","chifflot-7","bmc_node_power_watt",520
"2021-04-05T10:45:59.373622+02:00","chifflot-7","bmc_node_power_watt",520
"2021-04-05T10:46:04.374774+02:00","chifflot-7","bmc_node_power_watt",494
"2021-04-05T10:46:09.375692+02:00","chifflot-7","bmc_node_power_watt",494
"2021-04-05T10:46:14.378289+02:00","chifflot-7","bmc_node_power_watt",494
"2021-04-05T10:46:19.379886+02:00","chifflot-7","bmc_node_power_watt",494
"2021-04-05T10:46:24.381397+02:00","chifflot-7","bmc_node_power_watt",494
"2021-04-05T10:46:29.382363+02:00","chifflot-7","bmc_node_power_watt",520
"2021-04-05T10:46:34.383884+02:00","chifflot-7","bmc_node_power_watt",520
"2021-04-05T10:46:39.384116+02:00","chifflot-7","bmc_node_power_watt",520
"2021-04-05T10:46:44.385115+02:00","chifflot-7","bmc_node_power_watt",520
"2021-04-05T10:46:49.386523+02:00","chifflot-7","bmc_node_power_watt",520
"2021-04-05T10:46:54.387419+02:00","chifflot-7","bmc_node_power_watt",520
"2021-04-05T10:46:59.388799+02:00","chifflot-7","bmc_node_power_watt",520
"2021-04-05T10:47:04.389415+02:00","chifflot-7","bmc_node_power_watt",520
"2021-04-05T10:47:09.390337+02:00","chifflot-7","bmc_node_power_watt",520
"2021-04-05T10:47:14.391687+02:00","chifflot-7","bmc_node_power_watt",520
"2021-04-05T10:47:19.392547+02:00","chifflot-7","bmc_node_power_watt",520
"2021-04-05T10:47:24.393979+02:00","chifflot-7","bmc_node_power_watt",520
"2021-04-05T10:47:29.394354+02:00","chifflot-7","bmc_node_power_watt",520
"2021-04-05T10:47:34.396859+02:00","chifflot-7","bmc_node_power_watt",520
"2021-04-05T10:47:39.398956+02:00","chifflot-7","bmc_node_power_watt",520
"2021-04-05T10:47:44.400229+02:00","chifflot-7","bmc_node_power_watt",520
"2021-04-05T10:47:49.401459+02:00","chifflot-7","bmc_node_power_watt",520
"2021-04-05T10:47:54.402632+02:00","chifflot-7","bmc_node_power_watt",520
"2021-04-05T10:47:59.403983+02:00","chifflot-7","bmc_node_power_watt",520
"2021-04-05T10:48:04.405753+02:00","chifflot-7","bmc_node_power_watt",494
"2021-04-05T10:48:09.40669+02:00","chifflot-7","bmc_node_power_watt",494
"2021-04-05T10:48:14.407828+02:00","chifflot-7","bmc_node_power_watt",494
"2021-04-05T10:48:19.408493+02:00","chifflot-7","bmc_node_power_watt",494
"2021-04-05T10:48:24.409595+02:00","chifflot-7","bmc_node_power_watt",494
"2021-04-05T10:48:29.410743+02:00","chifflot-7","bmc_node_power_watt",494
"2021-04-05T10:48:34.41149+02:00","chifflot-7","bmc_node_power_watt",494
"2021-04-05T10:48:39.413942+02:00","chifflot-7","bmc_node_power_watt",494
"2021-04-05T10:48:44.415501+02:00","chifflot-7","bmc_node_power_watt",494
"2021-04-05T10:48:49.416107+02:00","chifflot-7","bmc_node_power_watt",494
"2021-04-05T10:48:54.416646+02:00","chifflot-7","bmc_node_power_watt",494
"2021-04-05T10:48:59.416875+02:00","chifflot-7","bmc_node_power_watt",494
"2021-04-05T10:49:04.41713+02:00","chifflot-7","bmc_node_power_watt",494
"2021-04-05T10:49:09.417894+02:00","chifflot-7","bmc_node_power_watt",494
"2021-04-05T10:49:14.418525+02:00","chifflot-7","bmc_node_power_watt",494
"2021-04-05T10:49:19.420902+02:00","chifflot-7","bmc_node_power_watt",494
"2021-04-05T10:49:24.423331+02:00","chifflot-7","bmc_node_power_watt",494
"2021-04-05T10:49:29.424627+02:00","chifflot-7","bmc_node_power_watt",494
"2021-04-05T10:49:34.425206+02:00","chifflot-7","bmc_node_power_watt",494
"2021-04-05T10:49:39.426049+02:00","chifflot-7","bmc_node_power_watt",494
"2021-04-05T10:49:44.426669+02:00","chifflot-7","bmc_node_power_watt",494
"2021-04-05T10:49:49.42804+02:00","chifflot-7","bmc_node_power_watt",494
"2021-04-05T10:49:54.428924+02:00","chifflot-7","bmc_node_power_watt",494
"2021-04-05T10:49:59.429786+02:00","chifflot-7","bmc_node_power_watt",494
"2021-04-05T10:50:04.430974+02:00","chifflot-7","bmc_node_power_watt",494
"2021-04-05T10:50:09.432123+02:00","chifflot-7","bmc_node_power_watt",494
"2021-04-05T10:50:14.43375+02:00","chifflot-7","bmc_node_power_watt",494
"2021-04-05T10:50:19.434895+02:00","chifflot-7","bmc_node_power_watt",494
"2021-04-05T10:50:24.435932+02:00","chifflot-7","bmc_node_power_watt",494
"2021-04-05T10:50:29.436477+02:00","chifflot-7","bmc_node_power_watt",494
"2021-04-05T10:50:34.437992+02:00","chifflot-7","bmc_node_power_watt",494
"2021-04-05T10:50:39.437976+02:00","chifflot-7","bmc_node_power_watt",494
