172.16.36.7  : 29.52 13.86 13.90 13.90 13.92 13.91 13.92 13.88 13.85 13.86
172.16.66.51 : 0.14 0.12 0.14 0.14 0.16 0.15 0.15 0.15 0.12 0.14
172.16.66.53 : 0.22 0.22 0.21 0.20 0.21 0.21 0.21 0.19 0.21 0.21
172.16.66.54 : 0.22 0.22 0.19 0.21 0.20 0.21 0.21 0.20 0.20 0.18
172.16.66.55 : 0.20 0.18 0.21 0.21 0.20 0.20 0.18 0.20 0.21 0.21
172.16.66.56 : 0.20 0.18 0.21 0.20 0.21 0.20 0.20 0.20 0.22 0.20
172.16.66.57 : 0.21 0.17 0.18 0.17 0.20 0.20 0.22 0.16 0.21 0.20
172.16.66.58 : 0.19 0.18 0.21 0.20 0.20 0.21 0.21 0.18 0.19 0.16
172.16.66.59 : 0.04 0.03 0.03 0.03 0.03 0.03 0.03 0.03 0.03 0.03
172.16.66.6  : 0.23 0.21 0.20 0.21 0.21 0.21 0.21 0.19 0.21 0.20
172.16.66.60 : 0.30 0.20 0.20 0.20 0.21 0.22 0.20 0.21 0.20 0.20
172.16.66.61 : 0.21 0.21 0.20 0.20 0.21 0.19 0.19 0.20 0.19 0.19
172.16.66.62 : 0.41 0.21 0.21 0.21 0.20 0.21 0.20 0.18 0.20 0.19
172.16.66.63 : 0.30 0.21 0.20 0.20 0.20 0.21 0.20 0.21 0.20 0.20
172.16.66.64 : 0.38 0.20 0.21 0.20 0.18 0.20 0.21 0.21 0.21 0.20
172.16.66.65 : 0.36 0.20 0.22 0.21 0.18 0.20 0.18 0.19 0.18 0.21
172.16.66.66 : 0.38 0.21 0.21 0.19 0.21 0.20 0.20 0.19 0.20 0.18
172.16.66.67 : 0.38 0.18 0.20 0.21 0.20 0.20 0.14 0.21 0.20 0.20
172.16.66.68 : 0.40 0.21 0.21 0.23 0.21 0.21 0.21 0.20 0.21 0.23
172.16.66.69 : 0.25 0.19 0.21 0.19 0.20 0.22 0.21 0.20 0.20 0.23
172.16.66.7  : 0.35 0.21 0.21 0.20 0.11 0.20 0.21 0.20 0.18 0.22
172.16.66.70 : 0.32 0.17 0.20 0.21 0.20 0.21 0.21 0.21 0.20 0.21
172.16.66.71 : 0.39 0.22 0.20 0.21 0.21 0.20 0.20 0.20 0.21 0.21
172.16.66.72 : 0.38 0.21 0.13 0.20 0.21 0.21 0.21 0.22 0.20 0.20
172.16.66.73 : 0.39 0.19 0.19 0.20 0.21 0.19 0.20 0.21 0.20 0.20
172.16.66.74 : 0.36 0.19 0.21 0.20 0.20 0.21 0.21 0.24 0.20 0.18
172.16.66.75 : 0.35 0.21 0.21 0.20 0.20 0.20 0.20 0.21 0.20 0.21
172.16.66.76 : 0.37 0.20 0.18 0.22 0.21 0.20 0.20 0.21 0.20 0.20
172.16.66.77 : 0.38 0.20 0.21 0.23 0.21 0.21 0.21 0.23 0.21 0.21
172.16.66.78 : 0.38 0.18 0.18 0.20 0.18 0.18 0.21 0.21 0.21 0.18
172.16.66.79 : 0.34 0.15 0.16 0.16 0.16 0.16 0.16 0.16 0.16 0.15
172.16.66.8  : 0.38 0.17 0.20 0.21 0.22 0.20 0.20 0.20 0.20 0.20
172.16.66.80 : 0.39 0.23 0.20 0.20 0.20 0.20 0.20 0.21 0.21 0.20
172.16.66.81 : 0.39 0.21 0.21 0.19 0.20 0.23 0.20 0.23 0.20 0.21
172.16.66.82 : 0.32 0.20 0.20 0.19 0.21 0.21 0.21 0.20 0.20 0.21
172.16.66.83 : 0.33 0.21 0.20 0.20 0.21 0.20 0.21 0.15 0.20 0.20
172.16.66.84 : 0.30 0.20 0.24 0.21 0.19 0.11 0.20 0.20 0.20 0.21
172.16.66.85 : 0.31 0.17 0.16 0.16 0.18 0.16 0.17 0.21 0.21 0.21
172.16.66.86 : 0.25 0.21 0.21 0.22 0.20 0.20 0.21 0.20 0.21 0.21
172.16.66.87 : 0.18 0.20 0.16 0.16 0.19 0.11 0.21 0.20 0.20 0.21
172.16.66.88 : 0.32 0.20 0.14 0.19 0.17 0.17 0.17 0.18 0.17 0.19
172.16.66.9  : 0.31 0.16 0.16 0.15 0.17 0.13 0.22 0.22 0.20 0.20

      42 targets
      42 alive
       0 unreachable
       0 unknown addresses

       0 timeouts (waiting for response)
     420 ICMP Echos sent
     420 ICMP Echo Replies received
       0 other ICMP received

 0.03 ms (min round trip time)
 0.56 ms (avg round trip time)
 29.5 ms (max round trip time)
        9.417 sec (elapsed real time)

