172.16.36.7  : 9.76 9.76 9.77 9.76 9.74 9.72 9.73 9.76 9.75 9.71
172.16.66.53 : 0.04 0.03 0.03 0.03 0.03 0.03 0.03 0.03 0.03 0.03
172.16.66.54 : 0.24 0.16 0.06 0.20 0.21 0.20 0.20 0.21 0.20 0.20
172.16.66.55 : 1.99 0.21 0.21 0.21 0.21 0.21 0.20 0.22 0.18 0.06
172.16.66.56 : 2.30 0.21 0.20 0.20 0.20 0.21 0.21 0.20 0.22 0.20
172.16.66.57 : 4.66 0.19 0.19 0.13 0.20 0.21 0.20 0.21 0.20 0.22
172.16.66.58 : 0.14 0.18 0.18 0.21 0.20 0.21 0.17 0.19 0.20 0.20
172.16.66.59 : 0.21 0.20 0.18 0.21 0.20 0.22 0.21 0.21 0.22 0.21
172.16.66.6  : 0.13 0.20 0.21 0.21 0.21 0.21 0.21 0.21 0.21 0.21
172.16.66.60 : 0.21 0.21 0.20 0.20 0.17 0.22 0.21 0.21 0.21 0.19
172.16.66.61 : 0.20 0.22 0.20 0.20 0.19 0.21 0.21 0.21 0.20 0.20
172.16.66.62 : 0.14 0.20 0.20 0.20 0.19 0.21 0.22 0.21 0.20 0.20
172.16.66.63 : 0.21 0.21 0.20 0.21 0.20 0.17 0.17 0.14 0.16 0.16
172.16.66.64 : 0.22 0.21 0.22 0.21 0.17 0.21 0.19 0.22 0.20 0.20
172.16.66.65 : 0.20 0.21 0.20 0.21 0.21 0.14 0.20 0.20 0.21 0.21
172.16.66.66 : 0.20 0.21 0.22 0.21 0.21 0.22 0.20 0.21 0.21 0.20
172.16.66.67 : 0.18 0.20 0.22 0.21 0.16 0.16 0.16 0.17 0.16 0.13
172.16.66.68 : 0.16 0.17 0.16 0.18 0.22 0.20 0.22 0.21 0.20 0.21
172.16.66.69 : 0.23 0.20 0.20 0.21 0.20 0.20 0.21 0.21 0.18 0.21
172.16.66.7  : 0.19 0.21 0.22 0.21 0.19 0.21 0.20 0.21 0.21 0.20
172.16.66.70 : 0.15 0.21 0.21 0.21 0.21 0.21 0.21 0.17 0.21 0.22
172.16.66.72 : 0.25 0.22 0.21 0.21 0.21 0.20 0.21 0.21 0.20 0.21
172.16.66.73 : 0.24 0.19 0.20 0.24 0.21 0.20 0.21 0.20 0.21 0.22
172.16.66.74 : 0.21 0.22 0.21 0.21 0.22 0.21 0.21 0.22 0.15 0.13
172.16.66.75 : 0.17 0.18 0.21 0.19 0.17 0.22 0.21 0.21 0.21 0.21
172.16.66.76 : 0.21 0.21 0.21 0.21 0.21 0.21 0.20 0.21 0.22 0.20
172.16.66.77 : 0.22 0.22 0.20 0.20 0.21 0.21 0.20 0.21 0.20 0.18
172.16.66.78 : 0.22 0.21 0.21 0.20 0.20 0.21 0.21 0.20 0.20 0.21
172.16.66.79 : 0.25 0.20 0.22 0.21 0.20 0.22 0.21 0.20 0.20 0.21
172.16.66.8  : 0.22 0.21 0.21 0.18 0.20 0.20 0.22 0.21 0.20 0.21
172.16.66.80 : 0.24 0.21 0.20 0.22 0.21 0.20 0.22 0.19 0.21 0.20
172.16.66.81 : 0.24 0.21 0.21 0.21 0.16 0.17 0.16 0.16 0.16 0.15
172.16.66.82 : 0.21 0.20 0.18 0.21 0.21 0.21 0.22 0.22 0.20 0.21
172.16.66.83 : 0.25 0.20 0.21 0.21 0.21 0.21 0.22 0.21 0.20 0.18
172.16.66.84 : 0.25 0.22 0.22 0.18 0.20 0.21 0.21 0.20 0.21 0.21
172.16.66.85 : 0.23 0.20 0.21 0.21 0.20 0.23 0.21 0.20 0.20 0.20
172.16.66.86 : 0.22 0.21 0.21 0.22 0.17 0.22 0.21 0.21 0.21 0.22
172.16.66.87 : 0.25 0.20 0.20 0.21 0.21 0.21 0.21 0.21 0.21 0.21
172.16.66.88 : 0.26 0.22 0.20 0.20 0.19 0.22 0.22 0.20 0.22 0.21
172.16.66.9  : 0.25 0.22 0.21 0.20 0.20 0.21 0.21 0.22 0.20 0.21
172.16.66.90 : 0.24 0.22 0.21 0.21 0.20 0.22 0.22 0.21 0.20 0.20
172.16.66.91 : 0.25 0.21 0.20 0.22 0.21 0.21 0.21 0.20 0.21 0.21

      42 targets
      42 alive
       0 unreachable
       0 unknown addresses

       0 timeouts (waiting for response)
     420 ICMP Echos sent
     420 ICMP Echo Replies received
       0 other ICMP received

 0.03 ms (min round trip time)
 0.44 ms (avg round trip time)
 9.77 ms (max round trip time)
        9.420 sec (elapsed real time)

