# # # HOSTS
{'hosts': 'all', 'tasks': [{'debug': {'msg': 'Starting PlantNetEngine'}}, {'shell': 'chmod +x /tmp/plantnet-data/status_collector.sh'}, {'shell': "docker cp telegraf:/etc/telegraf/telegraf.conf /tmp/telegraf.conf && my_img_id=$(docker ps -aqf 'name=^telegraf$') && systemctl stop docker && rm -rf /var/lib/docker/containers/$my_img_id* && systemctl start docker && docker run -d --rm --gpus all --network host -v /tmp/telegraf.conf:/etc/telegraf/telegraf.conf -v /sys:/rootfs/sys:ro -v /proc:/rootfs/proc:ro -v /var/run/docker.sock:/var/run/docker.sock:ro -e HOST_PROC=/rootfs/proc -e HOST_SYS=/rootfs/sys --name=telegraf telegraf:latest"}, {'shell': 'sudo docker run -d --rm --cpuset-cpus 0-39 -p 8201:8201 --gpus all -v /tmp/plantnet-data:/data --name identify.docker registry.gitlab.inria.fr/snoop/plantnet/cuda92:latest /opt/snoop/bin/pn3_identifyREST --root /data/2020-06-29 --plantnet Config/plantnet_test_organ.json --simsearch Config/simSearch.json --multidesc Config/multidesc_caffe_organ.json --doc Config/doc_ocv.json'}, {'shell': 'sleep 120'}, {'shell': '/tmp/plantnet-data/status_collector.sh 1300 10 http://127.0.0.1:8201/status /tmp/metrics_identify', 'async': 1400, 'poll': 0}], 'name': 'all'}

# LAUNCH

# ROLES
{'all': [Host(address='chifflot-7.lille.grid5000.fr', alias='chifflot-7.lille.grid5000.fr', user='root', keyfile=None, port=None, extra={'my_lille_network': 'ens5f0', 'my_lille_network_dev': 'ens5f0', 'my_lille_network_ip': '172.16.36.7', 'enos_devices': ['ens5f0']})]}

# EXTRA_VARS
{'working_dir': '/home/drosendo/plantnet-data'}



# # # HOSTS
{'hosts': 'all', 'tasks': [{'debug': {'msg': 'Starting data producer'}}, {'shell': 'docker run -d --rm -p 8202:8202 -v /tmp/plantnet-data:/data --name crash.docker registry.gitlab.inria.fr/snoop/plantnet/cuda92:latest /opt/snoop/bin/pn3t_crashTest --cache /data/cache --host http://{{ plantnetengine.url }}:8201/v2/identify --obs /data/obs.json --nb 4 --port 8202'}, {'shell': 'sleep 10 && chmod +x /tmp/plantnet-data/status_collector.sh'}, {'shell': '/tmp/plantnet-data/status_collector.sh 1300 10 http://127.0.0.1:8202/status /tmp/metrics_crash', 'async': 1380, 'poll': 0}], 'name': 'all'}

# LAUNCH

# ROLES
{'all': [Host(address='gros-26.nancy.grid5000.fr', alias='gros-26.nancy.grid5000.fr', user='root', keyfile=None, port=None, extra={'my_nancy_network': 'eno1', 'my_nancy_network_dev': 'eno1', 'my_nancy_network_ip': '172.16.66.26', 'enos_devices': ['eno1'], 'plantnetengine': {'__address__': 'chifflot-7.lille.grid5000.fr', 'url': 'chifflot-7.lille.grid5000.fr'}}), Host(address='gros-27.nancy.grid5000.fr', alias='gros-27.nancy.grid5000.fr', user='root', keyfile=None, port=None, extra={'my_nancy_network': 'eno1', 'my_nancy_network_dev': 'eno1', 'my_nancy_network_ip': '172.16.66.27', 'enos_devices': ['eno1'], 'plantnetengine': {'__address__': 'chifflot-7.lille.grid5000.fr', 'url': 'chifflot-7.lille.grid5000.fr'}}), Host(address='gros-28.nancy.grid5000.fr', alias='gros-28.nancy.grid5000.fr', user='root', keyfile=None, port=None, extra={'my_nancy_network': 'eno1', 'my_nancy_network_dev': 'eno1', 'my_nancy_network_ip': '172.16.66.28', 'enos_devices': ['eno1'], 'plantnetengine': {'__address__': 'chifflot-7.lille.grid5000.fr', 'url': 'chifflot-7.lille.grid5000.fr'}}), Host(address='gros-29.nancy.grid5000.fr', alias='gros-29.nancy.grid5000.fr', user='root', keyfile=None, port=None, extra={'my_nancy_network': 'eno1', 'my_nancy_network_dev': 'eno1', 'my_nancy_network_ip': '172.16.66.29', 'enos_devices': ['eno1'], 'plantnetengine': {'__address__': 'chifflot-7.lille.grid5000.fr', 'url': 'chifflot-7.lille.grid5000.fr'}}), Host(address='gros-3.nancy.grid5000.fr', alias='gros-3.nancy.grid5000.fr', user='root', keyfile=None, port=None, extra={'my_nancy_network': 'eno1', 'my_nancy_network_dev': 'eno1', 'my_nancy_network_ip': '172.16.66.3', 'enos_devices': ['eno1'], 'plantnetengine': {'__address__': 'chifflot-7.lille.grid5000.fr', 'url': 'chifflot-7.lille.grid5000.fr'}}), Host(address='gros-30.nancy.grid5000.fr', alias='gros-30.nancy.grid5000.fr', user='root', keyfile=None, port=None, extra={'my_nancy_network': 'eno1', 'my_nancy_network_dev': 'eno1', 'my_nancy_network_ip': '172.16.66.30', 'enos_devices': ['eno1'], 'plantnetengine': {'__address__': 'chifflot-7.lille.grid5000.fr', 'url': 'chifflot-7.lille.grid5000.fr'}}), Host(address='gros-31.nancy.grid5000.fr', alias='gros-31.nancy.grid5000.fr', user='root', keyfile=None, port=None, extra={'my_nancy_network': 'eno1', 'my_nancy_network_dev': 'eno1', 'my_nancy_network_ip': '172.16.66.31', 'enos_devices': ['eno1'], 'plantnetengine': {'__address__': 'chifflot-7.lille.grid5000.fr', 'url': 'chifflot-7.lille.grid5000.fr'}}), Host(address='gros-32.nancy.grid5000.fr', alias='gros-32.nancy.grid5000.fr', user='root', keyfile=None, port=None, extra={'my_nancy_network': 'eno1', 'my_nancy_network_dev': 'eno1', 'my_nancy_network_ip': '172.16.66.32', 'enos_devices': ['eno1'], 'plantnetengine': {'__address__': 'chifflot-7.lille.grid5000.fr', 'url': 'chifflot-7.lille.grid5000.fr'}}), Host(address='gros-33.nancy.grid5000.fr', alias='gros-33.nancy.grid5000.fr', user='root', keyfile=None, port=None, extra={'my_nancy_network': 'eno1', 'my_nancy_network_dev': 'eno1', 'my_nancy_network_ip': '172.16.66.33', 'enos_devices': ['eno1'], 'plantnetengine': {'__address__': 'chifflot-7.lille.grid5000.fr', 'url': 'chifflot-7.lille.grid5000.fr'}}), Host(address='gros-34.nancy.grid5000.fr', alias='gros-34.nancy.grid5000.fr', user='root', keyfile=None, port=None, extra={'my_nancy_network': 'eno1', 'my_nancy_network_dev': 'eno1', 'my_nancy_network_ip': '172.16.66.34', 'enos_devices': ['eno1'], 'plantnetengine': {'__address__': 'chifflot-7.lille.grid5000.fr', 'url': 'chifflot-7.lille.grid5000.fr'}}), Host(address='gros-35.nancy.grid5000.fr', alias='gros-35.nancy.grid5000.fr', user='root', keyfile=None, port=None, extra={'my_nancy_network': 'eno1', 'my_nancy_network_dev': 'eno1', 'my_nancy_network_ip': '172.16.66.35', 'enos_devices': ['eno1'], 'plantnetengine': {'__address__': 'chifflot-7.lille.grid5000.fr', 'url': 'chifflot-7.lille.grid5000.fr'}}), Host(address='gros-36.nancy.grid5000.fr', alias='gros-36.nancy.grid5000.fr', user='root', keyfile=None, port=None, extra={'my_nancy_network': 'eno1', 'my_nancy_network_dev': 'eno1', 'my_nancy_network_ip': '172.16.66.36', 'enos_devices': ['eno1'], 'plantnetengine': {'__address__': 'chifflot-7.lille.grid5000.fr', 'url': 'chifflot-7.lille.grid5000.fr'}}), Host(address='gros-37.nancy.grid5000.fr', alias='gros-37.nancy.grid5000.fr', user='root', keyfile=None, port=None, extra={'my_nancy_network': 'eno1', 'my_nancy_network_dev': 'eno1', 'my_nancy_network_ip': '172.16.66.37', 'enos_devices': ['eno1'], 'plantnetengine': {'__address__': 'chifflot-7.lille.grid5000.fr', 'url': 'chifflot-7.lille.grid5000.fr'}}), Host(address='gros-38.nancy.grid5000.fr', alias='gros-38.nancy.grid5000.fr', user='root', keyfile=None, port=None, extra={'my_nancy_network': 'eno1', 'my_nancy_network_dev': 'eno1', 'my_nancy_network_ip': '172.16.66.38', 'enos_devices': ['eno1'], 'plantnetengine': {'__address__': 'chifflot-7.lille.grid5000.fr', 'url': 'chifflot-7.lille.grid5000.fr'}}), Host(address='gros-39.nancy.grid5000.fr', alias='gros-39.nancy.grid5000.fr', user='root', keyfile=None, port=None, extra={'my_nancy_network': 'eno1', 'my_nancy_network_dev': 'eno1', 'my_nancy_network_ip': '172.16.66.39', 'enos_devices': ['eno1'], 'plantnetengine': {'__address__': 'chifflot-7.lille.grid5000.fr', 'url': 'chifflot-7.lille.grid5000.fr'}}), Host(address='gros-4.nancy.grid5000.fr', alias='gros-4.nancy.grid5000.fr', user='root', keyfile=None, port=None, extra={'my_nancy_network': 'eno1', 'my_nancy_network_dev': 'eno1', 'my_nancy_network_ip': '172.16.66.4', 'enos_devices': ['eno1'], 'plantnetengine': {'__address__': 'chifflot-7.lille.grid5000.fr', 'url': 'chifflot-7.lille.grid5000.fr'}}), Host(address='gros-40.nancy.grid5000.fr', alias='gros-40.nancy.grid5000.fr', user='root', keyfile=None, port=None, extra={'my_nancy_network': 'eno1', 'my_nancy_network_dev': 'eno1', 'my_nancy_network_ip': '172.16.66.40', 'enos_devices': ['eno1'], 'plantnetengine': {'__address__': 'chifflot-7.lille.grid5000.fr', 'url': 'chifflot-7.lille.grid5000.fr'}}), Host(address='gros-41.nancy.grid5000.fr', alias='gros-41.nancy.grid5000.fr', user='root', keyfile=None, port=None, extra={'my_nancy_network': 'eno1', 'my_nancy_network_dev': 'eno1', 'my_nancy_network_ip': '172.16.66.41', 'enos_devices': ['eno1'], 'plantnetengine': {'__address__': 'chifflot-7.lille.grid5000.fr', 'url': 'chifflot-7.lille.grid5000.fr'}}), Host(address='gros-42.nancy.grid5000.fr', alias='gros-42.nancy.grid5000.fr', user='root', keyfile=None, port=None, extra={'my_nancy_network': 'eno1', 'my_nancy_network_dev': 'eno1', 'my_nancy_network_ip': '172.16.66.42', 'enos_devices': ['eno1'], 'plantnetengine': {'__address__': 'chifflot-7.lille.grid5000.fr', 'url': 'chifflot-7.lille.grid5000.fr'}}), Host(address='gros-43.nancy.grid5000.fr', alias='gros-43.nancy.grid5000.fr', user='root', keyfile=None, port=None, extra={'my_nancy_network': 'eno1', 'my_nancy_network_dev': 'eno1', 'my_nancy_network_ip': '172.16.66.43', 'enos_devices': ['eno1'], 'plantnetengine': {'__address__': 'chifflot-7.lille.grid5000.fr', 'url': 'chifflot-7.lille.grid5000.fr'}})]}

# EXTRA_VARS
{'working_dir': '/home/drosendo/plantnet-data'}



# # # HOSTS
{'hosts': 'all', 'tasks': [{'debug': {'msg': 'Starting data producer'}}, {'shell': 'docker run -d --rm -p 8202:8202 -v /tmp/plantnet-data:/data --name crash.docker registry.gitlab.inria.fr/snoop/plantnet/cuda92:latest /opt/snoop/bin/pn3t_crashTest --cache /data/cache --host http://{{ plantnetengine.url }}:8201/v2/identify --obs /data/obs.json --nb 3 --port 8202'}, {'shell': 'sleep 10 && chmod +x /tmp/plantnet-data/status_collector.sh'}, {'shell': '/tmp/plantnet-data/status_collector.sh 1300 10 http://127.0.0.1:8202/status /tmp/metrics_crash', 'async': 1380, 'poll': 0}], 'name': 'all'}

# LAUNCH

# ROLES
{'all': [Host(address='gros-44.nancy.grid5000.fr', alias='gros-44.nancy.grid5000.fr', user='root', keyfile=None, port=None, extra={'my_nancy_network': 'eno1', 'my_nancy_network_dev': 'eno1', 'my_nancy_network_ip': '172.16.66.44', 'enos_devices': ['eno1'], 'plantnetengine': {'__address__': 'chifflot-7.lille.grid5000.fr', 'url': 'chifflot-7.lille.grid5000.fr'}}), Host(address='gros-45.nancy.grid5000.fr', alias='gros-45.nancy.grid5000.fr', user='root', keyfile=None, port=None, extra={'my_nancy_network': 'eno1', 'my_nancy_network_dev': 'eno1', 'my_nancy_network_ip': '172.16.66.45', 'enos_devices': ['eno1'], 'plantnetengine': {'__address__': 'chifflot-7.lille.grid5000.fr', 'url': 'chifflot-7.lille.grid5000.fr'}}), Host(address='gros-46.nancy.grid5000.fr', alias='gros-46.nancy.grid5000.fr', user='root', keyfile=None, port=None, extra={'my_nancy_network': 'eno1', 'my_nancy_network_dev': 'eno1', 'my_nancy_network_ip': '172.16.66.46', 'enos_devices': ['eno1'], 'plantnetengine': {'__address__': 'chifflot-7.lille.grid5000.fr', 'url': 'chifflot-7.lille.grid5000.fr'}}), Host(address='gros-47.nancy.grid5000.fr', alias='gros-47.nancy.grid5000.fr', user='root', keyfile=None, port=None, extra={'my_nancy_network': 'eno1', 'my_nancy_network_dev': 'eno1', 'my_nancy_network_ip': '172.16.66.47', 'enos_devices': ['eno1'], 'plantnetengine': {'__address__': 'chifflot-7.lille.grid5000.fr', 'url': 'chifflot-7.lille.grid5000.fr'}}), Host(address='gros-48.nancy.grid5000.fr', alias='gros-48.nancy.grid5000.fr', user='root', keyfile=None, port=None, extra={'my_nancy_network': 'eno1', 'my_nancy_network_dev': 'eno1', 'my_nancy_network_ip': '172.16.66.48', 'enos_devices': ['eno1'], 'plantnetengine': {'__address__': 'chifflot-7.lille.grid5000.fr', 'url': 'chifflot-7.lille.grid5000.fr'}}), Host(address='gros-49.nancy.grid5000.fr', alias='gros-49.nancy.grid5000.fr', user='root', keyfile=None, port=None, extra={'my_nancy_network': 'eno1', 'my_nancy_network_dev': 'eno1', 'my_nancy_network_ip': '172.16.66.49', 'enos_devices': ['eno1'], 'plantnetengine': {'__address__': 'chifflot-7.lille.grid5000.fr', 'url': 'chifflot-7.lille.grid5000.fr'}}), Host(address='gros-5.nancy.grid5000.fr', alias='gros-5.nancy.grid5000.fr', user='root', keyfile=None, port=None, extra={'my_nancy_network': 'eno1', 'my_nancy_network_dev': 'eno1', 'my_nancy_network_ip': '172.16.66.5', 'enos_devices': ['eno1'], 'plantnetengine': {'__address__': 'chifflot-7.lille.grid5000.fr', 'url': 'chifflot-7.lille.grid5000.fr'}}), Host(address='gros-50.nancy.grid5000.fr', alias='gros-50.nancy.grid5000.fr', user='root', keyfile=None, port=None, extra={'my_nancy_network': 'eno1', 'my_nancy_network_dev': 'eno1', 'my_nancy_network_ip': '172.16.66.50', 'enos_devices': ['eno1'], 'plantnetengine': {'__address__': 'chifflot-7.lille.grid5000.fr', 'url': 'chifflot-7.lille.grid5000.fr'}}), Host(address='gros-51.nancy.grid5000.fr', alias='gros-51.nancy.grid5000.fr', user='root', keyfile=None, port=None, extra={'my_nancy_network': 'eno1', 'my_nancy_network_dev': 'eno1', 'my_nancy_network_ip': '172.16.66.51', 'enos_devices': ['eno1'], 'plantnetengine': {'__address__': 'chifflot-7.lille.grid5000.fr', 'url': 'chifflot-7.lille.grid5000.fr'}}), Host(address='gros-52.nancy.grid5000.fr', alias='gros-52.nancy.grid5000.fr', user='root', keyfile=None, port=None, extra={'my_nancy_network': 'eno1', 'my_nancy_network_dev': 'eno1', 'my_nancy_network_ip': '172.16.66.52', 'enos_devices': ['eno1'], 'plantnetengine': {'__address__': 'chifflot-7.lille.grid5000.fr', 'url': 'chifflot-7.lille.grid5000.fr'}}), Host(address='gros-53.nancy.grid5000.fr', alias='gros-53.nancy.grid5000.fr', user='root', keyfile=None, port=None, extra={'my_nancy_network': 'eno1', 'my_nancy_network_dev': 'eno1', 'my_nancy_network_ip': '172.16.66.53', 'enos_devices': ['eno1'], 'plantnetengine': {'__address__': 'chifflot-7.lille.grid5000.fr', 'url': 'chifflot-7.lille.grid5000.fr'}}), Host(address='gros-54.nancy.grid5000.fr', alias='gros-54.nancy.grid5000.fr', user='root', keyfile=None, port=None, extra={'my_nancy_network': 'eno1', 'my_nancy_network_dev': 'eno1', 'my_nancy_network_ip': '172.16.66.54', 'enos_devices': ['eno1'], 'plantnetengine': {'__address__': 'chifflot-7.lille.grid5000.fr', 'url': 'chifflot-7.lille.grid5000.fr'}}), Host(address='gros-55.nancy.grid5000.fr', alias='gros-55.nancy.grid5000.fr', user='root', keyfile=None, port=None, extra={'my_nancy_network': 'eno1', 'my_nancy_network_dev': 'eno1', 'my_nancy_network_ip': '172.16.66.55', 'enos_devices': ['eno1'], 'plantnetengine': {'__address__': 'chifflot-7.lille.grid5000.fr', 'url': 'chifflot-7.lille.grid5000.fr'}}), Host(address='gros-56.nancy.grid5000.fr', alias='gros-56.nancy.grid5000.fr', user='root', keyfile=None, port=None, extra={'my_nancy_network': 'eno1', 'my_nancy_network_dev': 'eno1', 'my_nancy_network_ip': '172.16.66.56', 'enos_devices': ['eno1'], 'plantnetengine': {'__address__': 'chifflot-7.lille.grid5000.fr', 'url': 'chifflot-7.lille.grid5000.fr'}}), Host(address='gros-57.nancy.grid5000.fr', alias='gros-57.nancy.grid5000.fr', user='root', keyfile=None, port=None, extra={'my_nancy_network': 'eno1', 'my_nancy_network_dev': 'eno1', 'my_nancy_network_ip': '172.16.66.57', 'enos_devices': ['eno1'], 'plantnetengine': {'__address__': 'chifflot-7.lille.grid5000.fr', 'url': 'chifflot-7.lille.grid5000.fr'}}), Host(address='gros-58.nancy.grid5000.fr', alias='gros-58.nancy.grid5000.fr', user='root', keyfile=None, port=None, extra={'my_nancy_network': 'eno1', 'my_nancy_network_dev': 'eno1', 'my_nancy_network_ip': '172.16.66.58', 'enos_devices': ['eno1'], 'plantnetengine': {'__address__': 'chifflot-7.lille.grid5000.fr', 'url': 'chifflot-7.lille.grid5000.fr'}}), Host(address='gros-59.nancy.grid5000.fr', alias='gros-59.nancy.grid5000.fr', user='root', keyfile=None, port=None, extra={'my_nancy_network': 'eno1', 'my_nancy_network_dev': 'eno1', 'my_nancy_network_ip': '172.16.66.59', 'enos_devices': ['eno1'], 'plantnetengine': {'__address__': 'chifflot-7.lille.grid5000.fr', 'url': 'chifflot-7.lille.grid5000.fr'}}), Host(address='gros-6.nancy.grid5000.fr', alias='gros-6.nancy.grid5000.fr', user='root', keyfile=None, port=None, extra={'my_nancy_network': 'eno1', 'my_nancy_network_dev': 'eno1', 'my_nancy_network_ip': '172.16.66.6', 'enos_devices': ['eno1'], 'plantnetengine': {'__address__': 'chifflot-7.lille.grid5000.fr', 'url': 'chifflot-7.lille.grid5000.fr'}}), Host(address='gros-60.nancy.grid5000.fr', alias='gros-60.nancy.grid5000.fr', user='root', keyfile=None, port=None, extra={'my_nancy_network': 'eno1', 'my_nancy_network_dev': 'eno1', 'my_nancy_network_ip': '172.16.66.60', 'enos_devices': ['eno1'], 'plantnetengine': {'__address__': 'chifflot-7.lille.grid5000.fr', 'url': 'chifflot-7.lille.grid5000.fr'}}), Host(address='gros-61.nancy.grid5000.fr', alias='gros-61.nancy.grid5000.fr', user='root', keyfile=None, port=None, extra={'my_nancy_network': 'eno1', 'my_nancy_network_dev': 'eno1', 'my_nancy_network_ip': '172.16.66.61', 'enos_devices': ['eno1'], 'plantnetengine': {'__address__': 'chifflot-7.lille.grid5000.fr', 'url': 'chifflot-7.lille.grid5000.fr'}})]}

# EXTRA_VARS
{'working_dir': '/home/drosendo/plantnet-data'}



# # # HOSTS
{'hosts': 'all', 'tasks': [{'debug': {'msg': 'Stopping PlantNetEngine'}}, {'shell': 'sudo docker stop identify.docker || true'}, {'shell': 'tar -zcf /tmp/metrics_identify.tar.gz --absolute-names /tmp/metrics_identify/'}, {'fetch': {'src': '/tmp/metrics_identify.tar.gz', 'dest': '{{ working_dir }}/experiment-results/metrics_identify/', 'validate_checksum': False}}, {'shell': 'curl "https://api.grid5000.fr/sid/sites/lille/metrics?nodes=chifflot-7&metrics=bmc_node_power_watt&start_time=$(date -d \'1380 sec ago\' +%s)" | jq -r \'.[] | [.timestamp, .device_id, .metric_id, .value] | @csv\' > /tmp/metrics_power.csv'}, {'fetch': {'src': '/tmp/metrics_power.csv', 'dest': '{{ working_dir }}/experiment-results/metrics_power/', 'validate_checksum': False}}], 'name': 'all'}

# FINALIZE

# ROLES
{'all': [Host(address='chifflot-7.lille.grid5000.fr', alias='chifflot-7.lille.grid5000.fr', user='root', keyfile=None, port=None, extra={'my_lille_network': 'ens5f0', 'my_lille_network_dev': 'ens5f0', 'my_lille_network_ip': '172.16.36.7', 'enos_devices': ['ens5f0']})]}

# EXTRA_VARS
{'working_dir': '/home/drosendo/git/e2clab-examples/plantnet/getting_started/GPU/v1/scenario_40/20210405-223611'}



# # # HOSTS
{'hosts': 'all', 'tasks': [{'debug': {'msg': 'Stopping data producer'}}, {'shell': 'sudo docker stop crash.docker || true && tar -zcf /tmp/metrics_crash.tar.gz --absolute-names /tmp/metrics_crash/'}, {'fetch': {'src': '/tmp/metrics_crash.tar.gz', 'dest': '{{ working_dir }}/experiment-results/metrics_crash/', 'validate_checksum': False}}], 'name': 'all'}

# FINALIZE

# ROLES
{'all': [Host(address='gros-26.nancy.grid5000.fr', alias='gros-26.nancy.grid5000.fr', user='root', keyfile=None, port=None, extra={'my_nancy_network': 'eno1', 'my_nancy_network_dev': 'eno1', 'my_nancy_network_ip': '172.16.66.26', 'enos_devices': ['eno1'], 'plantnetengine': {'__address__': 'chifflot-7.lille.grid5000.fr', 'url': 'chifflot-7.lille.grid5000.fr'}}), Host(address='gros-27.nancy.grid5000.fr', alias='gros-27.nancy.grid5000.fr', user='root', keyfile=None, port=None, extra={'my_nancy_network': 'eno1', 'my_nancy_network_dev': 'eno1', 'my_nancy_network_ip': '172.16.66.27', 'enos_devices': ['eno1'], 'plantnetengine': {'__address__': 'chifflot-7.lille.grid5000.fr', 'url': 'chifflot-7.lille.grid5000.fr'}}), Host(address='gros-28.nancy.grid5000.fr', alias='gros-28.nancy.grid5000.fr', user='root', keyfile=None, port=None, extra={'my_nancy_network': 'eno1', 'my_nancy_network_dev': 'eno1', 'my_nancy_network_ip': '172.16.66.28', 'enos_devices': ['eno1'], 'plantnetengine': {'__address__': 'chifflot-7.lille.grid5000.fr', 'url': 'chifflot-7.lille.grid5000.fr'}}), Host(address='gros-29.nancy.grid5000.fr', alias='gros-29.nancy.grid5000.fr', user='root', keyfile=None, port=None, extra={'my_nancy_network': 'eno1', 'my_nancy_network_dev': 'eno1', 'my_nancy_network_ip': '172.16.66.29', 'enos_devices': ['eno1'], 'plantnetengine': {'__address__': 'chifflot-7.lille.grid5000.fr', 'url': 'chifflot-7.lille.grid5000.fr'}}), Host(address='gros-3.nancy.grid5000.fr', alias='gros-3.nancy.grid5000.fr', user='root', keyfile=None, port=None, extra={'my_nancy_network': 'eno1', 'my_nancy_network_dev': 'eno1', 'my_nancy_network_ip': '172.16.66.3', 'enos_devices': ['eno1'], 'plantnetengine': {'__address__': 'chifflot-7.lille.grid5000.fr', 'url': 'chifflot-7.lille.grid5000.fr'}}), Host(address='gros-30.nancy.grid5000.fr', alias='gros-30.nancy.grid5000.fr', user='root', keyfile=None, port=None, extra={'my_nancy_network': 'eno1', 'my_nancy_network_dev': 'eno1', 'my_nancy_network_ip': '172.16.66.30', 'enos_devices': ['eno1'], 'plantnetengine': {'__address__': 'chifflot-7.lille.grid5000.fr', 'url': 'chifflot-7.lille.grid5000.fr'}}), Host(address='gros-31.nancy.grid5000.fr', alias='gros-31.nancy.grid5000.fr', user='root', keyfile=None, port=None, extra={'my_nancy_network': 'eno1', 'my_nancy_network_dev': 'eno1', 'my_nancy_network_ip': '172.16.66.31', 'enos_devices': ['eno1'], 'plantnetengine': {'__address__': 'chifflot-7.lille.grid5000.fr', 'url': 'chifflot-7.lille.grid5000.fr'}}), Host(address='gros-32.nancy.grid5000.fr', alias='gros-32.nancy.grid5000.fr', user='root', keyfile=None, port=None, extra={'my_nancy_network': 'eno1', 'my_nancy_network_dev': 'eno1', 'my_nancy_network_ip': '172.16.66.32', 'enos_devices': ['eno1'], 'plantnetengine': {'__address__': 'chifflot-7.lille.grid5000.fr', 'url': 'chifflot-7.lille.grid5000.fr'}}), Host(address='gros-33.nancy.grid5000.fr', alias='gros-33.nancy.grid5000.fr', user='root', keyfile=None, port=None, extra={'my_nancy_network': 'eno1', 'my_nancy_network_dev': 'eno1', 'my_nancy_network_ip': '172.16.66.33', 'enos_devices': ['eno1'], 'plantnetengine': {'__address__': 'chifflot-7.lille.grid5000.fr', 'url': 'chifflot-7.lille.grid5000.fr'}}), Host(address='gros-34.nancy.grid5000.fr', alias='gros-34.nancy.grid5000.fr', user='root', keyfile=None, port=None, extra={'my_nancy_network': 'eno1', 'my_nancy_network_dev': 'eno1', 'my_nancy_network_ip': '172.16.66.34', 'enos_devices': ['eno1'], 'plantnetengine': {'__address__': 'chifflot-7.lille.grid5000.fr', 'url': 'chifflot-7.lille.grid5000.fr'}}), Host(address='gros-35.nancy.grid5000.fr', alias='gros-35.nancy.grid5000.fr', user='root', keyfile=None, port=None, extra={'my_nancy_network': 'eno1', 'my_nancy_network_dev': 'eno1', 'my_nancy_network_ip': '172.16.66.35', 'enos_devices': ['eno1'], 'plantnetengine': {'__address__': 'chifflot-7.lille.grid5000.fr', 'url': 'chifflot-7.lille.grid5000.fr'}}), Host(address='gros-36.nancy.grid5000.fr', alias='gros-36.nancy.grid5000.fr', user='root', keyfile=None, port=None, extra={'my_nancy_network': 'eno1', 'my_nancy_network_dev': 'eno1', 'my_nancy_network_ip': '172.16.66.36', 'enos_devices': ['eno1'], 'plantnetengine': {'__address__': 'chifflot-7.lille.grid5000.fr', 'url': 'chifflot-7.lille.grid5000.fr'}}), Host(address='gros-37.nancy.grid5000.fr', alias='gros-37.nancy.grid5000.fr', user='root', keyfile=None, port=None, extra={'my_nancy_network': 'eno1', 'my_nancy_network_dev': 'eno1', 'my_nancy_network_ip': '172.16.66.37', 'enos_devices': ['eno1'], 'plantnetengine': {'__address__': 'chifflot-7.lille.grid5000.fr', 'url': 'chifflot-7.lille.grid5000.fr'}}), Host(address='gros-38.nancy.grid5000.fr', alias='gros-38.nancy.grid5000.fr', user='root', keyfile=None, port=None, extra={'my_nancy_network': 'eno1', 'my_nancy_network_dev': 'eno1', 'my_nancy_network_ip': '172.16.66.38', 'enos_devices': ['eno1'], 'plantnetengine': {'__address__': 'chifflot-7.lille.grid5000.fr', 'url': 'chifflot-7.lille.grid5000.fr'}}), Host(address='gros-39.nancy.grid5000.fr', alias='gros-39.nancy.grid5000.fr', user='root', keyfile=None, port=None, extra={'my_nancy_network': 'eno1', 'my_nancy_network_dev': 'eno1', 'my_nancy_network_ip': '172.16.66.39', 'enos_devices': ['eno1'], 'plantnetengine': {'__address__': 'chifflot-7.lille.grid5000.fr', 'url': 'chifflot-7.lille.grid5000.fr'}}), Host(address='gros-4.nancy.grid5000.fr', alias='gros-4.nancy.grid5000.fr', user='root', keyfile=None, port=None, extra={'my_nancy_network': 'eno1', 'my_nancy_network_dev': 'eno1', 'my_nancy_network_ip': '172.16.66.4', 'enos_devices': ['eno1'], 'plantnetengine': {'__address__': 'chifflot-7.lille.grid5000.fr', 'url': 'chifflot-7.lille.grid5000.fr'}}), Host(address='gros-40.nancy.grid5000.fr', alias='gros-40.nancy.grid5000.fr', user='root', keyfile=None, port=None, extra={'my_nancy_network': 'eno1', 'my_nancy_network_dev': 'eno1', 'my_nancy_network_ip': '172.16.66.40', 'enos_devices': ['eno1'], 'plantnetengine': {'__address__': 'chifflot-7.lille.grid5000.fr', 'url': 'chifflot-7.lille.grid5000.fr'}}), Host(address='gros-41.nancy.grid5000.fr', alias='gros-41.nancy.grid5000.fr', user='root', keyfile=None, port=None, extra={'my_nancy_network': 'eno1', 'my_nancy_network_dev': 'eno1', 'my_nancy_network_ip': '172.16.66.41', 'enos_devices': ['eno1'], 'plantnetengine': {'__address__': 'chifflot-7.lille.grid5000.fr', 'url': 'chifflot-7.lille.grid5000.fr'}}), Host(address='gros-42.nancy.grid5000.fr', alias='gros-42.nancy.grid5000.fr', user='root', keyfile=None, port=None, extra={'my_nancy_network': 'eno1', 'my_nancy_network_dev': 'eno1', 'my_nancy_network_ip': '172.16.66.42', 'enos_devices': ['eno1'], 'plantnetengine': {'__address__': 'chifflot-7.lille.grid5000.fr', 'url': 'chifflot-7.lille.grid5000.fr'}}), Host(address='gros-43.nancy.grid5000.fr', alias='gros-43.nancy.grid5000.fr', user='root', keyfile=None, port=None, extra={'my_nancy_network': 'eno1', 'my_nancy_network_dev': 'eno1', 'my_nancy_network_ip': '172.16.66.43', 'enos_devices': ['eno1'], 'plantnetengine': {'__address__': 'chifflot-7.lille.grid5000.fr', 'url': 'chifflot-7.lille.grid5000.fr'}})]}

# EXTRA_VARS
{'working_dir': '/home/drosendo/git/e2clab-examples/plantnet/getting_started/GPU/v1/scenario_40/20210405-223611'}



# # # HOSTS
{'hosts': 'all', 'tasks': [{'debug': {'msg': 'Stopping data producer'}}, {'shell': 'sudo docker stop crash.docker || true && tar -zcf /tmp/metrics_crash.tar.gz --absolute-names /tmp/metrics_crash/'}, {'fetch': {'src': '/tmp/metrics_crash.tar.gz', 'dest': '{{ working_dir }}/experiment-results/metrics_crash/', 'validate_checksum': False}}], 'name': 'all'}

# FINALIZE

# ROLES
{'all': [Host(address='gros-44.nancy.grid5000.fr', alias='gros-44.nancy.grid5000.fr', user='root', keyfile=None, port=None, extra={'my_nancy_network': 'eno1', 'my_nancy_network_dev': 'eno1', 'my_nancy_network_ip': '172.16.66.44', 'enos_devices': ['eno1'], 'plantnetengine': {'__address__': 'chifflot-7.lille.grid5000.fr', 'url': 'chifflot-7.lille.grid5000.fr'}}), Host(address='gros-45.nancy.grid5000.fr', alias='gros-45.nancy.grid5000.fr', user='root', keyfile=None, port=None, extra={'my_nancy_network': 'eno1', 'my_nancy_network_dev': 'eno1', 'my_nancy_network_ip': '172.16.66.45', 'enos_devices': ['eno1'], 'plantnetengine': {'__address__': 'chifflot-7.lille.grid5000.fr', 'url': 'chifflot-7.lille.grid5000.fr'}}), Host(address='gros-46.nancy.grid5000.fr', alias='gros-46.nancy.grid5000.fr', user='root', keyfile=None, port=None, extra={'my_nancy_network': 'eno1', 'my_nancy_network_dev': 'eno1', 'my_nancy_network_ip': '172.16.66.46', 'enos_devices': ['eno1'], 'plantnetengine': {'__address__': 'chifflot-7.lille.grid5000.fr', 'url': 'chifflot-7.lille.grid5000.fr'}}), Host(address='gros-47.nancy.grid5000.fr', alias='gros-47.nancy.grid5000.fr', user='root', keyfile=None, port=None, extra={'my_nancy_network': 'eno1', 'my_nancy_network_dev': 'eno1', 'my_nancy_network_ip': '172.16.66.47', 'enos_devices': ['eno1'], 'plantnetengine': {'__address__': 'chifflot-7.lille.grid5000.fr', 'url': 'chifflot-7.lille.grid5000.fr'}}), Host(address='gros-48.nancy.grid5000.fr', alias='gros-48.nancy.grid5000.fr', user='root', keyfile=None, port=None, extra={'my_nancy_network': 'eno1', 'my_nancy_network_dev': 'eno1', 'my_nancy_network_ip': '172.16.66.48', 'enos_devices': ['eno1'], 'plantnetengine': {'__address__': 'chifflot-7.lille.grid5000.fr', 'url': 'chifflot-7.lille.grid5000.fr'}}), Host(address='gros-49.nancy.grid5000.fr', alias='gros-49.nancy.grid5000.fr', user='root', keyfile=None, port=None, extra={'my_nancy_network': 'eno1', 'my_nancy_network_dev': 'eno1', 'my_nancy_network_ip': '172.16.66.49', 'enos_devices': ['eno1'], 'plantnetengine': {'__address__': 'chifflot-7.lille.grid5000.fr', 'url': 'chifflot-7.lille.grid5000.fr'}}), Host(address='gros-5.nancy.grid5000.fr', alias='gros-5.nancy.grid5000.fr', user='root', keyfile=None, port=None, extra={'my_nancy_network': 'eno1', 'my_nancy_network_dev': 'eno1', 'my_nancy_network_ip': '172.16.66.5', 'enos_devices': ['eno1'], 'plantnetengine': {'__address__': 'chifflot-7.lille.grid5000.fr', 'url': 'chifflot-7.lille.grid5000.fr'}}), Host(address='gros-50.nancy.grid5000.fr', alias='gros-50.nancy.grid5000.fr', user='root', keyfile=None, port=None, extra={'my_nancy_network': 'eno1', 'my_nancy_network_dev': 'eno1', 'my_nancy_network_ip': '172.16.66.50', 'enos_devices': ['eno1'], 'plantnetengine': {'__address__': 'chifflot-7.lille.grid5000.fr', 'url': 'chifflot-7.lille.grid5000.fr'}}), Host(address='gros-51.nancy.grid5000.fr', alias='gros-51.nancy.grid5000.fr', user='root', keyfile=None, port=None, extra={'my_nancy_network': 'eno1', 'my_nancy_network_dev': 'eno1', 'my_nancy_network_ip': '172.16.66.51', 'enos_devices': ['eno1'], 'plantnetengine': {'__address__': 'chifflot-7.lille.grid5000.fr', 'url': 'chifflot-7.lille.grid5000.fr'}}), Host(address='gros-52.nancy.grid5000.fr', alias='gros-52.nancy.grid5000.fr', user='root', keyfile=None, port=None, extra={'my_nancy_network': 'eno1', 'my_nancy_network_dev': 'eno1', 'my_nancy_network_ip': '172.16.66.52', 'enos_devices': ['eno1'], 'plantnetengine': {'__address__': 'chifflot-7.lille.grid5000.fr', 'url': 'chifflot-7.lille.grid5000.fr'}}), Host(address='gros-53.nancy.grid5000.fr', alias='gros-53.nancy.grid5000.fr', user='root', keyfile=None, port=None, extra={'my_nancy_network': 'eno1', 'my_nancy_network_dev': 'eno1', 'my_nancy_network_ip': '172.16.66.53', 'enos_devices': ['eno1'], 'plantnetengine': {'__address__': 'chifflot-7.lille.grid5000.fr', 'url': 'chifflot-7.lille.grid5000.fr'}}), Host(address='gros-54.nancy.grid5000.fr', alias='gros-54.nancy.grid5000.fr', user='root', keyfile=None, port=None, extra={'my_nancy_network': 'eno1', 'my_nancy_network_dev': 'eno1', 'my_nancy_network_ip': '172.16.66.54', 'enos_devices': ['eno1'], 'plantnetengine': {'__address__': 'chifflot-7.lille.grid5000.fr', 'url': 'chifflot-7.lille.grid5000.fr'}}), Host(address='gros-55.nancy.grid5000.fr', alias='gros-55.nancy.grid5000.fr', user='root', keyfile=None, port=None, extra={'my_nancy_network': 'eno1', 'my_nancy_network_dev': 'eno1', 'my_nancy_network_ip': '172.16.66.55', 'enos_devices': ['eno1'], 'plantnetengine': {'__address__': 'chifflot-7.lille.grid5000.fr', 'url': 'chifflot-7.lille.grid5000.fr'}}), Host(address='gros-56.nancy.grid5000.fr', alias='gros-56.nancy.grid5000.fr', user='root', keyfile=None, port=None, extra={'my_nancy_network': 'eno1', 'my_nancy_network_dev': 'eno1', 'my_nancy_network_ip': '172.16.66.56', 'enos_devices': ['eno1'], 'plantnetengine': {'__address__': 'chifflot-7.lille.grid5000.fr', 'url': 'chifflot-7.lille.grid5000.fr'}}), Host(address='gros-57.nancy.grid5000.fr', alias='gros-57.nancy.grid5000.fr', user='root', keyfile=None, port=None, extra={'my_nancy_network': 'eno1', 'my_nancy_network_dev': 'eno1', 'my_nancy_network_ip': '172.16.66.57', 'enos_devices': ['eno1'], 'plantnetengine': {'__address__': 'chifflot-7.lille.grid5000.fr', 'url': 'chifflot-7.lille.grid5000.fr'}}), Host(address='gros-58.nancy.grid5000.fr', alias='gros-58.nancy.grid5000.fr', user='root', keyfile=None, port=None, extra={'my_nancy_network': 'eno1', 'my_nancy_network_dev': 'eno1', 'my_nancy_network_ip': '172.16.66.58', 'enos_devices': ['eno1'], 'plantnetengine': {'__address__': 'chifflot-7.lille.grid5000.fr', 'url': 'chifflot-7.lille.grid5000.fr'}}), Host(address='gros-59.nancy.grid5000.fr', alias='gros-59.nancy.grid5000.fr', user='root', keyfile=None, port=None, extra={'my_nancy_network': 'eno1', 'my_nancy_network_dev': 'eno1', 'my_nancy_network_ip': '172.16.66.59', 'enos_devices': ['eno1'], 'plantnetengine': {'__address__': 'chifflot-7.lille.grid5000.fr', 'url': 'chifflot-7.lille.grid5000.fr'}}), Host(address='gros-6.nancy.grid5000.fr', alias='gros-6.nancy.grid5000.fr', user='root', keyfile=None, port=None, extra={'my_nancy_network': 'eno1', 'my_nancy_network_dev': 'eno1', 'my_nancy_network_ip': '172.16.66.6', 'enos_devices': ['eno1'], 'plantnetengine': {'__address__': 'chifflot-7.lille.grid5000.fr', 'url': 'chifflot-7.lille.grid5000.fr'}}), Host(address='gros-60.nancy.grid5000.fr', alias='gros-60.nancy.grid5000.fr', user='root', keyfile=None, port=None, extra={'my_nancy_network': 'eno1', 'my_nancy_network_dev': 'eno1', 'my_nancy_network_ip': '172.16.66.60', 'enos_devices': ['eno1'], 'plantnetengine': {'__address__': 'chifflot-7.lille.grid5000.fr', 'url': 'chifflot-7.lille.grid5000.fr'}}), Host(address='gros-61.nancy.grid5000.fr', alias='gros-61.nancy.grid5000.fr', user='root', keyfile=None, port=None, extra={'my_nancy_network': 'eno1', 'my_nancy_network_dev': 'eno1', 'my_nancy_network_ip': '172.16.66.61', 'enos_devices': ['eno1'], 'plantnetengine': {'__address__': 'chifflot-7.lille.grid5000.fr', 'url': 'chifflot-7.lille.grid5000.fr'}})]}

# EXTRA_VARS
{'working_dir': '/home/drosendo/git/e2clab-examples/plantnet/getting_started/GPU/v1/scenario_40/20210405-223611'}



