"2021-04-01T02:15:37.136883+02:00","chifflot-7","bmc_node_power_watt",520
"2021-04-01T02:15:42.138663+02:00","chifflot-7","bmc_node_power_watt",520
"2021-04-01T02:15:47.139796+02:00","chifflot-7","bmc_node_power_watt",494
"2021-04-01T02:15:52.140472+02:00","chifflot-7","bmc_node_power_watt",494
"2021-04-01T02:15:57.14151+02:00","chifflot-7","bmc_node_power_watt",494
"2021-04-01T02:16:02.142668+02:00","chifflot-7","bmc_node_power_watt",494
"2021-04-01T02:16:07.144046+02:00","chifflot-7","bmc_node_power_watt",494
"2021-04-01T02:16:12.145316+02:00","chifflot-7","bmc_node_power_watt",494
"2021-04-01T02:16:17.145306+02:00","chifflot-7","bmc_node_power_watt",494
"2021-04-01T02:16:22.146755+02:00","chifflot-7","bmc_node_power_watt",494
"2021-04-01T02:16:27.147905+02:00","chifflot-7","bmc_node_power_watt",494
"2021-04-01T02:16:32.149732+02:00","chifflot-7","bmc_node_power_watt",494
"2021-04-01T02:16:37.150507+02:00","chifflot-7","bmc_node_power_watt",494
"2021-04-01T02:16:42.152179+02:00","chifflot-7","bmc_node_power_watt",494
"2021-04-01T02:16:47.153291+02:00","chifflot-7","bmc_node_power_watt",494
"2021-04-01T02:16:52.154125+02:00","chifflot-7","bmc_node_power_watt",494
"2021-04-01T02:16:57.154794+02:00","chifflot-7","bmc_node_power_watt",520
"2021-04-01T02:17:02.156292+02:00","chifflot-7","bmc_node_power_watt",520
"2021-04-01T02:17:07.157212+02:00","chifflot-7","bmc_node_power_watt",520
"2021-04-01T02:17:12.157979+02:00","chifflot-7","bmc_node_power_watt",520
"2021-04-01T02:17:17.158253+02:00","chifflot-7","bmc_node_power_watt",520
"2021-04-01T02:17:22.15863+02:00","chifflot-7","bmc_node_power_watt",494
"2021-04-01T02:17:27.159098+02:00","chifflot-7","bmc_node_power_watt",494
"2021-04-01T02:17:32.160314+02:00","chifflot-7","bmc_node_power_watt",494
"2021-04-01T02:17:37.160932+02:00","chifflot-7","bmc_node_power_watt",494
"2021-04-01T02:17:42.161738+02:00","chifflot-7","bmc_node_power_watt",494
"2021-04-01T02:17:47.161909+02:00","chifflot-7","bmc_node_power_watt",494
"2021-04-01T02:17:52.162454+02:00","chifflot-7","bmc_node_power_watt",494
"2021-04-01T02:17:57.16281+02:00","chifflot-7","bmc_node_power_watt",494
"2021-04-01T02:18:02.16374+02:00","chifflot-7","bmc_node_power_watt",494
"2021-04-01T02:18:07.164409+02:00","chifflot-7","bmc_node_power_watt",494
"2021-04-01T02:18:12.164878+02:00","chifflot-7","bmc_node_power_watt",494
"2021-04-01T02:18:17.165337+02:00","chifflot-7","bmc_node_power_watt",494
"2021-04-01T02:18:22.165828+02:00","chifflot-7","bmc_node_power_watt",494
"2021-04-01T02:18:27.166296+02:00","chifflot-7","bmc_node_power_watt",494
"2021-04-01T02:18:32.166774+02:00","chifflot-7","bmc_node_power_watt",494
"2021-04-01T02:18:37.167192+02:00","chifflot-7","bmc_node_power_watt",494
"2021-04-01T02:18:42.168503+02:00","chifflot-7","bmc_node_power_watt",494
"2021-04-01T02:18:47.169215+02:00","chifflot-7","bmc_node_power_watt",494
"2021-04-01T02:18:52.171139+02:00","chifflot-7","bmc_node_power_watt",494
"2021-04-01T02:18:57.171006+02:00","chifflot-7","bmc_node_power_watt",520
"2021-04-01T02:19:02.172407+02:00","chifflot-7","bmc_node_power_watt",520
"2021-04-01T02:19:07.173002+02:00","chifflot-7","bmc_node_power_watt",520
"2021-04-01T02:19:12.1732+02:00","chifflot-7","bmc_node_power_watt",520
"2021-04-01T02:19:17.173955+02:00","chifflot-7","bmc_node_power_watt",520
"2021-04-01T02:19:22.174572+02:00","chifflot-7","bmc_node_power_watt",520
"2021-04-01T02:19:27.175423+02:00","chifflot-7","bmc_node_power_watt",520
"2021-04-01T02:19:32.177089+02:00","chifflot-7","bmc_node_power_watt",520
"2021-04-01T02:19:37.177279+02:00","chifflot-7","bmc_node_power_watt",520
"2021-04-01T02:19:42.178051+02:00","chifflot-7","bmc_node_power_watt",494
"2021-04-01T02:19:47.178231+02:00","chifflot-7","bmc_node_power_watt",494
"2021-04-01T02:19:52.179741+02:00","chifflot-7","bmc_node_power_watt",494
"2021-04-01T02:19:57.180031+02:00","chifflot-7","bmc_node_power_watt",494
"2021-04-01T02:20:02.181084+02:00","chifflot-7","bmc_node_power_watt",494
"2021-04-01T02:20:07.182247+02:00","chifflot-7","bmc_node_power_watt",494
"2021-04-01T02:20:12.183138+02:00","chifflot-7","bmc_node_power_watt",494
"2021-04-01T02:20:17.183679+02:00","chifflot-7","bmc_node_power_watt",494
"2021-04-01T02:20:22.184417+02:00","chifflot-7","bmc_node_power_watt",494
"2021-04-01T02:20:27.185709+02:00","chifflot-7","bmc_node_power_watt",494
"2021-04-01T02:20:32.186861+02:00","chifflot-7","bmc_node_power_watt",520
"2021-04-01T02:20:37.187599+02:00","chifflot-7","bmc_node_power_watt",520
"2021-04-01T02:20:42.188138+02:00","chifflot-7","bmc_node_power_watt",520
"2021-04-01T02:20:47.188957+02:00","chifflot-7","bmc_node_power_watt",520
"2021-04-01T02:20:52.189233+02:00","chifflot-7","bmc_node_power_watt",520
"2021-04-01T02:20:57.19013+02:00","chifflot-7","bmc_node_power_watt",520
"2021-04-01T02:21:02.190894+02:00","chifflot-7","bmc_node_power_watt",520
"2021-04-01T02:21:07.191753+02:00","chifflot-7","bmc_node_power_watt",520
"2021-04-01T02:21:12.192248+02:00","chifflot-7","bmc_node_power_watt",520
"2021-04-01T02:21:17.193307+02:00","chifflot-7","bmc_node_power_watt",520
"2021-04-01T02:21:22.194405+02:00","chifflot-7","bmc_node_power_watt",520
"2021-04-01T02:21:27.194863+02:00","chifflot-7","bmc_node_power_watt",520
"2021-04-01T02:21:32.198334+02:00","chifflot-7","bmc_node_power_watt",520
"2021-04-01T02:21:37.197733+02:00","chifflot-7","bmc_node_power_watt",520
"2021-04-01T02:21:42.199939+02:00","chifflot-7","bmc_node_power_watt",494
"2021-04-01T02:21:47.200506+02:00","chifflot-7","bmc_node_power_watt",494
"2021-04-01T02:21:52.20115+02:00","chifflot-7","bmc_node_power_watt",494
"2021-04-01T02:21:57.202026+02:00","chifflot-7","bmc_node_power_watt",494
"2021-04-01T02:22:02.203622+02:00","chifflot-7","bmc_node_power_watt",494
"2021-04-01T02:22:07.20483+02:00","chifflot-7","bmc_node_power_watt",520
"2021-04-01T02:22:12.205943+02:00","chifflot-7","bmc_node_power_watt",520
"2021-04-01T02:22:17.207519+02:00","chifflot-7","bmc_node_power_watt",520
"2021-04-01T02:22:22.207869+02:00","chifflot-7","bmc_node_power_watt",520
"2021-04-01T02:22:27.208615+02:00","chifflot-7","bmc_node_power_watt",520
"2021-04-01T02:22:32.209745+02:00","chifflot-7","bmc_node_power_watt",520
"2021-04-01T02:22:37.210735+02:00","chifflot-7","bmc_node_power_watt",520
"2021-04-01T02:22:42.211775+02:00","chifflot-7","bmc_node_power_watt",520
"2021-04-01T02:22:47.212779+02:00","chifflot-7","bmc_node_power_watt",520
"2021-04-01T02:22:52.213776+02:00","chifflot-7","bmc_node_power_watt",520
"2021-04-01T02:22:57.214876+02:00","chifflot-7","bmc_node_power_watt",520
"2021-04-01T02:23:02.215744+02:00","chifflot-7","bmc_node_power_watt",520
"2021-04-01T02:23:07.217022+02:00","chifflot-7","bmc_node_power_watt",520
"2021-04-01T02:23:12.218046+02:00","chifflot-7","bmc_node_power_watt",520
"2021-04-01T02:23:17.219897+02:00","chifflot-7","bmc_node_power_watt",520
"2021-04-01T02:23:22.220031+02:00","chifflot-7","bmc_node_power_watt",520
"2021-04-01T02:23:27.220624+02:00","chifflot-7","bmc_node_power_watt",520
"2021-04-01T02:23:32.221741+02:00","chifflot-7","bmc_node_power_watt",520
"2021-04-01T02:23:37.222754+02:00","chifflot-7","bmc_node_power_watt",520
"2021-04-01T02:23:42.223349+02:00","chifflot-7","bmc_node_power_watt",520
"2021-04-01T02:23:47.224654+02:00","chifflot-7","bmc_node_power_watt",520
"2021-04-01T02:23:52.225428+02:00","chifflot-7","bmc_node_power_watt",520
"2021-04-01T02:23:57.225679+02:00","chifflot-7","bmc_node_power_watt",520
"2021-04-01T02:24:02.226604+02:00","chifflot-7","bmc_node_power_watt",494
"2021-04-01T02:24:07.227664+02:00","chifflot-7","bmc_node_power_watt",494
"2021-04-01T02:24:12.228876+02:00","chifflot-7","bmc_node_power_watt",494
"2021-04-01T02:24:17.230897+02:00","chifflot-7","bmc_node_power_watt",494
"2021-04-01T02:24:22.231798+02:00","chifflot-7","bmc_node_power_watt",494
"2021-04-01T02:24:27.23239+02:00","chifflot-7","bmc_node_power_watt",494
"2021-04-01T02:24:32.233796+02:00","chifflot-7","bmc_node_power_watt",494
"2021-04-01T02:24:37.234915+02:00","chifflot-7","bmc_node_power_watt",494
"2021-04-01T02:24:42.236118+02:00","chifflot-7","bmc_node_power_watt",494
"2021-04-01T02:24:47.236822+02:00","chifflot-7","bmc_node_power_watt",494
"2021-04-01T02:24:52.237366+02:00","chifflot-7","bmc_node_power_watt",494
"2021-04-01T02:24:57.23759+02:00","chifflot-7","bmc_node_power_watt",494
"2021-04-01T02:25:02.238288+02:00","chifflot-7","bmc_node_power_watt",494
"2021-04-01T02:25:07.239006+02:00","chifflot-7","bmc_node_power_watt",494
"2021-04-01T02:25:12.239946+02:00","chifflot-7","bmc_node_power_watt",494
"2021-04-01T02:25:17.240876+02:00","chifflot-7","bmc_node_power_watt",494
"2021-04-01T02:25:22.241833+02:00","chifflot-7","bmc_node_power_watt",494
"2021-04-01T02:25:27.242212+02:00","chifflot-7","bmc_node_power_watt",494
"2021-04-01T02:25:32.242573+02:00","chifflot-7","bmc_node_power_watt",494
"2021-04-01T02:25:37.243242+02:00","chifflot-7","bmc_node_power_watt",494
"2021-04-01T02:25:42.244231+02:00","chifflot-7","bmc_node_power_watt",494
"2021-04-01T02:25:47.245223+02:00","chifflot-7","bmc_node_power_watt",494
"2021-04-01T02:25:52.245993+02:00","chifflot-7","bmc_node_power_watt",494
"2021-04-01T02:25:57.246866+02:00","chifflot-7","bmc_node_power_watt",494
"2021-04-01T02:26:02.248077+02:00","chifflot-7","bmc_node_power_watt",520
"2021-04-01T02:26:07.248805+02:00","chifflot-7","bmc_node_power_watt",520
"2021-04-01T02:26:12.249676+02:00","chifflot-7","bmc_node_power_watt",520
"2021-04-01T02:26:17.250328+02:00","chifflot-7","bmc_node_power_watt",520
"2021-04-01T02:26:22.250612+02:00","chifflot-7","bmc_node_power_watt",520
"2021-04-01T02:26:27.251394+02:00","chifflot-7","bmc_node_power_watt",494
"2021-04-01T02:26:32.252798+02:00","chifflot-7","bmc_node_power_watt",494
"2021-04-01T02:26:37.253291+02:00","chifflot-7","bmc_node_power_watt",494
"2021-04-01T02:26:42.253762+02:00","chifflot-7","bmc_node_power_watt",494
"2021-04-01T02:26:47.25427+02:00","chifflot-7","bmc_node_power_watt",494
"2021-04-01T02:26:52.254929+02:00","chifflot-7","bmc_node_power_watt",494
"2021-04-01T02:26:57.25564+02:00","chifflot-7","bmc_node_power_watt",494
"2021-04-01T02:27:02.257425+02:00","chifflot-7","bmc_node_power_watt",494
"2021-04-01T02:27:07.258223+02:00","chifflot-7","bmc_node_power_watt",494
"2021-04-01T02:27:12.258912+02:00","chifflot-7","bmc_node_power_watt",494
"2021-04-01T02:27:17.25992+02:00","chifflot-7","bmc_node_power_watt",494
"2021-04-01T02:27:22.260694+02:00","chifflot-7","bmc_node_power_watt",494
"2021-04-01T02:27:27.260931+02:00","chifflot-7","bmc_node_power_watt",494
"2021-04-01T02:27:32.261426+02:00","chifflot-7","bmc_node_power_watt",494
"2021-04-01T02:27:37.26429+02:00","chifflot-7","bmc_node_power_watt",494
"2021-04-01T02:27:42.265698+02:00","chifflot-7","bmc_node_power_watt",494
"2021-04-01T02:27:47.266498+02:00","chifflot-7","bmc_node_power_watt",494
"2021-04-01T02:27:52.266974+02:00","chifflot-7","bmc_node_power_watt",494
"2021-04-01T02:27:57.268242+02:00","chifflot-7","bmc_node_power_watt",494
"2021-04-01T02:28:02.268732+02:00","chifflot-7","bmc_node_power_watt",494
"2021-04-01T02:28:07.269392+02:00","chifflot-7","bmc_node_power_watt",494
"2021-04-01T02:28:12.270342+02:00","chifflot-7","bmc_node_power_watt",494
"2021-04-01T02:28:17.270624+02:00","chifflot-7","bmc_node_power_watt",494
"2021-04-01T02:28:22.271001+02:00","chifflot-7","bmc_node_power_watt",494
"2021-04-01T02:28:27.272204+02:00","chifflot-7","bmc_node_power_watt",520
"2021-04-01T02:28:32.272641+02:00","chifflot-7","bmc_node_power_watt",520
"2021-04-01T02:28:37.273057+02:00","chifflot-7","bmc_node_power_watt",520
"2021-04-01T02:28:42.273608+02:00","chifflot-7","bmc_node_power_watt",520
"2021-04-01T02:28:47.274608+02:00","chifflot-7","bmc_node_power_watt",494
"2021-04-01T02:28:52.275243+02:00","chifflot-7","bmc_node_power_watt",494
"2021-04-01T02:28:57.276355+02:00","chifflot-7","bmc_node_power_watt",494
"2021-04-01T02:29:02.278671+02:00","chifflot-7","bmc_node_power_watt",494
"2021-04-01T02:29:07.279018+02:00","chifflot-7","bmc_node_power_watt",494
"2021-04-01T02:29:12.27985+02:00","chifflot-7","bmc_node_power_watt",494
"2021-04-01T02:29:17.28058+02:00","chifflot-7","bmc_node_power_watt",494
"2021-04-01T02:29:22.281384+02:00","chifflot-7","bmc_node_power_watt",494
"2021-04-01T02:29:27.282247+02:00","chifflot-7","bmc_node_power_watt",494
"2021-04-01T02:29:32.282705+02:00","chifflot-7","bmc_node_power_watt",494
"2021-04-01T02:29:37.283074+02:00","chifflot-7","bmc_node_power_watt",494
"2021-04-01T02:29:42.283438+02:00","chifflot-7","bmc_node_power_watt",494
"2021-04-01T02:29:47.284905+02:00","chifflot-7","bmc_node_power_watt",494
"2021-04-01T02:29:52.286341+02:00","chifflot-7","bmc_node_power_watt",494
"2021-04-01T02:29:57.287204+02:00","chifflot-7","bmc_node_power_watt",494
"2021-04-01T02:30:02.288359+02:00","chifflot-7","bmc_node_power_watt",494
"2021-04-01T02:30:07.288827+02:00","chifflot-7","bmc_node_power_watt",494
"2021-04-01T02:30:12.289226+02:00","chifflot-7","bmc_node_power_watt",494
"2021-04-01T02:30:17.290135+02:00","chifflot-7","bmc_node_power_watt",494
"2021-04-01T02:30:22.290674+02:00","chifflot-7","bmc_node_power_watt",520
"2021-04-01T02:30:27.291844+02:00","chifflot-7","bmc_node_power_watt",520
"2021-04-01T02:30:32.293226+02:00","chifflot-7","bmc_node_power_watt",520
"2021-04-01T02:30:37.293602+02:00","chifflot-7","bmc_node_power_watt",520
"2021-04-01T02:30:42.294674+02:00","chifflot-7","bmc_node_power_watt",520
"2021-04-01T02:30:47.295288+02:00","chifflot-7","bmc_node_power_watt",520
"2021-04-01T02:30:52.29629+02:00","chifflot-7","bmc_node_power_watt",520
"2021-04-01T02:30:57.297468+02:00","chifflot-7","bmc_node_power_watt",520
"2021-04-01T02:31:02.297769+02:00","chifflot-7","bmc_node_power_watt",520
"2021-04-01T02:31:07.298255+02:00","chifflot-7","bmc_node_power_watt",520
"2021-04-01T02:31:12.299388+02:00","chifflot-7","bmc_node_power_watt",520
"2021-04-01T02:31:17.300266+02:00","chifflot-7","bmc_node_power_watt",520
"2021-04-01T02:31:22.301378+02:00","chifflot-7","bmc_node_power_watt",520
"2021-04-01T02:31:27.30249+02:00","chifflot-7","bmc_node_power_watt",520
"2021-04-01T02:31:32.302735+02:00","chifflot-7","bmc_node_power_watt",520
"2021-04-01T02:31:37.30311+02:00","chifflot-7","bmc_node_power_watt",520
"2021-04-01T02:31:42.303861+02:00","chifflot-7","bmc_node_power_watt",520
"2021-04-01T02:31:47.304561+02:00","chifflot-7","bmc_node_power_watt",520
"2021-04-01T02:31:52.305977+02:00","chifflot-7","bmc_node_power_watt",520
"2021-04-01T02:31:57.307139+02:00","chifflot-7","bmc_node_power_watt",520
"2021-04-01T02:32:02.308105+02:00","chifflot-7","bmc_node_power_watt",520
"2021-04-01T02:32:07.309954+02:00","chifflot-7","bmc_node_power_watt",520
"2021-04-01T02:32:12.310728+02:00","chifflot-7","bmc_node_power_watt",520
"2021-04-01T02:32:17.3121+02:00","chifflot-7","bmc_node_power_watt",520
"2021-04-01T02:32:22.313011+02:00","chifflot-7","bmc_node_power_watt",494
"2021-04-01T02:32:27.313716+02:00","chifflot-7","bmc_node_power_watt",494
"2021-04-01T02:32:32.314655+02:00","chifflot-7","bmc_node_power_watt",494
"2021-04-01T02:32:37.315859+02:00","chifflot-7","bmc_node_power_watt",494
"2021-04-01T02:32:42.317097+02:00","chifflot-7","bmc_node_power_watt",494
"2021-04-01T02:32:47.317665+02:00","chifflot-7","bmc_node_power_watt",494
"2021-04-01T02:32:52.318031+02:00","chifflot-7","bmc_node_power_watt",494
"2021-04-01T02:32:57.319465+02:00","chifflot-7","bmc_node_power_watt",494
"2021-04-01T02:33:02.320624+02:00","chifflot-7","bmc_node_power_watt",494
"2021-04-01T02:33:07.321479+02:00","chifflot-7","bmc_node_power_watt",494
"2021-04-01T02:33:12.321928+02:00","chifflot-7","bmc_node_power_watt",494
"2021-04-01T02:33:17.323184+02:00","chifflot-7","bmc_node_power_watt",494
"2021-04-01T02:33:22.323866+02:00","chifflot-7","bmc_node_power_watt",494
"2021-04-01T02:33:27.324496+02:00","chifflot-7","bmc_node_power_watt",494
"2021-04-01T02:33:32.325313+02:00","chifflot-7","bmc_node_power_watt",520
"2021-04-01T02:33:37.325933+02:00","chifflot-7","bmc_node_power_watt",520
"2021-04-01T02:33:42.326225+02:00","chifflot-7","bmc_node_power_watt",520
"2021-04-01T02:33:47.326825+02:00","chifflot-7","bmc_node_power_watt",520
"2021-04-01T02:33:52.328022+02:00","chifflot-7","bmc_node_power_watt",520
"2021-04-01T02:33:57.329195+02:00","chifflot-7","bmc_node_power_watt",520
"2021-04-01T02:34:02.329926+02:00","chifflot-7","bmc_node_power_watt",520
"2021-04-01T02:34:07.330753+02:00","chifflot-7","bmc_node_power_watt",520
"2021-04-01T02:34:12.332037+02:00","chifflot-7","bmc_node_power_watt",520
"2021-04-01T02:34:17.333021+02:00","chifflot-7","bmc_node_power_watt",520
"2021-04-01T02:34:22.333812+02:00","chifflot-7","bmc_node_power_watt",494
"2021-04-01T02:34:27.334347+02:00","chifflot-7","bmc_node_power_watt",494
"2021-04-01T02:34:32.334928+02:00","chifflot-7","bmc_node_power_watt",494
"2021-04-01T02:34:37.336257+02:00","chifflot-7","bmc_node_power_watt",494
"2021-04-01T02:34:42.336952+02:00","chifflot-7","bmc_node_power_watt",494
"2021-04-01T02:34:47.33778+02:00","chifflot-7","bmc_node_power_watt",520
"2021-04-01T02:34:52.339922+02:00","chifflot-7","bmc_node_power_watt",520
"2021-04-01T02:34:57.341151+02:00","chifflot-7","bmc_node_power_watt",520
"2021-04-01T02:35:02.342161+02:00","chifflot-7","bmc_node_power_watt",520
"2021-04-01T02:35:07.342522+02:00","chifflot-7","bmc_node_power_watt",494
"2021-04-01T02:35:12.343377+02:00","chifflot-7","bmc_node_power_watt",494
"2021-04-01T02:35:17.343971+02:00","chifflot-7","bmc_node_power_watt",494
"2021-04-01T02:35:22.344249+02:00","chifflot-7","bmc_node_power_watt",494
"2021-04-01T02:35:27.345125+02:00","chifflot-7","bmc_node_power_watt",494
"2021-04-01T02:35:32.345562+02:00","chifflot-7","bmc_node_power_watt",494
"2021-04-01T02:35:37.346303+02:00","chifflot-7","bmc_node_power_watt",494
"2021-04-01T02:35:42.346869+02:00","chifflot-7","bmc_node_power_watt",494
"2021-04-01T02:35:47.34734+02:00","chifflot-7","bmc_node_power_watt",494
"2021-04-01T02:35:52.347835+02:00","chifflot-7","bmc_node_power_watt",494
"2021-04-01T02:35:57.348201+02:00","chifflot-7","bmc_node_power_watt",494
"2021-04-01T02:36:02.349494+02:00","chifflot-7","bmc_node_power_watt",494
"2021-04-01T02:36:07.351541+02:00","chifflot-7","bmc_node_power_watt",494
"2021-04-01T02:36:12.352711+02:00","chifflot-7","bmc_node_power_watt",494
"2021-04-01T02:36:17.353652+02:00","chifflot-7","bmc_node_power_watt",494
"2021-04-01T02:36:22.354035+02:00","chifflot-7","bmc_node_power_watt",494
"2021-04-01T02:36:27.354669+02:00","chifflot-7","bmc_node_power_watt",494
"2021-04-01T02:36:32.35523+02:00","chifflot-7","bmc_node_power_watt",494
"2021-04-01T02:36:37.355916+02:00","chifflot-7","bmc_node_power_watt",494
"2021-04-01T02:36:42.356428+02:00","chifflot-7","bmc_node_power_watt",520
"2021-04-01T02:36:47.358303+02:00","chifflot-7","bmc_node_power_watt",520
"2021-04-01T02:36:52.358296+02:00","chifflot-7","bmc_node_power_watt",520
"2021-04-01T02:36:57.359532+02:00","chifflot-7","bmc_node_power_watt",520
"2021-04-01T02:37:02.360233+02:00","chifflot-7","bmc_node_power_watt",520
"2021-04-01T02:37:07.361021+02:00","chifflot-7","bmc_node_power_watt",520
"2021-04-01T02:37:12.361146+02:00","chifflot-7","bmc_node_power_watt",520
"2021-04-01T02:37:17.362459+02:00","chifflot-7","bmc_node_power_watt",520
"2021-04-01T02:37:22.365306+02:00","chifflot-7","bmc_node_power_watt",520
"2021-04-01T02:37:27.36547+02:00","chifflot-7","bmc_node_power_watt",520
"2021-04-01T02:37:32.366123+02:00","chifflot-7","bmc_node_power_watt",520
"2021-04-01T02:37:37.367092+02:00","chifflot-7","bmc_node_power_watt",520
"2021-04-01T02:37:42.368521+02:00","chifflot-7","bmc_node_power_watt",520
"2021-04-01T02:37:47.370635+02:00","chifflot-7","bmc_node_power_watt",520
"2021-04-01T02:37:52.370925+02:00","chifflot-7","bmc_node_power_watt",520
"2021-04-01T02:37:57.371349+02:00","chifflot-7","bmc_node_power_watt",494
"2021-04-01T02:38:02.372018+02:00","chifflot-7","bmc_node_power_watt",494
"2021-04-01T02:38:07.372254+02:00","chifflot-7","bmc_node_power_watt",494
"2021-04-01T02:38:12.37264+02:00","chifflot-7","bmc_node_power_watt",494
"2021-04-01T02:38:17.373217+02:00","chifflot-7","bmc_node_power_watt",520
"2021-04-01T02:38:22.374207+02:00","chifflot-7","bmc_node_power_watt",520
"2021-04-01T02:38:27.375006+02:00","chifflot-7","bmc_node_power_watt",520
"2021-04-01T02:38:32.376009+02:00","chifflot-7","bmc_node_power_watt",520
