172.16.36.7  : 13.87 13.90 13.88 13.90 13.89 13.79 13.83 - 13.80 13.85
172.16.66.46 : 0.23 0.21 0.21 0.21 0.21 0.20 0.21 0.21 0.18 0.20
172.16.66.47 : 0.22 0.21 0.18 0.20 0.22 0.20 0.20 0.22 0.20 0.21
172.16.66.48 : 0.21 0.22 0.21 0.19 0.21 0.20 0.21 0.20 0.20 0.21
172.16.66.49 : 0.23 0.22 0.20 0.21 0.21 0.21 0.23 0.20 0.22 0.21
172.16.66.5  : 0.18 0.21 0.21 0.20 0.14 0.19 0.20 0.13 0.21 0.20
172.16.66.50 : 0.22 0.21 0.20 0.18 0.23 0.20 0.21 0.20 0.21 0.21
172.16.66.51 : 0.23 0.21 0.21 0.21 0.17 0.21 0.20 0.21 0.21 0.16
172.16.66.52 : 0.23 0.19 0.21 0.19 0.21 0.20 0.20 0.22 0.20 0.20
172.16.66.53 : 0.22 0.22 0.20 0.19 0.20 0.20 0.20 0.22 0.21 0.21
172.16.66.54 : 0.22 0.22 0.20 0.20 0.21 0.21 0.20 0.21 0.21 0.13
172.16.66.55 : 0.22 0.22 0.21 0.21 0.22 0.20 0.21 0.22 0.21 0.20
172.16.66.56 : 0.23 0.22 0.21 0.21 0.21 0.22 0.21 0.20 0.21 0.20
172.16.66.57 : 0.22 0.20 0.20 0.22 0.21 0.19 0.20 0.20 0.21 0.20
172.16.66.58 : 0.22 0.20 0.21 0.20 0.21 0.20 0.20 0.20 0.20 0.19
172.16.66.59 : 0.15 0.16 0.16 0.16 0.16 0.16 0.16 0.15 0.16 0.17
172.16.66.6  : 0.22 0.20 0.19 0.20 0.21 0.21 0.21 0.20 0.20 0.20
172.16.66.60 : 0.22 0.20 0.20 0.23 0.20 0.21 0.20 0.20 0.22 0.18
172.16.66.61 : 0.19 0.20 0.21 0.22 0.20 0.19 0.18 0.20 0.21 0.20
172.16.66.62 : 0.21 0.21 0.20 0.22 0.21 0.20 0.20 0.18 0.22 0.16
172.16.66.63 : 0.23 0.21 0.21 0.21 0.20 0.21 0.21 0.22 0.20 0.20
172.16.66.64 : 0.22 0.21 0.21 0.21 0.22 0.21 0.21 0.21 0.21 0.22
172.16.66.65 : 0.23 0.18 0.20 0.18 0.19 0.20 0.20 0.21 0.20 0.21
172.16.66.66 : 0.23 0.21 0.20 0.21 0.19 0.20 0.21 0.21 0.19 0.21
172.16.66.67 : 0.20 0.20 0.19 0.20 0.20 0.20 0.19 0.17 0.22 0.20
172.16.66.68 : 0.24 0.21 0.21 0.22 0.20 0.21 0.21 0.21 0.22 0.20
172.16.66.69 : 0.22 0.20 0.22 0.21 0.21 0.19 0.20 0.20 0.22 0.21
172.16.66.7  : 0.15 0.14 0.12 0.13 0.14 0.13 0.15 0.15 0.16 0.16
172.16.66.70 : 0.22 0.18 0.18 0.20 0.18 0.18 0.20 0.20 0.22 0.18
172.16.66.71 : 0.22 0.21 0.14 0.21 0.22 0.20 0.20 0.21 0.21 0.21
172.16.66.72 : 0.20 0.20 0.19 0.20 0.20 0.22 0.21 0.20 0.22 0.21
172.16.66.73 : 0.04 0.03 0.03 0.03 0.03 0.03 0.03 0.03 0.03 0.03
172.16.66.74 : 0.25 0.20 0.20 0.22 0.16 0.18 0.19 0.18 0.18 0.21
172.16.66.75 : 0.25 0.20 0.20 0.21 0.20 0.21 0.21 0.20 0.20 0.22
172.16.66.76 : 0.24 0.21 0.22 0.21 0.21 0.21 0.21 0.17 0.19 0.22
172.16.66.77 : 0.23 0.21 0.21 0.21 0.20 0.21 0.21 0.21 0.21 0.20
172.16.66.78 : 0.23 0.20 0.20 0.13 0.21 0.20 0.19 0.21 0.21 0.21
172.16.66.79 : 0.18 0.16 0.16 0.13 0.15 0.15 0.16 0.16 0.16 0.15
172.16.66.8  : 0.24 0.20 0.20 0.21 0.20 0.20 0.21 0.20 0.20 0.21
172.16.66.80 : 0.25 0.18 0.21 0.22 0.20 0.20 0.21 0.20 0.21 0.22
172.16.66.81 : 0.19 0.16 0.15 0.16 0.06 0.08 0.16 0.16 0.16 0.15
172.16.66.97 : 0.24 0.21 0.20 0.22 0.21 0.21 0.21 0.20 0.22 0.22

      42 targets
      42 alive
       0 unreachable
       0 unknown addresses

       1 timeouts (waiting for response)
     420 ICMP Echos sent
     419 ICMP Echo Replies received
       0 other ICMP received

 0.03 ms (min round trip time)
 0.48 ms (avg round trip time)
 13.9 ms (max round trip time)
       10.011 sec (elapsed real time)

