172.16.36.8 : 0.03 0.03 0.03 0.03 0.03 0.03 0.03 0.03 0.03 0.03
172.16.39.5 : 12.40 4.34 4.19 4.30 4.32 4.33 4.22 4.33 4.19 4.29
172.16.39.3 : 0.23 0.16 0.18 0.11 0.18 0.18 0.18 0.17 0.18 0.18

       3 targets
       3 alive
       0 unreachable
       0 unknown addresses

       0 timeouts (waiting for response)
      30 ICMP Echos sent
      30 ICMP Echo Replies received
       0 other ICMP received

 0.03 ms (min round trip time)
 1.76 ms (avg round trip time)
 12.4 ms (max round trip time)
        9.030 sec (elapsed real time)

