172.16.36.7  : 23.93 13.94 13.85 13.90 13.92 13.88 13.90 13.93 13.89 13.91
172.16.66.46 : 0.17 0.21 0.20 0.20 0.20 0.20 0.18 0.18 0.15 0.19
172.16.66.47 : 0.21 0.22 0.20 0.21 0.22 0.21 0.17 0.16 0.19 0.16
172.16.66.48 : 0.19 0.21 0.21 0.21 0.22 0.20 0.21 0.22 0.21 0.21
172.16.66.49 : 0.12 0.17 0.21 0.20 0.14 0.19 0.17 0.18 0.22 0.18
172.16.66.5  : 0.17 0.21 0.19 0.20 0.20 0.20 0.18 0.22 0.18 0.21
172.16.66.50 : 0.17 0.19 0.17 0.18 0.19 0.18 0.20 0.19 0.18 0.20
172.16.66.51 : 0.20 0.17 0.20 0.19 0.17 0.18 0.18 0.18 0.18 0.18
172.16.66.52 : 0.15 0.18 0.17 0.17 0.14 0.16 0.22 0.18 0.15 0.21
172.16.66.53 : 0.20 0.20 0.21 0.21 0.20 0.20 0.21 0.20 0.20 0.21
172.16.66.54 : 0.20 0.21 0.21 0.21 0.20 0.20 0.17 0.18 0.20 0.17
172.16.66.55 : 0.20 0.21 0.21 0.20 0.22 0.20 0.20 0.21 0.20 0.20
172.16.66.56 : 0.11 0.12 0.13 0.18 0.20 0.14 0.13 0.13 0.15 0.16
172.16.66.57 : 0.19 0.22 0.21 0.21 0.21 0.18 0.20 0.22 0.21 0.21
172.16.66.58 : 0.21 0.19 0.17 0.18 0.19 0.18 0.17 0.19 0.17 0.17
172.16.66.59 : 0.21 0.21 0.20 0.19 0.18 0.20 0.20 0.21 0.20 0.22
172.16.66.6  : 0.20 0.20 0.21 0.21 0.21 0.20 0.22 0.21 0.20 0.20
172.16.66.60 : 0.20 0.24 0.21 0.21 0.21 0.22 0.21 0.22 0.20 0.22
172.16.66.61 : 0.17 0.22 0.21 0.22 0.21 0.21 0.16 0.16 0.19 0.16
172.16.66.62 : 0.21 0.21 0.20 0.20 0.22 0.16 0.17 0.21 0.22 0.20
172.16.66.63 : 0.20 0.22 0.20 0.18 0.22 0.20 0.20 0.22 0.20 0.20
172.16.66.64 : 0.21 0.21 0.20 0.20 0.19 0.19 0.19 0.21 0.20 0.20
172.16.66.65 : 0.20 0.22 0.20 0.20 0.19 0.21 0.20 0.22 0.17 0.20
172.16.66.66 : 0.16 0.13 0.16 0.15 0.15 0.21 0.21 0.21 0.20 0.21
172.16.66.67 : 0.24 0.20 0.22 0.17 0.21 0.22 0.21 0.20 0.22 0.20
172.16.66.68 : 0.20 0.19 0.18 0.18 0.18 0.18 0.20 0.20 0.20 0.20
172.16.66.69 : 0.21 0.20 0.21 0.21 0.20 0.19 0.19 0.18 0.18 0.18
172.16.66.7  : 0.04 0.03 0.03 0.03 0.03 0.03 0.03 0.03 0.03 0.03
172.16.66.70 : 0.37 0.20 0.21 0.22 0.21 0.21 0.21 0.20 0.20 0.20
172.16.66.71 : 0.36 0.20 0.20 0.22 0.20 0.21 0.19 0.20 0.22 0.22
172.16.66.72 : 0.34 0.21 0.22 0.21 0.21 0.20 0.21 0.20 0.20 0.21
172.16.66.73 : 0.33 0.22 0.21 0.21 0.21 0.21 0.21 0.21 0.21 0.21
172.16.66.74 : 0.34 0.16 0.21 0.21 0.21 0.20 0.21 0.22 0.21 0.21
172.16.66.75 : 0.34 0.21 0.22 0.20 0.18 0.14 0.13 0.14 0.13 0.15
172.16.66.76 : 0.34 0.21 0.21 0.21 0.22 0.21 0.20 0.21 0.21 0.20
172.16.66.77 : 0.26 0.22 0.21 0.20 0.18 0.21 0.21 0.20 0.21 0.21
172.16.66.78 : 0.37 0.21 0.21 0.21 0.20 0.21 0.20 0.20 0.21 0.18
172.16.66.79 : 0.18 0.18 0.11 0.19 0.20 0.16 0.18 0.20 0.22 0.19
172.16.66.8  : 0.31 0.16 0.17 0.17 0.16 0.21 0.21 0.21 0.20 0.21
172.16.66.80 : 0.36 0.16 0.17 0.17 0.16 0.21 0.21 0.16 0.20 0.22
172.16.66.81 : 0.42 0.21 0.17 0.21 0.20 0.22 0.21 0.20 0.21 0.22
172.16.66.97 : 0.39 0.20 0.21 0.20 0.21 0.20 0.19 0.21 0.20 0.19

      42 targets
      42 alive
       0 unreachable
       0 unknown addresses

       0 timeouts (waiting for response)
     420 ICMP Echos sent
     420 ICMP Echo Replies received
       0 other ICMP received

 0.03 ms (min round trip time)
 0.54 ms (avg round trip time)
 23.9 ms (max round trip time)
        9.417 sec (elapsed real time)

