172.16.36.7 : 4.41 4.37 4.34 4.30 4.35 4.28 4.33 4.32 4.34 4.32
172.16.39.8 : 0.03 0.01 0.01 0.01 0.01 0.01 0.02 0.01 0.01 0.01
172.16.39.6 : 0.17 0.14 0.15 0.14 0.15 0.14 0.13 0.12 0.08 0.12

       3 targets
       3 alive
       0 unreachable
       0 unknown addresses

       0 timeouts (waiting for response)
      30 ICMP Echos sent
      30 ICMP Echo Replies received
       0 other ICMP received

 0.01 ms (min round trip time)
 1.49 ms (avg round trip time)
 4.41 ms (max round trip time)
        9.021 sec (elapsed real time)

