172.16.36.8 : 0.04 0.03 0.01 0.01 0.03 0.03 0.03 0.03 0.03 0.03
172.16.38.6 : 10.87 4.16 4.24 4.35 4.34 4.34 4.34 4.38 4.34 4.28
172.16.38.5 : 0.17 0.20 0.22 0.21 0.22 0.21 0.20 0.20 0.20 0.21

       3 targets
       3 alive
       0 unreachable
       0 unknown addresses

       0 timeouts (waiting for response)
      30 ICMP Echos sent
      30 ICMP Echo Replies received
       0 other ICMP received

 0.01 ms (min round trip time)
 1.73 ms (avg round trip time)
 10.8 ms (max round trip time)
        9.033 sec (elapsed real time)

