"2021-03-24T03:20:01.131124+01:00","chifflot-8","bmc_node_power_watt",494
"2021-03-24T03:20:06.13214+01:00","chifflot-8","bmc_node_power_watt",494
"2021-03-24T03:20:11.133378+01:00","chifflot-8","bmc_node_power_watt",494
"2021-03-24T03:20:16.134444+01:00","chifflot-8","bmc_node_power_watt",494
"2021-03-24T03:20:21.137071+01:00","chifflot-8","bmc_node_power_watt",494
"2021-03-24T03:20:26.136653+01:00","chifflot-8","bmc_node_power_watt",494
"2021-03-24T03:20:31.137599+01:00","chifflot-8","bmc_node_power_watt",494
"2021-03-24T03:20:36.13811+01:00","chifflot-8","bmc_node_power_watt",494
"2021-03-24T03:20:41.139736+01:00","chifflot-8","bmc_node_power_watt",494
"2021-03-24T03:20:46.140722+01:00","chifflot-8","bmc_node_power_watt",494
"2021-03-24T03:20:51.144293+01:00","chifflot-8","bmc_node_power_watt",494
"2021-03-24T03:20:56.146755+01:00","chifflot-8","bmc_node_power_watt",494
"2021-03-24T03:21:01.147495+01:00","chifflot-8","bmc_node_power_watt",494
"2021-03-24T03:21:06.149356+01:00","chifflot-8","bmc_node_power_watt",494
"2021-03-24T03:21:11.152368+01:00","chifflot-8","bmc_node_power_watt",494
"2021-03-24T03:21:16.155302+01:00","chifflot-8","bmc_node_power_watt",494
"2021-03-24T03:21:21.158428+01:00","chifflot-8","bmc_node_power_watt",494
"2021-03-24T03:21:26.16101+01:00","chifflot-8","bmc_node_power_watt",494
"2021-03-24T03:21:31.161997+01:00","chifflot-8","bmc_node_power_watt",494
"2021-03-24T03:21:36.161679+01:00","chifflot-8","bmc_node_power_watt",494
"2021-03-24T03:21:41.162395+01:00","chifflot-8","bmc_node_power_watt",494
"2021-03-24T03:21:46.162748+01:00","chifflot-8","bmc_node_power_watt",494
"2021-03-24T03:21:51.162875+01:00","chifflot-8","bmc_node_power_watt",494
"2021-03-24T03:21:56.163251+01:00","chifflot-8","bmc_node_power_watt",494
"2021-03-24T03:22:01.164073+01:00","chifflot-8","bmc_node_power_watt",494
"2021-03-24T03:22:06.164827+01:00","chifflot-8","bmc_node_power_watt",494
"2021-03-24T03:22:11.165907+01:00","chifflot-8","bmc_node_power_watt",494
"2021-03-24T03:22:16.166459+01:00","chifflot-8","bmc_node_power_watt",520
"2021-03-24T03:22:21.167201+01:00","chifflot-8","bmc_node_power_watt",520
"2021-03-24T03:22:26.167883+01:00","chifflot-8","bmc_node_power_watt",520
"2021-03-24T03:22:31.16868+01:00","chifflot-8","bmc_node_power_watt",520
"2021-03-24T03:22:36.169568+01:00","chifflot-8","bmc_node_power_watt",494
"2021-03-24T03:22:41.169969+01:00","chifflot-8","bmc_node_power_watt",494
"2021-03-24T03:22:46.170673+01:00","chifflot-8","bmc_node_power_watt",494
"2021-03-24T03:22:51.171095+01:00","chifflot-8","bmc_node_power_watt",494
"2021-03-24T03:22:56.172354+01:00","chifflot-8","bmc_node_power_watt",494
"2021-03-24T03:23:01.172485+01:00","chifflot-8","bmc_node_power_watt",520
"2021-03-24T03:23:06.172854+01:00","chifflot-8","bmc_node_power_watt",520
"2021-03-24T03:23:11.173437+01:00","chifflot-8","bmc_node_power_watt",520
"2021-03-24T03:23:16.173718+01:00","chifflot-8","bmc_node_power_watt",520
"2021-03-24T03:23:21.174685+01:00","chifflot-8","bmc_node_power_watt",520
"2021-03-24T03:23:26.175537+01:00","chifflot-8","bmc_node_power_watt",494
"2021-03-24T03:23:31.176052+01:00","chifflot-8","bmc_node_power_watt",494
"2021-03-24T03:23:36.177965+01:00","chifflot-8","bmc_node_power_watt",494
"2021-03-24T03:23:41.178619+01:00","chifflot-8","bmc_node_power_watt",494
"2021-03-24T03:23:46.179597+01:00","chifflot-8","bmc_node_power_watt",494
"2021-03-24T03:23:51.18107+01:00","chifflot-8","bmc_node_power_watt",494
"2021-03-24T03:23:56.180655+01:00","chifflot-8","bmc_node_power_watt",494
"2021-03-24T03:24:01.182648+01:00","chifflot-8","bmc_node_power_watt",494
"2021-03-24T03:24:06.182662+01:00","chifflot-8","bmc_node_power_watt",494
"2021-03-24T03:24:11.184253+01:00","chifflot-8","bmc_node_power_watt",494
"2021-03-24T03:24:16.185403+01:00","chifflot-8","bmc_node_power_watt",494
"2021-03-24T03:24:21.186273+01:00","chifflot-8","bmc_node_power_watt",494
"2021-03-24T03:24:26.188189+01:00","chifflot-8","bmc_node_power_watt",494
"2021-03-24T03:24:31.189378+01:00","chifflot-8","bmc_node_power_watt",494
"2021-03-24T03:24:36.190111+01:00","chifflot-8","bmc_node_power_watt",494
"2021-03-24T03:24:41.190726+01:00","chifflot-8","bmc_node_power_watt",494
"2021-03-24T03:24:46.192734+01:00","chifflot-8","bmc_node_power_watt",494
"2021-03-24T03:24:51.195386+01:00","chifflot-8","bmc_node_power_watt",494
"2021-03-24T03:24:56.195801+01:00","chifflot-8","bmc_node_power_watt",494
"2021-03-24T03:25:01.195881+01:00","chifflot-8","bmc_node_power_watt",520
"2021-03-24T03:25:06.196577+01:00","chifflot-8","bmc_node_power_watt",520
"2021-03-24T03:25:11.197529+01:00","chifflot-8","bmc_node_power_watt",520
"2021-03-24T03:25:16.199229+01:00","chifflot-8","bmc_node_power_watt",520
"2021-03-24T03:25:21.200918+01:00","chifflot-8","bmc_node_power_watt",520
"2021-03-24T03:25:26.202916+01:00","chifflot-8","bmc_node_power_watt",494
"2021-03-24T03:25:31.206235+01:00","chifflot-8","bmc_node_power_watt",494
"2021-03-24T03:25:36.206916+01:00","chifflot-8","bmc_node_power_watt",494
"2021-03-24T03:25:41.20752+01:00","chifflot-8","bmc_node_power_watt",494
"2021-03-24T03:25:46.20903+01:00","chifflot-8","bmc_node_power_watt",494
"2021-03-24T03:25:51.209274+01:00","chifflot-8","bmc_node_power_watt",494
"2021-03-24T03:25:56.209691+01:00","chifflot-8","bmc_node_power_watt",494
"2021-03-24T03:26:01.210666+01:00","chifflot-8","bmc_node_power_watt",494
"2021-03-24T03:26:06.21141+01:00","chifflot-8","bmc_node_power_watt",494
"2021-03-24T03:26:11.212161+01:00","chifflot-8","bmc_node_power_watt",494
"2021-03-24T03:26:16.21291+01:00","chifflot-8","bmc_node_power_watt",494
"2021-03-24T03:26:21.21485+01:00","chifflot-8","bmc_node_power_watt",494
"2021-03-24T03:26:26.215765+01:00","chifflot-8","bmc_node_power_watt",494
"2021-03-24T03:26:31.216202+01:00","chifflot-8","bmc_node_power_watt",494
"2021-03-24T03:26:36.217035+01:00","chifflot-8","bmc_node_power_watt",494
"2021-03-24T03:26:41.218263+01:00","chifflot-8","bmc_node_power_watt",494
"2021-03-24T03:26:46.2182+01:00","chifflot-8","bmc_node_power_watt",494
"2021-03-24T03:26:51.220227+01:00","chifflot-8","bmc_node_power_watt",494
"2021-03-24T03:26:56.221158+01:00","chifflot-8","bmc_node_power_watt",494
"2021-03-24T03:27:01.222806+01:00","chifflot-8","bmc_node_power_watt",520
"2021-03-24T03:27:06.223595+01:00","chifflot-8","bmc_node_power_watt",520
"2021-03-24T03:27:11.224229+01:00","chifflot-8","bmc_node_power_watt",520
"2021-03-24T03:27:16.224377+01:00","chifflot-8","bmc_node_power_watt",520
"2021-03-24T03:27:21.227081+01:00","chifflot-8","bmc_node_power_watt",494
"2021-03-24T03:27:26.227881+01:00","chifflot-8","bmc_node_power_watt",494
"2021-03-24T03:27:31.228978+01:00","chifflot-8","bmc_node_power_watt",494
"2021-03-24T03:27:36.231432+01:00","chifflot-8","bmc_node_power_watt",494
"2021-03-24T03:27:41.234692+01:00","chifflot-8","bmc_node_power_watt",494
"2021-03-24T03:27:46.234944+01:00","chifflot-8","bmc_node_power_watt",520
"2021-03-24T03:27:51.238276+01:00","chifflot-8","bmc_node_power_watt",520
"2021-03-24T03:27:56.238254+01:00","chifflot-8","bmc_node_power_watt",520
"2021-03-24T03:28:01.240508+01:00","chifflot-8","bmc_node_power_watt",520
"2021-03-24T03:28:06.241807+01:00","chifflot-8","bmc_node_power_watt",520
"2021-03-24T03:28:11.241916+01:00","chifflot-8","bmc_node_power_watt",494
"2021-03-24T03:28:16.242948+01:00","chifflot-8","bmc_node_power_watt",494
"2021-03-24T03:28:21.243445+01:00","chifflot-8","bmc_node_power_watt",494
"2021-03-24T03:28:26.243852+01:00","chifflot-8","bmc_node_power_watt",494
"2021-03-24T03:28:31.244375+01:00","chifflot-8","bmc_node_power_watt",520
"2021-03-24T03:28:36.245717+01:00","chifflot-8","bmc_node_power_watt",520
"2021-03-24T03:28:41.245746+01:00","chifflot-8","bmc_node_power_watt",520
"2021-03-24T03:28:46.246476+01:00","chifflot-8","bmc_node_power_watt",520
"2021-03-24T03:28:51.247817+01:00","chifflot-8","bmc_node_power_watt",520
"2021-03-24T03:28:56.249111+01:00","chifflot-8","bmc_node_power_watt",494
"2021-03-24T03:29:01.249303+01:00","chifflot-8","bmc_node_power_watt",494
"2021-03-24T03:29:06.250694+01:00","chifflot-8","bmc_node_power_watt",494
"2021-03-24T03:29:11.251684+01:00","chifflot-8","bmc_node_power_watt",494
"2021-03-24T03:29:16.252461+01:00","chifflot-8","bmc_node_power_watt",494
"2021-03-24T03:29:21.254116+01:00","chifflot-8","bmc_node_power_watt",494
"2021-03-24T03:29:26.255579+01:00","chifflot-8","bmc_node_power_watt",494
"2021-03-24T03:29:31.256985+01:00","chifflot-8","bmc_node_power_watt",494
"2021-03-24T03:29:36.259544+01:00","chifflot-8","bmc_node_power_watt",494
"2021-03-24T03:29:41.25905+01:00","chifflot-8","bmc_node_power_watt",494
"2021-03-24T03:29:46.261931+01:00","chifflot-8","bmc_node_power_watt",494
"2021-03-24T03:29:51.265175+01:00","chifflot-8","bmc_node_power_watt",494
"2021-03-24T03:29:56.26461+01:00","chifflot-8","bmc_node_power_watt",494
"2021-03-24T03:30:01.265918+01:00","chifflot-8","bmc_node_power_watt",494
"2021-03-24T03:30:06.267502+01:00","chifflot-8","bmc_node_power_watt",494
"2021-03-24T03:30:11.268037+01:00","chifflot-8","bmc_node_power_watt",494
"2021-03-24T03:30:16.269738+01:00","chifflot-8","bmc_node_power_watt",494
"2021-03-24T03:30:21.273135+01:00","chifflot-8","bmc_node_power_watt",494
"2021-03-24T03:30:26.274274+01:00","chifflot-8","bmc_node_power_watt",494
"2021-03-24T03:30:31.27319+01:00","chifflot-8","bmc_node_power_watt",494
"2021-03-24T03:30:36.278008+01:00","chifflot-8","bmc_node_power_watt",494
"2021-03-24T03:30:41.277722+01:00","chifflot-8","bmc_node_power_watt",494
"2021-03-24T03:30:46.27825+01:00","chifflot-8","bmc_node_power_watt",494
"2021-03-24T03:30:51.279028+01:00","chifflot-8","bmc_node_power_watt",494
"2021-03-24T03:30:56.280593+01:00","chifflot-8","bmc_node_power_watt",494
"2021-03-24T03:31:01.280559+01:00","chifflot-8","bmc_node_power_watt",494
"2021-03-24T03:31:06.281105+01:00","chifflot-8","bmc_node_power_watt",494
"2021-03-24T03:31:11.28134+01:00","chifflot-8","bmc_node_power_watt",494
"2021-03-24T03:31:16.281555+01:00","chifflot-8","bmc_node_power_watt",494
"2021-03-24T03:31:21.282423+01:00","chifflot-8","bmc_node_power_watt",494
"2021-03-24T03:31:26.282865+01:00","chifflot-8","bmc_node_power_watt",494
"2021-03-24T03:31:31.28421+01:00","chifflot-8","bmc_node_power_watt",494
"2021-03-24T03:31:36.28457+01:00","chifflot-8","bmc_node_power_watt",494
"2021-03-24T03:31:41.285018+01:00","chifflot-8","bmc_node_power_watt",494
"2021-03-24T03:31:46.286488+01:00","chifflot-8","bmc_node_power_watt",494
"2021-03-24T03:31:51.287923+01:00","chifflot-8","bmc_node_power_watt",494
"2021-03-24T03:31:56.28818+01:00","chifflot-8","bmc_node_power_watt",494
"2021-03-24T03:32:01.288879+01:00","chifflot-8","bmc_node_power_watt",494
"2021-03-24T03:32:06.289363+01:00","chifflot-8","bmc_node_power_watt",494
"2021-03-24T03:32:11.289519+01:00","chifflot-8","bmc_node_power_watt",494
"2021-03-24T03:32:16.290698+01:00","chifflot-8","bmc_node_power_watt",494
"2021-03-24T03:32:21.291809+01:00","chifflot-8","bmc_node_power_watt",494
"2021-03-24T03:32:26.292487+01:00","chifflot-8","bmc_node_power_watt",494
"2021-03-24T03:32:31.293105+01:00","chifflot-8","bmc_node_power_watt",494
"2021-03-24T03:32:36.29438+01:00","chifflot-8","bmc_node_power_watt",494
"2021-03-24T03:32:41.294597+01:00","chifflot-8","bmc_node_power_watt",494
"2021-03-24T03:32:46.295711+01:00","chifflot-8","bmc_node_power_watt",494
"2021-03-24T03:32:51.296253+01:00","chifflot-8","bmc_node_power_watt",494
"2021-03-24T03:32:56.297248+01:00","chifflot-8","bmc_node_power_watt",494
"2021-03-24T03:33:01.298207+01:00","chifflot-8","bmc_node_power_watt",494
"2021-03-24T03:33:06.298854+01:00","chifflot-8","bmc_node_power_watt",494
"2021-03-24T03:33:11.299246+01:00","chifflot-8","bmc_node_power_watt",494
"2021-03-24T03:33:16.30069+01:00","chifflot-8","bmc_node_power_watt",494
"2021-03-24T03:33:21.301189+01:00","chifflot-8","bmc_node_power_watt",494
"2021-03-24T03:33:26.301949+01:00","chifflot-8","bmc_node_power_watt",494
"2021-03-24T03:33:31.302958+01:00","chifflot-8","bmc_node_power_watt",494
"2021-03-24T03:33:36.304023+01:00","chifflot-8","bmc_node_power_watt",494
"2021-03-24T03:33:41.305192+01:00","chifflot-8","bmc_node_power_watt",494
"2021-03-24T03:33:46.306283+01:00","chifflot-8","bmc_node_power_watt",494
"2021-03-24T03:33:51.306997+01:00","chifflot-8","bmc_node_power_watt",494
"2021-03-24T03:33:56.307134+01:00","chifflot-8","bmc_node_power_watt",494
"2021-03-24T03:34:01.307917+01:00","chifflot-8","bmc_node_power_watt",494
"2021-03-24T03:34:06.308617+01:00","chifflot-8","bmc_node_power_watt",494
"2021-03-24T03:34:11.309355+01:00","chifflot-8","bmc_node_power_watt",494
"2021-03-24T03:34:16.310427+01:00","chifflot-8","bmc_node_power_watt",494
"2021-03-24T03:34:21.310891+01:00","chifflot-8","bmc_node_power_watt",494
"2021-03-24T03:34:26.311388+01:00","chifflot-8","bmc_node_power_watt",494
"2021-03-24T03:34:31.312358+01:00","chifflot-8","bmc_node_power_watt",494
"2021-03-24T03:34:36.312614+01:00","chifflot-8","bmc_node_power_watt",494
"2021-03-24T03:34:41.313939+01:00","chifflot-8","bmc_node_power_watt",494
"2021-03-24T03:34:46.315341+01:00","chifflot-8","bmc_node_power_watt",494
"2021-03-24T03:34:51.315906+01:00","chifflot-8","bmc_node_power_watt",494
"2021-03-24T03:34:56.317275+01:00","chifflot-8","bmc_node_power_watt",494
"2021-03-24T03:35:01.319073+01:00","chifflot-8","bmc_node_power_watt",494
"2021-03-24T03:35:06.319943+01:00","chifflot-8","bmc_node_power_watt",494
"2021-03-24T03:35:11.321833+01:00","chifflot-8","bmc_node_power_watt",494
"2021-03-24T03:35:16.323713+01:00","chifflot-8","bmc_node_power_watt",494
"2021-03-24T03:35:21.328092+01:00","chifflot-8","bmc_node_power_watt",494
"2021-03-24T03:35:26.330799+01:00","chifflot-8","bmc_node_power_watt",494
"2021-03-24T03:35:31.335414+01:00","chifflot-8","bmc_node_power_watt",494
"2021-03-24T03:35:36.336404+01:00","chifflot-8","bmc_node_power_watt",494
"2021-03-24T03:35:41.338007+01:00","chifflot-8","bmc_node_power_watt",494
"2021-03-24T03:35:46.341029+01:00","chifflot-8","bmc_node_power_watt",494
"2021-03-24T03:35:51.341487+01:00","chifflot-8","bmc_node_power_watt",494
"2021-03-24T03:35:56.342213+01:00","chifflot-8","bmc_node_power_watt",494
"2021-03-24T03:36:01.343125+01:00","chifflot-8","bmc_node_power_watt",494
"2021-03-24T03:36:06.343543+01:00","chifflot-8","bmc_node_power_watt",494
"2021-03-24T03:36:11.344713+01:00","chifflot-8","bmc_node_power_watt",494
"2021-03-24T03:36:16.345633+01:00","chifflot-8","bmc_node_power_watt",494
"2021-03-24T03:36:21.346275+01:00","chifflot-8","bmc_node_power_watt",494
"2021-03-24T03:36:26.34664+01:00","chifflot-8","bmc_node_power_watt",494
"2021-03-24T03:36:31.346909+01:00","chifflot-8","bmc_node_power_watt",494
"2021-03-24T03:36:36.347716+01:00","chifflot-8","bmc_node_power_watt",494
"2021-03-24T03:36:41.349015+01:00","chifflot-8","bmc_node_power_watt",494
"2021-03-24T03:36:46.349163+01:00","chifflot-8","bmc_node_power_watt",494
"2021-03-24T03:36:51.350162+01:00","chifflot-8","bmc_node_power_watt",494
"2021-03-24T03:36:56.350749+01:00","chifflot-8","bmc_node_power_watt",494
"2021-03-24T03:37:01.351475+01:00","chifflot-8","bmc_node_power_watt",494
"2021-03-24T03:37:06.351905+01:00","chifflot-8","bmc_node_power_watt",494
"2021-03-24T03:37:11.352581+01:00","chifflot-8","bmc_node_power_watt",494
"2021-03-24T03:37:16.353247+01:00","chifflot-8","bmc_node_power_watt",494
"2021-03-24T03:37:21.353479+01:00","chifflot-8","bmc_node_power_watt",494
"2021-03-24T03:37:26.354367+01:00","chifflot-8","bmc_node_power_watt",494
"2021-03-24T03:37:31.354716+01:00","chifflot-8","bmc_node_power_watt",494
"2021-03-24T03:37:36.355152+01:00","chifflot-8","bmc_node_power_watt",494
"2021-03-24T03:37:41.355448+01:00","chifflot-8","bmc_node_power_watt",494
"2021-03-24T03:37:46.355709+01:00","chifflot-8","bmc_node_power_watt",494
"2021-03-24T03:37:51.356403+01:00","chifflot-8","bmc_node_power_watt",494
"2021-03-24T03:37:56.357371+01:00","chifflot-8","bmc_node_power_watt",494
"2021-03-24T03:38:01.357944+01:00","chifflot-8","bmc_node_power_watt",520
"2021-03-24T03:38:06.358417+01:00","chifflot-8","bmc_node_power_watt",520
"2021-03-24T03:38:11.359094+01:00","chifflot-8","bmc_node_power_watt",520
"2021-03-24T03:38:16.360436+01:00","chifflot-8","bmc_node_power_watt",520
"2021-03-24T03:38:21.361509+01:00","chifflot-8","bmc_node_power_watt",520
"2021-03-24T03:38:26.362298+01:00","chifflot-8","bmc_node_power_watt",494
"2021-03-24T03:38:31.362874+01:00","chifflot-8","bmc_node_power_watt",494
"2021-03-24T03:38:36.363593+01:00","chifflot-8","bmc_node_power_watt",494
"2021-03-24T03:38:41.364281+01:00","chifflot-8","bmc_node_power_watt",494
"2021-03-24T03:38:46.364983+01:00","chifflot-8","bmc_node_power_watt",494
"2021-03-24T03:38:51.365356+01:00","chifflot-8","bmc_node_power_watt",494
"2021-03-24T03:38:56.36655+01:00","chifflot-8","bmc_node_power_watt",494
"2021-03-24T03:39:01.367905+01:00","chifflot-8","bmc_node_power_watt",494
"2021-03-24T03:39:06.368288+01:00","chifflot-8","bmc_node_power_watt",494
"2021-03-24T03:39:11.368982+01:00","chifflot-8","bmc_node_power_watt",494
"2021-03-24T03:39:16.369265+01:00","chifflot-8","bmc_node_power_watt",494
"2021-03-24T03:39:21.369991+01:00","chifflot-8","bmc_node_power_watt",494
"2021-03-24T03:39:26.37075+01:00","chifflot-8","bmc_node_power_watt",494
"2021-03-24T03:39:31.371167+01:00","chifflot-8","bmc_node_power_watt",494
"2021-03-24T03:39:36.37221+01:00","chifflot-8","bmc_node_power_watt",520
"2021-03-24T03:39:41.373147+01:00","chifflot-8","bmc_node_power_watt",520
"2021-03-24T03:39:46.374015+01:00","chifflot-8","bmc_node_power_watt",520
"2021-03-24T03:39:51.374964+01:00","chifflot-8","bmc_node_power_watt",520
"2021-03-24T03:39:56.375476+01:00","chifflot-8","bmc_node_power_watt",520
"2021-03-24T03:40:01.37621+01:00","chifflot-8","bmc_node_power_watt",520
"2021-03-24T03:40:06.377415+01:00","chifflot-8","bmc_node_power_watt",520
"2021-03-24T03:40:11.378124+01:00","chifflot-8","bmc_node_power_watt",520
"2021-03-24T03:40:16.378945+01:00","chifflot-8","bmc_node_power_watt",520
"2021-03-24T03:40:21.379228+01:00","chifflot-8","bmc_node_power_watt",520
"2021-03-24T03:40:26.379976+01:00","chifflot-8","bmc_node_power_watt",494
"2021-03-24T03:40:31.380261+01:00","chifflot-8","bmc_node_power_watt",494
"2021-03-24T03:40:36.381126+01:00","chifflot-8","bmc_node_power_watt",494
"2021-03-24T03:40:41.381101+01:00","chifflot-8","bmc_node_power_watt",494
"2021-03-24T03:40:46.382247+01:00","chifflot-8","bmc_node_power_watt",520
"2021-03-24T03:40:51.383266+01:00","chifflot-8","bmc_node_power_watt",520
"2021-03-24T03:40:56.383613+01:00","chifflot-8","bmc_node_power_watt",520
"2021-03-24T03:41:01.384069+01:00","chifflot-8","bmc_node_power_watt",520
"2021-03-24T03:41:06.384733+01:00","chifflot-8","bmc_node_power_watt",520
"2021-03-24T03:41:11.385098+01:00","chifflot-8","bmc_node_power_watt",520
"2021-03-24T03:41:16.385755+01:00","chifflot-8","bmc_node_power_watt",520
"2021-03-24T03:41:21.386764+01:00","chifflot-8","bmc_node_power_watt",520
"2021-03-24T03:41:26.387786+01:00","chifflot-8","bmc_node_power_watt",520
"2021-03-24T03:41:31.388702+01:00","chifflot-8","bmc_node_power_watt",520
"2021-03-24T03:41:36.389489+01:00","chifflot-8","bmc_node_power_watt",494
"2021-03-24T03:41:41.390497+01:00","chifflot-8","bmc_node_power_watt",494
"2021-03-24T03:41:46.390746+01:00","chifflot-8","bmc_node_power_watt",494
"2021-03-24T03:41:51.391288+01:00","chifflot-8","bmc_node_power_watt",494
"2021-03-24T03:41:56.391615+01:00","chifflot-8","bmc_node_power_watt",494
"2021-03-24T03:42:01.391941+01:00","chifflot-8","bmc_node_power_watt",494
"2021-03-24T03:42:06.392446+01:00","chifflot-8","bmc_node_power_watt",494
"2021-03-24T03:42:11.393628+01:00","chifflot-8","bmc_node_power_watt",494
"2021-03-24T03:42:16.394143+01:00","chifflot-8","bmc_node_power_watt",494
"2021-03-24T03:42:21.394809+01:00","chifflot-8","bmc_node_power_watt",520
"2021-03-24T03:42:26.395306+01:00","chifflot-8","bmc_node_power_watt",520
"2021-03-24T03:42:31.396519+01:00","chifflot-8","bmc_node_power_watt",520
"2021-03-24T03:42:36.397647+01:00","chifflot-8","bmc_node_power_watt",520
"2021-03-24T03:42:41.398168+01:00","chifflot-8","bmc_node_power_watt",520
"2021-03-24T03:42:46.39861+01:00","chifflot-8","bmc_node_power_watt",520
"2021-03-24T03:42:51.398846+01:00","chifflot-8","bmc_node_power_watt",520
"2021-03-24T03:42:56.399644+01:00","chifflot-8","bmc_node_power_watt",520
