"2021-04-05T11:29:50.044367+02:00","chifflot-7","bmc_node_power_watt",494
"2021-04-05T11:29:55.045072+02:00","chifflot-7","bmc_node_power_watt",494
"2021-04-05T11:30:00.045759+02:00","chifflot-7","bmc_node_power_watt",520
"2021-04-05T11:30:05.048611+02:00","chifflot-7","bmc_node_power_watt",520
"2021-04-05T11:30:10.050583+02:00","chifflot-7","bmc_node_power_watt",520
"2021-04-05T11:30:15.050905+02:00","chifflot-7","bmc_node_power_watt",520
"2021-04-05T11:30:20.051814+02:00","chifflot-7","bmc_node_power_watt",494
"2021-04-05T11:30:25.052555+02:00","chifflot-7","bmc_node_power_watt",494
"2021-04-05T11:30:30.054+02:00","chifflot-7","bmc_node_power_watt",494
"2021-04-05T11:30:35.055921+02:00","chifflot-7","bmc_node_power_watt",494
"2021-04-05T11:30:40.055846+02:00","chifflot-7","bmc_node_power_watt",494
"2021-04-05T11:30:45.057314+02:00","chifflot-7","bmc_node_power_watt",494
"2021-04-05T11:30:50.059232+02:00","chifflot-7","bmc_node_power_watt",494
"2021-04-05T11:30:55.061433+02:00","chifflot-7","bmc_node_power_watt",494
"2021-04-05T11:31:00.062865+02:00","chifflot-7","bmc_node_power_watt",494
"2021-04-05T11:31:05.063705+02:00","chifflot-7","bmc_node_power_watt",494
"2021-04-05T11:31:10.065078+02:00","chifflot-7","bmc_node_power_watt",520
"2021-04-05T11:31:15.065886+02:00","chifflot-7","bmc_node_power_watt",520
"2021-04-05T11:31:20.06759+02:00","chifflot-7","bmc_node_power_watt",520
"2021-04-05T11:31:25.068492+02:00","chifflot-7","bmc_node_power_watt",520
"2021-04-05T11:31:30.068924+02:00","chifflot-7","bmc_node_power_watt",520
"2021-04-05T11:31:35.070506+02:00","chifflot-7","bmc_node_power_watt",494
"2021-04-05T11:31:40.071879+02:00","chifflot-7","bmc_node_power_watt",494
"2021-04-05T11:31:45.071949+02:00","chifflot-7","bmc_node_power_watt",494
"2021-04-05T11:31:50.073702+02:00","chifflot-7","bmc_node_power_watt",494
"2021-04-05T11:31:55.075516+02:00","chifflot-7","bmc_node_power_watt",494
"2021-04-05T11:32:00.075963+02:00","chifflot-7","bmc_node_power_watt",494
"2021-04-05T11:32:05.077319+02:00","chifflot-7","bmc_node_power_watt",494
"2021-04-05T11:32:10.079699+02:00","chifflot-7","bmc_node_power_watt",494
"2021-04-05T11:32:15.080804+02:00","chifflot-7","bmc_node_power_watt",494
"2021-04-05T11:32:20.081976+02:00","chifflot-7","bmc_node_power_watt",520
"2021-04-05T11:32:25.082606+02:00","chifflot-7","bmc_node_power_watt",520
"2021-04-05T11:32:30.083549+02:00","chifflot-7","bmc_node_power_watt",520
"2021-04-05T11:32:35.084827+02:00","chifflot-7","bmc_node_power_watt",520
"2021-04-05T11:32:40.085682+02:00","chifflot-7","bmc_node_power_watt",520
"2021-04-05T11:32:45.086534+02:00","chifflot-7","bmc_node_power_watt",520
"2021-04-05T11:32:50.087772+02:00","chifflot-7","bmc_node_power_watt",520
"2021-04-05T11:32:55.088317+02:00","chifflot-7","bmc_node_power_watt",520
"2021-04-05T11:33:00.089805+02:00","chifflot-7","bmc_node_power_watt",520
"2021-04-05T11:33:05.090635+02:00","chifflot-7","bmc_node_power_watt",520
"2021-04-05T11:33:10.092451+02:00","chifflot-7","bmc_node_power_watt",520
"2021-04-05T11:33:15.092891+02:00","chifflot-7","bmc_node_power_watt",520
"2021-04-05T11:33:20.093749+02:00","chifflot-7","bmc_node_power_watt",520
"2021-04-05T11:33:25.09516+02:00","chifflot-7","bmc_node_power_watt",520
"2021-04-05T11:33:30.096138+02:00","chifflot-7","bmc_node_power_watt",494
"2021-04-05T11:33:35.097296+02:00","chifflot-7","bmc_node_power_watt",494
"2021-04-05T11:33:40.098025+02:00","chifflot-7","bmc_node_power_watt",494
"2021-04-05T11:33:45.099334+02:00","chifflot-7","bmc_node_power_watt",494
"2021-04-05T11:33:50.100152+02:00","chifflot-7","bmc_node_power_watt",494
"2021-04-05T11:33:55.101071+02:00","chifflot-7","bmc_node_power_watt",494
"2021-04-05T11:34:00.101339+02:00","chifflot-7","bmc_node_power_watt",494
"2021-04-05T11:34:05.102906+02:00","chifflot-7","bmc_node_power_watt",494
"2021-04-05T11:34:10.10369+02:00","chifflot-7","bmc_node_power_watt",494
"2021-04-05T11:34:15.106049+02:00","chifflot-7","bmc_node_power_watt",494
"2021-04-05T11:34:20.107997+02:00","chifflot-7","bmc_node_power_watt",520
"2021-04-05T11:34:25.110513+02:00","chifflot-7","bmc_node_power_watt",520
"2021-04-05T11:34:30.1105+02:00","chifflot-7","bmc_node_power_watt",520
"2021-04-05T11:34:35.11129+02:00","chifflot-7","bmc_node_power_watt",520
"2021-04-05T11:34:40.112196+02:00","chifflot-7","bmc_node_power_watt",520
"2021-04-05T11:34:45.112978+02:00","chifflot-7","bmc_node_power_watt",494
"2021-04-05T11:34:50.114418+02:00","chifflot-7","bmc_node_power_watt",494
"2021-04-05T11:34:55.115747+02:00","chifflot-7","bmc_node_power_watt",494
"2021-04-05T11:35:00.117065+02:00","chifflot-7","bmc_node_power_watt",494
"2021-04-05T11:35:05.118702+02:00","chifflot-7","bmc_node_power_watt",494
"2021-04-05T11:35:10.11933+02:00","chifflot-7","bmc_node_power_watt",494
"2021-04-05T11:35:15.12005+02:00","chifflot-7","bmc_node_power_watt",494
"2021-04-05T11:35:20.122028+02:00","chifflot-7","bmc_node_power_watt",494
"2021-04-05T11:35:25.122639+02:00","chifflot-7","bmc_node_power_watt",494
"2021-04-05T11:35:30.123349+02:00","chifflot-7","bmc_node_power_watt",494
"2021-04-05T11:35:35.125234+02:00","chifflot-7","bmc_node_power_watt",494
"2021-04-05T11:35:40.127552+02:00","chifflot-7","bmc_node_power_watt",494
"2021-04-05T11:35:45.128557+02:00","chifflot-7","bmc_node_power_watt",494
"2021-04-05T11:35:50.128916+02:00","chifflot-7","bmc_node_power_watt",494
"2021-04-05T11:35:55.130163+02:00","chifflot-7","bmc_node_power_watt",520
"2021-04-05T11:36:00.132208+02:00","chifflot-7","bmc_node_power_watt",520
"2021-04-05T11:36:05.134431+02:00","chifflot-7","bmc_node_power_watt",520
"2021-04-05T11:36:10.136657+02:00","chifflot-7","bmc_node_power_watt",520
"2021-04-05T11:36:15.13756+02:00","chifflot-7","bmc_node_power_watt",520
"2021-04-05T11:36:20.138678+02:00","chifflot-7","bmc_node_power_watt",494
"2021-04-05T11:36:25.140537+02:00","chifflot-7","bmc_node_power_watt",494
"2021-04-05T11:36:30.141355+02:00","chifflot-7","bmc_node_power_watt",494
"2021-04-05T11:36:35.142621+02:00","chifflot-7","bmc_node_power_watt",494
"2021-04-05T11:36:40.143241+02:00","chifflot-7","bmc_node_power_watt",520
"2021-04-05T11:36:45.144352+02:00","chifflot-7","bmc_node_power_watt",520
"2021-04-05T11:36:50.145812+02:00","chifflot-7","bmc_node_power_watt",520
"2021-04-05T11:36:55.148034+02:00","chifflot-7","bmc_node_power_watt",520
"2021-04-05T11:37:00.148624+02:00","chifflot-7","bmc_node_power_watt",520
"2021-04-05T11:37:05.150967+02:00","chifflot-7","bmc_node_power_watt",494
"2021-04-05T11:37:10.15215+02:00","chifflot-7","bmc_node_power_watt",494
"2021-04-05T11:37:15.152843+02:00","chifflot-7","bmc_node_power_watt",494
"2021-04-05T11:37:20.153033+02:00","chifflot-7","bmc_node_power_watt",494
"2021-04-05T11:37:25.154133+02:00","chifflot-7","bmc_node_power_watt",494
"2021-04-05T11:37:30.155544+02:00","chifflot-7","bmc_node_power_watt",494
"2021-04-05T11:37:35.156017+02:00","chifflot-7","bmc_node_power_watt",494
"2021-04-05T11:37:40.156838+02:00","chifflot-7","bmc_node_power_watt",494
"2021-04-05T11:37:45.159829+02:00","chifflot-7","bmc_node_power_watt",494
"2021-04-05T11:37:50.160553+02:00","chifflot-7","bmc_node_power_watt",494
"2021-04-05T11:37:55.162382+02:00","chifflot-7","bmc_node_power_watt",494
"2021-04-05T11:38:00.163589+02:00","chifflot-7","bmc_node_power_watt",494
"2021-04-05T11:38:05.164815+02:00","chifflot-7","bmc_node_power_watt",494
"2021-04-05T11:38:10.166118+02:00","chifflot-7","bmc_node_power_watt",494
"2021-04-05T11:38:15.166424+02:00","chifflot-7","bmc_node_power_watt",494
"2021-04-05T11:38:20.166847+02:00","chifflot-7","bmc_node_power_watt",494
"2021-04-05T11:38:25.16793+02:00","chifflot-7","bmc_node_power_watt",494
"2021-04-05T11:38:30.168508+02:00","chifflot-7","bmc_node_power_watt",494
"2021-04-05T11:38:35.170318+02:00","chifflot-7","bmc_node_power_watt",494
"2021-04-05T11:38:40.171438+02:00","chifflot-7","bmc_node_power_watt",494
"2021-04-05T11:38:45.17234+02:00","chifflot-7","bmc_node_power_watt",494
"2021-04-05T11:38:50.174503+02:00","chifflot-7","bmc_node_power_watt",494
"2021-04-05T11:38:55.175618+02:00","chifflot-7","bmc_node_power_watt",494
"2021-04-05T11:39:00.176312+02:00","chifflot-7","bmc_node_power_watt",494
"2021-04-05T11:39:05.177095+02:00","chifflot-7","bmc_node_power_watt",494
"2021-04-05T11:39:10.178432+02:00","chifflot-7","bmc_node_power_watt",494
"2021-04-05T11:39:15.178944+02:00","chifflot-7","bmc_node_power_watt",494
"2021-04-05T11:39:20.180444+02:00","chifflot-7","bmc_node_power_watt",494
"2021-04-05T11:39:25.180976+02:00","chifflot-7","bmc_node_power_watt",494
"2021-04-05T11:39:30.182703+02:00","chifflot-7","bmc_node_power_watt",494
"2021-04-05T11:39:35.183383+02:00","chifflot-7","bmc_node_power_watt",494
"2021-04-05T11:39:40.185963+02:00","chifflot-7","bmc_node_power_watt",494
"2021-04-05T11:39:45.187377+02:00","chifflot-7","bmc_node_power_watt",494
"2021-04-05T11:39:50.19059+02:00","chifflot-7","bmc_node_power_watt",494
"2021-04-05T11:39:55.190038+02:00","chifflot-7","bmc_node_power_watt",494
"2021-04-05T11:40:00.190611+02:00","chifflot-7","bmc_node_power_watt",494
"2021-04-05T11:40:05.191455+02:00","chifflot-7","bmc_node_power_watt",494
"2021-04-05T11:40:10.192041+02:00","chifflot-7","bmc_node_power_watt",494
"2021-04-05T11:40:15.192526+02:00","chifflot-7","bmc_node_power_watt",494
"2021-04-05T11:40:20.193493+02:00","chifflot-7","bmc_node_power_watt",494
"2021-04-05T11:40:25.195331+02:00","chifflot-7","bmc_node_power_watt",494
"2021-04-05T11:40:30.196521+02:00","chifflot-7","bmc_node_power_watt",494
"2021-04-05T11:40:35.198315+02:00","chifflot-7","bmc_node_power_watt",494
"2021-04-05T11:40:40.199701+02:00","chifflot-7","bmc_node_power_watt",520
"2021-04-05T11:40:45.200189+02:00","chifflot-7","bmc_node_power_watt",520
"2021-04-05T11:40:50.201511+02:00","chifflot-7","bmc_node_power_watt",520
"2021-04-05T11:40:55.202296+02:00","chifflot-7","bmc_node_power_watt",520
"2021-04-05T11:41:00.203532+02:00","chifflot-7","bmc_node_power_watt",520
"2021-04-05T11:41:05.205076+02:00","chifflot-7","bmc_node_power_watt",494
"2021-04-05T11:41:10.206718+02:00","chifflot-7","bmc_node_power_watt",494
"2021-04-05T11:41:15.208187+02:00","chifflot-7","bmc_node_power_watt",494
"2021-04-05T11:41:20.209079+02:00","chifflot-7","bmc_node_power_watt",494
"2021-04-05T11:41:25.210336+02:00","chifflot-7","bmc_node_power_watt",494
"2021-04-05T11:41:30.211498+02:00","chifflot-7","bmc_node_power_watt",494
"2021-04-05T11:41:35.212753+02:00","chifflot-7","bmc_node_power_watt",494
"2021-04-05T11:41:40.213677+02:00","chifflot-7","bmc_node_power_watt",494
"2021-04-05T11:41:45.214967+02:00","chifflot-7","bmc_node_power_watt",494
"2021-04-05T11:41:50.216796+02:00","chifflot-7","bmc_node_power_watt",494
"2021-04-05T11:41:55.219036+02:00","chifflot-7","bmc_node_power_watt",494
"2021-04-05T11:42:00.219716+02:00","chifflot-7","bmc_node_power_watt",494
"2021-04-05T11:42:05.221559+02:00","chifflot-7","bmc_node_power_watt",494
"2021-04-05T11:42:10.223539+02:00","chifflot-7","bmc_node_power_watt",494
"2021-04-05T11:42:15.224101+02:00","chifflot-7","bmc_node_power_watt",494
"2021-04-05T11:42:20.224846+02:00","chifflot-7","bmc_node_power_watt",494
"2021-04-05T11:42:25.226374+02:00","chifflot-7","bmc_node_power_watt",494
"2021-04-05T11:42:30.22723+02:00","chifflot-7","bmc_node_power_watt",494
"2021-04-05T11:42:35.229026+02:00","chifflot-7","bmc_node_power_watt",494
"2021-04-05T11:42:40.230453+02:00","chifflot-7","bmc_node_power_watt",494
"2021-04-05T11:42:45.231268+02:00","chifflot-7","bmc_node_power_watt",494
"2021-04-05T11:42:50.233546+02:00","chifflot-7","bmc_node_power_watt",494
"2021-04-05T11:42:55.235094+02:00","chifflot-7","bmc_node_power_watt",494
"2021-04-05T11:43:00.236284+02:00","chifflot-7","bmc_node_power_watt",494
"2021-04-05T11:43:05.238052+02:00","chifflot-7","bmc_node_power_watt",494
"2021-04-05T11:43:10.240058+02:00","chifflot-7","bmc_node_power_watt",494
"2021-04-05T11:43:15.2416+02:00","chifflot-7","bmc_node_power_watt",494
"2021-04-05T11:43:20.242442+02:00","chifflot-7","bmc_node_power_watt",494
"2021-04-05T11:43:25.243902+02:00","chifflot-7","bmc_node_power_watt",494
"2021-04-05T11:43:30.244559+02:00","chifflot-7","bmc_node_power_watt",494
"2021-04-05T11:43:35.24661+02:00","chifflot-7","bmc_node_power_watt",494
"2021-04-05T11:43:40.248175+02:00","chifflot-7","bmc_node_power_watt",494
"2021-04-05T11:43:45.248736+02:00","chifflot-7","bmc_node_power_watt",494
"2021-04-05T11:43:50.250018+02:00","chifflot-7","bmc_node_power_watt",494
"2021-04-05T11:43:55.250686+02:00","chifflot-7","bmc_node_power_watt",494
"2021-04-05T11:44:00.251857+02:00","chifflot-7","bmc_node_power_watt",494
"2021-04-05T11:44:05.254036+02:00","chifflot-7","bmc_node_power_watt",494
"2021-04-05T11:44:10.254968+02:00","chifflot-7","bmc_node_power_watt",494
"2021-04-05T11:44:15.256161+02:00","chifflot-7","bmc_node_power_watt",494
"2021-04-05T11:44:20.257068+02:00","chifflot-7","bmc_node_power_watt",494
"2021-04-05T11:44:25.258982+02:00","chifflot-7","bmc_node_power_watt",494
"2021-04-05T11:44:30.260295+02:00","chifflot-7","bmc_node_power_watt",494
"2021-04-05T11:44:35.262107+02:00","chifflot-7","bmc_node_power_watt",520
"2021-04-05T11:44:40.264784+02:00","chifflot-7","bmc_node_power_watt",520
"2021-04-05T11:44:45.266073+02:00","chifflot-7","bmc_node_power_watt",520
"2021-04-05T11:44:50.267856+02:00","chifflot-7","bmc_node_power_watt",520
"2021-04-05T11:44:55.269125+02:00","chifflot-7","bmc_node_power_watt",520
"2021-04-05T11:45:00.269563+02:00","chifflot-7","bmc_node_power_watt",494
"2021-04-05T11:45:05.270878+02:00","chifflot-7","bmc_node_power_watt",494
"2021-04-05T11:45:10.272686+02:00","chifflot-7","bmc_node_power_watt",494
"2021-04-05T11:45:15.274186+02:00","chifflot-7","bmc_node_power_watt",494
"2021-04-05T11:45:20.276292+02:00","chifflot-7","bmc_node_power_watt",494
"2021-04-05T11:45:25.276887+02:00","chifflot-7","bmc_node_power_watt",494
"2021-04-05T11:45:30.277735+02:00","chifflot-7","bmc_node_power_watt",494
"2021-04-05T11:45:35.27958+02:00","chifflot-7","bmc_node_power_watt",494
"2021-04-05T11:45:40.280612+02:00","chifflot-7","bmc_node_power_watt",494
"2021-04-05T11:45:45.280616+02:00","chifflot-7","bmc_node_power_watt",494
"2021-04-05T11:45:50.281649+02:00","chifflot-7","bmc_node_power_watt",494
"2021-04-05T11:45:55.283248+02:00","chifflot-7","bmc_node_power_watt",494
"2021-04-05T11:46:00.283953+02:00","chifflot-7","bmc_node_power_watt",494
"2021-04-05T11:46:05.28652+02:00","chifflot-7","bmc_node_power_watt",494
"2021-04-05T11:46:10.287849+02:00","chifflot-7","bmc_node_power_watt",520
"2021-04-05T11:46:15.288796+02:00","chifflot-7","bmc_node_power_watt",520
"2021-04-05T11:46:20.290709+02:00","chifflot-7","bmc_node_power_watt",520
"2021-04-05T11:46:25.291895+02:00","chifflot-7","bmc_node_power_watt",520
"2021-04-05T11:46:30.292761+02:00","chifflot-7","bmc_node_power_watt",520
"2021-04-05T11:46:35.293958+02:00","chifflot-7","bmc_node_power_watt",494
"2021-04-05T11:46:40.295062+02:00","chifflot-7","bmc_node_power_watt",494
"2021-04-05T11:46:45.295762+02:00","chifflot-7","bmc_node_power_watt",494
"2021-04-05T11:46:50.297823+02:00","chifflot-7","bmc_node_power_watt",494
"2021-04-05T11:46:55.298354+02:00","chifflot-7","bmc_node_power_watt",494
"2021-04-05T11:47:00.299067+02:00","chifflot-7","bmc_node_power_watt",520
"2021-04-05T11:47:05.300196+02:00","chifflot-7","bmc_node_power_watt",520
"2021-04-05T11:47:10.302052+02:00","chifflot-7","bmc_node_power_watt",520
"2021-04-05T11:47:15.303188+02:00","chifflot-7","bmc_node_power_watt",520
"2021-04-05T11:47:20.303941+02:00","chifflot-7","bmc_node_power_watt",520
"2021-04-05T11:47:25.305482+02:00","chifflot-7","bmc_node_power_watt",520
"2021-04-05T11:47:30.306711+02:00","chifflot-7","bmc_node_power_watt",520
"2021-04-05T11:47:35.308514+02:00","chifflot-7","bmc_node_power_watt",520
"2021-04-05T11:47:40.309642+02:00","chifflot-7","bmc_node_power_watt",520
"2021-04-05T11:47:45.310455+02:00","chifflot-7","bmc_node_power_watt",494
"2021-04-05T11:47:50.311599+02:00","chifflot-7","bmc_node_power_watt",494
"2021-04-05T11:47:55.312526+02:00","chifflot-7","bmc_node_power_watt",494
"2021-04-05T11:48:00.313646+02:00","chifflot-7","bmc_node_power_watt",494
"2021-04-05T11:48:05.314052+02:00","chifflot-7","bmc_node_power_watt",494
"2021-04-05T11:48:10.315239+02:00","chifflot-7","bmc_node_power_watt",520
"2021-04-05T11:48:15.316202+02:00","chifflot-7","bmc_node_power_watt",520
"2021-04-05T11:48:20.318199+02:00","chifflot-7","bmc_node_power_watt",520
"2021-04-05T11:48:25.319414+02:00","chifflot-7","bmc_node_power_watt",520
"2021-04-05T11:48:30.320544+02:00","chifflot-7","bmc_node_power_watt",520
"2021-04-05T11:48:35.321062+02:00","chifflot-7","bmc_node_power_watt",520
"2021-04-05T11:48:40.32144+02:00","chifflot-7","bmc_node_power_watt",520
"2021-04-05T11:48:45.323008+02:00","chifflot-7","bmc_node_power_watt",520
"2021-04-05T11:48:50.324289+02:00","chifflot-7","bmc_node_power_watt",520
"2021-04-05T11:48:55.325654+02:00","chifflot-7","bmc_node_power_watt",520
"2021-04-05T11:49:00.326499+02:00","chifflot-7","bmc_node_power_watt",494
"2021-04-05T11:49:05.328039+02:00","chifflot-7","bmc_node_power_watt",494
"2021-04-05T11:49:10.329386+02:00","chifflot-7","bmc_node_power_watt",494
"2021-04-05T11:49:15.331285+02:00","chifflot-7","bmc_node_power_watt",494
"2021-04-05T11:49:20.332416+02:00","chifflot-7","bmc_node_power_watt",520
"2021-04-05T11:49:25.333097+02:00","chifflot-7","bmc_node_power_watt",520
"2021-04-05T11:49:30.334568+02:00","chifflot-7","bmc_node_power_watt",520
"2021-04-05T11:49:35.33531+02:00","chifflot-7","bmc_node_power_watt",520
"2021-04-05T11:49:40.337622+02:00","chifflot-7","bmc_node_power_watt",520
"2021-04-05T11:49:45.338417+02:00","chifflot-7","bmc_node_power_watt",494
"2021-04-05T11:49:50.339982+02:00","chifflot-7","bmc_node_power_watt",494
"2021-04-05T11:49:55.341125+02:00","chifflot-7","bmc_node_power_watt",494
"2021-04-05T11:50:00.34243+02:00","chifflot-7","bmc_node_power_watt",494
"2021-04-05T11:50:05.343184+02:00","chifflot-7","bmc_node_power_watt",494
"2021-04-05T11:50:10.344363+02:00","chifflot-7","bmc_node_power_watt",520
"2021-04-05T11:50:15.345119+02:00","chifflot-7","bmc_node_power_watt",520
"2021-04-05T11:50:20.346465+02:00","chifflot-7","bmc_node_power_watt",520
"2021-04-05T11:50:25.347096+02:00","chifflot-7","bmc_node_power_watt",520
"2021-04-05T11:50:30.348334+02:00","chifflot-7","bmc_node_power_watt",520
"2021-04-05T11:50:35.350027+02:00","chifflot-7","bmc_node_power_watt",494
"2021-04-05T11:50:40.351161+02:00","chifflot-7","bmc_node_power_watt",494
"2021-04-05T11:50:45.352708+02:00","chifflot-7","bmc_node_power_watt",494
"2021-04-05T11:50:50.353559+02:00","chifflot-7","bmc_node_power_watt",494
"2021-04-05T11:50:55.354307+02:00","chifflot-7","bmc_node_power_watt",494
"2021-04-05T11:51:00.355429+02:00","chifflot-7","bmc_node_power_watt",494
"2021-04-05T11:51:05.356667+02:00","chifflot-7","bmc_node_power_watt",494
"2021-04-05T11:51:10.357798+02:00","chifflot-7","bmc_node_power_watt",494
"2021-04-05T11:51:15.358825+02:00","chifflot-7","bmc_node_power_watt",494
"2021-04-05T11:51:20.360235+02:00","chifflot-7","bmc_node_power_watt",494
"2021-04-05T11:51:25.360988+02:00","chifflot-7","bmc_node_power_watt",494
"2021-04-05T11:51:30.362903+02:00","chifflot-7","bmc_node_power_watt",494
"2021-04-05T11:51:35.365011+02:00","chifflot-7","bmc_node_power_watt",494
"2021-04-05T11:51:40.36633+02:00","chifflot-7","bmc_node_power_watt",494
"2021-04-05T11:51:45.367106+02:00","chifflot-7","bmc_node_power_watt",520
"2021-04-05T11:51:50.368261+02:00","chifflot-7","bmc_node_power_watt",520
"2021-04-05T11:51:55.368983+02:00","chifflot-7","bmc_node_power_watt",520
"2021-04-05T11:52:00.371277+02:00","chifflot-7","bmc_node_power_watt",520
"2021-04-05T11:52:05.37191+02:00","chifflot-7","bmc_node_power_watt",520
"2021-04-05T11:52:10.373178+02:00","chifflot-7","bmc_node_power_watt",520
"2021-04-05T11:52:15.373677+02:00","chifflot-7","bmc_node_power_watt",520
"2021-04-05T11:52:20.375014+02:00","chifflot-7","bmc_node_power_watt",520
"2021-04-05T11:52:25.376174+02:00","chifflot-7","bmc_node_power_watt",520
"2021-04-05T11:52:30.376732+02:00","chifflot-7","bmc_node_power_watt",494
"2021-04-05T11:52:35.377588+02:00","chifflot-7","bmc_node_power_watt",494
"2021-04-05T11:52:40.378266+02:00","chifflot-7","bmc_node_power_watt",494
"2021-04-05T11:52:45.379589+02:00","chifflot-7","bmc_node_power_watt",494
