"2021-04-02T11:00:14.559093+02:00","chifflot-7","bmc_node_power_watt",494
"2021-04-02T11:00:19.560332+02:00","chifflot-7","bmc_node_power_watt",494
"2021-04-02T11:00:24.561564+02:00","chifflot-7","bmc_node_power_watt",494
"2021-04-02T11:00:29.563124+02:00","chifflot-7","bmc_node_power_watt",494
"2021-04-02T11:00:34.564373+02:00","chifflot-7","bmc_node_power_watt",494
"2021-04-02T11:00:39.56513+02:00","chifflot-7","bmc_node_power_watt",494
"2021-04-02T11:00:44.566125+02:00","chifflot-7","bmc_node_power_watt",494
"2021-04-02T11:00:49.566208+02:00","chifflot-7","bmc_node_power_watt",494
"2021-04-02T11:00:54.56687+02:00","chifflot-7","bmc_node_power_watt",494
"2021-04-02T11:00:59.568269+02:00","chifflot-7","bmc_node_power_watt",494
"2021-04-02T11:01:04.569607+02:00","chifflot-7","bmc_node_power_watt",494
"2021-04-02T11:01:09.570652+02:00","chifflot-7","bmc_node_power_watt",494
"2021-04-02T11:01:14.571361+02:00","chifflot-7","bmc_node_power_watt",468
"2021-04-02T11:01:19.572062+02:00","chifflot-7","bmc_node_power_watt",468
"2021-04-02T11:01:24.572667+02:00","chifflot-7","bmc_node_power_watt",468
"2021-04-02T11:01:29.572939+02:00","chifflot-7","bmc_node_power_watt",468
"2021-04-02T11:01:34.573392+02:00","chifflot-7","bmc_node_power_watt",468
"2021-04-02T11:01:39.574183+02:00","chifflot-7","bmc_node_power_watt",494
"2021-04-02T11:01:44.57498+02:00","chifflot-7","bmc_node_power_watt",494
"2021-04-02T11:01:49.575794+02:00","chifflot-7","bmc_node_power_watt",494
"2021-04-02T11:01:54.576353+02:00","chifflot-7","bmc_node_power_watt",494
"2021-04-02T11:01:59.577039+02:00","chifflot-7","bmc_node_power_watt",494
"2021-04-02T11:02:04.57785+02:00","chifflot-7","bmc_node_power_watt",494
"2021-04-02T11:02:09.578183+02:00","chifflot-7","bmc_node_power_watt",494
"2021-04-02T11:02:14.579331+02:00","chifflot-7","bmc_node_power_watt",494
"2021-04-02T11:02:19.579978+02:00","chifflot-7","bmc_node_power_watt",494
"2021-04-02T11:02:24.580683+02:00","chifflot-7","bmc_node_power_watt",494
"2021-04-02T11:02:29.581262+02:00","chifflot-7","bmc_node_power_watt",494
"2021-04-02T11:02:34.581929+02:00","chifflot-7","bmc_node_power_watt",494
"2021-04-02T11:02:39.58283+02:00","chifflot-7","bmc_node_power_watt",494
"2021-04-02T11:02:44.583739+02:00","chifflot-7","bmc_node_power_watt",494
"2021-04-02T11:02:49.584459+02:00","chifflot-7","bmc_node_power_watt",494
"2021-04-02T11:02:54.585241+02:00","chifflot-7","bmc_node_power_watt",494
"2021-04-02T11:02:59.586341+02:00","chifflot-7","bmc_node_power_watt",494
"2021-04-02T11:03:04.587117+02:00","chifflot-7","bmc_node_power_watt",494
"2021-04-02T11:03:09.58747+02:00","chifflot-7","bmc_node_power_watt",494
"2021-04-02T11:03:14.588114+02:00","chifflot-7","bmc_node_power_watt",468
"2021-04-02T11:03:19.588479+02:00","chifflot-7","bmc_node_power_watt",468
"2021-04-02T11:03:24.589378+02:00","chifflot-7","bmc_node_power_watt",468
"2021-04-02T11:03:29.590667+02:00","chifflot-7","bmc_node_power_watt",468
"2021-04-02T11:03:34.594536+02:00","chifflot-7","bmc_node_power_watt",468
"2021-04-02T11:03:39.598835+02:00","chifflot-7","bmc_node_power_watt",494
"2021-04-02T11:03:44.599391+02:00","chifflot-7","bmc_node_power_watt",494
"2021-04-02T11:03:49.600466+02:00","chifflot-7","bmc_node_power_watt",494
"2021-04-02T11:03:54.600751+02:00","chifflot-7","bmc_node_power_watt",494
"2021-04-02T11:03:59.602114+02:00","chifflot-7","bmc_node_power_watt",494
"2021-04-02T11:04:04.603712+02:00","chifflot-7","bmc_node_power_watt",494
"2021-04-02T11:04:09.60482+02:00","chifflot-7","bmc_node_power_watt",494
"2021-04-02T11:04:14.606748+02:00","chifflot-7","bmc_node_power_watt",494
"2021-04-02T11:04:19.607295+02:00","chifflot-7","bmc_node_power_watt",494
"2021-04-02T11:04:24.608829+02:00","chifflot-7","bmc_node_power_watt",494
"2021-04-02T11:04:29.610903+02:00","chifflot-7","bmc_node_power_watt",494
"2021-04-02T11:04:34.61204+02:00","chifflot-7","bmc_node_power_watt",494
"2021-04-02T11:04:39.61353+02:00","chifflot-7","bmc_node_power_watt",494
"2021-04-02T11:04:44.615793+02:00","chifflot-7","bmc_node_power_watt",494
"2021-04-02T11:04:49.616385+02:00","chifflot-7","bmc_node_power_watt",468
"2021-04-02T11:04:54.61729+02:00","chifflot-7","bmc_node_power_watt",468
"2021-04-02T11:04:59.618375+02:00","chifflot-7","bmc_node_power_watt",468
"2021-04-02T11:05:04.620067+02:00","chifflot-7","bmc_node_power_watt",468
"2021-04-02T11:05:09.621296+02:00","chifflot-7","bmc_node_power_watt",468
"2021-04-02T11:05:14.622705+02:00","chifflot-7","bmc_node_power_watt",468
"2021-04-02T11:05:19.624431+02:00","chifflot-7","bmc_node_power_watt",468
"2021-04-02T11:05:24.625079+02:00","chifflot-7","bmc_node_power_watt",468
"2021-04-02T11:05:29.626358+02:00","chifflot-7","bmc_node_power_watt",468
"2021-04-02T11:05:34.62754+02:00","chifflot-7","bmc_node_power_watt",468
"2021-04-02T11:05:39.627917+02:00","chifflot-7","bmc_node_power_watt",494
"2021-04-02T11:05:44.629673+02:00","chifflot-7","bmc_node_power_watt",494
"2021-04-02T11:05:49.630538+02:00","chifflot-7","bmc_node_power_watt",494
"2021-04-02T11:05:54.631686+02:00","chifflot-7","bmc_node_power_watt",494
"2021-04-02T11:05:59.633186+02:00","chifflot-7","bmc_node_power_watt",468
"2021-04-02T11:06:04.634797+02:00","chifflot-7","bmc_node_power_watt",468
"2021-04-02T11:06:09.635495+02:00","chifflot-7","bmc_node_power_watt",468
"2021-04-02T11:06:14.636961+02:00","chifflot-7","bmc_node_power_watt",468
"2021-04-02T11:06:19.638183+02:00","chifflot-7","bmc_node_power_watt",468
"2021-04-02T11:06:24.639735+02:00","chifflot-7","bmc_node_power_watt",468
"2021-04-02T11:06:29.641161+02:00","chifflot-7","bmc_node_power_watt",468
"2021-04-02T11:06:34.641817+02:00","chifflot-7","bmc_node_power_watt",468
"2021-04-02T11:06:39.643029+02:00","chifflot-7","bmc_node_power_watt",468
"2021-04-02T11:06:44.645093+02:00","chifflot-7","bmc_node_power_watt",468
"2021-04-02T11:06:49.645814+02:00","chifflot-7","bmc_node_power_watt",468
"2021-04-02T11:06:54.6467+02:00","chifflot-7","bmc_node_power_watt",468
"2021-04-02T11:06:59.647667+02:00","chifflot-7","bmc_node_power_watt",468
"2021-04-02T11:07:04.649566+02:00","chifflot-7","bmc_node_power_watt",468
"2021-04-02T11:07:09.65063+02:00","chifflot-7","bmc_node_power_watt",468
"2021-04-02T11:07:14.652575+02:00","chifflot-7","bmc_node_power_watt",494
"2021-04-02T11:07:19.653856+02:00","chifflot-7","bmc_node_power_watt",494
"2021-04-02T11:07:24.655263+02:00","chifflot-7","bmc_node_power_watt",494
"2021-04-02T11:07:29.657047+02:00","chifflot-7","bmc_node_power_watt",494
"2021-04-02T11:07:34.658+02:00","chifflot-7","bmc_node_power_watt",468
"2021-04-02T11:07:39.659029+02:00","chifflot-7","bmc_node_power_watt",468
"2021-04-02T11:07:44.660491+02:00","chifflot-7","bmc_node_power_watt",468
"2021-04-02T11:07:49.662189+02:00","chifflot-7","bmc_node_power_watt",468
"2021-04-02T11:07:54.663347+02:00","chifflot-7","bmc_node_power_watt",468
"2021-04-02T11:07:59.664084+02:00","chifflot-7","bmc_node_power_watt",468
"2021-04-02T11:08:04.665854+02:00","chifflot-7","bmc_node_power_watt",468
"2021-04-02T11:08:09.66699+02:00","chifflot-7","bmc_node_power_watt",468
"2021-04-02T11:08:14.668129+02:00","chifflot-7","bmc_node_power_watt",468
"2021-04-02T11:08:19.668607+02:00","chifflot-7","bmc_node_power_watt",468
"2021-04-02T11:08:24.670143+02:00","chifflot-7","bmc_node_power_watt",468
"2021-04-02T11:08:29.670602+02:00","chifflot-7","bmc_node_power_watt",468
"2021-04-02T11:08:34.671899+02:00","chifflot-7","bmc_node_power_watt",468
"2021-04-02T11:08:39.673369+02:00","chifflot-7","bmc_node_power_watt",468
"2021-04-02T11:08:44.675326+02:00","chifflot-7","bmc_node_power_watt",468
"2021-04-02T11:08:49.675756+02:00","chifflot-7","bmc_node_power_watt",468
"2021-04-02T11:08:54.677407+02:00","chifflot-7","bmc_node_power_watt",468
"2021-04-02T11:08:59.678778+02:00","chifflot-7","bmc_node_power_watt",468
"2021-04-02T11:09:04.679886+02:00","chifflot-7","bmc_node_power_watt",468
"2021-04-02T11:09:09.681126+02:00","chifflot-7","bmc_node_power_watt",468
"2021-04-02T11:09:14.684222+02:00","chifflot-7","bmc_node_power_watt",494
"2021-04-02T11:09:19.685252+02:00","chifflot-7","bmc_node_power_watt",494
"2021-04-02T11:09:24.68642+02:00","chifflot-7","bmc_node_power_watt",494
"2021-04-02T11:09:29.686915+02:00","chifflot-7","bmc_node_power_watt",494
"2021-04-02T11:09:34.68826+02:00","chifflot-7","bmc_node_power_watt",494
"2021-04-02T11:09:39.689526+02:00","chifflot-7","bmc_node_power_watt",494
"2021-04-02T11:09:44.691163+02:00","chifflot-7","bmc_node_power_watt",494
"2021-04-02T11:09:49.694649+02:00","chifflot-7","bmc_node_power_watt",494
"2021-04-02T11:09:54.696008+02:00","chifflot-7","bmc_node_power_watt",494
"2021-04-02T11:09:59.697546+02:00","chifflot-7","bmc_node_power_watt",494
"2021-04-02T11:10:04.698222+02:00","chifflot-7","bmc_node_power_watt",494
"2021-04-02T11:10:09.699366+02:00","chifflot-7","bmc_node_power_watt",494
"2021-04-02T11:10:14.701527+02:00","chifflot-7","bmc_node_power_watt",494
"2021-04-02T11:10:19.701773+02:00","chifflot-7","bmc_node_power_watt",494
"2021-04-02T11:10:24.702677+02:00","chifflot-7","bmc_node_power_watt",494
"2021-04-02T11:10:29.704082+02:00","chifflot-7","bmc_node_power_watt",494
"2021-04-02T11:10:34.704544+02:00","chifflot-7","bmc_node_power_watt",494
"2021-04-02T11:10:39.706631+02:00","chifflot-7","bmc_node_power_watt",494
"2021-04-02T11:10:44.707835+02:00","chifflot-7","bmc_node_power_watt",494
"2021-04-02T11:10:49.70795+02:00","chifflot-7","bmc_node_power_watt",494
"2021-04-02T11:10:54.708392+02:00","chifflot-7","bmc_node_power_watt",494
"2021-04-02T11:10:59.709807+02:00","chifflot-7","bmc_node_power_watt",494
"2021-04-02T11:11:04.71269+02:00","chifflot-7","bmc_node_power_watt",494
"2021-04-02T11:11:09.713016+02:00","chifflot-7","bmc_node_power_watt",494
"2021-04-02T11:11:14.71449+02:00","chifflot-7","bmc_node_power_watt",494
"2021-04-02T11:11:19.715167+02:00","chifflot-7","bmc_node_power_watt",494
"2021-04-02T11:11:24.716916+02:00","chifflot-7","bmc_node_power_watt",494
"2021-04-02T11:11:29.717422+02:00","chifflot-7","bmc_node_power_watt",494
"2021-04-02T11:11:34.718149+02:00","chifflot-7","bmc_node_power_watt",494
"2021-04-02T11:11:39.719375+02:00","chifflot-7","bmc_node_power_watt",494
"2021-04-02T11:11:44.721403+02:00","chifflot-7","bmc_node_power_watt",494
"2021-04-02T11:11:49.722423+02:00","chifflot-7","bmc_node_power_watt",494
"2021-04-02T11:11:54.722914+02:00","chifflot-7","bmc_node_power_watt",494
"2021-04-02T11:11:59.723518+02:00","chifflot-7","bmc_node_power_watt",494
"2021-04-02T11:12:04.724216+02:00","chifflot-7","bmc_node_power_watt",494
"2021-04-02T11:12:09.725459+02:00","chifflot-7","bmc_node_power_watt",494
"2021-04-02T11:12:14.726256+02:00","chifflot-7","bmc_node_power_watt",494
"2021-04-02T11:12:19.72701+02:00","chifflot-7","bmc_node_power_watt",494
"2021-04-02T11:12:24.727616+02:00","chifflot-7","bmc_node_power_watt",494
"2021-04-02T11:12:29.729208+02:00","chifflot-7","bmc_node_power_watt",494
"2021-04-02T11:12:34.729814+02:00","chifflot-7","bmc_node_power_watt",494
"2021-04-02T11:12:39.730872+02:00","chifflot-7","bmc_node_power_watt",494
"2021-04-02T11:12:44.731396+02:00","chifflot-7","bmc_node_power_watt",494
"2021-04-02T11:12:49.732477+02:00","chifflot-7","bmc_node_power_watt",494
"2021-04-02T11:12:54.734445+02:00","chifflot-7","bmc_node_power_watt",494
"2021-04-02T11:12:59.735607+02:00","chifflot-7","bmc_node_power_watt",494
"2021-04-02T11:13:04.735938+02:00","chifflot-7","bmc_node_power_watt",494
"2021-04-02T11:13:09.738389+02:00","chifflot-7","bmc_node_power_watt",494
"2021-04-02T11:13:14.740012+02:00","chifflot-7","bmc_node_power_watt",494
"2021-04-02T11:13:19.740379+02:00","chifflot-7","bmc_node_power_watt",494
"2021-04-02T11:13:24.741788+02:00","chifflot-7","bmc_node_power_watt",494
"2021-04-02T11:13:29.744248+02:00","chifflot-7","bmc_node_power_watt",494
"2021-04-02T11:13:34.74485+02:00","chifflot-7","bmc_node_power_watt",494
"2021-04-02T11:13:39.745457+02:00","chifflot-7","bmc_node_power_watt",494
"2021-04-02T11:13:44.746655+02:00","chifflot-7","bmc_node_power_watt",494
"2021-04-02T11:13:49.748002+02:00","chifflot-7","bmc_node_power_watt",494
"2021-04-02T11:13:54.74804+02:00","chifflot-7","bmc_node_power_watt",494
"2021-04-02T11:13:59.749574+02:00","chifflot-7","bmc_node_power_watt",494
"2021-04-02T11:14:04.75017+02:00","chifflot-7","bmc_node_power_watt",494
"2021-04-02T11:14:09.750443+02:00","chifflot-7","bmc_node_power_watt",494
"2021-04-02T11:14:14.751722+02:00","chifflot-7","bmc_node_power_watt",494
"2021-04-02T11:14:19.752452+02:00","chifflot-7","bmc_node_power_watt",468
"2021-04-02T11:14:24.753742+02:00","chifflot-7","bmc_node_power_watt",468
"2021-04-02T11:14:29.754981+02:00","chifflot-7","bmc_node_power_watt",468
"2021-04-02T11:14:34.755558+02:00","chifflot-7","bmc_node_power_watt",468
"2021-04-02T11:14:39.756623+02:00","chifflot-7","bmc_node_power_watt",468
"2021-04-02T11:14:44.757809+02:00","chifflot-7","bmc_node_power_watt",468
"2021-04-02T11:14:49.759114+02:00","chifflot-7","bmc_node_power_watt",468
"2021-04-02T11:14:54.760134+02:00","chifflot-7","bmc_node_power_watt",468
"2021-04-02T11:14:59.760433+02:00","chifflot-7","bmc_node_power_watt",468
"2021-04-02T11:15:04.761705+02:00","chifflot-7","bmc_node_power_watt",468
"2021-04-02T11:15:09.763008+02:00","chifflot-7","bmc_node_power_watt",494
"2021-04-02T11:15:14.763972+02:00","chifflot-7","bmc_node_power_watt",494
"2021-04-02T11:15:19.76507+02:00","chifflot-7","bmc_node_power_watt",494
"2021-04-02T11:15:24.765563+02:00","chifflot-7","bmc_node_power_watt",494
"2021-04-02T11:15:29.767685+02:00","chifflot-7","bmc_node_power_watt",494
"2021-04-02T11:15:34.769914+02:00","chifflot-7","bmc_node_power_watt",494
"2021-04-02T11:15:39.771105+02:00","chifflot-7","bmc_node_power_watt",494
"2021-04-02T11:15:44.771509+02:00","chifflot-7","bmc_node_power_watt",494
"2021-04-02T11:15:49.772713+02:00","chifflot-7","bmc_node_power_watt",494
"2021-04-02T11:15:54.774638+02:00","chifflot-7","bmc_node_power_watt",468
"2021-04-02T11:15:59.776201+02:00","chifflot-7","bmc_node_power_watt",468
"2021-04-02T11:16:04.777105+02:00","chifflot-7","bmc_node_power_watt",468
"2021-04-02T11:16:09.778065+02:00","chifflot-7","bmc_node_power_watt",468
"2021-04-02T11:16:14.779503+02:00","chifflot-7","bmc_node_power_watt",468
"2021-04-02T11:16:19.780017+02:00","chifflot-7","bmc_node_power_watt",494
"2021-04-02T11:16:24.781378+02:00","chifflot-7","bmc_node_power_watt",494
"2021-04-02T11:16:29.782054+02:00","chifflot-7","bmc_node_power_watt",494
"2021-04-02T11:16:34.782409+02:00","chifflot-7","bmc_node_power_watt",494
"2021-04-02T11:16:39.783356+02:00","chifflot-7","bmc_node_power_watt",494
"2021-04-02T11:16:44.783957+02:00","chifflot-7","bmc_node_power_watt",468
"2021-04-02T11:16:49.784396+02:00","chifflot-7","bmc_node_power_watt",468
"2021-04-02T11:16:54.78521+02:00","chifflot-7","bmc_node_power_watt",468
"2021-04-02T11:16:59.785776+02:00","chifflot-7","bmc_node_power_watt",468
"2021-04-02T11:17:04.785939+02:00","chifflot-7","bmc_node_power_watt",468
"2021-04-02T11:17:09.786528+02:00","chifflot-7","bmc_node_power_watt",494
"2021-04-02T11:17:14.788247+02:00","chifflot-7","bmc_node_power_watt",494
"2021-04-02T11:17:19.788732+02:00","chifflot-7","bmc_node_power_watt",494
"2021-04-02T11:17:24.7897+02:00","chifflot-7","bmc_node_power_watt",494
"2021-04-02T11:17:29.790934+02:00","chifflot-7","bmc_node_power_watt",468
"2021-04-02T11:17:34.791248+02:00","chifflot-7","bmc_node_power_watt",468
"2021-04-02T11:17:39.792785+02:00","chifflot-7","bmc_node_power_watt",468
"2021-04-02T11:17:44.792893+02:00","chifflot-7","bmc_node_power_watt",468
"2021-04-02T11:17:49.793514+02:00","chifflot-7","bmc_node_power_watt",468
"2021-04-02T11:17:54.794472+02:00","chifflot-7","bmc_node_power_watt",494
"2021-04-02T11:17:59.795522+02:00","chifflot-7","bmc_node_power_watt",494
"2021-04-02T11:18:04.796786+02:00","chifflot-7","bmc_node_power_watt",494
"2021-04-02T11:18:09.798776+02:00","chifflot-7","bmc_node_power_watt",494
"2021-04-02T11:18:14.799342+02:00","chifflot-7","bmc_node_power_watt",494
"2021-04-02T11:18:19.799815+02:00","chifflot-7","bmc_node_power_watt",468
"2021-04-02T11:18:24.80135+02:00","chifflot-7","bmc_node_power_watt",468
"2021-04-02T11:18:29.801546+02:00","chifflot-7","bmc_node_power_watt",468
"2021-04-02T11:18:34.802138+02:00","chifflot-7","bmc_node_power_watt",468
"2021-04-02T11:18:39.803073+02:00","chifflot-7","bmc_node_power_watt",468
"2021-04-02T11:18:44.803841+02:00","chifflot-7","bmc_node_power_watt",494
"2021-04-02T11:18:49.803905+02:00","chifflot-7","bmc_node_power_watt",494
"2021-04-02T11:18:54.804885+02:00","chifflot-7","bmc_node_power_watt",494
"2021-04-02T11:18:59.805652+02:00","chifflot-7","bmc_node_power_watt",494
"2021-04-02T11:19:04.806973+02:00","chifflot-7","bmc_node_power_watt",468
"2021-04-02T11:19:09.807272+02:00","chifflot-7","bmc_node_power_watt",468
"2021-04-02T11:19:14.808066+02:00","chifflot-7","bmc_node_power_watt",468
"2021-04-02T11:19:19.80901+02:00","chifflot-7","bmc_node_power_watt",468
"2021-04-02T11:19:24.809059+02:00","chifflot-7","bmc_node_power_watt",468
"2021-04-02T11:19:29.810227+02:00","chifflot-7","bmc_node_power_watt",468
"2021-04-02T11:19:34.811561+02:00","chifflot-7","bmc_node_power_watt",468
"2021-04-02T11:19:39.812195+02:00","chifflot-7","bmc_node_power_watt",468
"2021-04-02T11:19:44.812826+02:00","chifflot-7","bmc_node_power_watt",468
"2021-04-02T11:19:49.817075+02:00","chifflot-7","bmc_node_power_watt",468
"2021-04-02T11:19:54.816515+02:00","chifflot-7","bmc_node_power_watt",494
"2021-04-02T11:19:59.816835+02:00","chifflot-7","bmc_node_power_watt",494
"2021-04-02T11:20:04.822769+02:00","chifflot-7","bmc_node_power_watt",494
"2021-04-02T11:20:09.81976+02:00","chifflot-7","bmc_node_power_watt",494
"2021-04-02T11:20:14.821166+02:00","chifflot-7","bmc_node_power_watt",494
"2021-04-02T11:20:19.821683+02:00","chifflot-7","bmc_node_power_watt",494
"2021-04-02T11:20:24.822789+02:00","chifflot-7","bmc_node_power_watt",494
"2021-04-02T11:20:29.824653+02:00","chifflot-7","bmc_node_power_watt",494
"2021-04-02T11:20:34.825895+02:00","chifflot-7","bmc_node_power_watt",494
"2021-04-02T11:20:39.826458+02:00","chifflot-7","bmc_node_power_watt",494
"2021-04-02T11:20:44.827737+02:00","chifflot-7","bmc_node_power_watt",494
"2021-04-02T11:20:49.828494+02:00","chifflot-7","bmc_node_power_watt",494
"2021-04-02T11:20:54.829192+02:00","chifflot-7","bmc_node_power_watt",494
"2021-04-02T11:20:59.829886+02:00","chifflot-7","bmc_node_power_watt",494
"2021-04-02T11:21:04.831079+02:00","chifflot-7","bmc_node_power_watt",494
"2021-04-02T11:21:09.832244+02:00","chifflot-7","bmc_node_power_watt",494
"2021-04-02T11:21:14.833626+02:00","chifflot-7","bmc_node_power_watt",494
"2021-04-02T11:21:19.834197+02:00","chifflot-7","bmc_node_power_watt",494
"2021-04-02T11:21:24.83498+02:00","chifflot-7","bmc_node_power_watt",494
"2021-04-02T11:21:29.835903+02:00","chifflot-7","bmc_node_power_watt",494
"2021-04-02T11:21:34.836657+02:00","chifflot-7","bmc_node_power_watt",494
"2021-04-02T11:21:39.837627+02:00","chifflot-7","bmc_node_power_watt",494
"2021-04-02T11:21:44.838934+02:00","chifflot-7","bmc_node_power_watt",494
"2021-04-02T11:21:49.839305+02:00","chifflot-7","bmc_node_power_watt",494
"2021-04-02T11:21:54.839932+02:00","chifflot-7","bmc_node_power_watt",494
"2021-04-02T11:21:59.840958+02:00","chifflot-7","bmc_node_power_watt",494
"2021-04-02T11:22:04.842098+02:00","chifflot-7","bmc_node_power_watt",494
"2021-04-02T11:22:09.842634+02:00","chifflot-7","bmc_node_power_watt",494
"2021-04-02T11:22:14.844003+02:00","chifflot-7","bmc_node_power_watt",468
"2021-04-02T11:22:19.844845+02:00","chifflot-7","bmc_node_power_watt",468
"2021-04-02T11:22:24.845584+02:00","chifflot-7","bmc_node_power_watt",468
"2021-04-02T11:22:29.847245+02:00","chifflot-7","bmc_node_power_watt",468
"2021-04-02T11:22:34.848364+02:00","chifflot-7","bmc_node_power_watt",468
"2021-04-02T11:22:39.849647+02:00","chifflot-7","bmc_node_power_watt",468
"2021-04-02T11:22:44.851487+02:00","chifflot-7","bmc_node_power_watt",468
"2021-04-02T11:22:49.852101+02:00","chifflot-7","bmc_node_power_watt",468
"2021-04-02T11:22:54.853017+02:00","chifflot-7","bmc_node_power_watt",468
"2021-04-02T11:22:59.85496+02:00","chifflot-7","bmc_node_power_watt",468
"2021-04-02T11:23:04.856088+02:00","chifflot-7","bmc_node_power_watt",494
"2021-04-02T11:23:09.85742+02:00","chifflot-7","bmc_node_power_watt",494
