172.16.36.7 : 0.03 0.03 0.03 0.03 0.03 0.03 0.03 0.03 0.03 0.03
172.16.39.8 : 10.95 4.29 4.23 4.28 4.27 - 4.30 4.29 4.31 4.35
172.16.39.6 : 0.19 0.16 0.12 0.15 0.11 0.15 0.16 0.11 0.14 0.15

       3 targets
       3 alive
       0 unreachable
       0 unknown addresses

       1 timeouts (waiting for response)
      30 ICMP Echos sent
      29 ICMP Echo Replies received
       0 other ICMP received

 0.03 ms (min round trip time)
 1.62 ms (avg round trip time)
 10.9 ms (max round trip time)
       10.031 sec (elapsed real time)

