172.16.36.7 : 4.33 4.31 4.34 4.40 4.40 4.41 4.26 4.19 4.24 4.23
172.16.39.5 : 0.03 0.01 0.01 0.01 0.01 0.01 0.01 0.01 0.01 0.01
172.16.39.3 : 0.30 0.14 0.08 0.14 0.13 0.13 0.14 0.14 0.13 0.14

       3 targets
       3 alive
       0 unreachable
       0 unknown addresses

       0 timeouts (waiting for response)
      30 ICMP Echos sent
      30 ICMP Echo Replies received
       0 other ICMP received

 0.01 ms (min round trip time)
 1.49 ms (avg round trip time)
 4.41 ms (max round trip time)
        9.021 sec (elapsed real time)

