172.16.36.8 : 0.03 0.02 0.03 0.03 0.03 0.03 0.01 0.03 0.03 0.03
172.16.39.5 : 11.04 4.33 4.27 4.32 4.34 4.35 4.30 4.35 4.35 4.23
172.16.39.3 : 0.26 0.19 0.18 0.15 0.19 0.15 0.19 0.18 0.19 0.16

       3 targets
       3 alive
       0 unreachable
       0 unknown addresses

       0 timeouts (waiting for response)
      30 ICMP Echos sent
      30 ICMP Echo Replies received
       0 other ICMP received

 0.01 ms (min round trip time)
 1.73 ms (avg round trip time)
 11.0 ms (max round trip time)
        9.030 sec (elapsed real time)

