172.16.36.8 : 0.03 0.03 0.03 0.03 0.03 0.01 0.03 0.04 0.03 0.03
172.16.39.5 : 12.41 4.27 4.20 4.33 4.35 4.29 4.22 4.31 4.36 4.27
172.16.39.3 : 0.24 0.13 0.16 0.19 0.18 0.18 0.20 0.14 0.19 0.18

       3 targets
       3 alive
       0 unreachable
       0 unknown addresses

       0 timeouts (waiting for response)
      30 ICMP Echos sent
      30 ICMP Echo Replies received
       0 other ICMP received

 0.01 ms (min round trip time)
 1.76 ms (avg round trip time)
 12.4 ms (max round trip time)
        9.030 sec (elapsed real time)

