172.16.36.7  : 20.96 13.79 13.84 13.81 13.80 13.78 13.82 13.83 13.84 13.85
172.16.66.51 : 0.22 0.21 0.19 0.20 0.21 0.20 0.19 0.21 0.13 0.17
172.16.66.53 : 0.22 0.23 0.22 0.20 0.17 0.20 0.20 0.19 0.20 0.16
172.16.66.54 : 0.21 0.20 0.19 0.20 0.15 0.20 0.19 0.18 0.20 0.19
172.16.66.55 : 0.22 0.22 0.21 0.21 0.20 0.19 0.22 0.20 0.22 0.21
172.16.66.56 : 0.22 0.20 0.20 0.21 0.20 0.21 0.21 0.20 0.21 0.21
172.16.66.57 : 0.23 0.20 0.21 0.21 0.20 0.20 0.21 0.19 0.21 0.20
172.16.66.58 : 0.18 0.21 0.21 0.21 0.20 0.16 0.18 0.21 0.22 0.21
172.16.66.59 : 0.18 0.16 0.15 0.16 0.15 0.15 0.15 0.15 0.16 0.14
172.16.66.6  : 0.23 0.22 0.22 0.21 0.21 0.22 0.22 0.21 0.21 0.20
172.16.66.60 : 0.22 0.21 0.20 0.20 0.21 0.20 0.19 0.19 0.20 0.18
172.16.66.61 : 0.20 0.19 0.17 0.19 0.18 0.17 0.20 0.18 0.18 0.18
172.16.66.62 : 0.22 0.21 0.21 0.21 0.20 0.20 0.21 0.20 0.21 0.23
172.16.66.63 : 0.22 0.21 0.20 0.20 0.20 0.20 0.21 0.20 0.21 0.20
172.16.66.64 : 0.23 0.14 0.20 0.21 0.21 0.13 0.13 0.20 0.21 0.21
172.16.66.65 : 0.18 0.20 0.20 0.20 0.21 0.20 0.20 0.21 0.21 0.22
172.16.66.66 : 0.22 0.21 0.20 0.21 0.21 0.21 0.20 0.20 0.21 0.22
172.16.66.67 : 0.22 0.20 0.20 0.21 0.21 0.21 0.20 0.20 0.22 0.20
172.16.66.68 : 0.22 0.22 0.21 0.21 0.20 0.22 0.20 0.18 0.22 0.21
172.16.66.69 : 0.21 0.20 0.20 0.21 0.21 0.20 0.21 0.20 0.20 0.20
172.16.66.7  : 0.23 0.20 0.20 0.22 0.21 0.20 0.20 0.21 0.20 0.14
172.16.66.70 : 0.23 0.20 0.18 0.20 0.19 0.21 0.21 0.21 0.21 0.22
172.16.66.71 : 0.17 0.16 0.15 0.17 0.16 0.15 0.14 0.15 0.16 0.15
172.16.66.72 : 0.22 0.20 0.20 0.22 0.21 0.20 0.21 0.21 0.16 0.19
172.16.66.73 : 0.23 0.20 0.20 0.22 0.21 0.20 0.22 0.21 0.14 0.20
172.16.66.74 : 0.22 0.21 0.20 0.20 0.21 0.19 0.21 0.20 0.22 0.21
172.16.66.75 : 0.22 0.20 0.20 0.21 0.20 0.21 0.20 0.21 0.21 0.20
172.16.66.76 : 0.19 0.22 0.22 0.20 0.21 0.20 0.17 0.22 0.20 0.20
172.16.66.77 : 0.22 0.21 0.21 0.21 0.21 0.21 0.21 0.19 0.22 0.18
172.16.66.78 : 0.22 0.20 0.20 0.21 0.20 0.21 0.14 0.20 0.21 0.21
172.16.66.79 : 0.04 0.03 0.03 0.03 0.03 0.03 0.03 0.03 0.03 0.01
172.16.66.8  : 0.23 0.21 0.20 0.21 0.21 0.20 0.21 0.23 0.19 0.20
172.16.66.80 : 0.22 0.19 0.21 0.21 0.22 0.20 0.22 0.21 0.22 0.20
172.16.66.81 : 0.25 0.19 0.21 0.19 0.20 0.20 0.21 0.21 0.20 0.21
172.16.66.82 : 0.24 0.18 0.21 0.22 0.21 0.21 0.21 0.18 0.18 0.19
172.16.66.83 : 0.19 0.20 0.19 0.19 0.20 0.20 0.22 0.21 0.18 0.22
172.16.66.84 : 0.23 0.21 0.20 0.22 0.20 0.17 0.21 0.16 0.20 0.21
172.16.66.85 : 0.19 0.16 0.17 0.16 0.16 0.16 0.16 0.17 0.16 0.16
172.16.66.86 : 0.21 0.19 0.20 0.17 0.18 0.18 0.18 0.18 0.18 0.21
172.16.66.87 : 0.22 0.18 0.20 0.22 0.21 0.18 0.21 0.20 0.18 0.21
172.16.66.88 : 0.24 0.19 0.21 0.22 0.23 0.21 0.21 0.21 0.21 0.19
172.16.66.9  : 0.23 0.18 0.18 0.20 0.18 0.21 0.15 0.20 0.19 0.21

      42 targets
      42 alive
       0 unreachable
       0 unknown addresses

       0 timeouts (waiting for response)
     420 ICMP Echos sent
     420 ICMP Echo Replies received
       0 other ICMP received

 0.01 ms (min round trip time)
 0.53 ms (avg round trip time)
 20.9 ms (max round trip time)
        9.417 sec (elapsed real time)

