172.16.36.7  : 0.02 0.02 0.02 0.03 0.03 0.01 0.02 0.01 0.03 0.01
172.16.66.25 : 9.76 9.76 9.76 9.76 9.76 9.76 9.75 9.72 9.76 9.76
172.16.66.26 : 26.34 13.82 13.83 13.82 13.85 13.89 13.91 13.88 13.89 13.88
172.16.66.27 : 13.76 13.85 13.84 13.81 13.85 13.84 13.76 13.83 13.93 13.85
172.16.66.28 : 19.34 13.90 13.88 13.88 13.93 13.91 13.91 13.83 13.88 13.90
172.16.66.29 : 13.76 13.83 13.87 13.86 13.87 13.85 13.88 13.87 13.91 13.84
172.16.66.3  : 13.81 13.88 13.88 13.83 13.89 13.90 13.89 13.90 13.89 13.77
172.16.66.30 : 13.81 13.87 13.93 13.80 13.85 13.84 13.90 13.76 13.88 13.84
172.16.66.31 : 13.84 13.92 13.88 13.82 13.82 13.81 13.85 13.84 13.80 13.78
172.16.66.32 : 15.93 13.86 13.86 13.82 13.89 13.84 13.93 13.90 13.83 13.79
172.16.66.33 : 17.57 13.91 13.90 13.80 13.86 13.84 13.85 13.85 13.82 13.90
172.16.66.34 : 13.86 13.92 13.91 13.90 13.93 13.87 13.90 13.90 13.92 13.86
172.16.66.35 : 17.86 13.83 13.78 13.84 13.84 13.85 13.78 13.85 13.91 13.92
172.16.66.36 : 13.86 13.89 13.91 13.86 13.87 13.90 13.94 13.92 13.93 13.90
172.16.66.37 : 13.78 13.84 13.77 13.81 13.75 13.75 13.84 13.85 13.80 13.83
172.16.66.38 : 13.89 13.89 13.87 13.92 13.88 13.80 13.90 13.86 13.84 13.85
172.16.66.39 : 26.04 13.82 13.84 13.83 13.92 13.89 13.92 13.84 13.90 13.89
172.16.66.4  : 13.86 13.88 13.94 13.86 13.94 - 13.90 13.92 13.92 13.93
172.16.66.40 : 13.89 13.87 13.82 13.87 13.81 13.84 13.90 13.89 13.89 13.92
172.16.66.41 : 13.81 - 13.85 13.84 13.85 13.86 13.82 13.88 13.87 13.86
172.16.66.42 : 16.33 13.89 13.93 13.88 13.90 13.81 13.87 13.87 13.87 13.89
172.16.66.43 : 13.87 13.88 13.84 13.91 13.91 13.87 13.87 13.89 13.79 13.82
172.16.66.44 : 24.52 13.79 13.79 13.79 13.85 13.84 13.81 13.81 13.82 13.84
172.16.66.45 : 13.83 13.89 13.85 13.90 13.92 13.91 13.87 13.90 13.91 13.91
172.16.66.46 : 13.85 13.79 13.86 13.83 13.83 13.80 13.82 13.88 13.89 13.84
172.16.66.47 : 13.84 13.86 13.86 13.88 13.89 13.89 13.88 13.91 13.91 13.86
172.16.66.48 : 17.94 13.83 13.88 13.92 13.86 13.94 13.89 13.80 13.86 13.92
172.16.66.49 : 13.69 13.91 13.89 13.89 13.93 13.91 13.87 13.93 13.90 13.92
172.16.66.5  : 17.41 13.81 13.87 13.91 13.90 13.87 13.90 13.89 13.89 13.90
172.16.66.50 : 22.30 13.87 13.86 13.89 13.94 13.88 - 13.92 13.89 13.92
172.16.66.51 : 20.81 13.90 13.90 13.89 13.90 13.89 13.90 13.87 13.89 13.89
172.16.66.52 : 20.95 13.81 13.82 13.83 13.87 13.87 13.85 13.83 13.79 13.83
172.16.66.53 : 24.54 13.89 13.91 13.89 13.87 13.93 13.95 13.87 13.94 13.94
172.16.66.54 : 20.89 13.89 13.89 13.88 13.87 13.93 13.90 13.89 13.89 13.81
172.16.66.55 : 20.88 13.83 13.84 13.85 13.78 13.78 13.82 13.78 13.78 13.83
172.16.66.56 : 20.84 13.88 13.92 13.90 13.88 13.89 13.90 13.91 13.93 13.85
172.16.66.57 : 20.78 13.81 13.86 13.82 13.82 13.85 13.84 13.86 13.85 13.82
172.16.66.58 : 20.90 13.81 13.84 13.81 13.82 13.80 13.83 13.81 13.84 13.81
172.16.66.59 : - 13.80 13.79 13.85 13.80 13.82 13.82 13.81 13.82 13.80
172.16.66.6  : 25.13 13.90 13.92 13.88 13.91 13.94 13.93 13.91 - 13.89
172.16.66.60 : 24.64 13.85 13.88 13.90 13.82 13.81 13.85 13.84 13.83 13.85
172.16.66.61 : 20.88 13.91 13.92 13.91 13.89 13.91 13.95 13.91 13.91 13.92

      42 targets
      42 alive
       0 unreachable
       0 unknown addresses

       5 timeouts (waiting for response)
     420 ICMP Echos sent
     415 ICMP Echo Replies received
       0 other ICMP received

 0.01 ms (min round trip time)
 13.8 ms (avg round trip time)
 26.3 ms (max round trip time)
       10.416 sec (elapsed real time)

