"2021-03-23T15:46:26.282856+01:00","chifflot-8","bmc_node_power_watt",494
"2021-03-23T15:46:31.283599+01:00","chifflot-8","bmc_node_power_watt",494
"2021-03-23T15:46:36.28554+01:00","chifflot-8","bmc_node_power_watt",494
"2021-03-23T15:46:41.285965+01:00","chifflot-8","bmc_node_power_watt",494
"2021-03-23T15:46:46.287421+01:00","chifflot-8","bmc_node_power_watt",494
"2021-03-23T15:46:51.28903+01:00","chifflot-8","bmc_node_power_watt",494
"2021-03-23T15:46:56.289901+01:00","chifflot-8","bmc_node_power_watt",494
"2021-03-23T15:47:01.290509+01:00","chifflot-8","bmc_node_power_watt",494
"2021-03-23T15:47:06.29215+01:00","chifflot-8","bmc_node_power_watt",494
"2021-03-23T15:47:11.294085+01:00","chifflot-8","bmc_node_power_watt",494
"2021-03-23T15:47:16.294213+01:00","chifflot-8","bmc_node_power_watt",494
"2021-03-23T15:47:21.295312+01:00","chifflot-8","bmc_node_power_watt",494
"2021-03-23T15:47:26.297942+01:00","chifflot-8","bmc_node_power_watt",494
"2021-03-23T15:47:31.29786+01:00","chifflot-8","bmc_node_power_watt",520
"2021-03-23T15:47:36.298666+01:00","chifflot-8","bmc_node_power_watt",520
"2021-03-23T15:47:41.29942+01:00","chifflot-8","bmc_node_power_watt",520
"2021-03-23T15:47:46.300981+01:00","chifflot-8","bmc_node_power_watt",520
"2021-03-23T15:47:51.303485+01:00","chifflot-8","bmc_node_power_watt",520
"2021-03-23T15:47:56.305267+01:00","chifflot-8","bmc_node_power_watt",494
"2021-03-23T15:48:01.305051+01:00","chifflot-8","bmc_node_power_watt",494
"2021-03-23T15:48:06.308272+01:00","chifflot-8","bmc_node_power_watt",494
"2021-03-23T15:48:11.309582+01:00","chifflot-8","bmc_node_power_watt",494
"2021-03-23T15:48:16.309375+01:00","chifflot-8","bmc_node_power_watt",494
"2021-03-23T15:48:21.311267+01:00","chifflot-8","bmc_node_power_watt",494
"2021-03-23T15:48:26.31266+01:00","chifflot-8","bmc_node_power_watt",494
"2021-03-23T15:48:31.314249+01:00","chifflot-8","bmc_node_power_watt",494
"2021-03-23T15:48:36.314532+01:00","chifflot-8","bmc_node_power_watt",494
"2021-03-23T15:48:41.316558+01:00","chifflot-8","bmc_node_power_watt",494
"2021-03-23T15:48:46.317225+01:00","chifflot-8","bmc_node_power_watt",520
"2021-03-23T15:48:51.317818+01:00","chifflot-8","bmc_node_power_watt",520
"2021-03-23T15:48:56.317862+01:00","chifflot-8","bmc_node_power_watt",520
"2021-03-23T15:49:01.322592+01:00","chifflot-8","bmc_node_power_watt",520
"2021-03-23T15:49:06.32275+01:00","chifflot-8","bmc_node_power_watt",520
"2021-03-23T15:49:11.323308+01:00","chifflot-8","bmc_node_power_watt",520
"2021-03-23T15:49:16.324042+01:00","chifflot-8","bmc_node_power_watt",520
"2021-03-23T15:49:21.324648+01:00","chifflot-8","bmc_node_power_watt",520
"2021-03-23T15:49:26.326475+01:00","chifflot-8","bmc_node_power_watt",520
"2021-03-23T15:49:31.326541+01:00","chifflot-8","bmc_node_power_watt",520
"2021-03-23T15:49:36.327699+01:00","chifflot-8","bmc_node_power_watt",520
"2021-03-23T15:49:41.328362+01:00","chifflot-8","bmc_node_power_watt",520
"2021-03-23T15:49:46.328655+01:00","chifflot-8","bmc_node_power_watt",520
"2021-03-23T15:49:51.329544+01:00","chifflot-8","bmc_node_power_watt",520
"2021-03-23T15:49:56.330109+01:00","chifflot-8","bmc_node_power_watt",520
"2021-03-23T15:50:01.330908+01:00","chifflot-8","bmc_node_power_watt",520
"2021-03-23T15:50:06.332011+01:00","chifflot-8","bmc_node_power_watt",520
"2021-03-23T15:50:11.332568+01:00","chifflot-8","bmc_node_power_watt",520
"2021-03-23T15:50:16.334472+01:00","chifflot-8","bmc_node_power_watt",520
"2021-03-23T15:50:21.335865+01:00","chifflot-8","bmc_node_power_watt",520
"2021-03-23T15:50:26.336747+01:00","chifflot-8","bmc_node_power_watt",520
"2021-03-23T15:50:31.338179+01:00","chifflot-8","bmc_node_power_watt",520
"2021-03-23T15:50:36.340292+01:00","chifflot-8","bmc_node_power_watt",520
"2021-03-23T15:50:41.343791+01:00","chifflot-8","bmc_node_power_watt",520
"2021-03-23T15:50:46.344055+01:00","chifflot-8","bmc_node_power_watt",520
"2021-03-23T15:50:51.345671+01:00","chifflot-8","bmc_node_power_watt",520
"2021-03-23T15:50:56.346014+01:00","chifflot-8","bmc_node_power_watt",520
"2021-03-23T15:51:01.346568+01:00","chifflot-8","bmc_node_power_watt",520
"2021-03-23T15:51:06.347071+01:00","chifflot-8","bmc_node_power_watt",494
"2021-03-23T15:51:11.348253+01:00","chifflot-8","bmc_node_power_watt",494
"2021-03-23T15:51:16.348281+01:00","chifflot-8","bmc_node_power_watt",494
"2021-03-23T15:51:21.349626+01:00","chifflot-8","bmc_node_power_watt",494
"2021-03-23T15:51:26.350053+01:00","chifflot-8","bmc_node_power_watt",494
"2021-03-23T15:51:31.352019+01:00","chifflot-8","bmc_node_power_watt",494
"2021-03-23T15:51:36.351763+01:00","chifflot-8","bmc_node_power_watt",494
"2021-03-23T15:51:41.352938+01:00","chifflot-8","bmc_node_power_watt",494
"2021-03-23T15:51:46.352928+01:00","chifflot-8","bmc_node_power_watt",494
"2021-03-23T15:51:51.353631+01:00","chifflot-8","bmc_node_power_watt",494
"2021-03-23T15:51:56.354523+01:00","chifflot-8","bmc_node_power_watt",520
"2021-03-23T15:52:01.35565+01:00","chifflot-8","bmc_node_power_watt",520
"2021-03-23T15:52:06.357725+01:00","chifflot-8","bmc_node_power_watt",520
"2021-03-23T15:52:11.357947+01:00","chifflot-8","bmc_node_power_watt",520
"2021-03-23T15:52:16.358489+01:00","chifflot-8","bmc_node_power_watt",494
"2021-03-23T15:52:21.360376+01:00","chifflot-8","bmc_node_power_watt",494
"2021-03-23T15:52:26.360579+01:00","chifflot-8","bmc_node_power_watt",494
"2021-03-23T15:52:31.361786+01:00","chifflot-8","bmc_node_power_watt",494
"2021-03-23T15:52:36.363523+01:00","chifflot-8","bmc_node_power_watt",494
"2021-03-23T15:52:41.364832+01:00","chifflot-8","bmc_node_power_watt",520
"2021-03-23T15:52:46.3673+01:00","chifflot-8","bmc_node_power_watt",520
"2021-03-23T15:52:51.366845+01:00","chifflot-8","bmc_node_power_watt",520
"2021-03-23T15:52:56.368332+01:00","chifflot-8","bmc_node_power_watt",520
"2021-03-23T15:53:01.371723+01:00","chifflot-8","bmc_node_power_watt",520
"2021-03-23T15:53:06.374297+01:00","chifflot-8","bmc_node_power_watt",494
"2021-03-23T15:53:11.379118+01:00","chifflot-8","bmc_node_power_watt",494
"2021-03-23T15:53:16.380334+01:00","chifflot-8","bmc_node_power_watt",494
"2021-03-23T15:53:21.384316+01:00","chifflot-8","bmc_node_power_watt",494
"2021-03-23T15:53:26.383976+01:00","chifflot-8","bmc_node_power_watt",494
"2021-03-23T15:53:31.388002+01:00","chifflot-8","bmc_node_power_watt",520
"2021-03-23T15:53:36.3909+01:00","chifflot-8","bmc_node_power_watt",520
"2021-03-23T15:53:41.392837+01:00","chifflot-8","bmc_node_power_watt",520
"2021-03-23T15:53:46.39484+01:00","chifflot-8","bmc_node_power_watt",520
"2021-03-23T15:53:51.399611+01:00","chifflot-8","bmc_node_power_watt",520
"2021-03-23T15:53:56.40291+01:00","chifflot-8","bmc_node_power_watt",520
"2021-03-23T15:54:01.404594+01:00","chifflot-8","bmc_node_power_watt",520
"2021-03-23T15:54:06.406449+01:00","chifflot-8","bmc_node_power_watt",520
"2021-03-23T15:54:11.407811+01:00","chifflot-8","bmc_node_power_watt",520
"2021-03-23T15:54:16.40742+01:00","chifflot-8","bmc_node_power_watt",494
"2021-03-23T15:54:21.408326+01:00","chifflot-8","bmc_node_power_watt",494
"2021-03-23T15:54:26.408792+01:00","chifflot-8","bmc_node_power_watt",494
"2021-03-23T15:54:31.409669+01:00","chifflot-8","bmc_node_power_watt",494
"2021-03-23T15:54:36.410334+01:00","chifflot-8","bmc_node_power_watt",494
"2021-03-23T15:54:41.410719+01:00","chifflot-8","bmc_node_power_watt",494
"2021-03-23T15:54:46.411167+01:00","chifflot-8","bmc_node_power_watt",494
"2021-03-23T15:54:51.411834+01:00","chifflot-8","bmc_node_power_watt",494
"2021-03-23T15:54:56.412575+01:00","chifflot-8","bmc_node_power_watt",494
"2021-03-23T15:55:01.413715+01:00","chifflot-8","bmc_node_power_watt",494
"2021-03-23T15:55:06.414082+01:00","chifflot-8","bmc_node_power_watt",520
"2021-03-23T15:55:11.414963+01:00","chifflot-8","bmc_node_power_watt",520
"2021-03-23T15:55:16.416109+01:00","chifflot-8","bmc_node_power_watt",520
"2021-03-23T15:55:21.416588+01:00","chifflot-8","bmc_node_power_watt",520
"2021-03-23T15:55:26.416948+01:00","chifflot-8","bmc_node_power_watt",494
"2021-03-23T15:55:31.417372+01:00","chifflot-8","bmc_node_power_watt",494
"2021-03-23T15:55:36.417559+01:00","chifflot-8","bmc_node_power_watt",494
"2021-03-23T15:55:41.418004+01:00","chifflot-8","bmc_node_power_watt",494
"2021-03-23T15:55:46.418214+01:00","chifflot-8","bmc_node_power_watt",494
"2021-03-23T15:55:51.418991+01:00","chifflot-8","bmc_node_power_watt",494
"2021-03-23T15:55:56.420082+01:00","chifflot-8","bmc_node_power_watt",494
"2021-03-23T15:56:01.420957+01:00","chifflot-8","bmc_node_power_watt",494
"2021-03-23T15:56:06.421181+01:00","chifflot-8","bmc_node_power_watt",494
"2021-03-23T15:56:11.421632+01:00","chifflot-8","bmc_node_power_watt",494
"2021-03-23T15:56:16.422051+01:00","chifflot-8","bmc_node_power_watt",494
"2021-03-23T15:56:21.422281+01:00","chifflot-8","bmc_node_power_watt",494
"2021-03-23T15:56:26.422687+01:00","chifflot-8","bmc_node_power_watt",494
"2021-03-23T15:56:31.423557+01:00","chifflot-8","bmc_node_power_watt",494
"2021-03-23T15:56:36.424061+01:00","chifflot-8","bmc_node_power_watt",494
"2021-03-23T15:56:41.424939+01:00","chifflot-8","bmc_node_power_watt",494
"2021-03-23T15:56:46.425711+01:00","chifflot-8","bmc_node_power_watt",494
"2021-03-23T15:56:51.426108+01:00","chifflot-8","bmc_node_power_watt",494
"2021-03-23T15:56:56.42751+01:00","chifflot-8","bmc_node_power_watt",494
"2021-03-23T15:57:01.427589+01:00","chifflot-8","bmc_node_power_watt",494
"2021-03-23T15:57:06.428271+01:00","chifflot-8","bmc_node_power_watt",494
"2021-03-23T15:57:11.429003+01:00","chifflot-8","bmc_node_power_watt",494
"2021-03-23T15:57:16.429597+01:00","chifflot-8","bmc_node_power_watt",494
"2021-03-23T15:57:21.430677+01:00","chifflot-8","bmc_node_power_watt",494
"2021-03-23T15:57:26.431793+01:00","chifflot-8","bmc_node_power_watt",494
"2021-03-23T15:57:31.431973+01:00","chifflot-8","bmc_node_power_watt",494
"2021-03-23T15:57:36.433565+01:00","chifflot-8","bmc_node_power_watt",494
"2021-03-23T15:57:41.434641+01:00","chifflot-8","bmc_node_power_watt",494
"2021-03-23T15:57:46.434975+01:00","chifflot-8","bmc_node_power_watt",494
"2021-03-23T15:57:51.436194+01:00","chifflot-8","bmc_node_power_watt",494
"2021-03-23T15:57:56.43724+01:00","chifflot-8","bmc_node_power_watt",494
"2021-03-23T15:58:01.43859+01:00","chifflot-8","bmc_node_power_watt",494
"2021-03-23T15:58:06.439691+01:00","chifflot-8","bmc_node_power_watt",494
"2021-03-23T15:58:11.440224+01:00","chifflot-8","bmc_node_power_watt",494
"2021-03-23T15:58:16.440412+01:00","chifflot-8","bmc_node_power_watt",494
"2021-03-23T15:58:21.441209+01:00","chifflot-8","bmc_node_power_watt",494
"2021-03-23T15:58:26.442692+01:00","chifflot-8","bmc_node_power_watt",494
"2021-03-23T15:58:31.443722+01:00","chifflot-8","bmc_node_power_watt",494
"2021-03-23T15:58:36.444273+01:00","chifflot-8","bmc_node_power_watt",520
"2021-03-23T15:58:41.446501+01:00","chifflot-8","bmc_node_power_watt",520
"2021-03-23T15:58:46.447421+01:00","chifflot-8","bmc_node_power_watt",520
"2021-03-23T15:58:51.448918+01:00","chifflot-8","bmc_node_power_watt",520
"2021-03-23T15:58:56.450235+01:00","chifflot-8","bmc_node_power_watt",520
"2021-03-23T15:59:01.452008+01:00","chifflot-8","bmc_node_power_watt",520
"2021-03-23T15:59:06.451958+01:00","chifflot-8","bmc_node_power_watt",520
"2021-03-23T15:59:11.453192+01:00","chifflot-8","bmc_node_power_watt",520
"2021-03-23T15:59:16.454359+01:00","chifflot-8","bmc_node_power_watt",520
"2021-03-23T15:59:21.455466+01:00","chifflot-8","bmc_node_power_watt",520
"2021-03-23T15:59:26.456031+01:00","chifflot-8","bmc_node_power_watt",520
"2021-03-23T15:59:31.456664+01:00","chifflot-8","bmc_node_power_watt",520
"2021-03-23T15:59:36.459626+01:00","chifflot-8","bmc_node_power_watt",520
"2021-03-23T15:59:41.45917+01:00","chifflot-8","bmc_node_power_watt",520
"2021-03-23T15:59:46.460108+01:00","chifflot-8","bmc_node_power_watt",520
"2021-03-23T15:59:51.462426+01:00","chifflot-8","bmc_node_power_watt",520
"2021-03-23T15:59:56.462893+01:00","chifflot-8","bmc_node_power_watt",520
"2021-03-23T16:00:01.464988+01:00","chifflot-8","bmc_node_power_watt",520
"2021-03-23T16:00:06.466239+01:00","chifflot-8","bmc_node_power_watt",520
"2021-03-23T16:00:11.468134+01:00","chifflot-8","bmc_node_power_watt",520
"2021-03-23T16:00:16.468665+01:00","chifflot-8","bmc_node_power_watt",520
"2021-03-23T16:00:21.469245+01:00","chifflot-8","bmc_node_power_watt",520
"2021-03-23T16:00:26.470027+01:00","chifflot-8","bmc_node_power_watt",520
"2021-03-23T16:00:31.470873+01:00","chifflot-8","bmc_node_power_watt",520
"2021-03-23T16:00:36.471937+01:00","chifflot-8","bmc_node_power_watt",520
"2021-03-23T16:00:41.477644+01:00","chifflot-8","bmc_node_power_watt",520
"2021-03-23T16:00:46.476781+01:00","chifflot-8","bmc_node_power_watt",520
"2021-03-23T16:00:51.47759+01:00","chifflot-8","bmc_node_power_watt",520
"2021-03-23T16:00:56.478156+01:00","chifflot-8","bmc_node_power_watt",520
"2021-03-23T16:01:01.478979+01:00","chifflot-8","bmc_node_power_watt",520
"2021-03-23T16:01:06.481822+01:00","chifflot-8","bmc_node_power_watt",520
"2021-03-23T16:01:11.482535+01:00","chifflot-8","bmc_node_power_watt",520
"2021-03-23T16:01:16.482997+01:00","chifflot-8","bmc_node_power_watt",520
"2021-03-23T16:01:21.484618+01:00","chifflot-8","bmc_node_power_watt",520
"2021-03-23T16:01:26.48538+01:00","chifflot-8","bmc_node_power_watt",520
"2021-03-23T16:01:31.486897+01:00","chifflot-8","bmc_node_power_watt",520
"2021-03-23T16:01:36.48667+01:00","chifflot-8","bmc_node_power_watt",520
"2021-03-23T16:01:41.487923+01:00","chifflot-8","bmc_node_power_watt",520
"2021-03-23T16:01:46.487945+01:00","chifflot-8","bmc_node_power_watt",494
"2021-03-23T16:01:51.488797+01:00","chifflot-8","bmc_node_power_watt",494
"2021-03-23T16:01:56.489149+01:00","chifflot-8","bmc_node_power_watt",494
"2021-03-23T16:02:01.490068+01:00","chifflot-8","bmc_node_power_watt",494
"2021-03-23T16:02:06.490553+01:00","chifflot-8","bmc_node_power_watt",494
"2021-03-23T16:02:11.493005+01:00","chifflot-8","bmc_node_power_watt",494
"2021-03-23T16:02:16.493318+01:00","chifflot-8","bmc_node_power_watt",494
"2021-03-23T16:02:21.494256+01:00","chifflot-8","bmc_node_power_watt",494
"2021-03-23T16:02:26.49549+01:00","chifflot-8","bmc_node_power_watt",494
"2021-03-23T16:02:31.49704+01:00","chifflot-8","bmc_node_power_watt",494
"2021-03-23T16:02:36.497549+01:00","chifflot-8","bmc_node_power_watt",520
"2021-03-23T16:02:41.498173+01:00","chifflot-8","bmc_node_power_watt",520
"2021-03-23T16:02:46.498406+01:00","chifflot-8","bmc_node_power_watt",520
"2021-03-23T16:02:51.498562+01:00","chifflot-8","bmc_node_power_watt",520
"2021-03-23T16:02:56.499226+01:00","chifflot-8","bmc_node_power_watt",520
"2021-03-23T16:03:01.50082+01:00","chifflot-8","bmc_node_power_watt",520
"2021-03-23T16:03:06.501507+01:00","chifflot-8","bmc_node_power_watt",520
"2021-03-23T16:03:11.503492+01:00","chifflot-8","bmc_node_power_watt",520
"2021-03-23T16:03:16.50426+01:00","chifflot-8","bmc_node_power_watt",520
"2021-03-23T16:03:21.505047+01:00","chifflot-8","bmc_node_power_watt",520
"2021-03-23T16:03:26.506549+01:00","chifflot-8","bmc_node_power_watt",520
"2021-03-23T16:03:31.506652+01:00","chifflot-8","bmc_node_power_watt",520
"2021-03-23T16:03:36.509034+01:00","chifflot-8","bmc_node_power_watt",520
"2021-03-23T16:03:41.511562+01:00","chifflot-8","bmc_node_power_watt",520
"2021-03-23T16:03:46.511813+01:00","chifflot-8","bmc_node_power_watt",494
"2021-03-23T16:03:51.512487+01:00","chifflot-8","bmc_node_power_watt",494
"2021-03-23T16:03:56.514116+01:00","chifflot-8","bmc_node_power_watt",494
"2021-03-23T16:04:01.51491+01:00","chifflot-8","bmc_node_power_watt",494
"2021-03-23T16:04:06.515252+01:00","chifflot-8","bmc_node_power_watt",494
"2021-03-23T16:04:11.517147+01:00","chifflot-8","bmc_node_power_watt",520
"2021-03-23T16:04:16.519024+01:00","chifflot-8","bmc_node_power_watt",520
"2021-03-23T16:04:21.519859+01:00","chifflot-8","bmc_node_power_watt",520
"2021-03-23T16:04:26.522623+01:00","chifflot-8","bmc_node_power_watt",520
"2021-03-23T16:04:31.523173+01:00","chifflot-8","bmc_node_power_watt",520
"2021-03-23T16:04:36.525096+01:00","chifflot-8","bmc_node_power_watt",520
"2021-03-23T16:04:41.526437+01:00","chifflot-8","bmc_node_power_watt",520
"2021-03-23T16:04:46.527726+01:00","chifflot-8","bmc_node_power_watt",520
"2021-03-23T16:04:51.528652+01:00","chifflot-8","bmc_node_power_watt",520
"2021-03-23T16:04:56.529072+01:00","chifflot-8","bmc_node_power_watt",520
"2021-03-23T16:05:01.52962+01:00","chifflot-8","bmc_node_power_watt",520
"2021-03-23T16:05:06.529858+01:00","chifflot-8","bmc_node_power_watt",520
"2021-03-23T16:05:11.531043+01:00","chifflot-8","bmc_node_power_watt",520
"2021-03-23T16:05:16.532287+01:00","chifflot-8","bmc_node_power_watt",520
"2021-03-23T16:05:21.533582+01:00","chifflot-8","bmc_node_power_watt",520
"2021-03-23T16:05:26.533787+01:00","chifflot-8","bmc_node_power_watt",520
"2021-03-23T16:05:31.536564+01:00","chifflot-8","bmc_node_power_watt",520
"2021-03-23T16:05:36.537766+01:00","chifflot-8","bmc_node_power_watt",520
"2021-03-23T16:05:41.54062+01:00","chifflot-8","bmc_node_power_watt",520
"2021-03-23T16:05:46.541735+01:00","chifflot-8","bmc_node_power_watt",494
"2021-03-23T16:05:51.541607+01:00","chifflot-8","bmc_node_power_watt",494
"2021-03-23T16:05:56.544214+01:00","chifflot-8","bmc_node_power_watt",494
"2021-03-23T16:06:01.544097+01:00","chifflot-8","bmc_node_power_watt",494
"2021-03-23T16:06:06.544075+01:00","chifflot-8","bmc_node_power_watt",520
"2021-03-23T16:06:11.544867+01:00","chifflot-8","bmc_node_power_watt",520
"2021-03-23T16:06:16.54517+01:00","chifflot-8","bmc_node_power_watt",520
"2021-03-23T16:06:21.545745+01:00","chifflot-8","bmc_node_power_watt",520
"2021-03-23T16:06:26.546697+01:00","chifflot-8","bmc_node_power_watt",520
"2021-03-23T16:06:31.549288+01:00","chifflot-8","bmc_node_power_watt",520
"2021-03-23T16:06:36.548732+01:00","chifflot-8","bmc_node_power_watt",520
"2021-03-23T16:06:41.549823+01:00","chifflot-8","bmc_node_power_watt",520
"2021-03-23T16:06:46.551676+01:00","chifflot-8","bmc_node_power_watt",520
"2021-03-23T16:06:51.551738+01:00","chifflot-8","bmc_node_power_watt",520
"2021-03-23T16:06:56.55527+01:00","chifflot-8","bmc_node_power_watt",520
"2021-03-23T16:07:01.554286+01:00","chifflot-8","bmc_node_power_watt",520
"2021-03-23T16:07:06.557585+01:00","chifflot-8","bmc_node_power_watt",520
"2021-03-23T16:07:11.557871+01:00","chifflot-8","bmc_node_power_watt",520
"2021-03-23T16:07:16.558304+01:00","chifflot-8","bmc_node_power_watt",520
"2021-03-23T16:07:21.559565+01:00","chifflot-8","bmc_node_power_watt",520
"2021-03-23T16:07:26.560037+01:00","chifflot-8","bmc_node_power_watt",520
"2021-03-23T16:07:31.561337+01:00","chifflot-8","bmc_node_power_watt",520
"2021-03-23T16:07:36.563913+01:00","chifflot-8","bmc_node_power_watt",520
"2021-03-23T16:07:41.565377+01:00","chifflot-8","bmc_node_power_watt",494
"2021-03-23T16:07:46.567428+01:00","chifflot-8","bmc_node_power_watt",494
"2021-03-23T16:07:51.568292+01:00","chifflot-8","bmc_node_power_watt",494
"2021-03-23T16:07:56.56906+01:00","chifflot-8","bmc_node_power_watt",494
"2021-03-23T16:08:01.571079+01:00","chifflot-8","bmc_node_power_watt",494
"2021-03-23T16:08:06.571716+01:00","chifflot-8","bmc_node_power_watt",520
"2021-03-23T16:08:11.575191+01:00","chifflot-8","bmc_node_power_watt",520
"2021-03-23T16:08:16.57515+01:00","chifflot-8","bmc_node_power_watt",520
"2021-03-23T16:08:21.575652+01:00","chifflot-8","bmc_node_power_watt",520
"2021-03-23T16:08:26.576498+01:00","chifflot-8","bmc_node_power_watt",520
"2021-03-23T16:08:31.577509+01:00","chifflot-8","bmc_node_power_watt",520
"2021-03-23T16:08:36.579241+01:00","chifflot-8","bmc_node_power_watt",520
"2021-03-23T16:08:41.58073+01:00","chifflot-8","bmc_node_power_watt",520
"2021-03-23T16:08:46.581535+01:00","chifflot-8","bmc_node_power_watt",520
"2021-03-23T16:08:51.581803+01:00","chifflot-8","bmc_node_power_watt",520
"2021-03-23T16:08:56.584274+01:00","chifflot-8","bmc_node_power_watt",520
"2021-03-23T16:09:01.585813+01:00","chifflot-8","bmc_node_power_watt",520
"2021-03-23T16:09:06.592145+01:00","chifflot-8","bmc_node_power_watt",520
"2021-03-23T16:09:11.595575+01:00","chifflot-8","bmc_node_power_watt",520
"2021-03-23T16:09:16.595887+01:00","chifflot-8","bmc_node_power_watt",520
"2021-03-23T16:09:21.599189+01:00","chifflot-8","bmc_node_power_watt",520
