172.16.36.8 : 0.22 0.11 0.09 0.09 0.09 0.09 0.15 0.13 0.15 0.15
172.16.38.8 : 0.24 0.18 0.19 0.20 0.21 0.20 0.19 0.19 0.17 0.12
172.16.38.4 : 0.03 0.02 0.03 0.03 0.03 0.03 0.04 0.03 0.03 0.03

       3 targets
       3 alive
       0 unreachable
       0 unknown addresses

       0 timeouts (waiting for response)
      30 ICMP Echos sent
      30 ICMP Echo Replies received
       0 other ICMP received

 0.02 ms (min round trip time)
 0.11 ms (avg round trip time)
 0.24 ms (max round trip time)
        9.026 sec (elapsed real time)

