172.16.36.8 : 0.03 0.01 0.03 0.03 0.03 0.03 0.03 0.03 0.03 0.03
172.16.37.7 : 14.27 4.33 4.31 4.12 4.26 4.26 4.18 4.35 4.34 4.30
172.16.37.2 : 0.25 0.17 0.21 0.24 0.21 0.22 0.20 0.18 0.17 0.18

       3 targets
       3 alive
       0 unreachable
       0 unknown addresses

       0 timeouts (waiting for response)
      30 ICMP Echos sent
      30 ICMP Echo Replies received
       0 other ICMP received

 0.01 ms (min round trip time)
 1.83 ms (avg round trip time)
 14.2 ms (max round trip time)
        9.030 sec (elapsed real time)

