172.16.36.7 : 0.04 0.02 0.04 0.03 0.03 0.03 0.03 0.03 0.03 0.01
172.16.39.8 : 20.20 4.33 4.32 4.16 - 4.31 4.38 4.24 4.31 4.34
172.16.39.6 : 0.23 0.18 0.16 0.25 0.25 0.25 0.22 0.14 0.12 0.12

       3 targets
       3 alive
       0 unreachable
       0 unknown addresses

       1 timeouts (waiting for response)
      30 ICMP Echos sent
      29 ICMP Echo Replies received
       0 other ICMP received

 0.01 ms (min round trip time)
 1.95 ms (avg round trip time)
 20.2 ms (max round trip time)
       10.030 sec (elapsed real time)

