"2021-04-09T10:26:35.274569+02:00","chifflot-8","bmc_node_power_watt",494
"2021-04-09T10:26:40.277848+02:00","chifflot-8","bmc_node_power_watt",494
"2021-04-09T10:26:45.277063+02:00","chifflot-8","bmc_node_power_watt",494
"2021-04-09T10:26:50.277999+02:00","chifflot-8","bmc_node_power_watt",494
"2021-04-09T10:26:55.280484+02:00","chifflot-8","bmc_node_power_watt",494
"2021-04-09T10:27:00.284092+02:00","chifflot-8","bmc_node_power_watt",494
"2021-04-09T10:27:05.284259+02:00","chifflot-8","bmc_node_power_watt",494
"2021-04-09T10:27:10.288023+02:00","chifflot-8","bmc_node_power_watt",494
"2021-04-09T10:27:15.288606+02:00","chifflot-8","bmc_node_power_watt",494
"2021-04-09T10:27:20.289163+02:00","chifflot-8","bmc_node_power_watt",494
"2021-04-09T10:27:25.291331+02:00","chifflot-8","bmc_node_power_watt",494
"2021-04-09T10:27:30.291724+02:00","chifflot-8","bmc_node_power_watt",494
"2021-04-09T10:27:35.291907+02:00","chifflot-8","bmc_node_power_watt",494
"2021-04-09T10:27:40.294654+02:00","chifflot-8","bmc_node_power_watt",494
"2021-04-09T10:27:45.295265+02:00","chifflot-8","bmc_node_power_watt",494
"2021-04-09T10:27:50.295853+02:00","chifflot-8","bmc_node_power_watt",494
"2021-04-09T10:27:55.296263+02:00","chifflot-8","bmc_node_power_watt",494
"2021-04-09T10:28:00.298679+02:00","chifflot-8","bmc_node_power_watt",494
"2021-04-09T10:28:05.299576+02:00","chifflot-8","bmc_node_power_watt",494
"2021-04-09T10:28:10.302266+02:00","chifflot-8","bmc_node_power_watt",494
"2021-04-09T10:28:15.302574+02:00","chifflot-8","bmc_node_power_watt",494
"2021-04-09T10:28:20.303324+02:00","chifflot-8","bmc_node_power_watt",494
"2021-04-09T10:28:25.304443+02:00","chifflot-8","bmc_node_power_watt",494
"2021-04-09T10:28:30.3053+02:00","chifflot-8","bmc_node_power_watt",494
"2021-04-09T10:28:35.305211+02:00","chifflot-8","bmc_node_power_watt",494
"2021-04-09T10:28:40.306468+02:00","chifflot-8","bmc_node_power_watt",494
"2021-04-09T10:28:45.306704+02:00","chifflot-8","bmc_node_power_watt",494
"2021-04-09T10:28:50.307468+02:00","chifflot-8","bmc_node_power_watt",494
"2021-04-09T10:28:55.307759+02:00","chifflot-8","bmc_node_power_watt",494
"2021-04-09T10:29:00.308731+02:00","chifflot-8","bmc_node_power_watt",494
"2021-04-09T10:29:05.309079+02:00","chifflot-8","bmc_node_power_watt",494
"2021-04-09T10:29:10.310122+02:00","chifflot-8","bmc_node_power_watt",494
"2021-04-09T10:29:15.310946+02:00","chifflot-8","bmc_node_power_watt",494
"2021-04-09T10:29:20.312941+02:00","chifflot-8","bmc_node_power_watt",494
"2021-04-09T10:29:25.312913+02:00","chifflot-8","bmc_node_power_watt",494
"2021-04-09T10:29:30.313864+02:00","chifflot-8","bmc_node_power_watt",494
"2021-04-09T10:29:35.314858+02:00","chifflot-8","bmc_node_power_watt",494
"2021-04-09T10:29:40.315976+02:00","chifflot-8","bmc_node_power_watt",494
"2021-04-09T10:29:45.316335+02:00","chifflot-8","bmc_node_power_watt",494
"2021-04-09T10:29:50.317914+02:00","chifflot-8","bmc_node_power_watt",494
"2021-04-09T10:29:55.31856+02:00","chifflot-8","bmc_node_power_watt",494
"2021-04-09T10:30:00.319688+02:00","chifflot-8","bmc_node_power_watt",494
"2021-04-09T10:30:05.320055+02:00","chifflot-8","bmc_node_power_watt",494
"2021-04-09T10:30:10.322301+02:00","chifflot-8","bmc_node_power_watt",494
"2021-04-09T10:30:15.32419+02:00","chifflot-8","bmc_node_power_watt",494
"2021-04-09T10:30:20.324832+02:00","chifflot-8","bmc_node_power_watt",494
"2021-04-09T10:30:25.32609+02:00","chifflot-8","bmc_node_power_watt",494
"2021-04-09T10:30:30.327401+02:00","chifflot-8","bmc_node_power_watt",494
"2021-04-09T10:30:35.327665+02:00","chifflot-8","bmc_node_power_watt",494
"2021-04-09T10:30:40.330256+02:00","chifflot-8","bmc_node_power_watt",494
"2021-04-09T10:30:45.330498+02:00","chifflot-8","bmc_node_power_watt",494
"2021-04-09T10:30:50.333079+02:00","chifflot-8","bmc_node_power_watt",494
"2021-04-09T10:30:55.33354+02:00","chifflot-8","bmc_node_power_watt",520
"2021-04-09T10:31:00.333911+02:00","chifflot-8","bmc_node_power_watt",520
"2021-04-09T10:31:05.334001+02:00","chifflot-8","bmc_node_power_watt",520
"2021-04-09T10:31:10.335667+02:00","chifflot-8","bmc_node_power_watt",520
"2021-04-09T10:31:15.335431+02:00","chifflot-8","bmc_node_power_watt",520
"2021-04-09T10:31:20.336035+02:00","chifflot-8","bmc_node_power_watt",520
"2021-04-09T10:31:25.336804+02:00","chifflot-8","bmc_node_power_watt",520
"2021-04-09T10:31:30.337035+02:00","chifflot-8","bmc_node_power_watt",520
"2021-04-09T10:31:35.338531+02:00","chifflot-8","bmc_node_power_watt",520
"2021-04-09T10:31:40.34046+02:00","chifflot-8","bmc_node_power_watt",494
"2021-04-09T10:31:45.341276+02:00","chifflot-8","bmc_node_power_watt",494
"2021-04-09T10:31:50.341772+02:00","chifflot-8","bmc_node_power_watt",494
"2021-04-09T10:31:55.341797+02:00","chifflot-8","bmc_node_power_watt",494
"2021-04-09T10:32:00.342763+02:00","chifflot-8","bmc_node_power_watt",494
"2021-04-09T10:32:05.344999+02:00","chifflot-8","bmc_node_power_watt",520
"2021-04-09T10:32:10.34574+02:00","chifflot-8","bmc_node_power_watt",520
"2021-04-09T10:32:15.346394+02:00","chifflot-8","bmc_node_power_watt",520
"2021-04-09T10:32:20.346263+02:00","chifflot-8","bmc_node_power_watt",520
"2021-04-09T10:32:25.347608+02:00","chifflot-8","bmc_node_power_watt",520
"2021-04-09T10:32:30.348489+02:00","chifflot-8","bmc_node_power_watt",494
"2021-04-09T10:32:35.352523+02:00","chifflot-8","bmc_node_power_watt",494
"2021-04-09T10:32:40.352709+02:00","chifflot-8","bmc_node_power_watt",494
"2021-04-09T10:32:45.353237+02:00","chifflot-8","bmc_node_power_watt",494
"2021-04-09T10:32:50.354004+02:00","chifflot-8","bmc_node_power_watt",494
"2021-04-09T10:32:55.35404+02:00","chifflot-8","bmc_node_power_watt",520
"2021-04-09T10:33:00.354927+02:00","chifflot-8","bmc_node_power_watt",520
"2021-04-09T10:33:05.364348+02:00","chifflot-8","bmc_node_power_watt",520
"2021-04-09T10:33:10.363778+02:00","chifflot-8","bmc_node_power_watt",520
"2021-04-09T10:33:15.364916+02:00","chifflot-8","bmc_node_power_watt",494
"2021-04-09T10:33:20.365789+02:00","chifflot-8","bmc_node_power_watt",494
"2021-04-09T10:33:25.365921+02:00","chifflot-8","bmc_node_power_watt",494
"2021-04-09T10:33:30.366226+02:00","chifflot-8","bmc_node_power_watt",494
"2021-04-09T10:33:35.371007+02:00","chifflot-8","bmc_node_power_watt",494
"2021-04-09T10:33:40.370641+02:00","chifflot-8","bmc_node_power_watt",520
"2021-04-09T10:33:45.370992+02:00","chifflot-8","bmc_node_power_watt",520
"2021-04-09T10:33:50.371206+02:00","chifflot-8","bmc_node_power_watt",520
"2021-04-09T10:33:55.371633+02:00","chifflot-8","bmc_node_power_watt",520
"2021-04-09T10:34:00.371711+02:00","chifflot-8","bmc_node_power_watt",520
"2021-04-09T10:34:05.373566+02:00","chifflot-8","bmc_node_power_watt",494
"2021-04-09T10:34:10.373713+02:00","chifflot-8","bmc_node_power_watt",494
"2021-04-09T10:34:15.374781+02:00","chifflot-8","bmc_node_power_watt",494
"2021-04-09T10:34:20.375358+02:00","chifflot-8","bmc_node_power_watt",494
"2021-04-09T10:34:25.376013+02:00","chifflot-8","bmc_node_power_watt",494
"2021-04-09T10:34:30.377911+02:00","chifflot-8","bmc_node_power_watt",494
"2021-04-09T10:34:35.384923+02:00","chifflot-8","bmc_node_power_watt",494
"2021-04-09T10:34:40.385473+02:00","chifflot-8","bmc_node_power_watt",494
"2021-04-09T10:34:45.38732+02:00","chifflot-8","bmc_node_power_watt",494
"2021-04-09T10:34:50.388116+02:00","chifflot-8","bmc_node_power_watt",494
"2021-04-09T10:34:55.388943+02:00","chifflot-8","bmc_node_power_watt",494
"2021-04-09T10:35:00.392499+02:00","chifflot-8","bmc_node_power_watt",494
"2021-04-09T10:35:05.395732+02:00","chifflot-8","bmc_node_power_watt",494
"2021-04-09T10:35:10.400445+02:00","chifflot-8","bmc_node_power_watt",494
"2021-04-09T10:35:15.405296+02:00","chifflot-8","bmc_node_power_watt",520
"2021-04-09T10:35:20.403821+02:00","chifflot-8","bmc_node_power_watt",520
"2021-04-09T10:35:25.415359+02:00","chifflot-8","bmc_node_power_watt",520
"2021-04-09T10:35:30.414933+02:00","chifflot-8","bmc_node_power_watt",520
"2021-04-09T10:35:35.415909+02:00","chifflot-8","bmc_node_power_watt",520
"2021-04-09T10:35:40.420977+02:00","chifflot-8","bmc_node_power_watt",494
"2021-04-09T10:35:45.420726+02:00","chifflot-8","bmc_node_power_watt",494
"2021-04-09T10:35:50.42101+02:00","chifflot-8","bmc_node_power_watt",494
"2021-04-09T10:35:55.421687+02:00","chifflot-8","bmc_node_power_watt",494
"2021-04-09T10:36:00.422586+02:00","chifflot-8","bmc_node_power_watt",494
"2021-04-09T10:36:05.42269+02:00","chifflot-8","bmc_node_power_watt",494
"2021-04-09T10:36:10.424455+02:00","chifflot-8","bmc_node_power_watt",494
"2021-04-09T10:36:15.424392+02:00","chifflot-8","bmc_node_power_watt",494
"2021-04-09T10:36:20.425487+02:00","chifflot-8","bmc_node_power_watt",494
"2021-04-09T10:36:25.426194+02:00","chifflot-8","bmc_node_power_watt",520
"2021-04-09T10:36:30.426321+02:00","chifflot-8","bmc_node_power_watt",520
"2021-04-09T10:36:35.426881+02:00","chifflot-8","bmc_node_power_watt",520
"2021-04-09T10:36:40.428283+02:00","chifflot-8","bmc_node_power_watt",520
"2021-04-09T10:36:45.42966+02:00","chifflot-8","bmc_node_power_watt",520
"2021-04-09T10:36:50.430417+02:00","chifflot-8","bmc_node_power_watt",494
"2021-04-09T10:36:55.430864+02:00","chifflot-8","bmc_node_power_watt",494
"2021-04-09T10:37:00.431836+02:00","chifflot-8","bmc_node_power_watt",494
"2021-04-09T10:37:05.432907+02:00","chifflot-8","bmc_node_power_watt",494
"2021-04-09T10:37:10.433602+02:00","chifflot-8","bmc_node_power_watt",494
"2021-04-09T10:37:15.434398+02:00","chifflot-8","bmc_node_power_watt",520
"2021-04-09T10:37:20.43519+02:00","chifflot-8","bmc_node_power_watt",520
"2021-04-09T10:37:25.436023+02:00","chifflot-8","bmc_node_power_watt",520
"2021-04-09T10:37:30.437181+02:00","chifflot-8","bmc_node_power_watt",520
"2021-04-09T10:37:35.437717+02:00","chifflot-8","bmc_node_power_watt",520
"2021-04-09T10:37:40.439216+02:00","chifflot-8","bmc_node_power_watt",494
"2021-04-09T10:37:45.439987+02:00","chifflot-8","bmc_node_power_watt",494
"2021-04-09T10:37:50.440664+02:00","chifflot-8","bmc_node_power_watt",494
"2021-04-09T10:37:55.44189+02:00","chifflot-8","bmc_node_power_watt",494
"2021-04-09T10:38:00.443011+02:00","chifflot-8","bmc_node_power_watt",494
"2021-04-09T10:38:05.444846+02:00","chifflot-8","bmc_node_power_watt",494
"2021-04-09T10:38:10.44606+02:00","chifflot-8","bmc_node_power_watt",494
"2021-04-09T10:38:15.446305+02:00","chifflot-8","bmc_node_power_watt",494
"2021-04-09T10:38:20.447304+02:00","chifflot-8","bmc_node_power_watt",494
"2021-04-09T10:38:25.448368+02:00","chifflot-8","bmc_node_power_watt",494
"2021-04-09T10:38:30.449744+02:00","chifflot-8","bmc_node_power_watt",494
"2021-04-09T10:38:35.450479+02:00","chifflot-8","bmc_node_power_watt",494
"2021-04-09T10:38:40.450978+02:00","chifflot-8","bmc_node_power_watt",494
"2021-04-09T10:38:45.451998+02:00","chifflot-8","bmc_node_power_watt",494
"2021-04-09T10:38:50.453323+02:00","chifflot-8","bmc_node_power_watt",494
"2021-04-09T10:38:55.453859+02:00","chifflot-8","bmc_node_power_watt",494
"2021-04-09T10:39:00.455142+02:00","chifflot-8","bmc_node_power_watt",494
"2021-04-09T10:39:05.455053+02:00","chifflot-8","bmc_node_power_watt",494
"2021-04-09T10:39:10.457905+02:00","chifflot-8","bmc_node_power_watt",494
"2021-04-09T10:39:15.459979+02:00","chifflot-8","bmc_node_power_watt",494
"2021-04-09T10:39:20.460852+02:00","chifflot-8","bmc_node_power_watt",494
"2021-04-09T10:39:25.462092+02:00","chifflot-8","bmc_node_power_watt",494
"2021-04-09T10:39:30.473619+02:00","chifflot-8","bmc_node_power_watt",494
"2021-04-09T10:39:35.473543+02:00","chifflot-8","bmc_node_power_watt",520
"2021-04-09T10:39:40.473828+02:00","chifflot-8","bmc_node_power_watt",520
"2021-04-09T10:39:45.474005+02:00","chifflot-8","bmc_node_power_watt",520
"2021-04-09T10:39:50.475081+02:00","chifflot-8","bmc_node_power_watt",520
"2021-04-09T10:39:55.47588+02:00","chifflot-8","bmc_node_power_watt",520
"2021-04-09T10:40:00.476062+02:00","chifflot-8","bmc_node_power_watt",494
"2021-04-09T10:40:05.476736+02:00","chifflot-8","bmc_node_power_watt",494
"2021-04-09T10:40:10.476782+02:00","chifflot-8","bmc_node_power_watt",494
"2021-04-09T10:40:15.477771+02:00","chifflot-8","bmc_node_power_watt",494
"2021-04-09T10:40:20.478111+02:00","chifflot-8","bmc_node_power_watt",494
"2021-04-09T10:40:25.478684+02:00","chifflot-8","bmc_node_power_watt",494
"2021-04-09T10:40:30.480361+02:00","chifflot-8","bmc_node_power_watt",494
"2021-04-09T10:40:35.480404+02:00","chifflot-8","bmc_node_power_watt",494
"2021-04-09T10:40:40.480581+02:00","chifflot-8","bmc_node_power_watt",494
"2021-04-09T10:40:45.481675+02:00","chifflot-8","bmc_node_power_watt",494
"2021-04-09T10:40:50.482298+02:00","chifflot-8","bmc_node_power_watt",494
"2021-04-09T10:40:55.482745+02:00","chifflot-8","bmc_node_power_watt",494
"2021-04-09T10:41:00.483361+02:00","chifflot-8","bmc_node_power_watt",494
"2021-04-09T10:41:05.484541+02:00","chifflot-8","bmc_node_power_watt",494
"2021-04-09T10:41:10.485167+02:00","chifflot-8","bmc_node_power_watt",494
"2021-04-09T10:41:15.486142+02:00","chifflot-8","bmc_node_power_watt",494
"2021-04-09T10:41:20.487461+02:00","chifflot-8","bmc_node_power_watt",494
"2021-04-09T10:41:25.488318+02:00","chifflot-8","bmc_node_power_watt",494
"2021-04-09T10:41:30.492238+02:00","chifflot-8","bmc_node_power_watt",494
"2021-04-09T10:41:35.491968+02:00","chifflot-8","bmc_node_power_watt",494
"2021-04-09T10:41:40.492845+02:00","chifflot-8","bmc_node_power_watt",494
"2021-04-09T10:41:45.493588+02:00","chifflot-8","bmc_node_power_watt",494
"2021-04-09T10:41:50.493899+02:00","chifflot-8","bmc_node_power_watt",494
"2021-04-09T10:41:55.495158+02:00","chifflot-8","bmc_node_power_watt",494
"2021-04-09T10:42:00.495743+02:00","chifflot-8","bmc_node_power_watt",494
"2021-04-09T10:42:05.49664+02:00","chifflot-8","bmc_node_power_watt",494
"2021-04-09T10:42:10.498079+02:00","chifflot-8","bmc_node_power_watt",494
"2021-04-09T10:42:15.499101+02:00","chifflot-8","bmc_node_power_watt",494
"2021-04-09T10:42:20.500158+02:00","chifflot-8","bmc_node_power_watt",494
"2021-04-09T10:42:25.500751+02:00","chifflot-8","bmc_node_power_watt",494
"2021-04-09T10:42:30.504132+02:00","chifflot-8","bmc_node_power_watt",494
"2021-04-09T10:42:35.504896+02:00","chifflot-8","bmc_node_power_watt",494
"2021-04-09T10:42:40.505159+02:00","chifflot-8","bmc_node_power_watt",494
"2021-04-09T10:42:45.506718+02:00","chifflot-8","bmc_node_power_watt",494
"2021-04-09T10:42:50.506961+02:00","chifflot-8","bmc_node_power_watt",494
"2021-04-09T10:42:55.508943+02:00","chifflot-8","bmc_node_power_watt",494
"2021-04-09T10:43:00.509282+02:00","chifflot-8","bmc_node_power_watt",494
"2021-04-09T10:43:05.509309+02:00","chifflot-8","bmc_node_power_watt",494
"2021-04-09T10:43:10.51017+02:00","chifflot-8","bmc_node_power_watt",494
"2021-04-09T10:43:15.510821+02:00","chifflot-8","bmc_node_power_watt",494
"2021-04-09T10:43:20.511284+02:00","chifflot-8","bmc_node_power_watt",494
"2021-04-09T10:43:25.511904+02:00","chifflot-8","bmc_node_power_watt",494
"2021-04-09T10:43:30.51288+02:00","chifflot-8","bmc_node_power_watt",494
"2021-04-09T10:43:35.515539+02:00","chifflot-8","bmc_node_power_watt",494
"2021-04-09T10:43:40.516298+02:00","chifflot-8","bmc_node_power_watt",494
"2021-04-09T10:43:45.517914+02:00","chifflot-8","bmc_node_power_watt",494
"2021-04-09T10:43:50.518427+02:00","chifflot-8","bmc_node_power_watt",494
"2021-04-09T10:43:55.518568+02:00","chifflot-8","bmc_node_power_watt",494
"2021-04-09T10:44:00.519812+02:00","chifflot-8","bmc_node_power_watt",494
"2021-04-09T10:44:05.521841+02:00","chifflot-8","bmc_node_power_watt",494
"2021-04-09T10:44:10.523021+02:00","chifflot-8","bmc_node_power_watt",494
"2021-04-09T10:44:15.522932+02:00","chifflot-8","bmc_node_power_watt",494
"2021-04-09T10:44:20.524993+02:00","chifflot-8","bmc_node_power_watt",494
"2021-04-09T10:44:25.525917+02:00","chifflot-8","bmc_node_power_watt",494
"2021-04-09T10:44:30.528179+02:00","chifflot-8","bmc_node_power_watt",494
"2021-04-09T10:44:35.52812+02:00","chifflot-8","bmc_node_power_watt",494
"2021-04-09T10:44:40.529546+02:00","chifflot-8","bmc_node_power_watt",494
"2021-04-09T10:44:45.530356+02:00","chifflot-8","bmc_node_power_watt",494
"2021-04-09T10:44:50.531092+02:00","chifflot-8","bmc_node_power_watt",494
"2021-04-09T10:44:55.531347+02:00","chifflot-8","bmc_node_power_watt",494
"2021-04-09T10:45:00.53234+02:00","chifflot-8","bmc_node_power_watt",494
"2021-04-09T10:45:05.533828+02:00","chifflot-8","bmc_node_power_watt",494
"2021-04-09T10:45:10.534703+02:00","chifflot-8","bmc_node_power_watt",494
"2021-04-09T10:45:15.534403+02:00","chifflot-8","bmc_node_power_watt",494
"2021-04-09T10:45:20.536613+02:00","chifflot-8","bmc_node_power_watt",494
"2021-04-09T10:45:25.538992+02:00","chifflot-8","bmc_node_power_watt",494
"2021-04-09T10:45:30.539278+02:00","chifflot-8","bmc_node_power_watt",520
"2021-04-09T10:45:35.540362+02:00","chifflot-8","bmc_node_power_watt",520
"2021-04-09T10:45:40.540308+02:00","chifflot-8","bmc_node_power_watt",520
"2021-04-09T10:45:45.541674+02:00","chifflot-8","bmc_node_power_watt",520
"2021-04-09T10:45:50.541854+02:00","chifflot-8","bmc_node_power_watt",520
"2021-04-09T10:45:55.542927+02:00","chifflot-8","bmc_node_power_watt",494
"2021-04-09T10:46:00.543328+02:00","chifflot-8","bmc_node_power_watt",494
"2021-04-09T10:46:05.543533+02:00","chifflot-8","bmc_node_power_watt",494
"2021-04-09T10:46:10.544027+02:00","chifflot-8","bmc_node_power_watt",494
"2021-04-09T10:46:15.545111+02:00","chifflot-8","bmc_node_power_watt",494
"2021-04-09T10:46:20.545976+02:00","chifflot-8","bmc_node_power_watt",494
"2021-04-09T10:46:25.547651+02:00","chifflot-8","bmc_node_power_watt",494
"2021-04-09T10:46:30.548445+02:00","chifflot-8","bmc_node_power_watt",494
"2021-04-09T10:46:35.549364+02:00","chifflot-8","bmc_node_power_watt",494
"2021-04-09T10:46:40.550818+02:00","chifflot-8","bmc_node_power_watt",494
"2021-04-09T10:46:45.55142+02:00","chifflot-8","bmc_node_power_watt",520
"2021-04-09T10:46:50.552842+02:00","chifflot-8","bmc_node_power_watt",520
"2021-04-09T10:46:55.554504+02:00","chifflot-8","bmc_node_power_watt",520
"2021-04-09T10:47:00.554749+02:00","chifflot-8","bmc_node_power_watt",520
"2021-04-09T10:47:05.556421+02:00","chifflot-8","bmc_node_power_watt",494
"2021-04-09T10:47:10.565637+02:00","chifflot-8","bmc_node_power_watt",494
"2021-04-09T10:47:15.565526+02:00","chifflot-8","bmc_node_power_watt",494
"2021-04-09T10:47:20.565475+02:00","chifflot-8","bmc_node_power_watt",494
"2021-04-09T10:47:25.566395+02:00","chifflot-8","bmc_node_power_watt",494
"2021-04-09T10:47:30.566225+02:00","chifflot-8","bmc_node_power_watt",494
"2021-04-09T10:47:35.567158+02:00","chifflot-8","bmc_node_power_watt",494
"2021-04-09T10:47:40.568248+02:00","chifflot-8","bmc_node_power_watt",494
"2021-04-09T10:47:45.569242+02:00","chifflot-8","bmc_node_power_watt",494
"2021-04-09T10:47:50.56929+02:00","chifflot-8","bmc_node_power_watt",494
"2021-04-09T10:47:55.569701+02:00","chifflot-8","bmc_node_power_watt",520
"2021-04-09T10:48:00.570355+02:00","chifflot-8","bmc_node_power_watt",520
"2021-04-09T10:48:05.571021+02:00","chifflot-8","bmc_node_power_watt",520
"2021-04-09T10:48:10.572817+02:00","chifflot-8","bmc_node_power_watt",520
"2021-04-09T10:48:15.573871+02:00","chifflot-8","bmc_node_power_watt",520
"2021-04-09T10:48:20.573913+02:00","chifflot-8","bmc_node_power_watt",494
"2021-04-09T10:48:25.574804+02:00","chifflot-8","bmc_node_power_watt",494
"2021-04-09T10:48:30.576094+02:00","chifflot-8","bmc_node_power_watt",494
"2021-04-09T10:48:35.576296+02:00","chifflot-8","bmc_node_power_watt",494
"2021-04-09T10:48:40.577031+02:00","chifflot-8","bmc_node_power_watt",494
"2021-04-09T10:48:45.57818+02:00","chifflot-8","bmc_node_power_watt",494
"2021-04-09T10:48:50.579157+02:00","chifflot-8","bmc_node_power_watt",494
"2021-04-09T10:48:55.580153+02:00","chifflot-8","bmc_node_power_watt",494
"2021-04-09T10:49:00.581109+02:00","chifflot-8","bmc_node_power_watt",494
"2021-04-09T10:49:05.583669+02:00","chifflot-8","bmc_node_power_watt",520
"2021-04-09T10:49:10.584205+02:00","chifflot-8","bmc_node_power_watt",520
"2021-04-09T10:49:15.585448+02:00","chifflot-8","bmc_node_power_watt",520
"2021-04-09T10:49:20.586481+02:00","chifflot-8","bmc_node_power_watt",520
"2021-04-09T10:49:25.587633+02:00","chifflot-8","bmc_node_power_watt",520
"2021-04-09T10:49:30.589301+02:00","chifflot-8","bmc_node_power_watt",520
