"2021-03-23T11:21:32.555989+01:00","chifflot-8","bmc_node_power_watt",468
"2021-03-23T11:21:37.557286+01:00","chifflot-8","bmc_node_power_watt",468
"2021-03-23T11:21:42.557603+01:00","chifflot-8","bmc_node_power_watt",468
"2021-03-23T11:21:47.558108+01:00","chifflot-8","bmc_node_power_watt",468
"2021-03-23T11:21:52.558897+01:00","chifflot-8","bmc_node_power_watt",468
"2021-03-23T11:21:57.559534+01:00","chifflot-8","bmc_node_power_watt",468
"2021-03-23T11:22:02.560443+01:00","chifflot-8","bmc_node_power_watt",468
"2021-03-23T11:22:07.561108+01:00","chifflot-8","bmc_node_power_watt",468
"2021-03-23T11:22:12.561215+01:00","chifflot-8","bmc_node_power_watt",468
"2021-03-23T11:22:17.561883+01:00","chifflot-8","bmc_node_power_watt",468
"2021-03-23T11:22:22.562354+01:00","chifflot-8","bmc_node_power_watt",468
"2021-03-23T11:22:27.562879+01:00","chifflot-8","bmc_node_power_watt",468
"2021-03-23T11:22:32.563838+01:00","chifflot-8","bmc_node_power_watt",468
"2021-03-23T11:22:37.56445+01:00","chifflot-8","bmc_node_power_watt",468
"2021-03-23T11:22:42.564848+01:00","chifflot-8","bmc_node_power_watt",468
"2021-03-23T11:22:47.565362+01:00","chifflot-8","bmc_node_power_watt",468
"2021-03-23T11:22:52.566131+01:00","chifflot-8","bmc_node_power_watt",468
"2021-03-23T11:22:57.566258+01:00","chifflot-8","bmc_node_power_watt",468
"2021-03-23T11:23:02.568961+01:00","chifflot-8","bmc_node_power_watt",468
"2021-03-23T11:23:07.56883+01:00","chifflot-8","bmc_node_power_watt",468
"2021-03-23T11:23:12.569311+01:00","chifflot-8","bmc_node_power_watt",468
"2021-03-23T11:23:17.570157+01:00","chifflot-8","bmc_node_power_watt",468
"2021-03-23T11:23:22.570677+01:00","chifflot-8","bmc_node_power_watt",468
"2021-03-23T11:23:27.571777+01:00","chifflot-8","bmc_node_power_watt",468
"2021-03-23T11:23:32.572026+01:00","chifflot-8","bmc_node_power_watt",468
"2021-03-23T11:23:37.574354+01:00","chifflot-8","bmc_node_power_watt",468
"2021-03-23T11:23:42.574575+01:00","chifflot-8","bmc_node_power_watt",468
"2021-03-23T11:23:47.575416+01:00","chifflot-8","bmc_node_power_watt",468
"2021-03-23T11:23:52.576605+01:00","chifflot-8","bmc_node_power_watt",468
"2021-03-23T11:23:57.577398+01:00","chifflot-8","bmc_node_power_watt",468
"2021-03-23T11:24:02.579171+01:00","chifflot-8","bmc_node_power_watt",468
"2021-03-23T11:24:07.579921+01:00","chifflot-8","bmc_node_power_watt",494
"2021-03-23T11:24:12.580531+01:00","chifflot-8","bmc_node_power_watt",494
"2021-03-23T11:24:17.582796+01:00","chifflot-8","bmc_node_power_watt",494
"2021-03-23T11:24:22.582575+01:00","chifflot-8","bmc_node_power_watt",494
"2021-03-23T11:24:27.58487+01:00","chifflot-8","bmc_node_power_watt",494
"2021-03-23T11:24:32.584448+01:00","chifflot-8","bmc_node_power_watt",468
"2021-03-23T11:24:37.587413+01:00","chifflot-8","bmc_node_power_watt",468
"2021-03-23T11:24:42.588178+01:00","chifflot-8","bmc_node_power_watt",468
"2021-03-23T11:24:47.589303+01:00","chifflot-8","bmc_node_power_watt",468
"2021-03-23T11:24:52.590181+01:00","chifflot-8","bmc_node_power_watt",468
"2021-03-23T11:24:57.590817+01:00","chifflot-8","bmc_node_power_watt",468
"2021-03-23T11:25:02.590926+01:00","chifflot-8","bmc_node_power_watt",468
"2021-03-23T11:25:07.593639+01:00","chifflot-8","bmc_node_power_watt",468
"2021-03-23T11:25:12.594994+01:00","chifflot-8","bmc_node_power_watt",468
"2021-03-23T11:25:17.595915+01:00","chifflot-8","bmc_node_power_watt",468
"2021-03-23T11:25:22.598506+01:00","chifflot-8","bmc_node_power_watt",468
"2021-03-23T11:25:27.599093+01:00","chifflot-8","bmc_node_power_watt",468
"2021-03-23T11:25:32.599097+01:00","chifflot-8","bmc_node_power_watt",468
"2021-03-23T11:25:37.599295+01:00","chifflot-8","bmc_node_power_watt",468
"2021-03-23T11:25:42.599729+01:00","chifflot-8","bmc_node_power_watt",468
"2021-03-23T11:25:47.602067+01:00","chifflot-8","bmc_node_power_watt",468
"2021-03-23T11:25:52.602322+01:00","chifflot-8","bmc_node_power_watt",468
"2021-03-23T11:25:57.602994+01:00","chifflot-8","bmc_node_power_watt",468
"2021-03-23T11:26:02.603998+01:00","chifflot-8","bmc_node_power_watt",494
"2021-03-23T11:26:07.605489+01:00","chifflot-8","bmc_node_power_watt",494
"2021-03-23T11:26:12.605804+01:00","chifflot-8","bmc_node_power_watt",494
"2021-03-23T11:26:17.607595+01:00","chifflot-8","bmc_node_power_watt",494
"2021-03-23T11:26:22.60832+01:00","chifflot-8","bmc_node_power_watt",494
"2021-03-23T11:26:27.609545+01:00","chifflot-8","bmc_node_power_watt",494
"2021-03-23T11:26:32.611886+01:00","chifflot-8","bmc_node_power_watt",494
"2021-03-23T11:26:37.613204+01:00","chifflot-8","bmc_node_power_watt",494
"2021-03-23T11:26:42.614487+01:00","chifflot-8","bmc_node_power_watt",494
"2021-03-23T11:26:47.615705+01:00","chifflot-8","bmc_node_power_watt",494
"2021-03-23T11:26:52.61648+01:00","chifflot-8","bmc_node_power_watt",494
"2021-03-23T11:26:57.618252+01:00","chifflot-8","bmc_node_power_watt",494
"2021-03-23T11:27:02.617682+01:00","chifflot-8","bmc_node_power_watt",494
"2021-03-23T11:27:07.618167+01:00","chifflot-8","bmc_node_power_watt",494
"2021-03-23T11:27:12.621531+01:00","chifflot-8","bmc_node_power_watt",494
"2021-03-23T11:27:17.621866+01:00","chifflot-8","bmc_node_power_watt",494
"2021-03-23T11:27:22.621811+01:00","chifflot-8","bmc_node_power_watt",494
"2021-03-23T11:27:27.622166+01:00","chifflot-8","bmc_node_power_watt",494
"2021-03-23T11:27:32.622887+01:00","chifflot-8","bmc_node_power_watt",494
"2021-03-23T11:27:37.623206+01:00","chifflot-8","bmc_node_power_watt",494
"2021-03-23T11:27:42.625295+01:00","chifflot-8","bmc_node_power_watt",494
"2021-03-23T11:27:47.628404+01:00","chifflot-8","bmc_node_power_watt",494
"2021-03-23T11:27:52.628469+01:00","chifflot-8","bmc_node_power_watt",494
"2021-03-23T11:27:57.629546+01:00","chifflot-8","bmc_node_power_watt",494
"2021-03-23T11:28:02.630155+01:00","chifflot-8","bmc_node_power_watt",468
"2021-03-23T11:28:07.630903+01:00","chifflot-8","bmc_node_power_watt",468
"2021-03-23T11:28:12.632599+01:00","chifflot-8","bmc_node_power_watt",468
"2021-03-23T11:28:17.633759+01:00","chifflot-8","bmc_node_power_watt",468
"2021-03-23T11:28:22.634636+01:00","chifflot-8","bmc_node_power_watt",468
"2021-03-23T11:28:27.63449+01:00","chifflot-8","bmc_node_power_watt",468
"2021-03-23T11:28:32.635758+01:00","chifflot-8","bmc_node_power_watt",468
"2021-03-23T11:28:37.636883+01:00","chifflot-8","bmc_node_power_watt",468
"2021-03-23T11:28:42.638609+01:00","chifflot-8","bmc_node_power_watt",468
"2021-03-23T11:28:47.639872+01:00","chifflot-8","bmc_node_power_watt",468
"2021-03-23T11:28:52.644775+01:00","chifflot-8","bmc_node_power_watt",468
"2021-03-23T11:28:57.645674+01:00","chifflot-8","bmc_node_power_watt",468
"2021-03-23T11:29:02.646374+01:00","chifflot-8","bmc_node_power_watt",468
"2021-03-23T11:29:07.647273+01:00","chifflot-8","bmc_node_power_watt",468
"2021-03-23T11:29:12.647946+01:00","chifflot-8","bmc_node_power_watt",468
"2021-03-23T11:29:17.650613+01:00","chifflot-8","bmc_node_power_watt",468
"2021-03-23T11:29:22.651292+01:00","chifflot-8","bmc_node_power_watt",468
"2021-03-23T11:29:27.652322+01:00","chifflot-8","bmc_node_power_watt",468
"2021-03-23T11:29:32.653936+01:00","chifflot-8","bmc_node_power_watt",468
"2021-03-23T11:29:37.654958+01:00","chifflot-8","bmc_node_power_watt",468
"2021-03-23T11:29:42.656402+01:00","chifflot-8","bmc_node_power_watt",468
"2021-03-23T11:29:47.65784+01:00","chifflot-8","bmc_node_power_watt",468
"2021-03-23T11:29:52.663649+01:00","chifflot-8","bmc_node_power_watt",468
"2021-03-23T11:29:57.665076+01:00","chifflot-8","bmc_node_power_watt",468
"2021-03-23T11:30:02.665046+01:00","chifflot-8","bmc_node_power_watt",468
"2021-03-23T11:30:07.665322+01:00","chifflot-8","bmc_node_power_watt",468
"2021-03-23T11:30:12.666159+01:00","chifflot-8","bmc_node_power_watt",468
"2021-03-23T11:30:17.667223+01:00","chifflot-8","bmc_node_power_watt",468
"2021-03-23T11:30:22.667598+01:00","chifflot-8","bmc_node_power_watt",468
"2021-03-23T11:30:27.671168+01:00","chifflot-8","bmc_node_power_watt",468
"2021-03-23T11:30:32.671717+01:00","chifflot-8","bmc_node_power_watt",468
"2021-03-23T11:30:37.671998+01:00","chifflot-8","bmc_node_power_watt",468
"2021-03-23T11:30:42.673185+01:00","chifflot-8","bmc_node_power_watt",468
"2021-03-23T11:30:47.673268+01:00","chifflot-8","bmc_node_power_watt",468
"2021-03-23T11:30:52.674553+01:00","chifflot-8","bmc_node_power_watt",468
"2021-03-23T11:30:57.676273+01:00","chifflot-8","bmc_node_power_watt",468
"2021-03-23T11:31:02.67686+01:00","chifflot-8","bmc_node_power_watt",468
"2021-03-23T11:31:07.679518+01:00","chifflot-8","bmc_node_power_watt",468
"2021-03-23T11:31:12.679935+01:00","chifflot-8","bmc_node_power_watt",468
"2021-03-23T11:31:17.684231+01:00","chifflot-8","bmc_node_power_watt",468
"2021-03-23T11:31:22.68305+01:00","chifflot-8","bmc_node_power_watt",468
"2021-03-23T11:31:27.684445+01:00","chifflot-8","bmc_node_power_watt",468
"2021-03-23T11:31:32.686173+01:00","chifflot-8","bmc_node_power_watt",468
"2021-03-23T11:31:37.686687+01:00","chifflot-8","bmc_node_power_watt",468
"2021-03-23T11:31:42.68693+01:00","chifflot-8","bmc_node_power_watt",468
"2021-03-23T11:31:47.689429+01:00","chifflot-8","bmc_node_power_watt",468
"2021-03-23T11:31:52.690758+01:00","chifflot-8","bmc_node_power_watt",468
"2021-03-23T11:31:57.692484+01:00","chifflot-8","bmc_node_power_watt",468
"2021-03-23T11:32:02.692844+01:00","chifflot-8","bmc_node_power_watt",468
"2021-03-23T11:32:07.692853+01:00","chifflot-8","bmc_node_power_watt",468
"2021-03-23T11:32:12.693305+01:00","chifflot-8","bmc_node_power_watt",468
"2021-03-23T11:32:17.69439+01:00","chifflot-8","bmc_node_power_watt",468
"2021-03-23T11:32:22.696209+01:00","chifflot-8","bmc_node_power_watt",494
"2021-03-23T11:32:27.697873+01:00","chifflot-8","bmc_node_power_watt",494
"2021-03-23T11:32:32.697216+01:00","chifflot-8","bmc_node_power_watt",494
"2021-03-23T11:32:37.700358+01:00","chifflot-8","bmc_node_power_watt",494
"2021-03-23T11:32:42.700465+01:00","chifflot-8","bmc_node_power_watt",494
"2021-03-23T11:32:47.707609+01:00","chifflot-8","bmc_node_power_watt",494
"2021-03-23T11:32:52.705561+01:00","chifflot-8","bmc_node_power_watt",494
"2021-03-23T11:32:57.708458+01:00","chifflot-8","bmc_node_power_watt",494
"2021-03-23T11:33:02.708524+01:00","chifflot-8","bmc_node_power_watt",494
"2021-03-23T11:33:07.708417+01:00","chifflot-8","bmc_node_power_watt",494
"2021-03-23T11:33:12.709219+01:00","chifflot-8","bmc_node_power_watt",494
"2021-03-23T11:33:17.709435+01:00","chifflot-8","bmc_node_power_watt",494
"2021-03-23T11:33:22.710006+01:00","chifflot-8","bmc_node_power_watt",494
"2021-03-23T11:33:27.710923+01:00","chifflot-8","bmc_node_power_watt",494
"2021-03-23T11:33:32.71158+01:00","chifflot-8","bmc_node_power_watt",494
"2021-03-23T11:33:37.711522+01:00","chifflot-8","bmc_node_power_watt",494
"2021-03-23T11:33:42.712557+01:00","chifflot-8","bmc_node_power_watt",494
"2021-03-23T11:33:47.71295+01:00","chifflot-8","bmc_node_power_watt",494
"2021-03-23T11:33:52.7149+01:00","chifflot-8","bmc_node_power_watt",494
"2021-03-23T11:33:57.717175+01:00","chifflot-8","bmc_node_power_watt",494
"2021-03-23T11:34:02.718498+01:00","chifflot-8","bmc_node_power_watt",494
"2021-03-23T11:34:07.718373+01:00","chifflot-8","bmc_node_power_watt",494
"2021-03-23T11:34:12.719811+01:00","chifflot-8","bmc_node_power_watt",494
"2021-03-23T11:34:17.720714+01:00","chifflot-8","bmc_node_power_watt",494
"2021-03-23T11:34:22.720628+01:00","chifflot-8","bmc_node_power_watt",494
"2021-03-23T11:34:27.720799+01:00","chifflot-8","bmc_node_power_watt",494
"2021-03-23T11:34:32.721699+01:00","chifflot-8","bmc_node_power_watt",494
"2021-03-23T11:34:37.72452+01:00","chifflot-8","bmc_node_power_watt",494
"2021-03-23T11:34:42.726691+01:00","chifflot-8","bmc_node_power_watt",494
"2021-03-23T11:34:47.727794+01:00","chifflot-8","bmc_node_power_watt",494
"2021-03-23T11:34:52.728388+01:00","chifflot-8","bmc_node_power_watt",494
"2021-03-23T11:34:57.731153+01:00","chifflot-8","bmc_node_power_watt",494
"2021-03-23T11:35:02.732716+01:00","chifflot-8","bmc_node_power_watt",494
"2021-03-23T11:35:07.734345+01:00","chifflot-8","bmc_node_power_watt",494
"2021-03-23T11:35:12.741758+01:00","chifflot-8","bmc_node_power_watt",468
"2021-03-23T11:35:17.74117+01:00","chifflot-8","bmc_node_power_watt",468
"2021-03-23T11:35:22.742893+01:00","chifflot-8","bmc_node_power_watt",468
"2021-03-23T11:35:27.748328+01:00","chifflot-8","bmc_node_power_watt",468
"2021-03-23T11:35:32.753461+01:00","chifflot-8","bmc_node_power_watt",468
"2021-03-23T11:35:37.754566+01:00","chifflot-8","bmc_node_power_watt",468
"2021-03-23T11:35:42.755826+01:00","chifflot-8","bmc_node_power_watt",468
"2021-03-23T11:35:47.757356+01:00","chifflot-8","bmc_node_power_watt",468
"2021-03-23T11:35:52.759179+01:00","chifflot-8","bmc_node_power_watt",468
"2021-03-23T11:35:57.758161+01:00","chifflot-8","bmc_node_power_watt",494
"2021-03-23T11:36:02.759117+01:00","chifflot-8","bmc_node_power_watt",494
"2021-03-23T11:36:07.759541+01:00","chifflot-8","bmc_node_power_watt",494
"2021-03-23T11:36:12.760457+01:00","chifflot-8","bmc_node_power_watt",494
"2021-03-23T11:36:17.760604+01:00","chifflot-8","bmc_node_power_watt",494
"2021-03-23T11:36:22.761681+01:00","chifflot-8","bmc_node_power_watt",494
"2021-03-23T11:36:27.762505+01:00","chifflot-8","bmc_node_power_watt",494
"2021-03-23T11:36:32.763803+01:00","chifflot-8","bmc_node_power_watt",494
"2021-03-23T11:36:37.764995+01:00","chifflot-8","bmc_node_power_watt",494
"2021-03-23T11:36:42.765444+01:00","chifflot-8","bmc_node_power_watt",494
"2021-03-23T11:36:47.766359+01:00","chifflot-8","bmc_node_power_watt",494
"2021-03-23T11:36:52.767248+01:00","chifflot-8","bmc_node_power_watt",494
"2021-03-23T11:36:57.768069+01:00","chifflot-8","bmc_node_power_watt",494
"2021-03-23T11:37:02.768708+01:00","chifflot-8","bmc_node_power_watt",494
"2021-03-23T11:37:07.769545+01:00","chifflot-8","bmc_node_power_watt",494
"2021-03-23T11:37:12.77019+01:00","chifflot-8","bmc_node_power_watt",494
"2021-03-23T11:37:17.77046+01:00","chifflot-8","bmc_node_power_watt",494
"2021-03-23T11:37:22.770837+01:00","chifflot-8","bmc_node_power_watt",494
"2021-03-23T11:37:27.771038+01:00","chifflot-8","bmc_node_power_watt",494
"2021-03-23T11:37:32.771703+01:00","chifflot-8","bmc_node_power_watt",494
"2021-03-23T11:37:37.772283+01:00","chifflot-8","bmc_node_power_watt",494
"2021-03-23T11:37:42.773165+01:00","chifflot-8","bmc_node_power_watt",494
"2021-03-23T11:37:47.77409+01:00","chifflot-8","bmc_node_power_watt",494
"2021-03-23T11:37:52.777917+01:00","chifflot-8","bmc_node_power_watt",494
"2021-03-23T11:37:57.778034+01:00","chifflot-8","bmc_node_power_watt",468
"2021-03-23T11:38:02.778198+01:00","chifflot-8","bmc_node_power_watt",468
"2021-03-23T11:38:07.778975+01:00","chifflot-8","bmc_node_power_watt",468
"2021-03-23T11:38:12.77988+01:00","chifflot-8","bmc_node_power_watt",468
"2021-03-23T11:38:17.780855+01:00","chifflot-8","bmc_node_power_watt",468
"2021-03-23T11:38:22.781726+01:00","chifflot-8","bmc_node_power_watt",468
"2021-03-23T11:38:27.7823+01:00","chifflot-8","bmc_node_power_watt",468
"2021-03-23T11:38:32.783794+01:00","chifflot-8","bmc_node_power_watt",468
"2021-03-23T11:38:37.783912+01:00","chifflot-8","bmc_node_power_watt",468
"2021-03-23T11:38:42.785057+01:00","chifflot-8","bmc_node_power_watt",468
"2021-03-23T11:38:47.78562+01:00","chifflot-8","bmc_node_power_watt",468
"2021-03-23T11:38:52.787284+01:00","chifflot-8","bmc_node_power_watt",468
"2021-03-23T11:38:57.787825+01:00","chifflot-8","bmc_node_power_watt",468
"2021-03-23T11:39:02.789079+01:00","chifflot-8","bmc_node_power_watt",468
"2021-03-23T11:39:07.789151+01:00","chifflot-8","bmc_node_power_watt",468
"2021-03-23T11:39:12.790247+01:00","chifflot-8","bmc_node_power_watt",468
"2021-03-23T11:39:17.791439+01:00","chifflot-8","bmc_node_power_watt",468
"2021-03-23T11:39:22.792342+01:00","chifflot-8","bmc_node_power_watt",468
"2021-03-23T11:39:27.793504+01:00","chifflot-8","bmc_node_power_watt",468
"2021-03-23T11:39:32.79407+01:00","chifflot-8","bmc_node_power_watt",494
"2021-03-23T11:39:37.79488+01:00","chifflot-8","bmc_node_power_watt",494
"2021-03-23T11:39:42.795818+01:00","chifflot-8","bmc_node_power_watt",494
"2021-03-23T11:39:47.797944+01:00","chifflot-8","bmc_node_power_watt",494
"2021-03-23T11:39:52.798089+01:00","chifflot-8","bmc_node_power_watt",494
"2021-03-23T11:39:57.798952+01:00","chifflot-8","bmc_node_power_watt",468
"2021-03-23T11:40:02.799962+01:00","chifflot-8","bmc_node_power_watt",468
"2021-03-23T11:40:07.799999+01:00","chifflot-8","bmc_node_power_watt",468
"2021-03-23T11:40:12.801143+01:00","chifflot-8","bmc_node_power_watt",468
"2021-03-23T11:40:17.802414+01:00","chifflot-8","bmc_node_power_watt",468
"2021-03-23T11:40:22.804152+01:00","chifflot-8","bmc_node_power_watt",468
"2021-03-23T11:40:27.804365+01:00","chifflot-8","bmc_node_power_watt",468
"2021-03-23T11:40:32.805311+01:00","chifflot-8","bmc_node_power_watt",468
"2021-03-23T11:40:37.806122+01:00","chifflot-8","bmc_node_power_watt",468
"2021-03-23T11:40:42.807221+01:00","chifflot-8","bmc_node_power_watt",468
"2021-03-23T11:40:47.807834+01:00","chifflot-8","bmc_node_power_watt",468
"2021-03-23T11:40:52.808273+01:00","chifflot-8","bmc_node_power_watt",468
"2021-03-23T11:40:57.809502+01:00","chifflot-8","bmc_node_power_watt",468
"2021-03-23T11:41:02.809899+01:00","chifflot-8","bmc_node_power_watt",468
"2021-03-23T11:41:07.811927+01:00","chifflot-8","bmc_node_power_watt",468
"2021-03-23T11:41:12.812023+01:00","chifflot-8","bmc_node_power_watt",468
"2021-03-23T11:41:17.811808+01:00","chifflot-8","bmc_node_power_watt",468
"2021-03-23T11:41:22.813795+01:00","chifflot-8","bmc_node_power_watt",468
"2021-03-23T11:41:27.816018+01:00","chifflot-8","bmc_node_power_watt",494
"2021-03-23T11:41:32.817037+01:00","chifflot-8","bmc_node_power_watt",494
"2021-03-23T11:41:37.817212+01:00","chifflot-8","bmc_node_power_watt",494
"2021-03-23T11:41:42.817734+01:00","chifflot-8","bmc_node_power_watt",494
"2021-03-23T11:41:47.818871+01:00","chifflot-8","bmc_node_power_watt",494
"2021-03-23T11:41:52.822132+01:00","chifflot-8","bmc_node_power_watt",494
"2021-03-23T11:41:57.821769+01:00","chifflot-8","bmc_node_power_watt",494
"2021-03-23T11:42:02.82235+01:00","chifflot-8","bmc_node_power_watt",494
"2021-03-23T11:42:07.823474+01:00","chifflot-8","bmc_node_power_watt",494
"2021-03-23T11:42:12.823554+01:00","chifflot-8","bmc_node_power_watt",494
"2021-03-23T11:42:17.82461+01:00","chifflot-8","bmc_node_power_watt",494
"2021-03-23T11:42:22.826351+01:00","chifflot-8","bmc_node_power_watt",494
"2021-03-23T11:42:27.827123+01:00","chifflot-8","bmc_node_power_watt",494
"2021-03-23T11:42:32.828318+01:00","chifflot-8","bmc_node_power_watt",494
"2021-03-23T11:42:37.829305+01:00","chifflot-8","bmc_node_power_watt",494
"2021-03-23T11:42:42.830597+01:00","chifflot-8","bmc_node_power_watt",494
"2021-03-23T11:42:47.8314+01:00","chifflot-8","bmc_node_power_watt",494
"2021-03-23T11:42:52.832553+01:00","chifflot-8","bmc_node_power_watt",494
"2021-03-23T11:42:57.833306+01:00","chifflot-8","bmc_node_power_watt",494
"2021-03-23T11:43:02.833767+01:00","chifflot-8","bmc_node_power_watt",494
"2021-03-23T11:43:07.835021+01:00","chifflot-8","bmc_node_power_watt",494
"2021-03-23T11:43:12.836101+01:00","chifflot-8","bmc_node_power_watt",494
"2021-03-23T11:43:17.83725+01:00","chifflot-8","bmc_node_power_watt",494
"2021-03-23T11:43:22.837583+01:00","chifflot-8","bmc_node_power_watt",494
"2021-03-23T11:43:27.840132+01:00","chifflot-8","bmc_node_power_watt",468
"2021-03-23T11:43:32.841609+01:00","chifflot-8","bmc_node_power_watt",468
"2021-03-23T11:43:37.841529+01:00","chifflot-8","bmc_node_power_watt",468
"2021-03-23T11:43:42.842608+01:00","chifflot-8","bmc_node_power_watt",468
"2021-03-23T11:43:47.846636+01:00","chifflot-8","bmc_node_power_watt",468
"2021-03-23T11:43:52.847013+01:00","chifflot-8","bmc_node_power_watt",494
"2021-03-23T11:43:57.848312+01:00","chifflot-8","bmc_node_power_watt",494
"2021-03-23T11:44:02.848475+01:00","chifflot-8","bmc_node_power_watt",494
"2021-03-23T11:44:07.84915+01:00","chifflot-8","bmc_node_power_watt",494
"2021-03-23T11:44:12.849841+01:00","chifflot-8","bmc_node_power_watt",494
"2021-03-23T11:44:17.850521+01:00","chifflot-8","bmc_node_power_watt",468
"2021-03-23T11:44:22.851677+01:00","chifflot-8","bmc_node_power_watt",468
"2021-03-23T11:44:27.85382+01:00","chifflot-8","bmc_node_power_watt",468
