172.16.36.7  : 20.96 13.88 13.86 13.89 13.89 13.89 13.90 13.88 13.88 13.86
172.16.66.51 : 0.23 0.20 0.18 0.18 0.19 0.17 0.19 0.18 0.17 0.21
172.16.66.53 : 0.23 0.21 0.22 0.20 0.22 0.22 0.20 0.21 0.21 0.18
172.16.66.54 : 0.22 0.22 0.20 0.21 0.21 0.20 0.22 0.21 0.20 0.19
172.16.66.55 : 0.22 0.20 0.21 0.20 0.21 0.21 0.20 0.20 0.22 0.20
172.16.66.56 : 0.23 0.21 0.20 0.21 0.21 0.21 0.22 0.21 0.21 0.20
172.16.66.57 : 0.22 0.22 0.20 0.21 0.22 0.20 0.20 0.21 0.20 0.12
172.16.66.58 : 0.22 0.20 0.21 0.20 0.20 0.19 0.21 0.16 0.16 0.13
172.16.66.59 : 0.23 0.21 0.20 0.20 0.22 0.20 0.21 0.22 0.20 0.21
172.16.66.6  : 0.19 0.22 0.21 0.21 0.22 0.21 0.20 0.22 0.21 0.19
172.16.66.60 : 0.23 0.22 0.18 0.20 0.21 0.20 0.21 0.20 0.21 0.20
172.16.66.61 : 0.22 0.20 0.21 0.22 0.21 0.22 0.20 0.07 0.21 0.17
172.16.66.62 : 0.20 0.21 0.21 0.21 0.20 0.20 0.20 0.21 0.18 0.18
172.16.66.63 : 0.21 0.20 0.20 0.21 0.20 0.21 0.17 0.19 0.20 0.19
172.16.66.64 : 0.22 0.20 0.21 0.18 0.20 0.21 0.21 0.16 0.16 0.12
172.16.66.65 : 0.22 0.20 0.18 0.18 0.20 0.22 0.19 0.20 0.19 0.18
172.16.66.66 : 0.23 0.21 0.20 0.19 0.21 0.19 0.19 0.18 0.20 0.17
172.16.66.67 : 0.26 0.22 0.20 0.22 0.21 0.16 0.21 0.19 0.21 0.21
172.16.66.68 : 0.22 0.22 0.20 0.20 0.21 0.18 0.18 0.22 0.20 0.18
172.16.66.69 : 0.19 0.18 0.21 0.20 0.21 0.21 0.21 0.20 0.21 0.19
172.16.66.7  : 0.22 0.20 0.17 0.19 0.18 0.19 0.18 0.18 0.19 0.20
172.16.66.70 : 0.22 0.23 0.21 0.20 0.20 0.20 0.19 0.21 0.19 0.21
172.16.66.71 : 0.24 0.22 0.21 0.21 0.22 0.21 0.21 0.21 0.20 0.21
172.16.66.72 : 0.17 0.16 0.16 0.11 0.16 0.17 0.16 0.17 0.21 0.20
172.16.66.73 : 0.23 0.20 0.22 0.20 0.20 0.22 0.20 0.20 0.22 0.18
172.16.66.74 : 0.23 0.14 0.21 0.20 0.21 0.21 0.21 0.22 0.21 0.19
172.16.66.75 : 0.20 0.19 0.18 0.14 0.19 0.17 0.18 0.18 0.19 0.17
172.16.66.76 : 0.20 0.18 0.19 0.18 0.18 0.19 0.20 0.20 0.21 0.19
172.16.66.77 : 0.20 0.22 0.19 0.21 0.21 0.21 0.21 0.21 0.20 0.21
172.16.66.78 : 0.19 0.18 0.18 0.19 0.18 0.18 0.17 0.17 0.19 0.16
172.16.66.79 : 0.19 0.21 0.21 0.20 0.21 0.21 0.21 0.20 0.21 0.11
172.16.66.8  : 0.22 0.21 0.20 0.20 0.22 0.21 0.20 0.16 0.17 0.17
172.16.66.80 : 0.22 0.18 0.18 0.22 0.21 0.18 0.21 0.20 0.21 0.20
172.16.66.81 : 0.04 0.03 0.03 0.03 0.03 0.03 0.03 0.03 0.03 0.03
172.16.66.82 : 0.20 0.20 0.20 0.22 0.20 0.20 0.20 0.20 0.22 0.21
172.16.66.83 : 0.24 0.16 0.21 0.21 0.21 0.21 0.18 0.19 0.21 0.20
172.16.66.84 : 0.24 0.19 0.20 0.21 0.22 0.21 0.21 0.22 0.21 0.21
172.16.66.85 : 0.25 0.21 0.20 0.19 0.20 0.20 0.21 0.19 0.20 0.21
172.16.66.86 : 0.18 0.16 0.11 0.14 0.15 0.16 0.15 0.20 0.20 0.21
172.16.66.87 : 0.24 0.20 0.20 0.21 0.20 0.20 0.21 0.20 0.20 0.21
172.16.66.88 : 0.25 0.21 0.21 0.22 0.21 0.20 0.21 0.21 0.21 0.22
172.16.66.9  : 0.23 0.20 0.21 0.21 0.20 0.20 0.20 0.21 0.21 0.21

      42 targets
      42 alive
       0 unreachable
       0 unknown addresses

       0 timeouts (waiting for response)
     420 ICMP Echos sent
     420 ICMP Echo Replies received
       0 other ICMP received

 0.03 ms (min round trip time)
 0.53 ms (avg round trip time)
 20.9 ms (max round trip time)
        9.422 sec (elapsed real time)

