"2021-04-05T23:45:50.39229+02:00","chifflot-7","bmc_node_power_watt",468
"2021-04-05T23:45:55.393126+02:00","chifflot-7","bmc_node_power_watt",468
"2021-04-05T23:46:00.395617+02:00","chifflot-7","bmc_node_power_watt",468
"2021-04-05T23:46:05.39692+02:00","chifflot-7","bmc_node_power_watt",468
"2021-04-05T23:46:10.398159+02:00","chifflot-7","bmc_node_power_watt",468
"2021-04-05T23:46:15.398896+02:00","chifflot-7","bmc_node_power_watt",468
"2021-04-05T23:46:20.400445+02:00","chifflot-7","bmc_node_power_watt",468
"2021-04-05T23:46:25.401265+02:00","chifflot-7","bmc_node_power_watt",468
"2021-04-05T23:46:30.402282+02:00","chifflot-7","bmc_node_power_watt",468
"2021-04-05T23:46:35.40393+02:00","chifflot-7","bmc_node_power_watt",468
"2021-04-05T23:46:40.404862+02:00","chifflot-7","bmc_node_power_watt",468
"2021-04-05T23:46:45.406319+02:00","chifflot-7","bmc_node_power_watt",468
"2021-04-05T23:46:50.407544+02:00","chifflot-7","bmc_node_power_watt",468
"2021-04-05T23:46:55.408386+02:00","chifflot-7","bmc_node_power_watt",494
"2021-04-05T23:47:00.409466+02:00","chifflot-7","bmc_node_power_watt",494
"2021-04-05T23:47:05.410014+02:00","chifflot-7","bmc_node_power_watt",494
"2021-04-05T23:47:10.411476+02:00","chifflot-7","bmc_node_power_watt",494
"2021-04-05T23:47:15.412009+02:00","chifflot-7","bmc_node_power_watt",494
"2021-04-05T23:47:20.413401+02:00","chifflot-7","bmc_node_power_watt",468
"2021-04-05T23:47:25.413985+02:00","chifflot-7","bmc_node_power_watt",468
"2021-04-05T23:47:30.414167+02:00","chifflot-7","bmc_node_power_watt",468
"2021-04-05T23:47:35.415001+02:00","chifflot-7","bmc_node_power_watt",468
"2021-04-05T23:47:40.416178+02:00","chifflot-7","bmc_node_power_watt",468
"2021-04-05T23:47:45.416748+02:00","chifflot-7","bmc_node_power_watt",468
"2021-04-05T23:47:50.419175+02:00","chifflot-7","bmc_node_power_watt",468
"2021-04-05T23:47:55.419982+02:00","chifflot-7","bmc_node_power_watt",468
"2021-04-05T23:48:00.421164+02:00","chifflot-7","bmc_node_power_watt",468
"2021-04-05T23:48:05.42238+02:00","chifflot-7","bmc_node_power_watt",468
"2021-04-05T23:48:10.423805+02:00","chifflot-7","bmc_node_power_watt",468
"2021-04-05T23:48:15.424785+02:00","chifflot-7","bmc_node_power_watt",468
"2021-04-05T23:48:20.425889+02:00","chifflot-7","bmc_node_power_watt",468
"2021-04-05T23:48:25.426812+02:00","chifflot-7","bmc_node_power_watt",468
"2021-04-05T23:48:30.427441+02:00","chifflot-7","bmc_node_power_watt",468
"2021-04-05T23:48:35.428362+02:00","chifflot-7","bmc_node_power_watt",468
"2021-04-05T23:48:40.428492+02:00","chifflot-7","bmc_node_power_watt",468
"2021-04-05T23:48:45.429672+02:00","chifflot-7","bmc_node_power_watt",468
"2021-04-05T23:48:50.430458+02:00","chifflot-7","bmc_node_power_watt",468
"2021-04-05T23:48:55.430835+02:00","chifflot-7","bmc_node_power_watt",468
"2021-04-05T23:49:00.432325+02:00","chifflot-7","bmc_node_power_watt",468
"2021-04-05T23:49:05.433006+02:00","chifflot-7","bmc_node_power_watt",468
"2021-04-05T23:49:10.433576+02:00","chifflot-7","bmc_node_power_watt",468
"2021-04-05T23:49:15.435972+02:00","chifflot-7","bmc_node_power_watt",468
"2021-04-05T23:49:20.436665+02:00","chifflot-7","bmc_node_power_watt",468
"2021-04-05T23:49:25.437879+02:00","chifflot-7","bmc_node_power_watt",468
"2021-04-05T23:49:30.439024+02:00","chifflot-7","bmc_node_power_watt",468
"2021-04-05T23:49:35.440308+02:00","chifflot-7","bmc_node_power_watt",468
"2021-04-05T23:49:40.441999+02:00","chifflot-7","bmc_node_power_watt",468
"2021-04-05T23:49:45.443107+02:00","chifflot-7","bmc_node_power_watt",468
"2021-04-05T23:49:50.445504+02:00","chifflot-7","bmc_node_power_watt",468
"2021-04-05T23:49:55.446268+02:00","chifflot-7","bmc_node_power_watt",468
"2021-04-05T23:50:00.449633+02:00","chifflot-7","bmc_node_power_watt",468
"2021-04-05T23:50:05.449661+02:00","chifflot-7","bmc_node_power_watt",468
"2021-04-05T23:50:10.450302+02:00","chifflot-7","bmc_node_power_watt",468
"2021-04-05T23:50:15.452919+02:00","chifflot-7","bmc_node_power_watt",468
"2021-04-05T23:50:20.45469+02:00","chifflot-7","bmc_node_power_watt",468
"2021-04-05T23:50:25.455935+02:00","chifflot-7","bmc_node_power_watt",468
"2021-04-05T23:50:30.457023+02:00","chifflot-7","bmc_node_power_watt",468
"2021-04-05T23:50:35.458025+02:00","chifflot-7","bmc_node_power_watt",468
"2021-04-05T23:50:40.459431+02:00","chifflot-7","bmc_node_power_watt",468
"2021-04-05T23:50:45.460106+02:00","chifflot-7","bmc_node_power_watt",468
"2021-04-05T23:50:50.461343+02:00","chifflot-7","bmc_node_power_watt",468
"2021-04-05T23:50:55.46249+02:00","chifflot-7","bmc_node_power_watt",468
"2021-04-05T23:51:00.46357+02:00","chifflot-7","bmc_node_power_watt",468
"2021-04-05T23:51:05.465166+02:00","chifflot-7","bmc_node_power_watt",468
"2021-04-05T23:51:10.466673+02:00","chifflot-7","bmc_node_power_watt",468
"2021-04-05T23:51:15.468786+02:00","chifflot-7","bmc_node_power_watt",468
"2021-04-05T23:51:20.469884+02:00","chifflot-7","bmc_node_power_watt",494
"2021-04-05T23:51:25.470835+02:00","chifflot-7","bmc_node_power_watt",494
"2021-04-05T23:51:30.472659+02:00","chifflot-7","bmc_node_power_watt",494
"2021-04-05T23:51:35.473619+02:00","chifflot-7","bmc_node_power_watt",494
"2021-04-05T23:51:40.474201+02:00","chifflot-7","bmc_node_power_watt",468
"2021-04-05T23:51:45.475702+02:00","chifflot-7","bmc_node_power_watt",468
"2021-04-05T23:51:50.478022+02:00","chifflot-7","bmc_node_power_watt",468
"2021-04-05T23:51:55.47926+02:00","chifflot-7","bmc_node_power_watt",468
"2021-04-05T23:52:00.480273+02:00","chifflot-7","bmc_node_power_watt",468
"2021-04-05T23:52:05.481853+02:00","chifflot-7","bmc_node_power_watt",494
"2021-04-05T23:52:10.48298+02:00","chifflot-7","bmc_node_power_watt",494
"2021-04-05T23:52:15.484275+02:00","chifflot-7","bmc_node_power_watt",494
"2021-04-05T23:52:20.486574+02:00","chifflot-7","bmc_node_power_watt",494
"2021-04-05T23:52:25.487766+02:00","chifflot-7","bmc_node_power_watt",494
"2021-04-05T23:52:30.490607+02:00","chifflot-7","bmc_node_power_watt",494
"2021-04-05T23:52:35.49316+02:00","chifflot-7","bmc_node_power_watt",494
"2021-04-05T23:52:40.494674+02:00","chifflot-7","bmc_node_power_watt",494
"2021-04-05T23:52:45.495765+02:00","chifflot-7","bmc_node_power_watt",494
"2021-04-05T23:52:50.497176+02:00","chifflot-7","bmc_node_power_watt",494
"2021-04-05T23:52:55.498559+02:00","chifflot-7","bmc_node_power_watt",468
"2021-04-05T23:53:00.500219+02:00","chifflot-7","bmc_node_power_watt",468
"2021-04-05T23:53:05.502177+02:00","chifflot-7","bmc_node_power_watt",468
"2021-04-05T23:53:10.503193+02:00","chifflot-7","bmc_node_power_watt",468
"2021-04-05T23:53:15.505489+02:00","chifflot-7","bmc_node_power_watt",494
"2021-04-05T23:53:20.507135+02:00","chifflot-7","bmc_node_power_watt",494
"2021-04-05T23:53:25.508507+02:00","chifflot-7","bmc_node_power_watt",494
"2021-04-05T23:53:30.509685+02:00","chifflot-7","bmc_node_power_watt",494
"2021-04-05T23:53:35.511176+02:00","chifflot-7","bmc_node_power_watt",494
"2021-04-05T23:53:40.51233+02:00","chifflot-7","bmc_node_power_watt",494
"2021-04-05T23:53:45.513825+02:00","chifflot-7","bmc_node_power_watt",494
"2021-04-05T23:53:50.515113+02:00","chifflot-7","bmc_node_power_watt",494
"2021-04-05T23:53:55.516338+02:00","chifflot-7","bmc_node_power_watt",494
"2021-04-05T23:54:00.517433+02:00","chifflot-7","bmc_node_power_watt",494
"2021-04-05T23:54:05.519377+02:00","chifflot-7","bmc_node_power_watt",468
"2021-04-05T23:54:10.520568+02:00","chifflot-7","bmc_node_power_watt",468
"2021-04-05T23:54:15.521956+02:00","chifflot-7","bmc_node_power_watt",468
"2021-04-05T23:54:20.523581+02:00","chifflot-7","bmc_node_power_watt",468
"2021-04-05T23:54:25.525006+02:00","chifflot-7","bmc_node_power_watt",468
"2021-04-05T23:54:30.526809+02:00","chifflot-7","bmc_node_power_watt",468
"2021-04-05T23:54:35.527888+02:00","chifflot-7","bmc_node_power_watt",468
"2021-04-05T23:54:40.529228+02:00","chifflot-7","bmc_node_power_watt",468
"2021-04-05T23:54:45.530699+02:00","chifflot-7","bmc_node_power_watt",468
"2021-04-05T23:54:50.532779+02:00","chifflot-7","bmc_node_power_watt",468
"2021-04-05T23:54:55.533864+02:00","chifflot-7","bmc_node_power_watt",468
"2021-04-05T23:55:00.534292+02:00","chifflot-7","bmc_node_power_watt",468
"2021-04-05T23:55:05.536278+02:00","chifflot-7","bmc_node_power_watt",468
"2021-04-05T23:55:10.537599+02:00","chifflot-7","bmc_node_power_watt",468
"2021-04-05T23:55:15.539133+02:00","chifflot-7","bmc_node_power_watt",494
"2021-04-05T23:55:20.539847+02:00","chifflot-7","bmc_node_power_watt",494
"2021-04-05T23:55:25.541478+02:00","chifflot-7","bmc_node_power_watt",494
"2021-04-05T23:55:30.542163+02:00","chifflot-7","bmc_node_power_watt",494
"2021-04-05T23:55:35.542495+02:00","chifflot-7","bmc_node_power_watt",494
"2021-04-05T23:55:40.543965+02:00","chifflot-7","bmc_node_power_watt",494
"2021-04-05T23:55:45.545207+02:00","chifflot-7","bmc_node_power_watt",494
"2021-04-05T23:55:50.546695+02:00","chifflot-7","bmc_node_power_watt",494
"2021-04-05T23:55:55.547313+02:00","chifflot-7","bmc_node_power_watt",494
"2021-04-05T23:56:00.548264+02:00","chifflot-7","bmc_node_power_watt",494
"2021-04-05T23:56:05.549089+02:00","chifflot-7","bmc_node_power_watt",494
"2021-04-05T23:56:10.550801+02:00","chifflot-7","bmc_node_power_watt",494
"2021-04-05T23:56:15.55206+02:00","chifflot-7","bmc_node_power_watt",494
"2021-04-05T23:56:20.554523+02:00","chifflot-7","bmc_node_power_watt",494
"2021-04-05T23:56:25.555724+02:00","chifflot-7","bmc_node_power_watt",494
"2021-04-05T23:56:30.558303+02:00","chifflot-7","bmc_node_power_watt",494
"2021-04-05T23:56:35.559561+02:00","chifflot-7","bmc_node_power_watt",494
"2021-04-05T23:56:40.560529+02:00","chifflot-7","bmc_node_power_watt",494
"2021-04-05T23:56:45.561461+02:00","chifflot-7","bmc_node_power_watt",494
"2021-04-05T23:56:50.563565+02:00","chifflot-7","bmc_node_power_watt",494
"2021-04-05T23:56:55.564454+02:00","chifflot-7","bmc_node_power_watt",494
"2021-04-05T23:57:00.565773+02:00","chifflot-7","bmc_node_power_watt",494
"2021-04-05T23:57:05.566666+02:00","chifflot-7","bmc_node_power_watt",494
"2021-04-05T23:57:10.5685+02:00","chifflot-7","bmc_node_power_watt",494
"2021-04-05T23:57:15.569868+02:00","chifflot-7","bmc_node_power_watt",468
"2021-04-05T23:57:20.570903+02:00","chifflot-7","bmc_node_power_watt",468
"2021-04-05T23:57:25.573327+02:00","chifflot-7","bmc_node_power_watt",468
"2021-04-05T23:57:30.57441+02:00","chifflot-7","bmc_node_power_watt",468
"2021-04-05T23:57:35.575542+02:00","chifflot-7","bmc_node_power_watt",494
"2021-04-05T23:57:40.576343+02:00","chifflot-7","bmc_node_power_watt",494
"2021-04-05T23:57:45.577919+02:00","chifflot-7","bmc_node_power_watt",494
"2021-04-05T23:57:50.579447+02:00","chifflot-7","bmc_node_power_watt",494
"2021-04-05T23:57:55.580741+02:00","chifflot-7","bmc_node_power_watt",494
"2021-04-05T23:58:00.582197+02:00","chifflot-7","bmc_node_power_watt",494
"2021-04-05T23:58:05.582376+02:00","chifflot-7","bmc_node_power_watt",494
"2021-04-05T23:58:10.583359+02:00","chifflot-7","bmc_node_power_watt",494
"2021-04-05T23:58:15.584207+02:00","chifflot-7","bmc_node_power_watt",494
"2021-04-05T23:58:20.586129+02:00","chifflot-7","bmc_node_power_watt",494
"2021-04-05T23:58:25.587573+02:00","chifflot-7","bmc_node_power_watt",494
"2021-04-05T23:58:30.589293+02:00","chifflot-7","bmc_node_power_watt",494
"2021-04-05T23:58:35.590004+02:00","chifflot-7","bmc_node_power_watt",494
"2021-04-05T23:58:40.591556+02:00","chifflot-7","bmc_node_power_watt",494
"2021-04-05T23:58:45.592689+02:00","chifflot-7","bmc_node_power_watt",494
"2021-04-05T23:58:50.593569+02:00","chifflot-7","bmc_node_power_watt",494
"2021-04-05T23:58:55.595184+02:00","chifflot-7","bmc_node_power_watt",494
"2021-04-05T23:59:00.596648+02:00","chifflot-7","bmc_node_power_watt",494
"2021-04-05T23:59:05.59764+02:00","chifflot-7","bmc_node_power_watt",494
"2021-04-05T23:59:10.598757+02:00","chifflot-7","bmc_node_power_watt",494
"2021-04-05T23:59:15.600728+02:00","chifflot-7","bmc_node_power_watt",494
"2021-04-05T23:59:20.601731+02:00","chifflot-7","bmc_node_power_watt",494
"2021-04-05T23:59:25.602887+02:00","chifflot-7","bmc_node_power_watt",494
"2021-04-05T23:59:30.603809+02:00","chifflot-7","bmc_node_power_watt",494
"2021-04-05T23:59:35.604483+02:00","chifflot-7","bmc_node_power_watt",494
"2021-04-05T23:59:40.605757+02:00","chifflot-7","bmc_node_power_watt",494
"2021-04-05T23:59:45.606871+02:00","chifflot-7","bmc_node_power_watt",494
"2021-04-05T23:59:50.607392+02:00","chifflot-7","bmc_node_power_watt",494
"2021-04-05T23:59:55.608448+02:00","chifflot-7","bmc_node_power_watt",494
"2021-04-06T00:00:00.609214+02:00","chifflot-7","bmc_node_power_watt",494
"2021-04-06T00:00:05.610379+02:00","chifflot-7","bmc_node_power_watt",494
"2021-04-06T00:00:10.611603+02:00","chifflot-7","bmc_node_power_watt",494
"2021-04-06T00:00:15.612746+02:00","chifflot-7","bmc_node_power_watt",494
"2021-04-06T00:00:20.614145+02:00","chifflot-7","bmc_node_power_watt",494
"2021-04-06T00:00:25.615697+02:00","chifflot-7","bmc_node_power_watt",494
"2021-04-06T00:00:30.616723+02:00","chifflot-7","bmc_node_power_watt",494
"2021-04-06T00:00:35.617843+02:00","chifflot-7","bmc_node_power_watt",494
"2021-04-06T00:00:40.619168+02:00","chifflot-7","bmc_node_power_watt",494
"2021-04-06T00:00:45.620964+02:00","chifflot-7","bmc_node_power_watt",494
"2021-04-06T00:00:50.622025+02:00","chifflot-7","bmc_node_power_watt",494
"2021-04-06T00:00:55.622414+02:00","chifflot-7","bmc_node_power_watt",494
"2021-04-06T00:01:00.623175+02:00","chifflot-7","bmc_node_power_watt",494
"2021-04-06T00:01:05.624379+02:00","chifflot-7","bmc_node_power_watt",494
"2021-04-06T00:01:10.624985+02:00","chifflot-7","bmc_node_power_watt",494
"2021-04-06T00:01:15.625052+02:00","chifflot-7","bmc_node_power_watt",494
"2021-04-06T00:01:20.625956+02:00","chifflot-7","bmc_node_power_watt",494
"2021-04-06T00:01:25.62699+02:00","chifflot-7","bmc_node_power_watt",494
"2021-04-06T00:01:30.627417+02:00","chifflot-7","bmc_node_power_watt",494
"2021-04-06T00:01:35.628413+02:00","chifflot-7","bmc_node_power_watt",468
"2021-04-06T00:01:40.629742+02:00","chifflot-7","bmc_node_power_watt",468
"2021-04-06T00:01:45.630362+02:00","chifflot-7","bmc_node_power_watt",468
"2021-04-06T00:01:50.630851+02:00","chifflot-7","bmc_node_power_watt",468
"2021-04-06T00:01:55.631753+02:00","chifflot-7","bmc_node_power_watt",468
"2021-04-06T00:02:00.632702+02:00","chifflot-7","bmc_node_power_watt",494
"2021-04-06T00:02:05.633281+02:00","chifflot-7","bmc_node_power_watt",494
"2021-04-06T00:02:10.635385+02:00","chifflot-7","bmc_node_power_watt",494
"2021-04-06T00:02:15.635596+02:00","chifflot-7","bmc_node_power_watt",494
"2021-04-06T00:02:20.636916+02:00","chifflot-7","bmc_node_power_watt",494
"2021-04-06T00:02:25.638053+02:00","chifflot-7","bmc_node_power_watt",468
"2021-04-06T00:02:30.638428+02:00","chifflot-7","bmc_node_power_watt",468
"2021-04-06T00:02:35.638781+02:00","chifflot-7","bmc_node_power_watt",468
"2021-04-06T00:02:40.639648+02:00","chifflot-7","bmc_node_power_watt",468
"2021-04-06T00:02:45.640282+02:00","chifflot-7","bmc_node_power_watt",468
"2021-04-06T00:02:50.641717+02:00","chifflot-7","bmc_node_power_watt",468
"2021-04-06T00:02:55.644066+02:00","chifflot-7","bmc_node_power_watt",468
"2021-04-06T00:03:00.645157+02:00","chifflot-7","bmc_node_power_watt",468
"2021-04-06T00:03:05.645573+02:00","chifflot-7","bmc_node_power_watt",468
"2021-04-06T00:03:10.646027+02:00","chifflot-7","bmc_node_power_watt",468
"2021-04-06T00:03:15.647055+02:00","chifflot-7","bmc_node_power_watt",468
"2021-04-06T00:03:20.647375+02:00","chifflot-7","bmc_node_power_watt",468
"2021-04-06T00:03:25.649437+02:00","chifflot-7","bmc_node_power_watt",468
"2021-04-06T00:03:30.650152+02:00","chifflot-7","bmc_node_power_watt",468
"2021-04-06T00:03:35.651258+02:00","chifflot-7","bmc_node_power_watt",494
"2021-04-06T00:03:40.652365+02:00","chifflot-7","bmc_node_power_watt",494
"2021-04-06T00:03:45.653337+02:00","chifflot-7","bmc_node_power_watt",494
"2021-04-06T00:03:50.653927+02:00","chifflot-7","bmc_node_power_watt",494
"2021-04-06T00:03:55.65422+02:00","chifflot-7","bmc_node_power_watt",494
"2021-04-06T00:04:00.655512+02:00","chifflot-7","bmc_node_power_watt",468
"2021-04-06T00:04:05.656088+02:00","chifflot-7","bmc_node_power_watt",468
"2021-04-06T00:04:10.6567+02:00","chifflot-7","bmc_node_power_watt",468
"2021-04-06T00:04:15.658495+02:00","chifflot-7","bmc_node_power_watt",468
"2021-04-06T00:04:20.659076+02:00","chifflot-7","bmc_node_power_watt",468
"2021-04-06T00:04:25.66007+02:00","chifflot-7","bmc_node_power_watt",468
"2021-04-06T00:04:30.661316+02:00","chifflot-7","bmc_node_power_watt",468
"2021-04-06T00:04:35.663263+02:00","chifflot-7","bmc_node_power_watt",468
"2021-04-06T00:04:40.664463+02:00","chifflot-7","bmc_node_power_watt",468
"2021-04-06T00:04:45.665291+02:00","chifflot-7","bmc_node_power_watt",468
"2021-04-06T00:04:50.666169+02:00","chifflot-7","bmc_node_power_watt",468
"2021-04-06T00:04:55.667344+02:00","chifflot-7","bmc_node_power_watt",468
"2021-04-06T00:05:00.669401+02:00","chifflot-7","bmc_node_power_watt",468
"2021-04-06T00:05:05.671241+02:00","chifflot-7","bmc_node_power_watt",468
"2021-04-06T00:05:10.672324+02:00","chifflot-7","bmc_node_power_watt",468
"2021-04-06T00:05:15.67289+02:00","chifflot-7","bmc_node_power_watt",468
"2021-04-06T00:05:20.673644+02:00","chifflot-7","bmc_node_power_watt",468
"2021-04-06T00:05:25.673707+02:00","chifflot-7","bmc_node_power_watt",468
"2021-04-06T00:05:30.674884+02:00","chifflot-7","bmc_node_power_watt",468
"2021-04-06T00:05:35.675669+02:00","chifflot-7","bmc_node_power_watt",468
"2021-04-06T00:05:40.67688+02:00","chifflot-7","bmc_node_power_watt",468
"2021-04-06T00:05:45.67721+02:00","chifflot-7","bmc_node_power_watt",468
"2021-04-06T00:05:50.678226+02:00","chifflot-7","bmc_node_power_watt",468
"2021-04-06T00:05:55.678542+02:00","chifflot-7","bmc_node_power_watt",468
"2021-04-06T00:06:00.679876+02:00","chifflot-7","bmc_node_power_watt",494
"2021-04-06T00:06:05.68053+02:00","chifflot-7","bmc_node_power_watt",494
"2021-04-06T00:06:10.682771+02:00","chifflot-7","bmc_node_power_watt",494
"2021-04-06T00:06:15.681865+02:00","chifflot-7","bmc_node_power_watt",494
"2021-04-06T00:06:20.683064+02:00","chifflot-7","bmc_node_power_watt",494
"2021-04-06T00:06:25.684284+02:00","chifflot-7","bmc_node_power_watt",494
"2021-04-06T00:06:30.684678+02:00","chifflot-7","bmc_node_power_watt",494
"2021-04-06T00:06:35.686222+02:00","chifflot-7","bmc_node_power_watt",494
"2021-04-06T00:06:40.686957+02:00","chifflot-7","bmc_node_power_watt",494
"2021-04-06T00:06:45.689089+02:00","chifflot-7","bmc_node_power_watt",468
"2021-04-06T00:06:50.690936+02:00","chifflot-7","bmc_node_power_watt",468
"2021-04-06T00:06:55.692219+02:00","chifflot-7","bmc_node_power_watt",468
"2021-04-06T00:07:00.69301+02:00","chifflot-7","bmc_node_power_watt",468
"2021-04-06T00:07:05.693747+02:00","chifflot-7","bmc_node_power_watt",468
"2021-04-06T00:07:10.694847+02:00","chifflot-7","bmc_node_power_watt",494
"2021-04-06T00:07:15.69572+02:00","chifflot-7","bmc_node_power_watt",494
"2021-04-06T00:07:20.698348+02:00","chifflot-7","bmc_node_power_watt",494
"2021-04-06T00:07:25.699397+02:00","chifflot-7","bmc_node_power_watt",494
"2021-04-06T00:07:30.700234+02:00","chifflot-7","bmc_node_power_watt",494
"2021-04-06T00:07:35.701029+02:00","chifflot-7","bmc_node_power_watt",468
"2021-04-06T00:07:40.702373+02:00","chifflot-7","bmc_node_power_watt",468
"2021-04-06T00:07:45.70292+02:00","chifflot-7","bmc_node_power_watt",468
"2021-04-06T00:07:50.703732+02:00","chifflot-7","bmc_node_power_watt",468
"2021-04-06T00:07:55.704331+02:00","chifflot-7","bmc_node_power_watt",468
"2021-04-06T00:08:00.704985+02:00","chifflot-7","bmc_node_power_watt",468
"2021-04-06T00:08:05.705802+02:00","chifflot-7","bmc_node_power_watt",468
"2021-04-06T00:08:10.706593+02:00","chifflot-7","bmc_node_power_watt",468
"2021-04-06T00:08:15.706922+02:00","chifflot-7","bmc_node_power_watt",468
"2021-04-06T00:08:20.709417+02:00","chifflot-7","bmc_node_power_watt",468
"2021-04-06T00:08:25.70972+02:00","chifflot-7","bmc_node_power_watt",468
"2021-04-06T00:08:30.710378+02:00","chifflot-7","bmc_node_power_watt",468
"2021-04-06T00:08:35.711842+02:00","chifflot-7","bmc_node_power_watt",468
"2021-04-06T00:08:40.713197+02:00","chifflot-7","bmc_node_power_watt",468
"2021-04-06T00:08:45.713726+02:00","chifflot-7","bmc_node_power_watt",468
