172.16.36.8   : 23.96 13.84 13.79 13.80 13.82 13.85 13.85 13.81 13.84 13.85
172.16.66.109 : 0.17 0.20 0.18 0.17 0.14 0.19 0.18 0.18 0.15 0.17
172.16.66.11  : 0.21 0.21 0.21 0.20 0.18 0.21 0.22 0.21 0.21 0.20
172.16.66.110 : 0.21 0.20 0.19 0.18 0.18 0.20 0.20 0.21 0.20 0.22
172.16.66.111 : 0.23 0.23 0.22 0.21 0.21 0.20 0.21 0.22 0.21 0.21
172.16.66.112 : 0.21 0.20 0.21 0.20 0.21 0.20 0.20 0.21 0.20 0.19
172.16.66.113 : 0.22 0.20 0.22 0.20 0.21 0.21 0.20 0.20 0.21 0.21
172.16.66.114 : 0.22 0.18 0.18 0.18 0.22 0.21 0.20 0.21 0.21 0.22
172.16.66.115 : 0.22 0.21 0.20 0.20 0.21 0.21 0.21 0.22 0.20 0.20
172.16.66.116 : 0.22 0.20 0.21 0.21 0.19 0.21 0.18 0.20 0.22 0.20
172.16.66.117 : 0.23 0.23 0.22 0.21 0.22 0.20 0.20 0.21 0.20 0.20
172.16.66.118 : 0.23 0.21 0.21 0.20 0.21 0.21 0.18 0.21 0.20 0.21
172.16.66.119 : 0.14 0.11 0.12 0.13 0.11 0.17 0.21 0.21 0.21 0.17
172.16.66.12  : 0.18 0.21 0.19 0.21 0.20 0.22 0.20 0.20 0.21 0.18
172.16.66.120 : 0.20 0.20 0.21 0.20 0.18 0.18 0.22 0.20 0.21 0.16
172.16.66.121 : 0.20 0.19 0.21 0.20 0.21 0.21 0.21 0.18 0.18 0.20
172.16.66.122 : 0.26 0.22 0.21 0.20 0.20 0.21 0.20 0.20 0.21 0.21
172.16.66.123 : 0.04 0.03 0.03 0.03 0.03 0.03 0.03 0.03 0.03 0.03
172.16.66.124 : 0.27 0.21 0.20 0.19 0.21 0.20 0.21 0.21 0.20 0.16
172.16.66.13  : 0.25 0.21 0.21 0.20 0.19 0.20 0.21 0.21 0.20 0.20
172.16.66.14  : 0.27 0.18 0.18 0.18 0.19 0.19 0.18 0.20 0.18 0.18
172.16.66.15  : 0.26 0.21 0.21 0.19 0.20 0.21 0.21 0.21 0.21 0.18
172.16.66.16  : 0.22 0.17 0.16 0.17 0.16 0.16 0.18 0.14 0.13 0.14
172.16.66.17  : 0.27 0.21 0.21 0.22 0.21 0.20 0.21 0.21 0.20 0.21
172.16.66.18  : 0.25 0.21 0.21 0.21 0.20 0.21 0.21 0.21 0.20 0.19
172.16.66.19  : 0.27 0.20 0.21 0.18 0.22 0.20 0.21 0.22 0.21 0.20
172.16.66.2   : 0.25 0.19 0.18 0.20 0.21 0.20 0.21 0.18 0.21 0.21
172.16.66.20  : 0.28 0.21 0.21 0.21 0.21 0.21 0.20 0.23 0.20 0.22
172.16.66.21  : 0.29 0.18 0.19 0.11 0.11 0.12 0.20 0.12 0.21 0.20
172.16.66.22  : 0.18 0.20 0.21 0.20 0.12 0.21 0.21 0.20 0.20 0.20
172.16.66.23  : 0.17 0.19 0.21 0.21 0.21 0.21 0.18 0.21 0.19 0.21
172.16.66.24  : 0.29 0.22 0.21 0.22 0.21 0.21 0.21 0.21 0.21 0.21
172.16.66.25  : 0.26 0.22 0.20 0.21 0.20 0.21 0.21 0.21 0.20 0.18
172.16.66.27  : 0.28 0.21 0.21 0.22 0.21 0.21 0.20 0.21 0.19 0.21
172.16.66.28  : 0.26 0.20 0.21 0.21 0.21 0.20 0.22 0.18 0.18 0.19
172.16.66.41  : 0.21 0.21 0.20 0.20 0.21 0.22 0.20 0.21 0.21 0.20
172.16.66.80  : 0.23 0.20 0.22 0.17 0.20 0.20 0.20 0.18 0.22 0.16
172.16.66.81  : 0.31 0.20 0.20 0.21 0.21 0.20 0.21 0.20 0.21 0.22
172.16.66.82  : 0.33 0.21 0.21 0.22 0.20 0.21 0.22 0.14 0.20 0.25
172.16.66.83  : 0.32 0.21 0.22 0.21 0.20 0.20 0.20 0.19 0.18 0.22
172.16.66.84  : 0.29 0.20 0.20 0.21 0.21 0.21 0.19 0.20 0.18 0.19

      41 targets
      41 alive
       0 unreachable
       0 unknown addresses

       0 timeouts (waiting for response)
     410 ICMP Echos sent
     410 ICMP Echo Replies received
       0 other ICMP received

 0.03 ms (min round trip time)
 0.55 ms (avg round trip time)
 23.9 ms (max round trip time)
        9.416 sec (elapsed real time)

