172.16.36.8   : 17.50 13.79 13.77 13.76 13.73 13.75 - 13.74 13.85 13.76
172.16.66.109 : 0.22 0.21 0.20 0.21 0.21 0.21 0.20 0.21 0.21 0.19
172.16.66.11  : 0.22 0.20 0.22 0.19 0.21 0.18 0.18 0.21 0.20 0.16
172.16.66.110 : 0.22 0.18 0.21 0.21 0.22 0.18 0.21 0.22 0.20 0.20
172.16.66.111 : 0.22 0.20 0.21 0.20 0.20 0.21 0.18 0.21 0.22 0.18
172.16.66.112 : 0.22 0.21 0.20 0.22 0.19 0.21 0.21 0.21 0.21 0.19
172.16.66.113 : 0.22 0.21 0.20 0.20 0.20 0.20 0.21 0.19 0.21 0.19
172.16.66.114 : 0.23 0.20 0.21 0.21 0.20 0.21 0.20 0.21 0.21 0.20
172.16.66.115 : 0.24 0.22 0.21 0.21 0.22 0.22 0.21 0.21 0.21 0.18
172.16.66.116 : 0.17 0.20 0.19 0.21 0.19 0.18 0.18 0.19 0.21 0.20
172.16.66.117 : 0.22 0.19 0.21 0.20 0.21 0.20 0.20 0.21 0.22 0.20
172.16.66.118 : 0.17 0.14 0.15 0.15 0.16 0.20 0.17 0.21 0.21 0.20
172.16.66.119 : 0.20 0.21 0.21 0.21 0.22 0.20 0.21 0.21 0.22 0.21
172.16.66.12  : 0.20 0.20 0.20 0.22 0.20 0.21 0.20 0.20 0.20 0.21
172.16.66.120 : 0.22 0.18 0.21 0.22 0.21 0.19 0.20 0.21 0.21 0.20
172.16.66.121 : 0.22 0.21 0.18 0.20 0.22 0.21 0.21 0.21 0.20 0.19
172.16.66.122 : 0.23 0.20 0.20 0.20 0.20 0.22 0.23 0.20 0.20 0.18
172.16.66.123 : 0.23 0.21 0.21 0.21 0.21 0.16 0.17 0.16 0.16 0.16
172.16.66.124 : 0.21 0.21 0.21 0.21 0.21 0.22 0.22 0.20 0.19 0.21
172.16.66.13  : 0.23 0.21 0.21 0.21 0.22 0.20 0.20 0.20 0.21 0.19
172.16.66.14  : 0.20 0.22 0.20 0.20 0.19 0.21 0.21 0.21 0.20 0.21
172.16.66.15  : 0.22 0.21 0.21 0.22 0.21 0.15 0.16 0.16 0.15 0.17
172.16.66.16  : 0.23 0.20 0.20 0.21 0.22 0.21 0.21 0.20 0.21 0.20
172.16.66.17  : 0.22 0.21 0.20 0.21 0.20 0.21 0.21 0.20 0.13 0.20
172.16.66.18  : 0.18 0.21 0.20 0.18 0.21 0.20 0.20 0.20 0.22 0.20
172.16.66.19  : 0.22 0.21 0.21 0.21 0.19 0.17 0.18 0.18 0.19 0.21
172.16.66.2   : 0.04 0.03 0.03 0.03 0.03 0.03 0.03 0.03 0.03 0.03
172.16.66.20  : 0.24 0.19 0.20 0.20 0.21 0.18 0.20 0.22 0.20 0.21
172.16.66.21  : 0.25 0.21 0.22 0.23 0.21 0.21 0.22 0.21 0.21 0.22
172.16.66.22  : 0.23 0.19 0.21 0.19 0.21 0.20 0.20 0.22 0.20 0.20
172.16.66.23  : 0.25 0.20 0.20 0.22 0.20 0.21 0.21 0.20 0.21 0.21
172.16.66.24  : 0.19 0.16 0.16 0.17 0.16 0.21 0.21 0.21 0.21 0.21
172.16.66.25  : 0.24 0.21 0.21 0.21 0.21 0.20 0.21 0.22 0.20 0.20
172.16.66.27  : 0.23 0.21 0.20 0.22 0.21 0.18 0.20 0.21 0.20 0.22
172.16.66.28  : 0.24 0.20 0.21 0.21 0.19 0.20 0.20 0.22 0.21 0.20
172.16.66.41  : 0.23 0.21 0.22 0.21 0.21 0.20 0.22 0.21 0.20 0.19
172.16.66.80  : 0.24 0.20 0.21 0.20 0.20 0.20 0.19 0.21 0.21 0.22
172.16.66.81  : 0.23 0.20 0.19 0.21 0.22 0.20 0.21 0.22 0.20 0.20
172.16.66.82  : 0.17 0.16 0.15 0.13 0.16 0.21 0.21 0.22 0.14 0.20
172.16.66.83  : 0.24 0.22 0.21 0.19 0.19 0.20 0.21 0.19 0.18 0.17
172.16.66.84  : 0.24 0.18 0.20 0.21 0.22 0.20 0.22 0.22 0.18 0.21

      41 targets
      41 alive
       0 unreachable
       0 unknown addresses

       1 timeouts (waiting for response)
     410 ICMP Echos sent
     409 ICMP Echo Replies received
       0 other ICMP received

 0.03 ms (min round trip time)
 0.50 ms (avg round trip time)
 17.5 ms (max round trip time)
       10.011 sec (elapsed real time)

