172.16.36.8 : 17.02 4.33 4.36 4.31 4.38 4.29 4.40 4.37 4.35 4.27
172.16.38.6 : 0.02 0.02 0.01 0.01 0.01 0.00 0.00 0.00 0.01 0.01
172.16.38.5 : 0.13 0.21 0.18 0.20 0.24 0.18 0.17 0.18 0.20 0.20

       3 targets
       3 alive
       0 unreachable
       0 unknown addresses

       0 timeouts (waiting for response)
      30 ICMP Echos sent
      30 ICMP Echo Replies received
       0 other ICMP received

 0.01 ms (min round trip time)
 1.93 ms (avg round trip time)
 17.0 ms (max round trip time)
        9.026 sec (elapsed real time)

