172.16.36.8 : 0.03 0.03 0.01 0.01 0.04 0.01 0.03 0.04 0.02 0.03
172.16.37.7 : 15.21 4.25 4.25 4.34 4.16 4.35 4.28 4.22 4.25 4.31
172.16.37.2 : 0.18 0.19 0.19 0.20 0.22 0.21 0.22 0.18 0.27 0.23

       3 targets
       3 alive
       0 unreachable
       0 unknown addresses

       0 timeouts (waiting for response)
      30 ICMP Echos sent
      30 ICMP Echo Replies received
       0 other ICMP received

 0.01 ms (min round trip time)
 1.86 ms (avg round trip time)
 15.2 ms (max round trip time)
        9.030 sec (elapsed real time)

