"2021-03-23T17:30:42.798464+01:00","chifflot-8","bmc_node_power_watt",494
"2021-03-23T17:30:47.79888+01:00","chifflot-8","bmc_node_power_watt",494
"2021-03-23T17:30:52.800114+01:00","chifflot-8","bmc_node_power_watt",494
"2021-03-23T17:30:57.80052+01:00","chifflot-8","bmc_node_power_watt",494
"2021-03-23T17:31:02.800687+01:00","chifflot-8","bmc_node_power_watt",494
"2021-03-23T17:31:07.801501+01:00","chifflot-8","bmc_node_power_watt",494
"2021-03-23T17:31:12.80267+01:00","chifflot-8","bmc_node_power_watt",494
"2021-03-23T17:31:17.803504+01:00","chifflot-8","bmc_node_power_watt",494
"2021-03-23T17:31:22.804512+01:00","chifflot-8","bmc_node_power_watt",494
"2021-03-23T17:31:27.806381+01:00","chifflot-8","bmc_node_power_watt",494
"2021-03-23T17:31:32.808145+01:00","chifflot-8","bmc_node_power_watt",494
"2021-03-23T17:31:37.809301+01:00","chifflot-8","bmc_node_power_watt",494
"2021-03-23T17:31:42.8104+01:00","chifflot-8","bmc_node_power_watt",494
"2021-03-23T17:31:47.81073+01:00","chifflot-8","bmc_node_power_watt",494
"2021-03-23T17:31:52.811172+01:00","chifflot-8","bmc_node_power_watt",494
"2021-03-23T17:31:57.81457+01:00","chifflot-8","bmc_node_power_watt",494
"2021-03-23T17:32:02.816231+01:00","chifflot-8","bmc_node_power_watt",494
"2021-03-23T17:32:07.818009+01:00","chifflot-8","bmc_node_power_watt",494
"2021-03-23T17:32:12.819852+01:00","chifflot-8","bmc_node_power_watt",494
"2021-03-23T17:32:17.824702+01:00","chifflot-8","bmc_node_power_watt",494
"2021-03-23T17:32:22.825655+01:00","chifflot-8","bmc_node_power_watt",494
"2021-03-23T17:32:27.829076+01:00","chifflot-8","bmc_node_power_watt",494
"2021-03-23T17:32:32.832723+01:00","chifflot-8","bmc_node_power_watt",494
"2021-03-23T17:32:37.839314+01:00","chifflot-8","bmc_node_power_watt",494
"2021-03-23T17:32:42.84055+01:00","chifflot-8","bmc_node_power_watt",520
"2021-03-23T17:32:47.841336+01:00","chifflot-8","bmc_node_power_watt",520
"2021-03-23T17:32:52.843605+01:00","chifflot-8","bmc_node_power_watt",520
"2021-03-23T17:32:57.844188+01:00","chifflot-8","bmc_node_power_watt",520
"2021-03-23T17:33:02.845073+01:00","chifflot-8","bmc_node_power_watt",520
"2021-03-23T17:33:07.84733+01:00","chifflot-8","bmc_node_power_watt",520
"2021-03-23T17:33:12.847207+01:00","chifflot-8","bmc_node_power_watt",520
"2021-03-23T17:33:17.848307+01:00","chifflot-8","bmc_node_power_watt",520
"2021-03-23T17:33:22.848805+01:00","chifflot-8","bmc_node_power_watt",520
"2021-03-23T17:33:27.849563+01:00","chifflot-8","bmc_node_power_watt",520
"2021-03-23T17:33:32.850577+01:00","chifflot-8","bmc_node_power_watt",520
"2021-03-23T17:33:37.850955+01:00","chifflot-8","bmc_node_power_watt",520
"2021-03-23T17:33:42.851089+01:00","chifflot-8","bmc_node_power_watt",520
"2021-03-23T17:33:47.85159+01:00","chifflot-8","bmc_node_power_watt",520
"2021-03-23T17:33:52.852101+01:00","chifflot-8","bmc_node_power_watt",520
"2021-03-23T17:33:57.852248+01:00","chifflot-8","bmc_node_power_watt",520
"2021-03-23T17:34:02.852671+01:00","chifflot-8","bmc_node_power_watt",520
"2021-03-23T17:34:07.853326+01:00","chifflot-8","bmc_node_power_watt",520
"2021-03-23T17:34:12.853517+01:00","chifflot-8","bmc_node_power_watt",520
"2021-03-23T17:34:17.854618+01:00","chifflot-8","bmc_node_power_watt",494
"2021-03-23T17:34:22.854589+01:00","chifflot-8","bmc_node_power_watt",494
"2021-03-23T17:34:27.855374+01:00","chifflot-8","bmc_node_power_watt",494
"2021-03-23T17:34:32.855469+01:00","chifflot-8","bmc_node_power_watt",494
"2021-03-23T17:34:37.856736+01:00","chifflot-8","bmc_node_power_watt",494
"2021-03-23T17:34:42.857819+01:00","chifflot-8","bmc_node_power_watt",494
"2021-03-23T17:34:47.858526+01:00","chifflot-8","bmc_node_power_watt",494
"2021-03-23T17:34:52.860811+01:00","chifflot-8","bmc_node_power_watt",494
"2021-03-23T17:34:57.862311+01:00","chifflot-8","bmc_node_power_watt",494
"2021-03-23T17:35:02.862268+01:00","chifflot-8","bmc_node_power_watt",494
"2021-03-23T17:35:07.8644+01:00","chifflot-8","bmc_node_power_watt",520
"2021-03-23T17:35:12.865548+01:00","chifflot-8","bmc_node_power_watt",520
"2021-03-23T17:35:17.866528+01:00","chifflot-8","bmc_node_power_watt",520
"2021-03-23T17:35:22.868793+01:00","chifflot-8","bmc_node_power_watt",520
"2021-03-23T17:35:27.871062+01:00","chifflot-8","bmc_node_power_watt",520
"2021-03-23T17:35:32.873307+01:00","chifflot-8","bmc_node_power_watt",520
"2021-03-23T17:35:37.873558+01:00","chifflot-8","bmc_node_power_watt",520
"2021-03-23T17:35:42.879202+01:00","chifflot-8","bmc_node_power_watt",520
"2021-03-23T17:35:47.879207+01:00","chifflot-8","bmc_node_power_watt",520
"2021-03-23T17:35:52.879754+01:00","chifflot-8","bmc_node_power_watt",494
"2021-03-23T17:35:57.883186+01:00","chifflot-8","bmc_node_power_watt",494
"2021-03-23T17:36:02.88314+01:00","chifflot-8","bmc_node_power_watt",494
"2021-03-23T17:36:07.884133+01:00","chifflot-8","bmc_node_power_watt",494
"2021-03-23T17:36:12.886836+01:00","chifflot-8","bmc_node_power_watt",494
"2021-03-23T17:36:17.886487+01:00","chifflot-8","bmc_node_power_watt",494
"2021-03-23T17:36:22.887163+01:00","chifflot-8","bmc_node_power_watt",494
"2021-03-23T17:36:27.889282+01:00","chifflot-8","bmc_node_power_watt",494
"2021-03-23T17:36:32.889798+01:00","chifflot-8","bmc_node_power_watt",494
"2021-03-23T17:36:37.892026+01:00","chifflot-8","bmc_node_power_watt",494
"2021-03-23T17:36:42.895956+01:00","chifflot-8","bmc_node_power_watt",494
"2021-03-23T17:36:47.895853+01:00","chifflot-8","bmc_node_power_watt",494
"2021-03-23T17:36:52.896423+01:00","chifflot-8","bmc_node_power_watt",494
"2021-03-23T17:36:57.898416+01:00","chifflot-8","bmc_node_power_watt",494
"2021-03-23T17:37:02.89902+01:00","chifflot-8","bmc_node_power_watt",494
"2021-03-23T17:37:07.899787+01:00","chifflot-8","bmc_node_power_watt",494
"2021-03-23T17:37:12.904644+01:00","chifflot-8","bmc_node_power_watt",494
"2021-03-23T17:37:17.904792+01:00","chifflot-8","bmc_node_power_watt",494
"2021-03-23T17:37:22.90568+01:00","chifflot-8","bmc_node_power_watt",494
"2021-03-23T17:37:27.906691+01:00","chifflot-8","bmc_node_power_watt",494
"2021-03-23T17:37:32.907151+01:00","chifflot-8","bmc_node_power_watt",494
"2021-03-23T17:37:37.908005+01:00","chifflot-8","bmc_node_power_watt",494
"2021-03-23T17:37:42.910897+01:00","chifflot-8","bmc_node_power_watt",494
"2021-03-23T17:37:47.911622+01:00","chifflot-8","bmc_node_power_watt",494
"2021-03-23T17:37:52.913028+01:00","chifflot-8","bmc_node_power_watt",494
"2021-03-23T17:37:57.913478+01:00","chifflot-8","bmc_node_power_watt",494
"2021-03-23T17:38:02.914553+01:00","chifflot-8","bmc_node_power_watt",494
"2021-03-23T17:38:07.91568+01:00","chifflot-8","bmc_node_power_watt",494
"2021-03-23T17:38:12.917523+01:00","chifflot-8","bmc_node_power_watt",494
"2021-03-23T17:38:17.917863+01:00","chifflot-8","bmc_node_power_watt",494
"2021-03-23T17:38:22.9188+01:00","chifflot-8","bmc_node_power_watt",494
"2021-03-23T17:38:27.919265+01:00","chifflot-8","bmc_node_power_watt",494
"2021-03-23T17:38:32.920721+01:00","chifflot-8","bmc_node_power_watt",494
"2021-03-23T17:38:37.922543+01:00","chifflot-8","bmc_node_power_watt",494
"2021-03-23T17:38:42.924935+01:00","chifflot-8","bmc_node_power_watt",494
"2021-03-23T17:38:47.926093+01:00","chifflot-8","bmc_node_power_watt",494
"2021-03-23T17:38:52.930496+01:00","chifflot-8","bmc_node_power_watt",494
"2021-03-23T17:38:57.930555+01:00","chifflot-8","bmc_node_power_watt",494
"2021-03-23T17:39:02.931674+01:00","chifflot-8","bmc_node_power_watt",494
"2021-03-23T17:39:07.93254+01:00","chifflot-8","bmc_node_power_watt",494
"2021-03-23T17:39:12.933454+01:00","chifflot-8","bmc_node_power_watt",494
"2021-03-23T17:39:17.934472+01:00","chifflot-8","bmc_node_power_watt",494
"2021-03-23T17:39:22.934855+01:00","chifflot-8","bmc_node_power_watt",494
"2021-03-23T17:39:27.936071+01:00","chifflot-8","bmc_node_power_watt",494
"2021-03-23T17:39:32.93649+01:00","chifflot-8","bmc_node_power_watt",494
"2021-03-23T17:39:37.937587+01:00","chifflot-8","bmc_node_power_watt",494
"2021-03-23T17:39:42.938436+01:00","chifflot-8","bmc_node_power_watt",494
"2021-03-23T17:39:47.939165+01:00","chifflot-8","bmc_node_power_watt",494
"2021-03-23T17:39:52.939814+01:00","chifflot-8","bmc_node_power_watt",494
"2021-03-23T17:39:57.940674+01:00","chifflot-8","bmc_node_power_watt",494
"2021-03-23T17:40:02.941906+01:00","chifflot-8","bmc_node_power_watt",494
"2021-03-23T17:40:07.943013+01:00","chifflot-8","bmc_node_power_watt",494
"2021-03-23T17:40:12.943403+01:00","chifflot-8","bmc_node_power_watt",494
"2021-03-23T17:40:17.94475+01:00","chifflot-8","bmc_node_power_watt",494
"2021-03-23T17:40:22.945143+01:00","chifflot-8","bmc_node_power_watt",494
"2021-03-23T17:40:27.94572+01:00","chifflot-8","bmc_node_power_watt",494
"2021-03-23T17:40:32.946394+01:00","chifflot-8","bmc_node_power_watt",494
"2021-03-23T17:40:37.94781+01:00","chifflot-8","bmc_node_power_watt",494
"2021-03-23T17:40:42.948622+01:00","chifflot-8","bmc_node_power_watt",494
"2021-03-23T17:40:47.949349+01:00","chifflot-8","bmc_node_power_watt",494
"2021-03-23T17:40:52.950331+01:00","chifflot-8","bmc_node_power_watt",494
"2021-03-23T17:40:57.951488+01:00","chifflot-8","bmc_node_power_watt",494
"2021-03-23T17:41:02.953193+01:00","chifflot-8","bmc_node_power_watt",494
"2021-03-23T17:41:07.954817+01:00","chifflot-8","bmc_node_power_watt",494
"2021-03-23T17:41:12.956716+01:00","chifflot-8","bmc_node_power_watt",494
"2021-03-23T17:41:17.957103+01:00","chifflot-8","bmc_node_power_watt",494
"2021-03-23T17:41:22.958461+01:00","chifflot-8","bmc_node_power_watt",494
"2021-03-23T17:41:27.958787+01:00","chifflot-8","bmc_node_power_watt",520
"2021-03-23T17:41:32.95924+01:00","chifflot-8","bmc_node_power_watt",520
"2021-03-23T17:41:37.959708+01:00","chifflot-8","bmc_node_power_watt",520
"2021-03-23T17:41:42.961319+01:00","chifflot-8","bmc_node_power_watt",520
"2021-03-23T17:41:47.962357+01:00","chifflot-8","bmc_node_power_watt",494
"2021-03-23T17:41:52.963156+01:00","chifflot-8","bmc_node_power_watt",494
"2021-03-23T17:41:57.965946+01:00","chifflot-8","bmc_node_power_watt",494
"2021-03-23T17:42:02.967458+01:00","chifflot-8","bmc_node_power_watt",494
"2021-03-23T17:42:07.96839+01:00","chifflot-8","bmc_node_power_watt",494
"2021-03-23T17:42:12.969192+01:00","chifflot-8","bmc_node_power_watt",494
"2021-03-23T17:42:17.970007+01:00","chifflot-8","bmc_node_power_watt",494
"2021-03-23T17:42:22.971455+01:00","chifflot-8","bmc_node_power_watt",494
"2021-03-23T17:42:27.971535+01:00","chifflot-8","bmc_node_power_watt",494
"2021-03-23T17:42:32.971971+01:00","chifflot-8","bmc_node_power_watt",494
"2021-03-23T17:42:37.973454+01:00","chifflot-8","bmc_node_power_watt",494
"2021-03-23T17:42:42.974503+01:00","chifflot-8","bmc_node_power_watt",494
"2021-03-23T17:42:47.97475+01:00","chifflot-8","bmc_node_power_watt",494
"2021-03-23T17:42:52.975798+01:00","chifflot-8","bmc_node_power_watt",494
"2021-03-23T17:42:57.978353+01:00","chifflot-8","bmc_node_power_watt",494
"2021-03-23T17:43:02.978139+01:00","chifflot-8","bmc_node_power_watt",494
"2021-03-23T17:43:07.979648+01:00","chifflot-8","bmc_node_power_watt",494
"2021-03-23T17:43:12.980095+01:00","chifflot-8","bmc_node_power_watt",494
"2021-03-23T17:43:17.981928+01:00","chifflot-8","bmc_node_power_watt",494
"2021-03-23T17:43:22.982144+01:00","chifflot-8","bmc_node_power_watt",494
"2021-03-23T17:43:27.983837+01:00","chifflot-8","bmc_node_power_watt",494
"2021-03-23T17:43:32.984024+01:00","chifflot-8","bmc_node_power_watt",494
"2021-03-23T17:43:37.985203+01:00","chifflot-8","bmc_node_power_watt",494
"2021-03-23T17:43:42.98666+01:00","chifflot-8","bmc_node_power_watt",494
"2021-03-23T17:43:47.987136+01:00","chifflot-8","bmc_node_power_watt",494
"2021-03-23T17:43:52.992042+01:00","chifflot-8","bmc_node_power_watt",494
"2021-03-23T17:43:57.991956+01:00","chifflot-8","bmc_node_power_watt",494
"2021-03-23T17:44:02.992923+01:00","chifflot-8","bmc_node_power_watt",494
"2021-03-23T17:44:07.993685+01:00","chifflot-8","bmc_node_power_watt",494
"2021-03-23T17:44:12.994798+01:00","chifflot-8","bmc_node_power_watt",494
"2021-03-23T17:44:17.995149+01:00","chifflot-8","bmc_node_power_watt",494
"2021-03-23T17:44:22.995758+01:00","chifflot-8","bmc_node_power_watt",494
"2021-03-23T17:44:27.996278+01:00","chifflot-8","bmc_node_power_watt",494
"2021-03-23T17:44:32.997129+01:00","chifflot-8","bmc_node_power_watt",494
"2021-03-23T17:44:37.997702+01:00","chifflot-8","bmc_node_power_watt",494
"2021-03-23T17:44:42.999167+01:00","chifflot-8","bmc_node_power_watt",494
"2021-03-23T17:44:47.999801+01:00","chifflot-8","bmc_node_power_watt",494
"2021-03-23T17:44:53.000973+01:00","chifflot-8","bmc_node_power_watt",494
"2021-03-23T17:44:58.001416+01:00","chifflot-8","bmc_node_power_watt",494
"2021-03-23T17:45:03.002826+01:00","chifflot-8","bmc_node_power_watt",494
"2021-03-23T17:45:08.0037+01:00","chifflot-8","bmc_node_power_watt",494
"2021-03-23T17:45:13.005163+01:00","chifflot-8","bmc_node_power_watt",494
"2021-03-23T17:45:18.006869+01:00","chifflot-8","bmc_node_power_watt",494
"2021-03-23T17:45:23.007173+01:00","chifflot-8","bmc_node_power_watt",520
"2021-03-23T17:45:28.007416+01:00","chifflot-8","bmc_node_power_watt",520
"2021-03-23T17:45:33.01196+01:00","chifflot-8","bmc_node_power_watt",520
"2021-03-23T17:45:38.012599+01:00","chifflot-8","bmc_node_power_watt",520
"2021-03-23T17:45:43.014409+01:00","chifflot-8","bmc_node_power_watt",520
"2021-03-23T17:45:48.014288+01:00","chifflot-8","bmc_node_power_watt",494
"2021-03-23T17:45:53.015082+01:00","chifflot-8","bmc_node_power_watt",494
"2021-03-23T17:45:58.015897+01:00","chifflot-8","bmc_node_power_watt",494
"2021-03-23T17:46:03.015967+01:00","chifflot-8","bmc_node_power_watt",494
"2021-03-23T17:46:08.016543+01:00","chifflot-8","bmc_node_power_watt",520
"2021-03-23T17:46:13.017809+01:00","chifflot-8","bmc_node_power_watt",520
"2021-03-23T17:46:18.018903+01:00","chifflot-8","bmc_node_power_watt",520
"2021-03-23T17:46:23.019497+01:00","chifflot-8","bmc_node_power_watt",520
"2021-03-23T17:46:28.019891+01:00","chifflot-8","bmc_node_power_watt",520
"2021-03-23T17:46:33.021381+01:00","chifflot-8","bmc_node_power_watt",494
"2021-03-23T17:46:38.022028+01:00","chifflot-8","bmc_node_power_watt",494
"2021-03-23T17:46:43.022543+01:00","chifflot-8","bmc_node_power_watt",494
"2021-03-23T17:46:48.024065+01:00","chifflot-8","bmc_node_power_watt",494
"2021-03-23T17:46:53.0248+01:00","chifflot-8","bmc_node_power_watt",494
"2021-03-23T17:46:58.025102+01:00","chifflot-8","bmc_node_power_watt",494
"2021-03-23T17:47:03.025451+01:00","chifflot-8","bmc_node_power_watt",494
"2021-03-23T17:47:08.026305+01:00","chifflot-8","bmc_node_power_watt",494
"2021-03-23T17:47:13.027021+01:00","chifflot-8","bmc_node_power_watt",494
"2021-03-23T17:47:18.027709+01:00","chifflot-8","bmc_node_power_watt",494
"2021-03-23T17:47:23.028091+01:00","chifflot-8","bmc_node_power_watt",520
"2021-03-23T17:47:28.029198+01:00","chifflot-8","bmc_node_power_watt",520
"2021-03-23T17:47:33.029828+01:00","chifflot-8","bmc_node_power_watt",520
"2021-03-23T17:47:38.03116+01:00","chifflot-8","bmc_node_power_watt",520
"2021-03-23T17:47:43.032+01:00","chifflot-8","bmc_node_power_watt",494
"2021-03-23T17:47:48.033484+01:00","chifflot-8","bmc_node_power_watt",494
"2021-03-23T17:47:53.033566+01:00","chifflot-8","bmc_node_power_watt",494
"2021-03-23T17:47:58.03506+01:00","chifflot-8","bmc_node_power_watt",494
"2021-03-23T17:48:03.0371+01:00","chifflot-8","bmc_node_power_watt",494
"2021-03-23T17:48:08.038157+01:00","chifflot-8","bmc_node_power_watt",494
"2021-03-23T17:48:13.039458+01:00","chifflot-8","bmc_node_power_watt",494
"2021-03-23T17:48:18.043297+01:00","chifflot-8","bmc_node_power_watt",494
"2021-03-23T17:48:23.045918+01:00","chifflot-8","bmc_node_power_watt",494
"2021-03-23T17:48:28.050146+01:00","chifflot-8","bmc_node_power_watt",494
"2021-03-23T17:48:33.053736+01:00","chifflot-8","bmc_node_power_watt",494
"2021-03-23T17:48:38.052316+01:00","chifflot-8","bmc_node_power_watt",494
"2021-03-23T17:48:43.055126+01:00","chifflot-8","bmc_node_power_watt",494
"2021-03-23T17:48:48.059654+01:00","chifflot-8","bmc_node_power_watt",494
"2021-03-23T17:48:53.062569+01:00","chifflot-8","bmc_node_power_watt",494
"2021-03-23T17:48:58.065932+01:00","chifflot-8","bmc_node_power_watt",520
"2021-03-23T17:49:03.068431+01:00","chifflot-8","bmc_node_power_watt",520
"2021-03-23T17:49:08.07065+01:00","chifflot-8","bmc_node_power_watt",520
"2021-03-23T17:49:13.070363+01:00","chifflot-8","bmc_node_power_watt",520
"2021-03-23T17:49:18.070598+01:00","chifflot-8","bmc_node_power_watt",494
"2021-03-23T17:49:23.071511+01:00","chifflot-8","bmc_node_power_watt",494
"2021-03-23T17:49:28.072363+01:00","chifflot-8","bmc_node_power_watt",494
"2021-03-23T17:49:33.072608+01:00","chifflot-8","bmc_node_power_watt",494
"2021-03-23T17:49:38.073412+01:00","chifflot-8","bmc_node_power_watt",494
"2021-03-23T17:49:43.073645+01:00","chifflot-8","bmc_node_power_watt",494
"2021-03-23T17:49:48.07409+01:00","chifflot-8","bmc_node_power_watt",494
"2021-03-23T17:49:53.074907+01:00","chifflot-8","bmc_node_power_watt",494
"2021-03-23T17:49:58.075212+01:00","chifflot-8","bmc_node_power_watt",494
"2021-03-23T17:50:03.075865+01:00","chifflot-8","bmc_node_power_watt",494
"2021-03-23T17:50:08.076972+01:00","chifflot-8","bmc_node_power_watt",494
"2021-03-23T17:50:13.077478+01:00","chifflot-8","bmc_node_power_watt",494
"2021-03-23T17:50:18.077741+01:00","chifflot-8","bmc_node_power_watt",494
"2021-03-23T17:50:23.077978+01:00","chifflot-8","bmc_node_power_watt",494
"2021-03-23T17:50:28.078739+01:00","chifflot-8","bmc_node_power_watt",494
"2021-03-23T17:50:33.078965+01:00","chifflot-8","bmc_node_power_watt",520
"2021-03-23T17:50:38.079662+01:00","chifflot-8","bmc_node_power_watt",520
"2021-03-23T17:50:43.080261+01:00","chifflot-8","bmc_node_power_watt",520
"2021-03-23T17:50:48.08042+01:00","chifflot-8","bmc_node_power_watt",520
"2021-03-23T17:50:53.081281+01:00","chifflot-8","bmc_node_power_watt",494
"2021-03-23T17:50:58.082286+01:00","chifflot-8","bmc_node_power_watt",494
"2021-03-23T17:51:03.082265+01:00","chifflot-8","bmc_node_power_watt",494
"2021-03-23T17:51:08.082802+01:00","chifflot-8","bmc_node_power_watt",494
"2021-03-23T17:51:13.082836+01:00","chifflot-8","bmc_node_power_watt",494
"2021-03-23T17:51:18.082972+01:00","chifflot-8","bmc_node_power_watt",494
"2021-03-23T17:51:23.083278+01:00","chifflot-8","bmc_node_power_watt",494
"2021-03-23T17:51:28.084218+01:00","chifflot-8","bmc_node_power_watt",494
"2021-03-23T17:51:33.084653+01:00","chifflot-8","bmc_node_power_watt",494
"2021-03-23T17:51:38.085002+01:00","chifflot-8","bmc_node_power_watt",494
"2021-03-23T17:51:43.08516+01:00","chifflot-8","bmc_node_power_watt",494
"2021-03-23T17:51:48.086095+01:00","chifflot-8","bmc_node_power_watt",494
"2021-03-23T17:51:53.087091+01:00","chifflot-8","bmc_node_power_watt",494
"2021-03-23T17:51:58.087927+01:00","chifflot-8","bmc_node_power_watt",494
"2021-03-23T17:52:03.088689+01:00","chifflot-8","bmc_node_power_watt",494
"2021-03-23T17:52:08.08957+01:00","chifflot-8","bmc_node_power_watt",494
"2021-03-23T17:52:13.089965+01:00","chifflot-8","bmc_node_power_watt",494
"2021-03-23T17:52:18.090029+01:00","chifflot-8","bmc_node_power_watt",494
"2021-03-23T17:52:23.090338+01:00","chifflot-8","bmc_node_power_watt",494
"2021-03-23T17:52:28.091646+01:00","chifflot-8","bmc_node_power_watt",494
"2021-03-23T17:52:33.092084+01:00","chifflot-8","bmc_node_power_watt",494
"2021-03-23T17:52:38.092963+01:00","chifflot-8","bmc_node_power_watt",494
"2021-03-23T17:52:43.093578+01:00","chifflot-8","bmc_node_power_watt",494
"2021-03-23T17:52:48.093802+01:00","chifflot-8","bmc_node_power_watt",494
"2021-03-23T17:52:53.094899+01:00","chifflot-8","bmc_node_power_watt",494
"2021-03-23T17:52:58.095796+01:00","chifflot-8","bmc_node_power_watt",494
"2021-03-23T17:53:03.096562+01:00","chifflot-8","bmc_node_power_watt",494
"2021-03-23T17:53:08.097307+01:00","chifflot-8","bmc_node_power_watt",494
"2021-03-23T17:53:13.097759+01:00","chifflot-8","bmc_node_power_watt",494
"2021-03-23T17:53:18.099293+01:00","chifflot-8","bmc_node_power_watt",494
"2021-03-23T17:53:23.101138+01:00","chifflot-8","bmc_node_power_watt",494
"2021-03-23T17:53:28.10145+01:00","chifflot-8","bmc_node_power_watt",494
"2021-03-23T17:53:33.101717+01:00","chifflot-8","bmc_node_power_watt",494
"2021-03-23T17:53:38.104084+01:00","chifflot-8","bmc_node_power_watt",494
