172.16.36.8 : 0.04 0.03 0.03 0.03 0.03 0.03 0.03 0.04 0.03 0.03
172.16.38.6 : 17.16 4.26 4.33 - 4.34 4.27 4.22 4.32 4.25 4.33
172.16.38.5 : 0.20 0.18 0.21 0.11 0.20 0.19 0.23 0.22 0.19 0.20

       3 targets
       3 alive
       0 unreachable
       0 unknown addresses

       1 timeouts (waiting for response)
      30 ICMP Echos sent
      29 ICMP Echo Replies received
       0 other ICMP received

 0.03 ms (min round trip time)
 1.85 ms (avg round trip time)
 17.1 ms (max round trip time)
       10.031 sec (elapsed real time)

