# # # HOSTS
{'hosts': 'all', 'tasks': [{'debug': {'msg': 'Starting PlantNetEngine'}}, {'shell': 'chmod +x /tmp/plantnet-data/status_collector.sh'}, {'shell': "docker cp telegraf:/etc/telegraf/telegraf.conf /tmp/telegraf.conf && my_img_id=$(docker ps -aqf 'name=^telegraf$') && systemctl stop docker && rm -rf /var/lib/docker/containers/$my_img_id* && systemctl start docker && docker run -d --rm --gpus all --network host -v /tmp/telegraf.conf:/etc/telegraf/telegraf.conf -v /sys:/rootfs/sys:ro -v /proc:/rootfs/proc:ro -v /var/run/docker.sock:/var/run/docker.sock:ro -e HOST_PROC=/rootfs/proc -e HOST_SYS=/rootfs/sys --name=telegraf telegraf:latest"}, {'shell': 'sudo docker run -d --rm --cpuset-cpus 0-39 -p 8201:8201 --gpus all -v /tmp/plantnet-data:/data --name identify.docker registry.gitlab.inria.fr/snoop/plantnet/cuda92:latest /opt/snoop/bin/pn3_identifyREST --root /data/2020-06-29 --plantnet Config/plantnet_test_organ.json --simsearch Config/simSearch.json --multidesc Config/multidesc_caffe_organ.json --doc Config/doc_ocv.json'}, {'shell': 'sleep 120'}, {'shell': '/tmp/plantnet-data/status_collector.sh 1300 10 http://127.0.0.1:8201/status /tmp/metrics_identify', 'async': 1400, 'poll': 0}], 'name': 'all'}

# LAUNCH

# ROLES
{'all': [Host(address='chifflot-7.lille.grid5000.fr', alias='chifflot-7.lille.grid5000.fr', user='root', keyfile=None, port=None, extra={'my_lille_network': 'ens5f0', 'my_lille_network_dev': 'ens5f0', 'my_lille_network_ip': '172.16.36.7', 'enos_devices': ['ens5f0']})]}

# EXTRA_VARS
{'working_dir': '/home/drosendo/plantnet-data'}



# # # HOSTS
{'hosts': 'all', 'tasks': [{'debug': {'msg': 'Starting data producer'}}, {'shell': 'docker run -d --rm -p 8202:8202 -v /tmp/plantnet-data:/data --name crash.docker registry.gitlab.inria.fr/snoop/plantnet/cuda92:latest /opt/snoop/bin/pn3t_crashTest --cache /data/cache --host http://{{ plantnetengine.url }}:8201/v2/identify --obs /data/obs.json --nb 2 --port 8202'}, {'shell': 'sleep 10 && chmod +x /tmp/plantnet-data/status_collector.sh'}, {'shell': '/tmp/plantnet-data/status_collector.sh 1300 10 http://127.0.0.1:8202/status /tmp/metrics_crash', 'async': 1380, 'poll': 0}], 'name': 'all'}

# LAUNCH

# ROLES
{'all': [Host(address='gros-63.nancy.grid5000.fr', alias='gros-63.nancy.grid5000.fr', user='root', keyfile=None, port=None, extra={'my_nancy_network': 'eno1', 'my_nancy_network_dev': 'eno1', 'my_nancy_network_ip': '172.16.66.63', 'enos_devices': ['eno1'], 'plantnetengine': {'__address__': 'chifflot-7.lille.grid5000.fr', 'url': 'chifflot-7.lille.grid5000.fr'}}), Host(address='gros-64.nancy.grid5000.fr', alias='gros-64.nancy.grid5000.fr', user='root', keyfile=None, port=None, extra={'my_nancy_network': 'eno1', 'my_nancy_network_dev': 'eno1', 'my_nancy_network_ip': '172.16.66.64', 'enos_devices': ['eno1'], 'plantnetengine': {'__address__': 'chifflot-7.lille.grid5000.fr', 'url': 'chifflot-7.lille.grid5000.fr'}}), Host(address='gros-65.nancy.grid5000.fr', alias='gros-65.nancy.grid5000.fr', user='root', keyfile=None, port=None, extra={'my_nancy_network': 'eno1', 'my_nancy_network_dev': 'eno1', 'my_nancy_network_ip': '172.16.66.65', 'enos_devices': ['eno1'], 'plantnetengine': {'__address__': 'chifflot-7.lille.grid5000.fr', 'url': 'chifflot-7.lille.grid5000.fr'}}), Host(address='gros-66.nancy.grid5000.fr', alias='gros-66.nancy.grid5000.fr', user='root', keyfile=None, port=None, extra={'my_nancy_network': 'eno1', 'my_nancy_network_dev': 'eno1', 'my_nancy_network_ip': '172.16.66.66', 'enos_devices': ['eno1'], 'plantnetengine': {'__address__': 'chifflot-7.lille.grid5000.fr', 'url': 'chifflot-7.lille.grid5000.fr'}}), Host(address='gros-67.nancy.grid5000.fr', alias='gros-67.nancy.grid5000.fr', user='root', keyfile=None, port=None, extra={'my_nancy_network': 'eno1', 'my_nancy_network_dev': 'eno1', 'my_nancy_network_ip': '172.16.66.67', 'enos_devices': ['eno1'], 'plantnetengine': {'__address__': 'chifflot-7.lille.grid5000.fr', 'url': 'chifflot-7.lille.grid5000.fr'}}), Host(address='gros-68.nancy.grid5000.fr', alias='gros-68.nancy.grid5000.fr', user='root', keyfile=None, port=None, extra={'my_nancy_network': 'eno1', 'my_nancy_network_dev': 'eno1', 'my_nancy_network_ip': '172.16.66.68', 'enos_devices': ['eno1'], 'plantnetengine': {'__address__': 'chifflot-7.lille.grid5000.fr', 'url': 'chifflot-7.lille.grid5000.fr'}}), Host(address='gros-69.nancy.grid5000.fr', alias='gros-69.nancy.grid5000.fr', user='root', keyfile=None, port=None, extra={'my_nancy_network': 'eno1', 'my_nancy_network_dev': 'eno1', 'my_nancy_network_ip': '172.16.66.69', 'enos_devices': ['eno1'], 'plantnetengine': {'__address__': 'chifflot-7.lille.grid5000.fr', 'url': 'chifflot-7.lille.grid5000.fr'}}), Host(address='gros-7.nancy.grid5000.fr', alias='gros-7.nancy.grid5000.fr', user='root', keyfile=None, port=None, extra={'my_nancy_network': 'eno1', 'my_nancy_network_dev': 'eno1', 'my_nancy_network_ip': '172.16.66.7', 'enos_devices': ['eno1'], 'plantnetengine': {'__address__': 'chifflot-7.lille.grid5000.fr', 'url': 'chifflot-7.lille.grid5000.fr'}}), Host(address='gros-70.nancy.grid5000.fr', alias='gros-70.nancy.grid5000.fr', user='root', keyfile=None, port=None, extra={'my_nancy_network': 'eno1', 'my_nancy_network_dev': 'eno1', 'my_nancy_network_ip': '172.16.66.70', 'enos_devices': ['eno1'], 'plantnetengine': {'__address__': 'chifflot-7.lille.grid5000.fr', 'url': 'chifflot-7.lille.grid5000.fr'}}), Host(address='gros-71.nancy.grid5000.fr', alias='gros-71.nancy.grid5000.fr', user='root', keyfile=None, port=None, extra={'my_nancy_network': 'eno1', 'my_nancy_network_dev': 'eno1', 'my_nancy_network_ip': '172.16.66.71', 'enos_devices': ['eno1'], 'plantnetengine': {'__address__': 'chifflot-7.lille.grid5000.fr', 'url': 'chifflot-7.lille.grid5000.fr'}}), Host(address='gros-72.nancy.grid5000.fr', alias='gros-72.nancy.grid5000.fr', user='root', keyfile=None, port=None, extra={'my_nancy_network': 'eno1', 'my_nancy_network_dev': 'eno1', 'my_nancy_network_ip': '172.16.66.72', 'enos_devices': ['eno1'], 'plantnetengine': {'__address__': 'chifflot-7.lille.grid5000.fr', 'url': 'chifflot-7.lille.grid5000.fr'}}), Host(address='gros-73.nancy.grid5000.fr', alias='gros-73.nancy.grid5000.fr', user='root', keyfile=None, port=None, extra={'my_nancy_network': 'eno1', 'my_nancy_network_dev': 'eno1', 'my_nancy_network_ip': '172.16.66.73', 'enos_devices': ['eno1'], 'plantnetengine': {'__address__': 'chifflot-7.lille.grid5000.fr', 'url': 'chifflot-7.lille.grid5000.fr'}}), Host(address='gros-74.nancy.grid5000.fr', alias='gros-74.nancy.grid5000.fr', user='root', keyfile=None, port=None, extra={'my_nancy_network': 'eno1', 'my_nancy_network_dev': 'eno1', 'my_nancy_network_ip': '172.16.66.74', 'enos_devices': ['eno1'], 'plantnetengine': {'__address__': 'chifflot-7.lille.grid5000.fr', 'url': 'chifflot-7.lille.grid5000.fr'}}), Host(address='gros-75.nancy.grid5000.fr', alias='gros-75.nancy.grid5000.fr', user='root', keyfile=None, port=None, extra={'my_nancy_network': 'eno1', 'my_nancy_network_dev': 'eno1', 'my_nancy_network_ip': '172.16.66.75', 'enos_devices': ['eno1'], 'plantnetengine': {'__address__': 'chifflot-7.lille.grid5000.fr', 'url': 'chifflot-7.lille.grid5000.fr'}}), Host(address='gros-76.nancy.grid5000.fr', alias='gros-76.nancy.grid5000.fr', user='root', keyfile=None, port=None, extra={'my_nancy_network': 'eno1', 'my_nancy_network_dev': 'eno1', 'my_nancy_network_ip': '172.16.66.76', 'enos_devices': ['eno1'], 'plantnetengine': {'__address__': 'chifflot-7.lille.grid5000.fr', 'url': 'chifflot-7.lille.grid5000.fr'}}), Host(address='gros-77.nancy.grid5000.fr', alias='gros-77.nancy.grid5000.fr', user='root', keyfile=None, port=None, extra={'my_nancy_network': 'eno1', 'my_nancy_network_dev': 'eno1', 'my_nancy_network_ip': '172.16.66.77', 'enos_devices': ['eno1'], 'plantnetengine': {'__address__': 'chifflot-7.lille.grid5000.fr', 'url': 'chifflot-7.lille.grid5000.fr'}}), Host(address='gros-78.nancy.grid5000.fr', alias='gros-78.nancy.grid5000.fr', user='root', keyfile=None, port=None, extra={'my_nancy_network': 'eno1', 'my_nancy_network_dev': 'eno1', 'my_nancy_network_ip': '172.16.66.78', 'enos_devices': ['eno1'], 'plantnetengine': {'__address__': 'chifflot-7.lille.grid5000.fr', 'url': 'chifflot-7.lille.grid5000.fr'}}), Host(address='gros-79.nancy.grid5000.fr', alias='gros-79.nancy.grid5000.fr', user='root', keyfile=None, port=None, extra={'my_nancy_network': 'eno1', 'my_nancy_network_dev': 'eno1', 'my_nancy_network_ip': '172.16.66.79', 'enos_devices': ['eno1'], 'plantnetengine': {'__address__': 'chifflot-7.lille.grid5000.fr', 'url': 'chifflot-7.lille.grid5000.fr'}}), Host(address='gros-8.nancy.grid5000.fr', alias='gros-8.nancy.grid5000.fr', user='root', keyfile=None, port=None, extra={'my_nancy_network': 'eno1', 'my_nancy_network_dev': 'eno1', 'my_nancy_network_ip': '172.16.66.8', 'enos_devices': ['eno1'], 'plantnetengine': {'__address__': 'chifflot-7.lille.grid5000.fr', 'url': 'chifflot-7.lille.grid5000.fr'}}), Host(address='gros-80.nancy.grid5000.fr', alias='gros-80.nancy.grid5000.fr', user='root', keyfile=None, port=None, extra={'my_nancy_network': 'eno1', 'my_nancy_network_dev': 'eno1', 'my_nancy_network_ip': '172.16.66.80', 'enos_devices': ['eno1'], 'plantnetengine': {'__address__': 'chifflot-7.lille.grid5000.fr', 'url': 'chifflot-7.lille.grid5000.fr'}}), Host(address='gros-81.nancy.grid5000.fr', alias='gros-81.nancy.grid5000.fr', user='root', keyfile=None, port=None, extra={'my_nancy_network': 'eno1', 'my_nancy_network_dev': 'eno1', 'my_nancy_network_ip': '172.16.66.81', 'enos_devices': ['eno1'], 'plantnetengine': {'__address__': 'chifflot-7.lille.grid5000.fr', 'url': 'chifflot-7.lille.grid5000.fr'}}), Host(address='gros-82.nancy.grid5000.fr', alias='gros-82.nancy.grid5000.fr', user='root', keyfile=None, port=None, extra={'my_nancy_network': 'eno1', 'my_nancy_network_dev': 'eno1', 'my_nancy_network_ip': '172.16.66.82', 'enos_devices': ['eno1'], 'plantnetengine': {'__address__': 'chifflot-7.lille.grid5000.fr', 'url': 'chifflot-7.lille.grid5000.fr'}}), Host(address='gros-83.nancy.grid5000.fr', alias='gros-83.nancy.grid5000.fr', user='root', keyfile=None, port=None, extra={'my_nancy_network': 'eno1', 'my_nancy_network_dev': 'eno1', 'my_nancy_network_ip': '172.16.66.83', 'enos_devices': ['eno1'], 'plantnetengine': {'__address__': 'chifflot-7.lille.grid5000.fr', 'url': 'chifflot-7.lille.grid5000.fr'}}), Host(address='gros-84.nancy.grid5000.fr', alias='gros-84.nancy.grid5000.fr', user='root', keyfile=None, port=None, extra={'my_nancy_network': 'eno1', 'my_nancy_network_dev': 'eno1', 'my_nancy_network_ip': '172.16.66.84', 'enos_devices': ['eno1'], 'plantnetengine': {'__address__': 'chifflot-7.lille.grid5000.fr', 'url': 'chifflot-7.lille.grid5000.fr'}}), Host(address='gros-85.nancy.grid5000.fr', alias='gros-85.nancy.grid5000.fr', user='root', keyfile=None, port=None, extra={'my_nancy_network': 'eno1', 'my_nancy_network_dev': 'eno1', 'my_nancy_network_ip': '172.16.66.85', 'enos_devices': ['eno1'], 'plantnetengine': {'__address__': 'chifflot-7.lille.grid5000.fr', 'url': 'chifflot-7.lille.grid5000.fr'}}), Host(address='gros-86.nancy.grid5000.fr', alias='gros-86.nancy.grid5000.fr', user='root', keyfile=None, port=None, extra={'my_nancy_network': 'eno1', 'my_nancy_network_dev': 'eno1', 'my_nancy_network_ip': '172.16.66.86', 'enos_devices': ['eno1'], 'plantnetengine': {'__address__': 'chifflot-7.lille.grid5000.fr', 'url': 'chifflot-7.lille.grid5000.fr'}}), Host(address='gros-87.nancy.grid5000.fr', alias='gros-87.nancy.grid5000.fr', user='root', keyfile=None, port=None, extra={'my_nancy_network': 'eno1', 'my_nancy_network_dev': 'eno1', 'my_nancy_network_ip': '172.16.66.87', 'enos_devices': ['eno1'], 'plantnetengine': {'__address__': 'chifflot-7.lille.grid5000.fr', 'url': 'chifflot-7.lille.grid5000.fr'}}), Host(address='gros-88.nancy.grid5000.fr', alias='gros-88.nancy.grid5000.fr', user='root', keyfile=None, port=None, extra={'my_nancy_network': 'eno1', 'my_nancy_network_dev': 'eno1', 'my_nancy_network_ip': '172.16.66.88', 'enos_devices': ['eno1'], 'plantnetengine': {'__address__': 'chifflot-7.lille.grid5000.fr', 'url': 'chifflot-7.lille.grid5000.fr'}}), Host(address='gros-89.nancy.grid5000.fr', alias='gros-89.nancy.grid5000.fr', user='root', keyfile=None, port=None, extra={'my_nancy_network': 'eno1', 'my_nancy_network_dev': 'eno1', 'my_nancy_network_ip': '172.16.66.89', 'enos_devices': ['eno1'], 'plantnetengine': {'__address__': 'chifflot-7.lille.grid5000.fr', 'url': 'chifflot-7.lille.grid5000.fr'}}), Host(address='gros-9.nancy.grid5000.fr', alias='gros-9.nancy.grid5000.fr', user='root', keyfile=None, port=None, extra={'my_nancy_network': 'eno1', 'my_nancy_network_dev': 'eno1', 'my_nancy_network_ip': '172.16.66.9', 'enos_devices': ['eno1'], 'plantnetengine': {'__address__': 'chifflot-7.lille.grid5000.fr', 'url': 'chifflot-7.lille.grid5000.fr'}}), Host(address='gros-90.nancy.grid5000.fr', alias='gros-90.nancy.grid5000.fr', user='root', keyfile=None, port=None, extra={'my_nancy_network': 'eno1', 'my_nancy_network_dev': 'eno1', 'my_nancy_network_ip': '172.16.66.90', 'enos_devices': ['eno1'], 'plantnetengine': {'__address__': 'chifflot-7.lille.grid5000.fr', 'url': 'chifflot-7.lille.grid5000.fr'}}), Host(address='gros-91.nancy.grid5000.fr', alias='gros-91.nancy.grid5000.fr', user='root', keyfile=None, port=None, extra={'my_nancy_network': 'eno1', 'my_nancy_network_dev': 'eno1', 'my_nancy_network_ip': '172.16.66.91', 'enos_devices': ['eno1'], 'plantnetengine': {'__address__': 'chifflot-7.lille.grid5000.fr', 'url': 'chifflot-7.lille.grid5000.fr'}}), Host(address='gros-92.nancy.grid5000.fr', alias='gros-92.nancy.grid5000.fr', user='root', keyfile=None, port=None, extra={'my_nancy_network': 'eno1', 'my_nancy_network_dev': 'eno1', 'my_nancy_network_ip': '172.16.66.92', 'enos_devices': ['eno1'], 'plantnetengine': {'__address__': 'chifflot-7.lille.grid5000.fr', 'url': 'chifflot-7.lille.grid5000.fr'}}), Host(address='gros-93.nancy.grid5000.fr', alias='gros-93.nancy.grid5000.fr', user='root', keyfile=None, port=None, extra={'my_nancy_network': 'eno1', 'my_nancy_network_dev': 'eno1', 'my_nancy_network_ip': '172.16.66.93', 'enos_devices': ['eno1'], 'plantnetengine': {'__address__': 'chifflot-7.lille.grid5000.fr', 'url': 'chifflot-7.lille.grid5000.fr'}}), Host(address='gros-94.nancy.grid5000.fr', alias='gros-94.nancy.grid5000.fr', user='root', keyfile=None, port=None, extra={'my_nancy_network': 'eno1', 'my_nancy_network_dev': 'eno1', 'my_nancy_network_ip': '172.16.66.94', 'enos_devices': ['eno1'], 'plantnetengine': {'__address__': 'chifflot-7.lille.grid5000.fr', 'url': 'chifflot-7.lille.grid5000.fr'}}), Host(address='gros-95.nancy.grid5000.fr', alias='gros-95.nancy.grid5000.fr', user='root', keyfile=None, port=None, extra={'my_nancy_network': 'eno1', 'my_nancy_network_dev': 'eno1', 'my_nancy_network_ip': '172.16.66.95', 'enos_devices': ['eno1'], 'plantnetengine': {'__address__': 'chifflot-7.lille.grid5000.fr', 'url': 'chifflot-7.lille.grid5000.fr'}}), Host(address='gros-96.nancy.grid5000.fr', alias='gros-96.nancy.grid5000.fr', user='root', keyfile=None, port=None, extra={'my_nancy_network': 'eno1', 'my_nancy_network_dev': 'eno1', 'my_nancy_network_ip': '172.16.66.96', 'enos_devices': ['eno1'], 'plantnetengine': {'__address__': 'chifflot-7.lille.grid5000.fr', 'url': 'chifflot-7.lille.grid5000.fr'}}), Host(address='gros-97.nancy.grid5000.fr', alias='gros-97.nancy.grid5000.fr', user='root', keyfile=None, port=None, extra={'my_nancy_network': 'eno1', 'my_nancy_network_dev': 'eno1', 'my_nancy_network_ip': '172.16.66.97', 'enos_devices': ['eno1'], 'plantnetengine': {'__address__': 'chifflot-7.lille.grid5000.fr', 'url': 'chifflot-7.lille.grid5000.fr'}}), Host(address='gros-98.nancy.grid5000.fr', alias='gros-98.nancy.grid5000.fr', user='root', keyfile=None, port=None, extra={'my_nancy_network': 'eno1', 'my_nancy_network_dev': 'eno1', 'my_nancy_network_ip': '172.16.66.98', 'enos_devices': ['eno1'], 'plantnetengine': {'__address__': 'chifflot-7.lille.grid5000.fr', 'url': 'chifflot-7.lille.grid5000.fr'}}), Host(address='gros-99.nancy.grid5000.fr', alias='gros-99.nancy.grid5000.fr', user='root', keyfile=None, port=None, extra={'my_nancy_network': 'eno1', 'my_nancy_network_dev': 'eno1', 'my_nancy_network_ip': '172.16.66.99', 'enos_devices': ['eno1'], 'plantnetengine': {'__address__': 'chifflot-7.lille.grid5000.fr', 'url': 'chifflot-7.lille.grid5000.fr'}})]}

# EXTRA_VARS
{'working_dir': '/home/drosendo/plantnet-data'}



# # # HOSTS
{'hosts': 'all', 'tasks': [{'debug': {'msg': 'Stopping PlantNetEngine'}}, {'shell': 'sudo docker stop identify.docker || true'}, {'shell': 'tar -zcf /tmp/metrics_identify.tar.gz --absolute-names /tmp/metrics_identify/'}, {'fetch': {'src': '/tmp/metrics_identify.tar.gz', 'dest': '{{ working_dir }}/experiment-results/metrics_identify/', 'validate_checksum': False}}, {'shell': 'curl "https://api.grid5000.fr/sid/sites/lille/metrics?nodes=chifflot-7&metrics=bmc_node_power_watt&start_time=$(date -d \'1380 sec ago\' +%s)" | jq -r \'.[] | [.timestamp, .device_id, .metric_id, .value] | @csv\' > /tmp/metrics_power.csv'}, {'fetch': {'src': '/tmp/metrics_power.csv', 'dest': '{{ working_dir }}/experiment-results/metrics_power/', 'validate_checksum': False}}], 'name': 'all'}

# FINALIZE

# ROLES
{'all': [Host(address='chifflot-7.lille.grid5000.fr', alias='chifflot-7.lille.grid5000.fr', user='root', keyfile=None, port=None, extra={'my_lille_network': 'ens5f0', 'my_lille_network_dev': 'ens5f0', 'my_lille_network_ip': '172.16.36.7', 'enos_devices': ['ens5f0']})]}

# EXTRA_VARS
{'working_dir': '/home/drosendo/git/e2clab-examples/plantnet/getting_started/GPU/v1/scenario_40/20210402-125759'}



# # # HOSTS
{'hosts': 'all', 'tasks': [{'debug': {'msg': 'Stopping data producer'}}, {'shell': 'sudo docker stop crash.docker || true && tar -zcf /tmp/metrics_crash.tar.gz --absolute-names /tmp/metrics_crash/'}, {'fetch': {'src': '/tmp/metrics_crash.tar.gz', 'dest': '{{ working_dir }}/experiment-results/metrics_crash/', 'validate_checksum': False}}], 'name': 'all'}

# FINALIZE

# ROLES
{'all': [Host(address='gros-63.nancy.grid5000.fr', alias='gros-63.nancy.grid5000.fr', user='root', keyfile=None, port=None, extra={'my_nancy_network': 'eno1', 'my_nancy_network_dev': 'eno1', 'my_nancy_network_ip': '172.16.66.63', 'enos_devices': ['eno1'], 'plantnetengine': {'__address__': 'chifflot-7.lille.grid5000.fr', 'url': 'chifflot-7.lille.grid5000.fr'}}), Host(address='gros-64.nancy.grid5000.fr', alias='gros-64.nancy.grid5000.fr', user='root', keyfile=None, port=None, extra={'my_nancy_network': 'eno1', 'my_nancy_network_dev': 'eno1', 'my_nancy_network_ip': '172.16.66.64', 'enos_devices': ['eno1'], 'plantnetengine': {'__address__': 'chifflot-7.lille.grid5000.fr', 'url': 'chifflot-7.lille.grid5000.fr'}}), Host(address='gros-65.nancy.grid5000.fr', alias='gros-65.nancy.grid5000.fr', user='root', keyfile=None, port=None, extra={'my_nancy_network': 'eno1', 'my_nancy_network_dev': 'eno1', 'my_nancy_network_ip': '172.16.66.65', 'enos_devices': ['eno1'], 'plantnetengine': {'__address__': 'chifflot-7.lille.grid5000.fr', 'url': 'chifflot-7.lille.grid5000.fr'}}), Host(address='gros-66.nancy.grid5000.fr', alias='gros-66.nancy.grid5000.fr', user='root', keyfile=None, port=None, extra={'my_nancy_network': 'eno1', 'my_nancy_network_dev': 'eno1', 'my_nancy_network_ip': '172.16.66.66', 'enos_devices': ['eno1'], 'plantnetengine': {'__address__': 'chifflot-7.lille.grid5000.fr', 'url': 'chifflot-7.lille.grid5000.fr'}}), Host(address='gros-67.nancy.grid5000.fr', alias='gros-67.nancy.grid5000.fr', user='root', keyfile=None, port=None, extra={'my_nancy_network': 'eno1', 'my_nancy_network_dev': 'eno1', 'my_nancy_network_ip': '172.16.66.67', 'enos_devices': ['eno1'], 'plantnetengine': {'__address__': 'chifflot-7.lille.grid5000.fr', 'url': 'chifflot-7.lille.grid5000.fr'}}), Host(address='gros-68.nancy.grid5000.fr', alias='gros-68.nancy.grid5000.fr', user='root', keyfile=None, port=None, extra={'my_nancy_network': 'eno1', 'my_nancy_network_dev': 'eno1', 'my_nancy_network_ip': '172.16.66.68', 'enos_devices': ['eno1'], 'plantnetengine': {'__address__': 'chifflot-7.lille.grid5000.fr', 'url': 'chifflot-7.lille.grid5000.fr'}}), Host(address='gros-69.nancy.grid5000.fr', alias='gros-69.nancy.grid5000.fr', user='root', keyfile=None, port=None, extra={'my_nancy_network': 'eno1', 'my_nancy_network_dev': 'eno1', 'my_nancy_network_ip': '172.16.66.69', 'enos_devices': ['eno1'], 'plantnetengine': {'__address__': 'chifflot-7.lille.grid5000.fr', 'url': 'chifflot-7.lille.grid5000.fr'}}), Host(address='gros-7.nancy.grid5000.fr', alias='gros-7.nancy.grid5000.fr', user='root', keyfile=None, port=None, extra={'my_nancy_network': 'eno1', 'my_nancy_network_dev': 'eno1', 'my_nancy_network_ip': '172.16.66.7', 'enos_devices': ['eno1'], 'plantnetengine': {'__address__': 'chifflot-7.lille.grid5000.fr', 'url': 'chifflot-7.lille.grid5000.fr'}}), Host(address='gros-70.nancy.grid5000.fr', alias='gros-70.nancy.grid5000.fr', user='root', keyfile=None, port=None, extra={'my_nancy_network': 'eno1', 'my_nancy_network_dev': 'eno1', 'my_nancy_network_ip': '172.16.66.70', 'enos_devices': ['eno1'], 'plantnetengine': {'__address__': 'chifflot-7.lille.grid5000.fr', 'url': 'chifflot-7.lille.grid5000.fr'}}), Host(address='gros-71.nancy.grid5000.fr', alias='gros-71.nancy.grid5000.fr', user='root', keyfile=None, port=None, extra={'my_nancy_network': 'eno1', 'my_nancy_network_dev': 'eno1', 'my_nancy_network_ip': '172.16.66.71', 'enos_devices': ['eno1'], 'plantnetengine': {'__address__': 'chifflot-7.lille.grid5000.fr', 'url': 'chifflot-7.lille.grid5000.fr'}}), Host(address='gros-72.nancy.grid5000.fr', alias='gros-72.nancy.grid5000.fr', user='root', keyfile=None, port=None, extra={'my_nancy_network': 'eno1', 'my_nancy_network_dev': 'eno1', 'my_nancy_network_ip': '172.16.66.72', 'enos_devices': ['eno1'], 'plantnetengine': {'__address__': 'chifflot-7.lille.grid5000.fr', 'url': 'chifflot-7.lille.grid5000.fr'}}), Host(address='gros-73.nancy.grid5000.fr', alias='gros-73.nancy.grid5000.fr', user='root', keyfile=None, port=None, extra={'my_nancy_network': 'eno1', 'my_nancy_network_dev': 'eno1', 'my_nancy_network_ip': '172.16.66.73', 'enos_devices': ['eno1'], 'plantnetengine': {'__address__': 'chifflot-7.lille.grid5000.fr', 'url': 'chifflot-7.lille.grid5000.fr'}}), Host(address='gros-74.nancy.grid5000.fr', alias='gros-74.nancy.grid5000.fr', user='root', keyfile=None, port=None, extra={'my_nancy_network': 'eno1', 'my_nancy_network_dev': 'eno1', 'my_nancy_network_ip': '172.16.66.74', 'enos_devices': ['eno1'], 'plantnetengine': {'__address__': 'chifflot-7.lille.grid5000.fr', 'url': 'chifflot-7.lille.grid5000.fr'}}), Host(address='gros-75.nancy.grid5000.fr', alias='gros-75.nancy.grid5000.fr', user='root', keyfile=None, port=None, extra={'my_nancy_network': 'eno1', 'my_nancy_network_dev': 'eno1', 'my_nancy_network_ip': '172.16.66.75', 'enos_devices': ['eno1'], 'plantnetengine': {'__address__': 'chifflot-7.lille.grid5000.fr', 'url': 'chifflot-7.lille.grid5000.fr'}}), Host(address='gros-76.nancy.grid5000.fr', alias='gros-76.nancy.grid5000.fr', user='root', keyfile=None, port=None, extra={'my_nancy_network': 'eno1', 'my_nancy_network_dev': 'eno1', 'my_nancy_network_ip': '172.16.66.76', 'enos_devices': ['eno1'], 'plantnetengine': {'__address__': 'chifflot-7.lille.grid5000.fr', 'url': 'chifflot-7.lille.grid5000.fr'}}), Host(address='gros-77.nancy.grid5000.fr', alias='gros-77.nancy.grid5000.fr', user='root', keyfile=None, port=None, extra={'my_nancy_network': 'eno1', 'my_nancy_network_dev': 'eno1', 'my_nancy_network_ip': '172.16.66.77', 'enos_devices': ['eno1'], 'plantnetengine': {'__address__': 'chifflot-7.lille.grid5000.fr', 'url': 'chifflot-7.lille.grid5000.fr'}}), Host(address='gros-78.nancy.grid5000.fr', alias='gros-78.nancy.grid5000.fr', user='root', keyfile=None, port=None, extra={'my_nancy_network': 'eno1', 'my_nancy_network_dev': 'eno1', 'my_nancy_network_ip': '172.16.66.78', 'enos_devices': ['eno1'], 'plantnetengine': {'__address__': 'chifflot-7.lille.grid5000.fr', 'url': 'chifflot-7.lille.grid5000.fr'}}), Host(address='gros-79.nancy.grid5000.fr', alias='gros-79.nancy.grid5000.fr', user='root', keyfile=None, port=None, extra={'my_nancy_network': 'eno1', 'my_nancy_network_dev': 'eno1', 'my_nancy_network_ip': '172.16.66.79', 'enos_devices': ['eno1'], 'plantnetengine': {'__address__': 'chifflot-7.lille.grid5000.fr', 'url': 'chifflot-7.lille.grid5000.fr'}}), Host(address='gros-8.nancy.grid5000.fr', alias='gros-8.nancy.grid5000.fr', user='root', keyfile=None, port=None, extra={'my_nancy_network': 'eno1', 'my_nancy_network_dev': 'eno1', 'my_nancy_network_ip': '172.16.66.8', 'enos_devices': ['eno1'], 'plantnetengine': {'__address__': 'chifflot-7.lille.grid5000.fr', 'url': 'chifflot-7.lille.grid5000.fr'}}), Host(address='gros-80.nancy.grid5000.fr', alias='gros-80.nancy.grid5000.fr', user='root', keyfile=None, port=None, extra={'my_nancy_network': 'eno1', 'my_nancy_network_dev': 'eno1', 'my_nancy_network_ip': '172.16.66.80', 'enos_devices': ['eno1'], 'plantnetengine': {'__address__': 'chifflot-7.lille.grid5000.fr', 'url': 'chifflot-7.lille.grid5000.fr'}}), Host(address='gros-81.nancy.grid5000.fr', alias='gros-81.nancy.grid5000.fr', user='root', keyfile=None, port=None, extra={'my_nancy_network': 'eno1', 'my_nancy_network_dev': 'eno1', 'my_nancy_network_ip': '172.16.66.81', 'enos_devices': ['eno1'], 'plantnetengine': {'__address__': 'chifflot-7.lille.grid5000.fr', 'url': 'chifflot-7.lille.grid5000.fr'}}), Host(address='gros-82.nancy.grid5000.fr', alias='gros-82.nancy.grid5000.fr', user='root', keyfile=None, port=None, extra={'my_nancy_network': 'eno1', 'my_nancy_network_dev': 'eno1', 'my_nancy_network_ip': '172.16.66.82', 'enos_devices': ['eno1'], 'plantnetengine': {'__address__': 'chifflot-7.lille.grid5000.fr', 'url': 'chifflot-7.lille.grid5000.fr'}}), Host(address='gros-83.nancy.grid5000.fr', alias='gros-83.nancy.grid5000.fr', user='root', keyfile=None, port=None, extra={'my_nancy_network': 'eno1', 'my_nancy_network_dev': 'eno1', 'my_nancy_network_ip': '172.16.66.83', 'enos_devices': ['eno1'], 'plantnetengine': {'__address__': 'chifflot-7.lille.grid5000.fr', 'url': 'chifflot-7.lille.grid5000.fr'}}), Host(address='gros-84.nancy.grid5000.fr', alias='gros-84.nancy.grid5000.fr', user='root', keyfile=None, port=None, extra={'my_nancy_network': 'eno1', 'my_nancy_network_dev': 'eno1', 'my_nancy_network_ip': '172.16.66.84', 'enos_devices': ['eno1'], 'plantnetengine': {'__address__': 'chifflot-7.lille.grid5000.fr', 'url': 'chifflot-7.lille.grid5000.fr'}}), Host(address='gros-85.nancy.grid5000.fr', alias='gros-85.nancy.grid5000.fr', user='root', keyfile=None, port=None, extra={'my_nancy_network': 'eno1', 'my_nancy_network_dev': 'eno1', 'my_nancy_network_ip': '172.16.66.85', 'enos_devices': ['eno1'], 'plantnetengine': {'__address__': 'chifflot-7.lille.grid5000.fr', 'url': 'chifflot-7.lille.grid5000.fr'}}), Host(address='gros-86.nancy.grid5000.fr', alias='gros-86.nancy.grid5000.fr', user='root', keyfile=None, port=None, extra={'my_nancy_network': 'eno1', 'my_nancy_network_dev': 'eno1', 'my_nancy_network_ip': '172.16.66.86', 'enos_devices': ['eno1'], 'plantnetengine': {'__address__': 'chifflot-7.lille.grid5000.fr', 'url': 'chifflot-7.lille.grid5000.fr'}}), Host(address='gros-87.nancy.grid5000.fr', alias='gros-87.nancy.grid5000.fr', user='root', keyfile=None, port=None, extra={'my_nancy_network': 'eno1', 'my_nancy_network_dev': 'eno1', 'my_nancy_network_ip': '172.16.66.87', 'enos_devices': ['eno1'], 'plantnetengine': {'__address__': 'chifflot-7.lille.grid5000.fr', 'url': 'chifflot-7.lille.grid5000.fr'}}), Host(address='gros-88.nancy.grid5000.fr', alias='gros-88.nancy.grid5000.fr', user='root', keyfile=None, port=None, extra={'my_nancy_network': 'eno1', 'my_nancy_network_dev': 'eno1', 'my_nancy_network_ip': '172.16.66.88', 'enos_devices': ['eno1'], 'plantnetengine': {'__address__': 'chifflot-7.lille.grid5000.fr', 'url': 'chifflot-7.lille.grid5000.fr'}}), Host(address='gros-89.nancy.grid5000.fr', alias='gros-89.nancy.grid5000.fr', user='root', keyfile=None, port=None, extra={'my_nancy_network': 'eno1', 'my_nancy_network_dev': 'eno1', 'my_nancy_network_ip': '172.16.66.89', 'enos_devices': ['eno1'], 'plantnetengine': {'__address__': 'chifflot-7.lille.grid5000.fr', 'url': 'chifflot-7.lille.grid5000.fr'}}), Host(address='gros-9.nancy.grid5000.fr', alias='gros-9.nancy.grid5000.fr', user='root', keyfile=None, port=None, extra={'my_nancy_network': 'eno1', 'my_nancy_network_dev': 'eno1', 'my_nancy_network_ip': '172.16.66.9', 'enos_devices': ['eno1'], 'plantnetengine': {'__address__': 'chifflot-7.lille.grid5000.fr', 'url': 'chifflot-7.lille.grid5000.fr'}}), Host(address='gros-90.nancy.grid5000.fr', alias='gros-90.nancy.grid5000.fr', user='root', keyfile=None, port=None, extra={'my_nancy_network': 'eno1', 'my_nancy_network_dev': 'eno1', 'my_nancy_network_ip': '172.16.66.90', 'enos_devices': ['eno1'], 'plantnetengine': {'__address__': 'chifflot-7.lille.grid5000.fr', 'url': 'chifflot-7.lille.grid5000.fr'}}), Host(address='gros-91.nancy.grid5000.fr', alias='gros-91.nancy.grid5000.fr', user='root', keyfile=None, port=None, extra={'my_nancy_network': 'eno1', 'my_nancy_network_dev': 'eno1', 'my_nancy_network_ip': '172.16.66.91', 'enos_devices': ['eno1'], 'plantnetengine': {'__address__': 'chifflot-7.lille.grid5000.fr', 'url': 'chifflot-7.lille.grid5000.fr'}}), Host(address='gros-92.nancy.grid5000.fr', alias='gros-92.nancy.grid5000.fr', user='root', keyfile=None, port=None, extra={'my_nancy_network': 'eno1', 'my_nancy_network_dev': 'eno1', 'my_nancy_network_ip': '172.16.66.92', 'enos_devices': ['eno1'], 'plantnetengine': {'__address__': 'chifflot-7.lille.grid5000.fr', 'url': 'chifflot-7.lille.grid5000.fr'}}), Host(address='gros-93.nancy.grid5000.fr', alias='gros-93.nancy.grid5000.fr', user='root', keyfile=None, port=None, extra={'my_nancy_network': 'eno1', 'my_nancy_network_dev': 'eno1', 'my_nancy_network_ip': '172.16.66.93', 'enos_devices': ['eno1'], 'plantnetengine': {'__address__': 'chifflot-7.lille.grid5000.fr', 'url': 'chifflot-7.lille.grid5000.fr'}}), Host(address='gros-94.nancy.grid5000.fr', alias='gros-94.nancy.grid5000.fr', user='root', keyfile=None, port=None, extra={'my_nancy_network': 'eno1', 'my_nancy_network_dev': 'eno1', 'my_nancy_network_ip': '172.16.66.94', 'enos_devices': ['eno1'], 'plantnetengine': {'__address__': 'chifflot-7.lille.grid5000.fr', 'url': 'chifflot-7.lille.grid5000.fr'}}), Host(address='gros-95.nancy.grid5000.fr', alias='gros-95.nancy.grid5000.fr', user='root', keyfile=None, port=None, extra={'my_nancy_network': 'eno1', 'my_nancy_network_dev': 'eno1', 'my_nancy_network_ip': '172.16.66.95', 'enos_devices': ['eno1'], 'plantnetengine': {'__address__': 'chifflot-7.lille.grid5000.fr', 'url': 'chifflot-7.lille.grid5000.fr'}}), Host(address='gros-96.nancy.grid5000.fr', alias='gros-96.nancy.grid5000.fr', user='root', keyfile=None, port=None, extra={'my_nancy_network': 'eno1', 'my_nancy_network_dev': 'eno1', 'my_nancy_network_ip': '172.16.66.96', 'enos_devices': ['eno1'], 'plantnetengine': {'__address__': 'chifflot-7.lille.grid5000.fr', 'url': 'chifflot-7.lille.grid5000.fr'}}), Host(address='gros-97.nancy.grid5000.fr', alias='gros-97.nancy.grid5000.fr', user='root', keyfile=None, port=None, extra={'my_nancy_network': 'eno1', 'my_nancy_network_dev': 'eno1', 'my_nancy_network_ip': '172.16.66.97', 'enos_devices': ['eno1'], 'plantnetengine': {'__address__': 'chifflot-7.lille.grid5000.fr', 'url': 'chifflot-7.lille.grid5000.fr'}}), Host(address='gros-98.nancy.grid5000.fr', alias='gros-98.nancy.grid5000.fr', user='root', keyfile=None, port=None, extra={'my_nancy_network': 'eno1', 'my_nancy_network_dev': 'eno1', 'my_nancy_network_ip': '172.16.66.98', 'enos_devices': ['eno1'], 'plantnetengine': {'__address__': 'chifflot-7.lille.grid5000.fr', 'url': 'chifflot-7.lille.grid5000.fr'}}), Host(address='gros-99.nancy.grid5000.fr', alias='gros-99.nancy.grid5000.fr', user='root', keyfile=None, port=None, extra={'my_nancy_network': 'eno1', 'my_nancy_network_dev': 'eno1', 'my_nancy_network_ip': '172.16.66.99', 'enos_devices': ['eno1'], 'plantnetengine': {'__address__': 'chifflot-7.lille.grid5000.fr', 'url': 'chifflot-7.lille.grid5000.fr'}})]}

# EXTRA_VARS
{'working_dir': '/home/drosendo/git/e2clab-examples/plantnet/getting_started/GPU/v1/scenario_40/20210402-125759'}



