172.16.36.7  : 23.31 13.80 13.80 13.81 13.80 13.79 13.77 13.78 13.79 13.81
172.16.66.25 : 0.24 0.20 0.17 0.19 0.18 0.19 0.18 0.18 0.18 0.18
172.16.66.26 : 0.19 0.20 0.21 0.18 0.21 0.21 0.20 0.21 0.21 0.20
172.16.66.27 : 0.22 0.19 0.20 0.20 0.20 0.21 0.22 0.20 0.21 0.21
172.16.66.28 : 0.20 0.21 0.22 0.18 0.18 0.12 0.12 0.13 0.13 0.13
172.16.66.29 : 0.04 0.03 0.03 0.03 0.03 0.03 0.03 0.03 0.03 0.03
172.16.66.3  : 0.24 0.20 0.22 0.22 0.22 0.18 0.22 0.19 0.21 0.21
172.16.66.30 : 0.22 0.21 0.20 0.18 0.21 0.20 0.22 0.21 0.21 0.20
172.16.66.31 : 0.23 0.21 0.20 0.20 0.21 0.22 0.21 0.16 0.20 0.21
172.16.66.32 : 0.23 0.20 0.19 0.18 0.18 0.18 0.19 0.18 0.18 0.18
172.16.66.33 : 0.24 0.20 0.20 0.20 0.21 0.21 0.21 0.21 0.21 0.20
172.16.66.34 : 0.24 0.21 0.22 0.21 0.21 0.21 0.21 0.21 0.22 0.22
172.16.66.35 : 0.21 0.21 0.21 0.21 0.20 0.21 0.21 0.19 0.20 0.22
172.16.66.36 : 0.17 0.22 0.21 0.21 0.21 0.19 0.22 0.20 0.21 0.21
172.16.66.37 : 0.16 0.22 0.20 0.22 0.21 0.21 0.21 0.21 0.20 0.21
172.16.66.38 : 0.13 0.17 0.16 0.17 0.17 0.17 0.18 0.16 0.17 0.17
172.16.66.39 : 0.21 0.20 0.21 0.22 0.20 0.20 0.22 0.19 0.21 0.21
172.16.66.4  : 0.18 0.21 0.18 0.20 0.21 0.18 0.21 0.21 0.21 0.20
172.16.66.40 : 0.20 0.20 0.21 0.21 0.17 0.21 0.21 0.20 0.20 0.21
172.16.66.41 : 0.08 0.17 0.20 0.21 0.20 0.20 0.21 0.21 0.16 0.21
172.16.66.42 : 0.20 0.21 0.21 0.22 0.21 0.21 0.20 0.22 0.21 0.21
172.16.66.43 : 0.24 0.21 0.19 0.22 0.20 0.22 0.22 0.21 0.21 0.22
172.16.66.44 : 0.23 0.21 0.20 0.21 0.21 0.20 0.22 0.13 0.21 0.20
172.16.66.45 : 0.13 0.21 0.21 0.21 0.20 0.22 0.21 0.21 0.20 0.22
172.16.66.46 : 0.22 0.19 0.18 0.21 0.17 0.19 0.22 0.21 0.26 0.21
172.16.66.47 : 0.24 0.20 0.21 0.22 0.20 0.21 0.19 0.20 0.20 0.21
172.16.66.48 : 0.24 0.21 0.21 0.21 0.20 0.21 0.24 0.21 0.21 0.22
172.16.66.49 : 0.17 0.21 0.21 0.22 0.21 0.20 0.21 0.22 0.19 0.21
172.16.66.5  : 0.15 0.21 0.22 0.22 0.19 0.21 0.21 0.20 0.22 0.21
172.16.66.50 : 0.23 0.21 0.20 0.21 0.20 0.21 0.19 0.20 0.22 0.21
172.16.66.51 : 0.24 0.20 0.21 0.22 0.21 0.21 0.22 0.22 0.21 0.21
172.16.66.52 : 0.11 0.16 0.16 0.16 0.16 0.16 0.16 0.15 0.17 0.15
172.16.66.53 : 0.21 0.21 0.21 0.20 0.21 0.21 0.21 0.21 0.21 0.20
172.16.66.54 : 0.20 0.20 0.21 0.19 0.20 0.20 0.21 0.21 0.21 0.21
172.16.66.55 : 0.15 0.21 0.22 0.20 0.21 0.20 0.20 0.22 0.20 0.21
172.16.66.56 : 0.24 0.16 0.21 0.22 0.21 0.19 0.18 0.21 0.22 0.19
172.16.66.57 : 0.22 0.22 0.20 0.22 0.21 0.21 0.21 0.21 0.20 0.12
172.16.66.58 : 0.24 0.21 0.21 0.19 0.21 0.21 0.18 0.20 0.22 0.18
172.16.66.59 : 0.24 0.21 0.21 0.21 0.16 0.21 0.20 0.19 0.22 0.21
172.16.66.6  : 0.24 0.21 0.21 0.22 0.22 0.23 0.21 0.21 0.21 0.21
172.16.66.60 : 0.25 0.21 0.22 0.22 0.21 0.20 0.22 0.21 0.21 0.23
172.16.66.61 : 0.25 0.22 0.21 0.22 0.21 0.21 0.22 0.21 0.21 0.21

      42 targets
      42 alive
       0 unreachable
       0 unknown addresses

       0 timeouts (waiting for response)
     420 ICMP Echos sent
     420 ICMP Echo Replies received
       0 other ICMP received

 0.03 ms (min round trip time)
 0.54 ms (avg round trip time)
 23.3 ms (max round trip time)
        9.422 sec (elapsed real time)

