172.16.36.7  : 14.22 13.91 13.89 13.79 13.79 13.81 13.82 13.84 13.80 13.86
172.16.66.25 : 0.20 0.21 0.20 0.19 0.18 0.21 0.20 0.21 0.20 0.19
172.16.66.26 : 0.20 0.22 0.19 0.20 0.16 0.20 0.20 0.21 0.20 0.21
172.16.66.27 : 0.20 0.20 0.22 0.19 0.21 0.21 0.22 0.18 0.21 0.21
172.16.66.28 : 0.22 0.22 0.20 0.21 0.21 0.20 0.20 0.21 0.21 0.21
172.16.66.29 : 0.23 0.22 0.18 0.21 0.21 0.21 0.20 0.20 0.20 0.19
172.16.66.3  : 0.22 0.21 0.18 0.21 0.20 0.19 0.21 0.20 0.21 0.20
172.16.66.30 : 0.22 0.22 0.21 0.21 0.21 0.20 0.21 0.20 0.21 0.21
172.16.66.31 : 0.23 0.21 0.18 0.21 0.21 0.20 0.21 0.21 0.22 0.19
172.16.66.32 : 0.22 0.21 0.20 0.20 0.19 0.19 0.21 0.21 0.20 0.18
172.16.66.33 : 0.22 0.21 0.20 0.21 0.22 0.21 0.21 0.22 0.21 0.17
172.16.66.34 : 0.21 0.22 0.20 0.21 0.21 0.21 0.20 0.19 0.21 0.20
172.16.66.35 : 0.21 0.22 0.20 0.21 0.22 0.22 0.20 0.19 0.21 0.20
172.16.66.36 : 0.23 0.22 0.19 0.21 0.22 0.21 0.21 0.22 0.17 0.20
172.16.66.37 : 0.23 0.21 0.21 0.21 0.21 0.22 0.20 0.21 0.21 0.20
172.16.66.38 : 0.18 0.16 0.16 0.13 0.16 0.15 0.16 0.16 0.15 0.14
172.16.66.39 : 0.22 0.20 0.20 0.20 0.21 0.17 0.21 0.20 0.20 0.20
172.16.66.4  : 0.21 0.19 0.21 0.21 0.20 0.21 0.21 0.21 0.19 0.20
172.16.66.40 : 0.21 0.22 0.21 0.20 0.22 0.20 0.19 0.21 0.20 0.17
172.16.66.41 : 0.20 0.20 0.23 0.21 0.21 0.21 0.20 0.21 0.22 0.19
172.16.66.42 : 0.23 0.19 0.21 0.20 0.21 0.21 0.18 0.20 0.22 0.19
172.16.66.43 : 0.23 0.20 0.21 0.19 0.20 0.19 0.20 0.20 0.21 0.10
172.16.66.44 : 0.17 0.21 0.18 0.21 0.17 0.22 0.21 0.21 0.21 0.20
172.16.66.45 : 0.23 0.19 0.18 0.14 0.20 0.18 0.19 0.19 0.19 0.20
172.16.66.46 : 0.18 0.22 0.21 0.20 0.21 0.21 0.21 0.21 0.21 0.20
172.16.66.47 : 0.23 0.18 0.20 0.21 0.19 0.21 0.20 0.18 0.21 0.20
172.16.66.48 : 0.22 0.18 0.20 0.21 0.21 0.20 0.20 0.20 0.21 0.21
172.16.66.49 : 0.20 0.18 0.19 0.18 0.18 0.19 0.18 0.18 0.18 0.18
172.16.66.5  : 0.23 0.21 0.22 0.22 0.21 0.21 0.20 0.21 0.21 0.20
172.16.66.50 : 0.22 0.21 0.20 0.20 0.20 0.21 0.19 0.20 0.21 0.19
172.16.66.51 : 0.19 0.21 0.21 0.22 0.21 0.21 0.21 0.18 0.21 0.20
172.16.66.52 : 0.20 0.19 0.20 0.21 0.22 0.20 0.20 0.22 0.20 0.20
172.16.66.53 : 0.20 0.18 0.21 0.20 0.20 0.21 0.20 0.21 0.21 0.18
172.16.66.54 : 0.05 0.03 0.03 0.03 0.01 0.03 0.03 0.03 0.01 0.03
172.16.66.55 : 0.29 0.20 0.21 0.21 0.21 0.20 0.21 0.21 0.20 0.22
172.16.66.56 : 0.33 0.21 0.21 0.21 0.19 0.20 0.20 0.22 0.21 0.20
172.16.66.57 : 0.39 0.21 0.21 0.21 0.21 0.20 0.22 0.21 0.21 0.22
172.16.66.58 : 0.39 0.21 0.20 0.21 0.20 0.21 0.21 0.19 0.21 0.22
172.16.66.59 : 0.38 0.18 0.20 0.19 0.18 0.15 0.18 0.19 0.18 0.20
172.16.66.6  : 0.34 0.20 0.19 0.21 0.20 0.20 0.20 0.21 0.21 0.22
172.16.66.60 : 0.38 0.21 0.20 0.20 0.22 0.21 0.20 0.22 0.21 0.21
172.16.66.61 : 0.39 0.21 0.22 0.21 0.22 0.21 0.20 0.22 0.20 0.20

      42 targets
      42 alive
       0 unreachable
       0 unknown addresses

       0 timeouts (waiting for response)
     420 ICMP Echos sent
     420 ICMP Echo Replies received
       0 other ICMP received

 0.01 ms (min round trip time)
 0.52 ms (avg round trip time)
 14.2 ms (max round trip time)
        9.417 sec (elapsed real time)

