172.16.36.7  : 20.52 - 13.82 13.85 13.84 13.83 13.87 13.85 13.86 13.86
172.16.66.25 : 0.20 0.21 0.20 0.19 0.19 0.20 0.18 0.21 0.20 0.20
172.16.66.26 : 0.22 0.19 0.20 0.20 0.16 0.19 0.20 0.23 0.20 0.20
172.16.66.27 : 0.21 0.20 0.22 0.20 0.18 0.22 0.20 0.18 0.19 0.20
172.16.66.28 : 0.22 0.21 0.18 0.21 0.21 0.20 0.22 0.21 0.21 0.20
172.16.66.29 : 0.20 0.20 0.20 0.21 0.21 0.20 0.20 0.20 0.16 0.20
172.16.66.3  : 0.22 0.20 0.20 0.20 0.19 0.21 0.20 0.20 0.15 0.21
172.16.66.30 : 0.15 0.17 0.16 0.16 0.16 0.20 0.20 0.21 0.21 0.22
172.16.66.31 : 0.20 0.22 0.20 0.21 0.21 0.20 0.22 0.20 0.21 0.22
172.16.66.32 : 0.15 0.16 0.17 0.22 0.20 0.21 0.20 0.20 0.21 0.23
172.16.66.33 : 0.20 0.21 0.21 0.21 0.20 0.16 0.16 0.16 0.22 0.20
172.16.66.34 : 0.20 0.15 0.20 0.24 0.21 0.20 0.17 0.20 0.21 0.21
172.16.66.35 : 0.20 0.21 0.20 0.21 0.20 0.18 0.20 0.20 0.20 0.20
172.16.66.36 : 0.20 0.13 0.19 0.20 0.19 0.21 0.22 0.21 0.18 0.22
172.16.66.37 : 0.20 0.21 0.22 0.20 0.20 0.22 0.20 0.21 0.22 0.20
172.16.66.38 : 0.20 0.21 0.20 0.21 0.21 0.21 0.21 0.20 0.21 0.20
172.16.66.39 : 0.21 0.22 0.20 0.20 0.21 0.20 0.20 0.21 0.20 0.20
172.16.66.4  : 0.04 0.03 0.03 0.03 0.03 0.03 0.03 0.03 0.03 0.03
172.16.66.40 : 0.20 0.17 0.16 0.15 0.13 0.20 0.21 0.21 0.20 0.21
172.16.66.41 : 0.27 0.21 0.21 0.21 0.21 0.21 0.22 0.22 0.21 0.22
172.16.66.42 : 0.26 0.20 0.21 0.21 0.21 0.20 0.22 0.21 0.21 0.20
172.16.66.43 : 0.26 0.20 0.19 0.20 0.20 0.21 0.20 0.21 0.21 0.19
172.16.66.44 : 0.27 0.21 0.20 0.21 0.20 0.18 0.21 0.21 0.16 0.19
172.16.66.45 : 0.27 0.22 0.20 0.21 0.18 0.21 0.22 0.21 0.21 0.21
172.16.66.46 : 0.27 0.21 0.21 0.22 0.20 0.21 0.21 0.21 0.21 0.22
172.16.66.47 : 0.25 0.18 0.20 0.21 0.20 0.19 0.20 0.22 0.19 0.13
172.16.66.48 : 0.26 0.21 0.21 0.21 0.20 0.20 0.19 0.18 0.18 0.19
172.16.66.49 : 0.26 0.18 0.20 0.21 0.20 0.20 0.21 0.21 0.20 0.21
172.16.66.5  : 0.26 0.19 0.19 0.14 0.19 0.13 0.13 0.19 0.18 0.18
172.16.66.50 : 0.20 0.21 0.21 0.21 0.20 0.17 0.22 0.23 0.20 0.23
172.16.66.51 : 0.28 0.21 0.21 0.22 0.21 0.16 0.17 0.18 0.21 0.22
172.16.66.52 : 0.25 0.20 0.22 0.23 0.18 0.20 0.19 0.21 0.21 0.19
172.16.66.53 : 0.27 0.20 0.20 0.21 0.20 0.21 0.21 0.21 0.22 0.19
172.16.66.54 : 0.26 0.21 0.19 0.21 0.21 0.22 0.20 0.21 0.20 0.20
172.16.66.55 : 0.27 0.20 0.20 0.21 0.21 0.21 0.22 0.20 0.21 0.21
172.16.66.56 : 0.34 0.21 0.21 0.21 0.21 0.20 0.20 0.22 0.20 0.20
172.16.66.57 : 0.37 0.21 0.20 0.18 0.21 0.21 0.18 0.16 0.21 0.16
172.16.66.58 : 0.33 0.16 0.14 0.15 0.16 0.20 0.20 0.20 0.20 0.21
172.16.66.59 : 0.31 0.21 0.22 0.21 0.21 0.18 0.18 0.21 0.20 0.21
172.16.66.6  : 0.35 0.22 0.21 0.20 0.21 0.20 0.21 0.22 0.18 0.20
172.16.66.60 : 0.39 0.18 0.21 0.22 0.21 0.13 0.20 0.18 0.20 0.21
172.16.66.61 : 0.23 0.21 0.21 0.22 0.20 0.21 0.21 0.20 0.20 0.21

      42 targets
      42 alive
       0 unreachable
       0 unknown addresses

       1 timeouts (waiting for response)
     420 ICMP Echos sent
     419 ICMP Echo Replies received
       0 other ICMP received

 0.03 ms (min round trip time)
 0.50 ms (avg round trip time)
 20.5 ms (max round trip time)
       10.011 sec (elapsed real time)

