172.16.36.8  : 0.05 0.03 0.03 0.03 0.03 0.03 0.03 0.03 0.03 0.03
172.16.66.62 : 9.75 9.74 9.76 9.76 9.74 9.76 9.76 9.76 9.74 9.76
172.16.66.63 : 21.01 13.85 13.81 13.83 13.90 13.93 13.86 13.92 13.71 13.91
172.16.66.64 : 20.90 13.88 13.91 13.88 13.87 13.90 13.90 13.90 13.90 13.90
172.16.66.65 : 24.67 13.94 13.92 13.92 13.88 13.92 13.84 13.91 - 13.90
172.16.66.66 : 24.59 13.85 13.85 13.83 13.90 13.86 13.94 13.91 13.91 13.88
172.16.66.67 : 20.91 13.90 13.94 13.92 13.88 13.95 13.91 13.93 13.90 13.87
172.16.66.68 : 20.93 13.78 13.88 13.91 13.84 13.82 13.93 13.89 13.94 13.87
172.16.66.69 : 20.86 13.91 13.90 - 13.87 13.92 13.92 - 13.92 13.85
172.16.66.7  : 24.66 13.85 13.84 13.86 13.92 13.89 13.84 13.87 13.90 13.89
172.16.66.70 : 20.91 13.85 13.87 13.91 13.87 13.93 13.88 13.87 13.84 13.83
172.16.66.71 : 20.89 13.83 13.85 13.93 13.85 13.84 13.92 13.87 13.93 13.91
172.16.66.72 : 20.93 13.90 13.91 13.91 13.88 13.93 13.85 13.84 13.83 13.84
172.16.66.73 : - 13.87 13.94 13.89 13.94 13.92 13.91 13.91 13.92 13.89
172.16.66.74 : 24.62 13.89 13.88 13.90 13.84 13.83 13.85 13.83 13.83 13.90
172.16.66.75 : 24.61 13.89 13.84 13.94 - 13.91 13.90 13.86 13.92 13.83
172.16.66.76 : 20.90 13.96 13.80 13.79 13.78 13.85 13.82 13.91 - 13.91
172.16.66.77 : - 13.89 13.86 13.92 13.84 13.90 13.91 13.85 13.84 13.82
172.16.66.78 : 24.59 13.85 13.75 13.81 13.73 13.76 13.86 13.92 13.82 13.88
172.16.66.79 : 20.93 13.86 13.94 13.89 13.84 13.86 13.94 13.92 13.91 13.84
172.16.66.8  : 20.88 13.84 13.86 13.82 13.88 13.90 13.91 - 13.92 -
172.16.66.80 : 20.87 13.88 13.92 13.91 13.88 13.88 13.91 13.94 13.94 13.90
172.16.66.81 : - 13.86 13.79 13.84 13.84 13.85 13.82 13.89 13.88 13.90
172.16.66.82 : 20.84 13.92 13.94 13.92 13.92 13.91 13.92 13.95 13.94 13.90
172.16.66.83 : 20.92 - 13.87 13.93 13.92 13.90 13.91 13.92 13.93 13.93
172.16.66.84 : 20.76 13.92 13.92 13.92 13.91 13.90 13.87 13.91 13.77 13.79
172.16.66.85 : 20.94 13.86 13.87 13.94 13.87 13.86 13.89 13.91 - 13.91
172.16.66.86 : 20.88 13.88 13.91 13.93 13.90 13.90 13.88 13.85 13.84 13.81
172.16.66.87 : 20.85 13.86 13.92 13.91 13.88 13.89 13.91 13.89 13.91 13.89
172.16.66.88 : 20.91 13.91 13.94 13.91 13.89 13.80 13.85 13.86 13.77 13.84
172.16.66.89 : 20.91 13.92 13.87 13.92 13.88 13.89 13.93 13.92 13.91 13.91
172.16.66.9  : 26.17 13.86 13.85 13.90 13.71 13.75 13.81 13.80 13.84 13.89
172.16.66.90 : 20.89 13.88 13.88 13.89 13.88 13.89 13.91 13.92 13.90 13.91
172.16.66.91 : 20.87 13.81 13.85 13.76 13.82 13.80 14.27 13.91 13.84 13.90
172.16.66.92 : 20.87 13.94 13.90 13.91 13.92 13.88 13.91 13.93 13.89 13.91
172.16.66.93 : 20.87 13.78 13.84 13.84 13.84 13.89 13.91 13.91 - 13.90
172.16.66.94 : 20.88 13.91 13.92 13.89 13.87 13.89 13.94 13.88 13.91 13.88
172.16.66.95 : 24.54 13.81 13.84 13.86 13.91 13.82 13.87 13.86 13.92 13.92
172.16.66.96 : 24.61 13.89 13.91 13.92 13.87 13.86 13.90 13.88 13.84 13.90
172.16.66.97 : 24.75 13.89 13.88 13.88 13.81 13.91 13.90 13.93 13.91 13.93
172.16.66.98 : 20.87 13.88 13.92 13.90 13.89 13.89 13.92 13.92 13.85 13.83
172.16.66.99 : 24.61 13.90 13.77 13.88 13.86 13.93 - 13.90 13.89 13.90

      42 targets
      42 alive
       0 unreachable
       0 unknown addresses

      12 timeouts (waiting for response)
     420 ICMP Echos sent
     406 ICMP Echo Replies received
       0 other ICMP received

 0.03 ms (min round trip time)
 14.1 ms (avg round trip time)
 26.1 ms (max round trip time)
       10.433 sec (elapsed real time)

