172.16.36.7  : 22.68 13.72 13.70 13.75 13.75 13.73 13.75 13.75 - 13.74
172.16.66.53 : 0.22 0.21 0.21 0.20 0.20 0.21 0.19 0.21 0.20 0.15
172.16.66.54 : 0.20 0.21 0.20 0.20 0.22 0.20 0.21 0.20 0.21 0.17
172.16.66.55 : 0.25 0.22 0.21 0.21 0.19 0.21 0.19 0.19 0.21 0.19
172.16.66.56 : 0.22 0.20 0.21 0.21 0.21 0.18 0.20 0.22 0.17 0.20
172.16.66.57 : 0.23 0.20 0.22 0.21 0.21 0.21 0.21 0.21 0.20 0.11
172.16.66.58 : 0.22 0.20 0.22 0.21 0.20 0.21 0.21 0.21 0.21 0.20
172.16.66.59 : 0.22 0.21 0.21 0.21 0.20 0.20 0.21 0.20 0.18 0.16
172.16.66.6  : 0.22 0.22 0.21 0.22 0.21 0.18 0.22 0.22 0.17 0.20
172.16.66.60 : 0.21 0.19 0.21 0.22 0.22 0.21 0.21 0.21 0.21 0.21
172.16.66.61 : 0.17 0.20 0.21 0.21 0.18 0.21 0.21 0.21 0.21 0.19
172.16.66.62 : 0.22 0.21 0.22 0.21 0.20 0.20 0.20 0.21 0.21 0.20
172.16.66.63 : 0.22 0.22 0.21 0.21 0.23 0.20 0.20 0.22 0.20 0.20
172.16.66.64 : 0.22 0.20 0.20 0.21 0.21 0.21 0.20 0.16 0.21 0.19
172.16.66.65 : 0.22 0.22 0.21 0.22 0.20 0.20 0.21 0.21 0.21 0.21
172.16.66.66 : 0.23 0.19 0.20 0.22 0.21 0.20 0.21 0.21 0.21 0.20
172.16.66.67 : 0.22 0.14 0.20 0.21 0.21 0.21 0.19 0.21 0.22 0.19
172.16.66.68 : 0.22 0.20 0.20 0.21 0.21 0.19 0.20 0.21 0.21 0.19
172.16.66.69 : 0.22 0.21 0.21 0.22 0.21 0.20 0.20 0.20 0.21 0.22
172.16.66.7  : 0.22 0.20 0.21 0.21 0.21 0.19 0.19 0.21 0.21 0.19
172.16.66.70 : 0.22 0.21 0.21 0.18 0.19 0.21 0.21 0.20 0.21 0.18
172.16.66.72 : 0.21 0.22 0.19 0.21 0.22 0.09 0.21 0.21 0.21 0.20
172.16.66.73 : 0.23 0.21 0.22 0.21 0.21 0.21 0.21 0.20 0.22 0.20
172.16.66.74 : 0.22 0.20 0.20 0.21 0.21 0.21 0.20 0.20 0.21 0.20
172.16.66.75 : 0.22 0.21 0.21 0.21 0.20 0.21 0.17 0.22 0.22 0.16
172.16.66.76 : 0.23 0.22 0.18 0.20 0.19 0.16 0.20 0.21 0.21 0.17
172.16.66.77 : 0.23 0.22 0.21 0.21 0.22 0.21 0.20 0.22 0.20 0.20
172.16.66.78 : 0.23 0.21 0.23 0.21 0.21 0.20 0.21 0.19 0.21 0.20
172.16.66.79 : 0.23 0.20 0.22 0.20 0.18 0.16 0.17 0.21 0.21 0.20
172.16.66.8  : 0.22 0.18 0.21 0.20 0.19 0.21 0.21 0.21 0.20 0.19
172.16.66.80 : 0.20 0.20 0.22 0.22 0.21 0.21 0.21 0.21 0.21 0.18
172.16.66.81 : 0.23 0.20 0.21 0.21 0.21 0.20 0.19 0.21 0.21 0.17
172.16.66.82 : 0.23 0.22 0.21 0.20 0.21 0.22 0.21 0.21 0.22 0.19
172.16.66.83 : 0.22 0.21 0.21 0.20 0.22 0.20 0.20 0.22 0.20 0.18
172.16.66.84 : 0.18 0.16 0.15 0.17 0.17 0.16 0.16 0.16 0.15 0.11
172.16.66.85 : 0.23 0.20 0.19 0.21 0.22 0.20 0.21 0.23 0.21 0.21
172.16.66.86 : 0.23 0.21 0.22 0.20 0.21 0.21 0.21 0.21 0.20 0.22
172.16.66.87 : 0.23 0.22 0.18 0.20 0.21 0.21 0.20 0.22 0.19 0.17
172.16.66.88 : 0.23 0.21 0.21 0.20 0.21 0.21 0.21 0.20 0.07 0.21
172.16.66.9  : 0.22 0.20 0.21 0.21 0.20 0.22 0.20 0.20 0.21 0.18
172.16.66.90 : 0.04 0.03 0.03 0.03 0.03 0.03 0.03 0.03 0.03 0.03
172.16.66.91 : 0.23 0.06 0.06 0.12 0.11 0.10 0.06 0.06 0.06 0.06

      42 targets
      42 alive
       0 unreachable
       0 unknown addresses

       1 timeouts (waiting for response)
     420 ICMP Echos sent
     419 ICMP Echo Replies received
       0 other ICMP received

 0.03 ms (min round trip time)
 0.50 ms (avg round trip time)
 22.6 ms (max round trip time)
       10.010 sec (elapsed real time)

