"2021-03-31T23:41:50.033062+02:00","chifflot-7","bmc_node_power_watt",468
"2021-03-31T23:41:55.033741+02:00","chifflot-7","bmc_node_power_watt",468
"2021-03-31T23:42:00.035301+02:00","chifflot-7","bmc_node_power_watt",468
"2021-03-31T23:42:05.03551+02:00","chifflot-7","bmc_node_power_watt",468
"2021-03-31T23:42:10.036738+02:00","chifflot-7","bmc_node_power_watt",468
"2021-03-31T23:42:15.038332+02:00","chifflot-7","bmc_node_power_watt",468
"2021-03-31T23:42:20.038877+02:00","chifflot-7","bmc_node_power_watt",468
"2021-03-31T23:42:25.04027+02:00","chifflot-7","bmc_node_power_watt",468
"2021-03-31T23:42:30.041335+02:00","chifflot-7","bmc_node_power_watt",468
"2021-03-31T23:42:35.042632+02:00","chifflot-7","bmc_node_power_watt",468
"2021-03-31T23:42:40.043102+02:00","chifflot-7","bmc_node_power_watt",494
"2021-03-31T23:42:45.043452+02:00","chifflot-7","bmc_node_power_watt",494
"2021-03-31T23:42:50.044398+02:00","chifflot-7","bmc_node_power_watt",494
"2021-03-31T23:42:55.045975+02:00","chifflot-7","bmc_node_power_watt",494
"2021-03-31T23:43:00.046479+02:00","chifflot-7","bmc_node_power_watt",468
"2021-03-31T23:43:05.047318+02:00","chifflot-7","bmc_node_power_watt",468
"2021-03-31T23:43:10.047719+02:00","chifflot-7","bmc_node_power_watt",468
"2021-03-31T23:43:15.048905+02:00","chifflot-7","bmc_node_power_watt",468
"2021-03-31T23:43:20.049508+02:00","chifflot-7","bmc_node_power_watt",468
"2021-03-31T23:43:25.050274+02:00","chifflot-7","bmc_node_power_watt",494
"2021-03-31T23:43:30.051024+02:00","chifflot-7","bmc_node_power_watt",494
"2021-03-31T23:43:35.052403+02:00","chifflot-7","bmc_node_power_watt",494
"2021-03-31T23:43:40.053404+02:00","chifflot-7","bmc_node_power_watt",494
"2021-03-31T23:43:45.053994+02:00","chifflot-7","bmc_node_power_watt",494
"2021-03-31T23:43:50.055063+02:00","chifflot-7","bmc_node_power_watt",494
"2021-03-31T23:43:55.056105+02:00","chifflot-7","bmc_node_power_watt",494
"2021-03-31T23:44:00.056809+02:00","chifflot-7","bmc_node_power_watt",494
"2021-03-31T23:44:05.058189+02:00","chifflot-7","bmc_node_power_watt",494
"2021-03-31T23:44:10.059698+02:00","chifflot-7","bmc_node_power_watt",494
"2021-03-31T23:44:15.060308+02:00","chifflot-7","bmc_node_power_watt",468
"2021-03-31T23:44:20.06148+02:00","chifflot-7","bmc_node_power_watt",468
"2021-03-31T23:44:25.062102+02:00","chifflot-7","bmc_node_power_watt",468
"2021-03-31T23:44:30.062962+02:00","chifflot-7","bmc_node_power_watt",468
"2021-03-31T23:44:35.06432+02:00","chifflot-7","bmc_node_power_watt",468
"2021-03-31T23:44:40.065814+02:00","chifflot-7","bmc_node_power_watt",468
"2021-03-31T23:44:45.066704+02:00","chifflot-7","bmc_node_power_watt",468
"2021-03-31T23:44:50.067904+02:00","chifflot-7","bmc_node_power_watt",468
"2021-03-31T23:44:55.068843+02:00","chifflot-7","bmc_node_power_watt",468
"2021-03-31T23:45:00.069713+02:00","chifflot-7","bmc_node_power_watt",468
"2021-03-31T23:45:05.070511+02:00","chifflot-7","bmc_node_power_watt",468
"2021-03-31T23:45:10.071827+02:00","chifflot-7","bmc_node_power_watt",468
"2021-03-31T23:45:15.072641+02:00","chifflot-7","bmc_node_power_watt",468
"2021-03-31T23:45:20.074039+02:00","chifflot-7","bmc_node_power_watt",468
"2021-03-31T23:45:25.074998+02:00","chifflot-7","bmc_node_power_watt",494
"2021-03-31T23:45:30.075723+02:00","chifflot-7","bmc_node_power_watt",494
"2021-03-31T23:45:35.075788+02:00","chifflot-7","bmc_node_power_watt",494
"2021-03-31T23:45:40.077327+02:00","chifflot-7","bmc_node_power_watt",494
"2021-03-31T23:45:45.077579+02:00","chifflot-7","bmc_node_power_watt",494
"2021-03-31T23:45:50.079267+02:00","chifflot-7","bmc_node_power_watt",494
"2021-03-31T23:45:55.081757+02:00","chifflot-7","bmc_node_power_watt",494
"2021-03-31T23:46:00.08282+02:00","chifflot-7","bmc_node_power_watt",494
"2021-03-31T23:46:05.083894+02:00","chifflot-7","bmc_node_power_watt",494
"2021-03-31T23:46:10.085298+02:00","chifflot-7","bmc_node_power_watt",468
"2021-03-31T23:46:15.087437+02:00","chifflot-7","bmc_node_power_watt",468
"2021-03-31T23:46:20.088143+02:00","chifflot-7","bmc_node_power_watt",468
"2021-03-31T23:46:25.08915+02:00","chifflot-7","bmc_node_power_watt",468
"2021-03-31T23:46:30.090367+02:00","chifflot-7","bmc_node_power_watt",468
"2021-03-31T23:46:35.09148+02:00","chifflot-7","bmc_node_power_watt",468
"2021-03-31T23:46:40.092612+02:00","chifflot-7","bmc_node_power_watt",468
"2021-03-31T23:46:45.094299+02:00","chifflot-7","bmc_node_power_watt",468
"2021-03-31T23:46:50.096183+02:00","chifflot-7","bmc_node_power_watt",468
"2021-03-31T23:46:55.09748+02:00","chifflot-7","bmc_node_power_watt",468
"2021-03-31T23:47:00.098695+02:00","chifflot-7","bmc_node_power_watt",468
"2021-03-31T23:47:05.099946+02:00","chifflot-7","bmc_node_power_watt",468
"2021-03-31T23:47:10.100569+02:00","chifflot-7","bmc_node_power_watt",468
"2021-03-31T23:47:15.102126+02:00","chifflot-7","bmc_node_power_watt",468
"2021-03-31T23:47:20.104596+02:00","chifflot-7","bmc_node_power_watt",468
"2021-03-31T23:47:25.105627+02:00","chifflot-7","bmc_node_power_watt",468
"2021-03-31T23:47:30.106657+02:00","chifflot-7","bmc_node_power_watt",468
"2021-03-31T23:47:35.107774+02:00","chifflot-7","bmc_node_power_watt",468
"2021-03-31T23:47:40.108567+02:00","chifflot-7","bmc_node_power_watt",468
"2021-03-31T23:47:45.109848+02:00","chifflot-7","bmc_node_power_watt",468
"2021-03-31T23:47:50.11057+02:00","chifflot-7","bmc_node_power_watt",468
"2021-03-31T23:47:55.111156+02:00","chifflot-7","bmc_node_power_watt",468
"2021-03-31T23:48:00.112304+02:00","chifflot-7","bmc_node_power_watt",468
"2021-03-31T23:48:05.11394+02:00","chifflot-7","bmc_node_power_watt",468
"2021-03-31T23:48:10.115053+02:00","chifflot-7","bmc_node_power_watt",468
"2021-03-31T23:48:15.115845+02:00","chifflot-7","bmc_node_power_watt",468
"2021-03-31T23:48:20.116659+02:00","chifflot-7","bmc_node_power_watt",468
"2021-03-31T23:48:25.11755+02:00","chifflot-7","bmc_node_power_watt",468
"2021-03-31T23:48:30.120034+02:00","chifflot-7","bmc_node_power_watt",468
"2021-03-31T23:48:35.121935+02:00","chifflot-7","bmc_node_power_watt",494
"2021-03-31T23:48:40.123398+02:00","chifflot-7","bmc_node_power_watt",494
"2021-03-31T23:48:45.124579+02:00","chifflot-7","bmc_node_power_watt",494
"2021-03-31T23:48:50.12542+02:00","chifflot-7","bmc_node_power_watt",494
"2021-03-31T23:48:55.12759+02:00","chifflot-7","bmc_node_power_watt",494
"2021-03-31T23:49:00.128712+02:00","chifflot-7","bmc_node_power_watt",494
"2021-03-31T23:49:05.129107+02:00","chifflot-7","bmc_node_power_watt",494
"2021-03-31T23:49:10.130459+02:00","chifflot-7","bmc_node_power_watt",494
"2021-03-31T23:49:15.130758+02:00","chifflot-7","bmc_node_power_watt",494
"2021-03-31T23:49:20.131125+02:00","chifflot-7","bmc_node_power_watt",494
"2021-03-31T23:49:25.132003+02:00","chifflot-7","bmc_node_power_watt",494
"2021-03-31T23:49:30.133193+02:00","chifflot-7","bmc_node_power_watt",494
"2021-03-31T23:49:35.134554+02:00","chifflot-7","bmc_node_power_watt",494
"2021-03-31T23:49:40.135114+02:00","chifflot-7","bmc_node_power_watt",494
"2021-03-31T23:49:45.136607+02:00","chifflot-7","bmc_node_power_watt",494
"2021-03-31T23:49:50.13735+02:00","chifflot-7","bmc_node_power_watt",494
"2021-03-31T23:49:55.138148+02:00","chifflot-7","bmc_node_power_watt",494
"2021-03-31T23:50:00.13936+02:00","chifflot-7","bmc_node_power_watt",494
"2021-03-31T23:50:05.140649+02:00","chifflot-7","bmc_node_power_watt",494
"2021-03-31T23:50:10.141304+02:00","chifflot-7","bmc_node_power_watt",468
"2021-03-31T23:50:15.141916+02:00","chifflot-7","bmc_node_power_watt",468
"2021-03-31T23:50:20.142942+02:00","chifflot-7","bmc_node_power_watt",468
"2021-03-31T23:50:25.143199+02:00","chifflot-7","bmc_node_power_watt",468
"2021-03-31T23:50:30.144192+02:00","chifflot-7","bmc_node_power_watt",468
"2021-03-31T23:50:35.144974+02:00","chifflot-7","bmc_node_power_watt",494
"2021-03-31T23:50:40.145934+02:00","chifflot-7","bmc_node_power_watt",494
"2021-03-31T23:50:45.146476+02:00","chifflot-7","bmc_node_power_watt",494
"2021-03-31T23:50:50.147536+02:00","chifflot-7","bmc_node_power_watt",494
"2021-03-31T23:50:55.147886+02:00","chifflot-7","bmc_node_power_watt",494
"2021-03-31T23:51:00.148222+02:00","chifflot-7","bmc_node_power_watt",494
"2021-03-31T23:51:05.149477+02:00","chifflot-7","bmc_node_power_watt",494
"2021-03-31T23:51:10.151007+02:00","chifflot-7","bmc_node_power_watt",494
"2021-03-31T23:51:15.151468+02:00","chifflot-7","bmc_node_power_watt",494
"2021-03-31T23:51:20.152663+02:00","chifflot-7","bmc_node_power_watt",494
"2021-03-31T23:51:25.152923+02:00","chifflot-7","bmc_node_power_watt",494
"2021-03-31T23:51:30.154739+02:00","chifflot-7","bmc_node_power_watt",494
"2021-03-31T23:51:35.155179+02:00","chifflot-7","bmc_node_power_watt",494
"2021-03-31T23:51:40.156461+02:00","chifflot-7","bmc_node_power_watt",494
"2021-03-31T23:51:45.157994+02:00","chifflot-7","bmc_node_power_watt",468
"2021-03-31T23:51:50.159595+02:00","chifflot-7","bmc_node_power_watt",468
"2021-03-31T23:51:55.160465+02:00","chifflot-7","bmc_node_power_watt",468
"2021-03-31T23:52:00.161218+02:00","chifflot-7","bmc_node_power_watt",468
"2021-03-31T23:52:05.162328+02:00","chifflot-7","bmc_node_power_watt",468
"2021-03-31T23:52:10.164182+02:00","chifflot-7","bmc_node_power_watt",468
"2021-03-31T23:52:15.165623+02:00","chifflot-7","bmc_node_power_watt",468
"2021-03-31T23:52:20.166852+02:00","chifflot-7","bmc_node_power_watt",468
"2021-03-31T23:52:25.168406+02:00","chifflot-7","bmc_node_power_watt",468
"2021-03-31T23:52:30.169105+02:00","chifflot-7","bmc_node_power_watt",494
"2021-03-31T23:52:35.17047+02:00","chifflot-7","bmc_node_power_watt",494
"2021-03-31T23:52:40.172324+02:00","chifflot-7","bmc_node_power_watt",494
"2021-03-31T23:52:45.173187+02:00","chifflot-7","bmc_node_power_watt",494
"2021-03-31T23:52:50.175057+02:00","chifflot-7","bmc_node_power_watt",494
"2021-03-31T23:52:55.176418+02:00","chifflot-7","bmc_node_power_watt",468
"2021-03-31T23:53:00.177939+02:00","chifflot-7","bmc_node_power_watt",468
"2021-03-31T23:53:05.178719+02:00","chifflot-7","bmc_node_power_watt",468
"2021-03-31T23:53:10.180392+02:00","chifflot-7","bmc_node_power_watt",468
"2021-03-31T23:53:15.182878+02:00","chifflot-7","bmc_node_power_watt",468
"2021-03-31T23:53:20.184443+02:00","chifflot-7","bmc_node_power_watt",494
"2021-03-31T23:53:25.187077+02:00","chifflot-7","bmc_node_power_watt",494
"2021-03-31T23:53:30.188526+02:00","chifflot-7","bmc_node_power_watt",494
"2021-03-31T23:53:35.190012+02:00","chifflot-7","bmc_node_power_watt",494
"2021-03-31T23:53:40.190943+02:00","chifflot-7","bmc_node_power_watt",494
"2021-03-31T23:53:45.192219+02:00","chifflot-7","bmc_node_power_watt",494
"2021-03-31T23:53:50.193392+02:00","chifflot-7","bmc_node_power_watt",494
"2021-03-31T23:53:55.196018+02:00","chifflot-7","bmc_node_power_watt",494
"2021-03-31T23:54:00.197462+02:00","chifflot-7","bmc_node_power_watt",494
"2021-03-31T23:54:05.198359+02:00","chifflot-7","bmc_node_power_watt",494
"2021-03-31T23:54:10.200139+02:00","chifflot-7","bmc_node_power_watt",494
"2021-03-31T23:54:15.201032+02:00","chifflot-7","bmc_node_power_watt",494
"2021-03-31T23:54:20.202271+02:00","chifflot-7","bmc_node_power_watt",494
"2021-03-31T23:54:25.204046+02:00","chifflot-7","bmc_node_power_watt",494
"2021-03-31T23:54:30.205038+02:00","chifflot-7","bmc_node_power_watt",494
"2021-03-31T23:54:35.206416+02:00","chifflot-7","bmc_node_power_watt",494
"2021-03-31T23:54:40.208244+02:00","chifflot-7","bmc_node_power_watt",494
"2021-03-31T23:54:45.209308+02:00","chifflot-7","bmc_node_power_watt",494
"2021-03-31T23:54:50.21051+02:00","chifflot-7","bmc_node_power_watt",494
"2021-03-31T23:54:55.211681+02:00","chifflot-7","bmc_node_power_watt",494
"2021-03-31T23:55:00.214112+02:00","chifflot-7","bmc_node_power_watt",494
"2021-03-31T23:55:05.216346+02:00","chifflot-7","bmc_node_power_watt",494
"2021-03-31T23:55:10.217508+02:00","chifflot-7","bmc_node_power_watt",494
"2021-03-31T23:55:15.219016+02:00","chifflot-7","bmc_node_power_watt",494
"2021-03-31T23:55:20.219654+02:00","chifflot-7","bmc_node_power_watt",494
"2021-03-31T23:55:25.221472+02:00","chifflot-7","bmc_node_power_watt",494
"2021-03-31T23:55:30.222209+02:00","chifflot-7","bmc_node_power_watt",494
"2021-03-31T23:55:35.223305+02:00","chifflot-7","bmc_node_power_watt",494
"2021-03-31T23:55:40.224203+02:00","chifflot-7","bmc_node_power_watt",494
"2021-03-31T23:55:45.226691+02:00","chifflot-7","bmc_node_power_watt",494
"2021-03-31T23:55:50.228506+02:00","chifflot-7","bmc_node_power_watt",494
"2021-03-31T23:55:55.229408+02:00","chifflot-7","bmc_node_power_watt",494
"2021-03-31T23:56:00.23191+02:00","chifflot-7","bmc_node_power_watt",494
"2021-03-31T23:56:05.234307+02:00","chifflot-7","bmc_node_power_watt",494
"2021-03-31T23:56:10.236277+02:00","chifflot-7","bmc_node_power_watt",494
"2021-03-31T23:56:15.238003+02:00","chifflot-7","bmc_node_power_watt",494
"2021-03-31T23:56:20.239374+02:00","chifflot-7","bmc_node_power_watt",494
"2021-03-31T23:56:25.240446+02:00","chifflot-7","bmc_node_power_watt",494
"2021-03-31T23:56:30.241679+02:00","chifflot-7","bmc_node_power_watt",494
"2021-03-31T23:56:35.243579+02:00","chifflot-7","bmc_node_power_watt",494
"2021-03-31T23:56:40.245988+02:00","chifflot-7","bmc_node_power_watt",494
"2021-03-31T23:56:45.246625+02:00","chifflot-7","bmc_node_power_watt",494
"2021-03-31T23:56:50.247543+02:00","chifflot-7","bmc_node_power_watt",494
"2021-03-31T23:56:55.24812+02:00","chifflot-7","bmc_node_power_watt",494
"2021-03-31T23:57:00.249731+02:00","chifflot-7","bmc_node_power_watt",494
"2021-03-31T23:57:05.251117+02:00","chifflot-7","bmc_node_power_watt",494
"2021-03-31T23:57:10.253004+02:00","chifflot-7","bmc_node_power_watt",494
"2021-03-31T23:57:15.254164+02:00","chifflot-7","bmc_node_power_watt",494
"2021-03-31T23:57:20.255556+02:00","chifflot-7","bmc_node_power_watt",494
"2021-03-31T23:57:25.256869+02:00","chifflot-7","bmc_node_power_watt",494
"2021-03-31T23:57:30.257596+02:00","chifflot-7","bmc_node_power_watt",494
"2021-03-31T23:57:35.258819+02:00","chifflot-7","bmc_node_power_watt",494
"2021-03-31T23:57:40.260108+02:00","chifflot-7","bmc_node_power_watt",494
"2021-03-31T23:57:45.260621+02:00","chifflot-7","bmc_node_power_watt",494
"2021-03-31T23:57:50.261374+02:00","chifflot-7","bmc_node_power_watt",494
"2021-03-31T23:57:55.263322+02:00","chifflot-7","bmc_node_power_watt",494
"2021-03-31T23:58:00.265005+02:00","chifflot-7","bmc_node_power_watt",494
"2021-03-31T23:58:05.266453+02:00","chifflot-7","bmc_node_power_watt",468
"2021-03-31T23:58:10.267304+02:00","chifflot-7","bmc_node_power_watt",468
"2021-03-31T23:58:15.268734+02:00","chifflot-7","bmc_node_power_watt",468
"2021-03-31T23:58:20.269535+02:00","chifflot-7","bmc_node_power_watt",468
"2021-03-31T23:58:25.271838+02:00","chifflot-7","bmc_node_power_watt",494
"2021-03-31T23:58:30.272776+02:00","chifflot-7","bmc_node_power_watt",494
"2021-03-31T23:58:35.275715+02:00","chifflot-7","bmc_node_power_watt",494
"2021-03-31T23:58:40.277192+02:00","chifflot-7","bmc_node_power_watt",494
"2021-03-31T23:58:45.278656+02:00","chifflot-7","bmc_node_power_watt",494
"2021-03-31T23:58:50.279625+02:00","chifflot-7","bmc_node_power_watt",494
"2021-03-31T23:58:55.281247+02:00","chifflot-7","bmc_node_power_watt",494
"2021-03-31T23:59:00.28269+02:00","chifflot-7","bmc_node_power_watt",494
"2021-03-31T23:59:05.283522+02:00","chifflot-7","bmc_node_power_watt",494
"2021-03-31T23:59:10.284125+02:00","chifflot-7","bmc_node_power_watt",494
"2021-03-31T23:59:15.285449+02:00","chifflot-7","bmc_node_power_watt",468
"2021-03-31T23:59:20.287085+02:00","chifflot-7","bmc_node_power_watt",468
"2021-03-31T23:59:25.287789+02:00","chifflot-7","bmc_node_power_watt",468
"2021-03-31T23:59:30.289357+02:00","chifflot-7","bmc_node_power_watt",468
"2021-03-31T23:59:35.290478+02:00","chifflot-7","bmc_node_power_watt",468
"2021-03-31T23:59:40.291692+02:00","chifflot-7","bmc_node_power_watt",494
"2021-03-31T23:59:45.293195+02:00","chifflot-7","bmc_node_power_watt",494
"2021-03-31T23:59:50.294306+02:00","chifflot-7","bmc_node_power_watt",494
"2021-03-31T23:59:55.295355+02:00","chifflot-7","bmc_node_power_watt",494
"2021-04-01T00:00:00.296802+02:00","chifflot-7","bmc_node_power_watt",468
"2021-04-01T00:00:05.299681+02:00","chifflot-7","bmc_node_power_watt",468
"2021-04-01T00:00:10.300593+02:00","chifflot-7","bmc_node_power_watt",468
"2021-04-01T00:00:15.301554+02:00","chifflot-7","bmc_node_power_watt",468
"2021-04-01T00:00:20.302396+02:00","chifflot-7","bmc_node_power_watt",468
"2021-04-01T00:00:25.302958+02:00","chifflot-7","bmc_node_power_watt",494
"2021-04-01T00:00:30.304256+02:00","chifflot-7","bmc_node_power_watt",494
"2021-04-01T00:00:35.30575+02:00","chifflot-7","bmc_node_power_watt",494
"2021-04-01T00:00:40.313757+02:00","chifflot-7","bmc_node_power_watt",494
"2021-04-01T00:00:45.314956+02:00","chifflot-7","bmc_node_power_watt",494
"2021-04-01T00:00:50.316081+02:00","chifflot-7","bmc_node_power_watt",468
"2021-04-01T00:00:55.322229+02:00","chifflot-7","bmc_node_power_watt",468
"2021-04-01T00:01:00.323082+02:00","chifflot-7","bmc_node_power_watt",468
"2021-04-01T00:01:05.3244+02:00","chifflot-7","bmc_node_power_watt",468
"2021-04-01T00:01:10.325531+02:00","chifflot-7","bmc_node_power_watt",468
"2021-04-01T00:01:15.327595+02:00","chifflot-7","bmc_node_power_watt",468
"2021-04-01T00:01:20.329011+02:00","chifflot-7","bmc_node_power_watt",468
"2021-04-01T00:01:25.329167+02:00","chifflot-7","bmc_node_power_watt",468
"2021-04-01T00:01:30.331824+02:00","chifflot-7","bmc_node_power_watt",468
"2021-04-01T00:01:35.33357+02:00","chifflot-7","bmc_node_power_watt",468
"2021-04-01T00:01:40.334348+02:00","chifflot-7","bmc_node_power_watt",468
"2021-04-01T00:01:45.33529+02:00","chifflot-7","bmc_node_power_watt",468
"2021-04-01T00:01:50.336673+02:00","chifflot-7","bmc_node_power_watt",468
"2021-04-01T00:01:55.33726+02:00","chifflot-7","bmc_node_power_watt",468
"2021-04-01T00:02:00.338573+02:00","chifflot-7","bmc_node_power_watt",494
"2021-04-01T00:02:05.339493+02:00","chifflot-7","bmc_node_power_watt",494
"2021-04-01T00:02:10.34139+02:00","chifflot-7","bmc_node_power_watt",494
"2021-04-01T00:02:15.342652+02:00","chifflot-7","bmc_node_power_watt",494
"2021-04-01T00:02:20.344013+02:00","chifflot-7","bmc_node_power_watt",494
"2021-04-01T00:02:25.345407+02:00","chifflot-7","bmc_node_power_watt",468
"2021-04-01T00:02:30.347079+02:00","chifflot-7","bmc_node_power_watt",468
"2021-04-01T00:02:35.348467+02:00","chifflot-7","bmc_node_power_watt",468
"2021-04-01T00:02:40.349195+02:00","chifflot-7","bmc_node_power_watt",468
"2021-04-01T00:02:45.350069+02:00","chifflot-7","bmc_node_power_watt",468
"2021-04-01T00:02:50.35125+02:00","chifflot-7","bmc_node_power_watt",468
"2021-04-01T00:02:55.351772+02:00","chifflot-7","bmc_node_power_watt",468
"2021-04-01T00:03:00.353148+02:00","chifflot-7","bmc_node_power_watt",468
"2021-04-01T00:03:05.354719+02:00","chifflot-7","bmc_node_power_watt",468
"2021-04-01T00:03:10.355403+02:00","chifflot-7","bmc_node_power_watt",468
"2021-04-01T00:03:15.356292+02:00","chifflot-7","bmc_node_power_watt",468
"2021-04-01T00:03:20.357254+02:00","chifflot-7","bmc_node_power_watt",468
"2021-04-01T00:03:25.358187+02:00","chifflot-7","bmc_node_power_watt",468
"2021-04-01T00:03:30.359298+02:00","chifflot-7","bmc_node_power_watt",468
"2021-04-01T00:03:35.360642+02:00","chifflot-7","bmc_node_power_watt",468
"2021-04-01T00:03:40.361971+02:00","chifflot-7","bmc_node_power_watt",468
"2021-04-01T00:03:45.36381+02:00","chifflot-7","bmc_node_power_watt",468
"2021-04-01T00:03:50.365033+02:00","chifflot-7","bmc_node_power_watt",468
"2021-04-01T00:03:55.365727+02:00","chifflot-7","bmc_node_power_watt",468
"2021-04-01T00:04:00.367637+02:00","chifflot-7","bmc_node_power_watt",468
"2021-04-01T00:04:05.368951+02:00","chifflot-7","bmc_node_power_watt",468
"2021-04-01T00:04:10.369772+02:00","chifflot-7","bmc_node_power_watt",468
"2021-04-01T00:04:15.370837+02:00","chifflot-7","bmc_node_power_watt",468
"2021-04-01T00:04:20.373229+02:00","chifflot-7","bmc_node_power_watt",468
"2021-04-01T00:04:25.373375+02:00","chifflot-7","bmc_node_power_watt",494
"2021-04-01T00:04:30.374549+02:00","chifflot-7","bmc_node_power_watt",494
"2021-04-01T00:04:35.375075+02:00","chifflot-7","bmc_node_power_watt",494
"2021-04-01T00:04:40.377214+02:00","chifflot-7","bmc_node_power_watt",494
"2021-04-01T00:04:45.378106+02:00","chifflot-7","bmc_node_power_watt",494
