172.16.36.7 : 0.04 0.04 0.03 0.03 0.03 0.03 0.01 0.03 0.01 0.03
172.16.39.5 : 16.15 4.30 4.28 4.27 4.33 4.39 4.27 4.32 4.31 4.35
172.16.39.3 : 0.20 0.16 0.16 0.17 0.15 0.16 0.20 0.20 0.18 0.18

       3 targets
       3 alive
       0 unreachable
       0 unknown addresses

       0 timeouts (waiting for response)
      30 ICMP Echos sent
      30 ICMP Echo Replies received
       0 other ICMP received

 0.01 ms (min round trip time)
 1.90 ms (avg round trip time)
 16.1 ms (max round trip time)
        9.030 sec (elapsed real time)

