172.16.36.8 : 0.21 0.15 0.12 0.15 0.15 0.14 0.14 0.15 0.14 0.07
172.16.39.5 : 0.25 0.12 0.09 0.12 0.12 0.15 0.17 0.18 0.10 0.07
172.16.39.3 : 0.02 0.01 0.01 0.01 0.01 0.01 0.01 0.01 0.01 0.01

       3 targets
       3 alive
       0 unreachable
       0 unknown addresses

       0 timeouts (waiting for response)
      30 ICMP Echos sent
      30 ICMP Echo Replies received
       0 other ICMP received

 0.01 ms (min round trip time)
 0.09 ms (avg round trip time)
 0.25 ms (max round trip time)
        9.021 sec (elapsed real time)

