"2021-03-24T12:31:54.022444+01:00","chifflot-7","bmc_node_power_watt",494
"2021-03-24T12:31:59.023072+01:00","chifflot-7","bmc_node_power_watt",494
"2021-03-24T12:32:04.024534+01:00","chifflot-7","bmc_node_power_watt",494
"2021-03-24T12:32:09.025847+01:00","chifflot-7","bmc_node_power_watt",494
"2021-03-24T12:32:14.026883+01:00","chifflot-7","bmc_node_power_watt",494
"2021-03-24T12:32:19.027133+01:00","chifflot-7","bmc_node_power_watt",494
"2021-03-24T12:32:24.029383+01:00","chifflot-7","bmc_node_power_watt",494
"2021-03-24T12:32:29.028877+01:00","chifflot-7","bmc_node_power_watt",494
"2021-03-24T12:32:34.030734+01:00","chifflot-7","bmc_node_power_watt",494
"2021-03-24T12:32:39.033643+01:00","chifflot-7","bmc_node_power_watt",494
"2021-03-24T12:32:44.03396+01:00","chifflot-7","bmc_node_power_watt",494
"2021-03-24T12:32:49.036048+01:00","chifflot-7","bmc_node_power_watt",494
"2021-03-24T12:32:54.036844+01:00","chifflot-7","bmc_node_power_watt",494
"2021-03-24T12:32:59.039756+01:00","chifflot-7","bmc_node_power_watt",520
"2021-03-24T12:33:04.03999+01:00","chifflot-7","bmc_node_power_watt",520
"2021-03-24T12:33:09.040064+01:00","chifflot-7","bmc_node_power_watt",520
"2021-03-24T12:33:14.040804+01:00","chifflot-7","bmc_node_power_watt",520
"2021-03-24T12:33:19.041503+01:00","chifflot-7","bmc_node_power_watt",494
"2021-03-24T12:33:24.043883+01:00","chifflot-7","bmc_node_power_watt",494
"2021-03-24T12:33:29.044436+01:00","chifflot-7","bmc_node_power_watt",494
"2021-03-24T12:33:34.044444+01:00","chifflot-7","bmc_node_power_watt",494
"2021-03-24T12:33:39.04687+01:00","chifflot-7","bmc_node_power_watt",494
"2021-03-24T12:33:44.047709+01:00","chifflot-7","bmc_node_power_watt",494
"2021-03-24T12:33:49.049536+01:00","chifflot-7","bmc_node_power_watt",494
"2021-03-24T12:33:54.049113+01:00","chifflot-7","bmc_node_power_watt",494
"2021-03-24T12:33:59.051761+01:00","chifflot-7","bmc_node_power_watt",494
"2021-03-24T12:34:04.05194+01:00","chifflot-7","bmc_node_power_watt",494
"2021-03-24T12:34:09.053374+01:00","chifflot-7","bmc_node_power_watt",494
"2021-03-24T12:34:14.054656+01:00","chifflot-7","bmc_node_power_watt",494
"2021-03-24T12:34:19.055296+01:00","chifflot-7","bmc_node_power_watt",494
"2021-03-24T12:34:24.055979+01:00","chifflot-7","bmc_node_power_watt",494
"2021-03-24T12:34:29.058318+01:00","chifflot-7","bmc_node_power_watt",494
"2021-03-24T12:34:34.06012+01:00","chifflot-7","bmc_node_power_watt",520
"2021-03-24T12:34:39.060499+01:00","chifflot-7","bmc_node_power_watt",520
"2021-03-24T12:34:44.06096+01:00","chifflot-7","bmc_node_power_watt",520
"2021-03-24T12:34:49.061929+01:00","chifflot-7","bmc_node_power_watt",520
"2021-03-24T12:34:54.06235+01:00","chifflot-7","bmc_node_power_watt",494
"2021-03-24T12:34:59.062975+01:00","chifflot-7","bmc_node_power_watt",494
"2021-03-24T12:35:04.064619+01:00","chifflot-7","bmc_node_power_watt",494
"2021-03-24T12:35:09.066572+01:00","chifflot-7","bmc_node_power_watt",494
"2021-03-24T12:35:14.067491+01:00","chifflot-7","bmc_node_power_watt",494
"2021-03-24T12:35:19.067656+01:00","chifflot-7","bmc_node_power_watt",494
"2021-03-24T12:35:24.071231+01:00","chifflot-7","bmc_node_power_watt",494
"2021-03-24T12:35:29.071357+01:00","chifflot-7","bmc_node_power_watt",494
"2021-03-24T12:35:34.072107+01:00","chifflot-7","bmc_node_power_watt",494
"2021-03-24T12:35:39.072436+01:00","chifflot-7","bmc_node_power_watt",494
"2021-03-24T12:35:44.073204+01:00","chifflot-7","bmc_node_power_watt",494
"2021-03-24T12:35:49.073364+01:00","chifflot-7","bmc_node_power_watt",494
"2021-03-24T12:35:54.075167+01:00","chifflot-7","bmc_node_power_watt",494
"2021-03-24T12:35:59.075546+01:00","chifflot-7","bmc_node_power_watt",494
"2021-03-24T12:36:04.076247+01:00","chifflot-7","bmc_node_power_watt",494
"2021-03-24T12:36:09.077104+01:00","chifflot-7","bmc_node_power_watt",494
"2021-03-24T12:36:14.077471+01:00","chifflot-7","bmc_node_power_watt",494
"2021-03-24T12:36:19.078632+01:00","chifflot-7","bmc_node_power_watt",494
"2021-03-24T12:36:24.079002+01:00","chifflot-7","bmc_node_power_watt",494
"2021-03-24T12:36:29.08037+01:00","chifflot-7","bmc_node_power_watt",494
"2021-03-24T12:36:34.081733+01:00","chifflot-7","bmc_node_power_watt",494
"2021-03-24T12:36:39.0821+01:00","chifflot-7","bmc_node_power_watt",494
"2021-03-24T12:36:44.08275+01:00","chifflot-7","bmc_node_power_watt",494
"2021-03-24T12:36:49.084474+01:00","chifflot-7","bmc_node_power_watt",494
"2021-03-24T12:36:54.086182+01:00","chifflot-7","bmc_node_power_watt",494
"2021-03-24T12:36:59.086125+01:00","chifflot-7","bmc_node_power_watt",494
"2021-03-24T12:37:04.086584+01:00","chifflot-7","bmc_node_power_watt",494
"2021-03-24T12:37:09.086664+01:00","chifflot-7","bmc_node_power_watt",494
"2021-03-24T12:37:14.088715+01:00","chifflot-7","bmc_node_power_watt",494
"2021-03-24T12:37:19.089427+01:00","chifflot-7","bmc_node_power_watt",494
"2021-03-24T12:37:24.091076+01:00","chifflot-7","bmc_node_power_watt",494
"2021-03-24T12:37:29.093031+01:00","chifflot-7","bmc_node_power_watt",494
"2021-03-24T12:37:34.094104+01:00","chifflot-7","bmc_node_power_watt",494
"2021-03-24T12:37:39.096177+01:00","chifflot-7","bmc_node_power_watt",494
"2021-03-24T12:37:44.096049+01:00","chifflot-7","bmc_node_power_watt",494
"2021-03-24T12:37:49.097036+01:00","chifflot-7","bmc_node_power_watt",494
"2021-03-24T12:37:54.099412+01:00","chifflot-7","bmc_node_power_watt",494
"2021-03-24T12:37:59.099347+01:00","chifflot-7","bmc_node_power_watt",494
"2021-03-24T12:38:04.102013+01:00","chifflot-7","bmc_node_power_watt",494
"2021-03-24T12:38:09.104278+01:00","chifflot-7","bmc_node_power_watt",494
"2021-03-24T12:38:14.107731+01:00","chifflot-7","bmc_node_power_watt",494
"2021-03-24T12:38:19.108683+01:00","chifflot-7","bmc_node_power_watt",494
"2021-03-24T12:38:24.109354+01:00","chifflot-7","bmc_node_power_watt",494
"2021-03-24T12:38:29.110634+01:00","chifflot-7","bmc_node_power_watt",494
"2021-03-24T12:38:34.112776+01:00","chifflot-7","bmc_node_power_watt",494
"2021-03-24T12:38:39.11632+01:00","chifflot-7","bmc_node_power_watt",494
"2021-03-24T12:38:44.118014+01:00","chifflot-7","bmc_node_power_watt",494
"2021-03-24T12:38:49.121698+01:00","chifflot-7","bmc_node_power_watt",494
"2021-03-24T12:38:54.125336+01:00","chifflot-7","bmc_node_power_watt",494
"2021-03-24T12:38:59.127449+01:00","chifflot-7","bmc_node_power_watt",494
"2021-03-24T12:39:04.125956+01:00","chifflot-7","bmc_node_power_watt",494
"2021-03-24T12:39:09.126529+01:00","chifflot-7","bmc_node_power_watt",494
"2021-03-24T12:39:14.127665+01:00","chifflot-7","bmc_node_power_watt",494
"2021-03-24T12:39:19.127747+01:00","chifflot-7","bmc_node_power_watt",494
"2021-03-24T12:39:24.128746+01:00","chifflot-7","bmc_node_power_watt",494
"2021-03-24T12:39:29.129379+01:00","chifflot-7","bmc_node_power_watt",494
"2021-03-24T12:39:34.129913+01:00","chifflot-7","bmc_node_power_watt",494
"2021-03-24T12:39:39.130285+01:00","chifflot-7","bmc_node_power_watt",494
"2021-03-24T12:39:44.130848+01:00","chifflot-7","bmc_node_power_watt",494
"2021-03-24T12:39:49.13084+01:00","chifflot-7","bmc_node_power_watt",494
"2021-03-24T12:39:54.131514+01:00","chifflot-7","bmc_node_power_watt",494
"2021-03-24T12:39:59.132514+01:00","chifflot-7","bmc_node_power_watt",494
"2021-03-24T12:40:04.132481+01:00","chifflot-7","bmc_node_power_watt",520
"2021-03-24T12:40:09.132739+01:00","chifflot-7","bmc_node_power_watt",520
"2021-03-24T12:40:14.133752+01:00","chifflot-7","bmc_node_power_watt",520
"2021-03-24T12:40:19.134488+01:00","chifflot-7","bmc_node_power_watt",520
"2021-03-24T12:40:24.13885+01:00","chifflot-7","bmc_node_power_watt",520
"2021-03-24T12:40:29.137922+01:00","chifflot-7","bmc_node_power_watt",520
"2021-03-24T12:40:34.138884+01:00","chifflot-7","bmc_node_power_watt",520
"2021-03-24T12:40:39.139328+01:00","chifflot-7","bmc_node_power_watt",520
"2021-03-24T12:40:44.139785+01:00","chifflot-7","bmc_node_power_watt",520
"2021-03-24T12:40:49.140596+01:00","chifflot-7","bmc_node_power_watt",520
"2021-03-24T12:40:54.140622+01:00","chifflot-7","bmc_node_power_watt",494
"2021-03-24T12:40:59.140974+01:00","chifflot-7","bmc_node_power_watt",494
"2021-03-24T12:41:04.141507+01:00","chifflot-7","bmc_node_power_watt",494
"2021-03-24T12:41:09.14315+01:00","chifflot-7","bmc_node_power_watt",494
"2021-03-24T12:41:14.143744+01:00","chifflot-7","bmc_node_power_watt",494
"2021-03-24T12:41:19.144466+01:00","chifflot-7","bmc_node_power_watt",494
"2021-03-24T12:41:24.14467+01:00","chifflot-7","bmc_node_power_watt",494
"2021-03-24T12:41:29.146758+01:00","chifflot-7","bmc_node_power_watt",494
"2021-03-24T12:41:34.148287+01:00","chifflot-7","bmc_node_power_watt",494
"2021-03-24T12:41:39.148409+01:00","chifflot-7","bmc_node_power_watt",520
"2021-03-24T12:41:44.150058+01:00","chifflot-7","bmc_node_power_watt",520
"2021-03-24T12:41:49.151828+01:00","chifflot-7","bmc_node_power_watt",520
"2021-03-24T12:41:54.154639+01:00","chifflot-7","bmc_node_power_watt",520
"2021-03-24T12:41:59.154971+01:00","chifflot-7","bmc_node_power_watt",520
"2021-03-24T12:42:04.15612+01:00","chifflot-7","bmc_node_power_watt",494
"2021-03-24T12:42:09.155947+01:00","chifflot-7","bmc_node_power_watt",494
"2021-03-24T12:42:14.158358+01:00","chifflot-7","bmc_node_power_watt",494
"2021-03-24T12:42:19.159289+01:00","chifflot-7","bmc_node_power_watt",494
"2021-03-24T12:42:24.160852+01:00","chifflot-7","bmc_node_power_watt",494
"2021-03-24T12:42:29.161294+01:00","chifflot-7","bmc_node_power_watt",494
"2021-03-24T12:42:34.162739+01:00","chifflot-7","bmc_node_power_watt",494
"2021-03-24T12:42:39.164133+01:00","chifflot-7","bmc_node_power_watt",494
"2021-03-24T12:42:44.165045+01:00","chifflot-7","bmc_node_power_watt",494
"2021-03-24T12:42:49.16622+01:00","chifflot-7","bmc_node_power_watt",494
"2021-03-24T12:42:54.166347+01:00","chifflot-7","bmc_node_power_watt",494
"2021-03-24T12:42:59.168294+01:00","chifflot-7","bmc_node_power_watt",494
"2021-03-24T12:43:04.168637+01:00","chifflot-7","bmc_node_power_watt",494
"2021-03-24T12:43:09.169311+01:00","chifflot-7","bmc_node_power_watt",494
"2021-03-24T12:43:14.169794+01:00","chifflot-7","bmc_node_power_watt",494
"2021-03-24T12:43:19.170905+01:00","chifflot-7","bmc_node_power_watt",494
"2021-03-24T12:43:24.171436+01:00","chifflot-7","bmc_node_power_watt",494
"2021-03-24T12:43:29.172874+01:00","chifflot-7","bmc_node_power_watt",494
"2021-03-24T12:43:34.173758+01:00","chifflot-7","bmc_node_power_watt",494
"2021-03-24T12:43:39.174375+01:00","chifflot-7","bmc_node_power_watt",520
"2021-03-24T12:43:44.175416+01:00","chifflot-7","bmc_node_power_watt",520
"2021-03-24T12:43:49.176977+01:00","chifflot-7","bmc_node_power_watt",520
"2021-03-24T12:43:54.178297+01:00","chifflot-7","bmc_node_power_watt",520
"2021-03-24T12:43:59.18+01:00","chifflot-7","bmc_node_power_watt",520
"2021-03-24T12:44:04.179546+01:00","chifflot-7","bmc_node_power_watt",494
"2021-03-24T12:44:09.180224+01:00","chifflot-7","bmc_node_power_watt",494
"2021-03-24T12:44:14.181721+01:00","chifflot-7","bmc_node_power_watt",494
"2021-03-24T12:44:19.182029+01:00","chifflot-7","bmc_node_power_watt",494
"2021-03-24T12:44:24.184128+01:00","chifflot-7","bmc_node_power_watt",520
"2021-03-24T12:44:29.185883+01:00","chifflot-7","bmc_node_power_watt",520
"2021-03-24T12:44:34.187048+01:00","chifflot-7","bmc_node_power_watt",520
"2021-03-24T12:44:39.18947+01:00","chifflot-7","bmc_node_power_watt",520
"2021-03-24T12:44:44.191173+01:00","chifflot-7","bmc_node_power_watt",520
"2021-03-24T12:44:49.191243+01:00","chifflot-7","bmc_node_power_watt",520
"2021-03-24T12:44:54.192338+01:00","chifflot-7","bmc_node_power_watt",520
"2021-03-24T12:44:59.19265+01:00","chifflot-7","bmc_node_power_watt",520
"2021-03-24T12:45:04.194168+01:00","chifflot-7","bmc_node_power_watt",520
"2021-03-24T12:45:09.194832+01:00","chifflot-7","bmc_node_power_watt",520
"2021-03-24T12:45:14.195737+01:00","chifflot-7","bmc_node_power_watt",494
"2021-03-24T12:45:19.196295+01:00","chifflot-7","bmc_node_power_watt",494
"2021-03-24T12:45:24.197358+01:00","chifflot-7","bmc_node_power_watt",494
"2021-03-24T12:45:29.197711+01:00","chifflot-7","bmc_node_power_watt",494
"2021-03-24T12:45:34.198503+01:00","chifflot-7","bmc_node_power_watt",494
"2021-03-24T12:45:39.198581+01:00","chifflot-7","bmc_node_power_watt",494
"2021-03-24T12:45:44.199219+01:00","chifflot-7","bmc_node_power_watt",494
"2021-03-24T12:45:49.199779+01:00","chifflot-7","bmc_node_power_watt",494
"2021-03-24T12:45:54.202122+01:00","chifflot-7","bmc_node_power_watt",494
"2021-03-24T12:45:59.203025+01:00","chifflot-7","bmc_node_power_watt",520
"2021-03-24T12:46:04.206302+01:00","chifflot-7","bmc_node_power_watt",520
"2021-03-24T12:46:09.206119+01:00","chifflot-7","bmc_node_power_watt",520
"2021-03-24T12:46:14.206235+01:00","chifflot-7","bmc_node_power_watt",520
"2021-03-24T12:46:19.208099+01:00","chifflot-7","bmc_node_power_watt",520
"2021-03-24T12:46:24.208294+01:00","chifflot-7","bmc_node_power_watt",520
"2021-03-24T12:46:29.209273+01:00","chifflot-7","bmc_node_power_watt",520
"2021-03-24T12:46:34.20985+01:00","chifflot-7","bmc_node_power_watt",520
"2021-03-24T12:46:39.210808+01:00","chifflot-7","bmc_node_power_watt",520
"2021-03-24T12:46:44.211449+01:00","chifflot-7","bmc_node_power_watt",520
"2021-03-24T12:46:49.211603+01:00","chifflot-7","bmc_node_power_watt",520
"2021-03-24T12:46:54.212179+01:00","chifflot-7","bmc_node_power_watt",520
"2021-03-24T12:46:59.21348+01:00","chifflot-7","bmc_node_power_watt",520
"2021-03-24T12:47:04.214463+01:00","chifflot-7","bmc_node_power_watt",520
"2021-03-24T12:47:09.216477+01:00","chifflot-7","bmc_node_power_watt",520
"2021-03-24T12:47:14.217885+01:00","chifflot-7","bmc_node_power_watt",520
"2021-03-24T12:47:19.218694+01:00","chifflot-7","bmc_node_power_watt",520
"2021-03-24T12:47:24.221087+01:00","chifflot-7","bmc_node_power_watt",520
"2021-03-24T12:47:29.221481+01:00","chifflot-7","bmc_node_power_watt",520
"2021-03-24T12:47:34.221978+01:00","chifflot-7","bmc_node_power_watt",520
"2021-03-24T12:47:39.223787+01:00","chifflot-7","bmc_node_power_watt",520
"2021-03-24T12:47:44.225122+01:00","chifflot-7","bmc_node_power_watt",520
"2021-03-24T12:47:49.226126+01:00","chifflot-7","bmc_node_power_watt",520
"2021-03-24T12:47:54.227295+01:00","chifflot-7","bmc_node_power_watt",520
"2021-03-24T12:47:59.227507+01:00","chifflot-7","bmc_node_power_watt",520
"2021-03-24T12:48:04.229231+01:00","chifflot-7","bmc_node_power_watt",520
"2021-03-24T12:48:09.23035+01:00","chifflot-7","bmc_node_power_watt",520
"2021-03-24T12:48:14.230722+01:00","chifflot-7","bmc_node_power_watt",520
"2021-03-24T12:48:19.231448+01:00","chifflot-7","bmc_node_power_watt",520
"2021-03-24T12:48:24.233941+01:00","chifflot-7","bmc_node_power_watt",520
"2021-03-24T12:48:29.234375+01:00","chifflot-7","bmc_node_power_watt",520
"2021-03-24T12:48:34.234864+01:00","chifflot-7","bmc_node_power_watt",520
"2021-03-24T12:48:39.236038+01:00","chifflot-7","bmc_node_power_watt",520
"2021-03-24T12:48:44.237381+01:00","chifflot-7","bmc_node_power_watt",520
"2021-03-24T12:48:49.238563+01:00","chifflot-7","bmc_node_power_watt",494
"2021-03-24T12:48:54.239611+01:00","chifflot-7","bmc_node_power_watt",494
"2021-03-24T12:48:59.241239+01:00","chifflot-7","bmc_node_power_watt",494
"2021-03-24T12:49:04.24239+01:00","chifflot-7","bmc_node_power_watt",494
"2021-03-24T12:49:09.24329+01:00","chifflot-7","bmc_node_power_watt",520
"2021-03-24T12:49:14.24514+01:00","chifflot-7","bmc_node_power_watt",520
"2021-03-24T12:49:19.246735+01:00","chifflot-7","bmc_node_power_watt",520
"2021-03-24T12:49:24.247143+01:00","chifflot-7","bmc_node_power_watt",520
"2021-03-24T12:49:29.250631+01:00","chifflot-7","bmc_node_power_watt",520
"2021-03-24T12:49:34.251426+01:00","chifflot-7","bmc_node_power_watt",494
"2021-03-24T12:49:39.251358+01:00","chifflot-7","bmc_node_power_watt",494
"2021-03-24T12:49:44.253009+01:00","chifflot-7","bmc_node_power_watt",494
"2021-03-24T12:49:49.254379+01:00","chifflot-7","bmc_node_power_watt",494
"2021-03-24T12:49:54.25462+01:00","chifflot-7","bmc_node_power_watt",494
"2021-03-24T12:49:59.256289+01:00","chifflot-7","bmc_node_power_watt",520
"2021-03-24T12:50:04.268917+01:00","chifflot-7","bmc_node_power_watt",520
"2021-03-24T12:50:09.269552+01:00","chifflot-7","bmc_node_power_watt",520
"2021-03-24T12:50:14.270098+01:00","chifflot-7","bmc_node_power_watt",520
"2021-03-24T12:50:19.276902+01:00","chifflot-7","bmc_node_power_watt",520
"2021-03-24T12:50:24.27758+01:00","chifflot-7","bmc_node_power_watt",520
"2021-03-24T12:50:29.277681+01:00","chifflot-7","bmc_node_power_watt",520
"2021-03-24T12:50:34.28113+01:00","chifflot-7","bmc_node_power_watt",520
"2021-03-24T12:50:39.281273+01:00","chifflot-7","bmc_node_power_watt",520
"2021-03-24T12:50:44.281967+01:00","chifflot-7","bmc_node_power_watt",520
"2021-03-24T12:50:49.28241+01:00","chifflot-7","bmc_node_power_watt",520
"2021-03-24T12:50:54.282928+01:00","chifflot-7","bmc_node_power_watt",520
"2021-03-24T12:50:59.284648+01:00","chifflot-7","bmc_node_power_watt",520
"2021-03-24T12:51:04.28418+01:00","chifflot-7","bmc_node_power_watt",520
"2021-03-24T12:51:09.285079+01:00","chifflot-7","bmc_node_power_watt",520
"2021-03-24T12:51:14.286125+01:00","chifflot-7","bmc_node_power_watt",520
"2021-03-24T12:51:19.286766+01:00","chifflot-7","bmc_node_power_watt",520
"2021-03-24T12:51:24.287352+01:00","chifflot-7","bmc_node_power_watt",520
"2021-03-24T12:51:29.288444+01:00","chifflot-7","bmc_node_power_watt",520
"2021-03-24T12:51:34.288313+01:00","chifflot-7","bmc_node_power_watt",520
"2021-03-24T12:51:39.288908+01:00","chifflot-7","bmc_node_power_watt",520
"2021-03-24T12:51:44.29004+01:00","chifflot-7","bmc_node_power_watt",520
"2021-03-24T12:51:49.290598+01:00","chifflot-7","bmc_node_power_watt",520
"2021-03-24T12:51:54.291059+01:00","chifflot-7","bmc_node_power_watt",520
"2021-03-24T12:51:59.29119+01:00","chifflot-7","bmc_node_power_watt",494
"2021-03-24T12:52:04.291527+01:00","chifflot-7","bmc_node_power_watt",494
"2021-03-24T12:52:09.293152+01:00","chifflot-7","bmc_node_power_watt",494
"2021-03-24T12:52:14.293887+01:00","chifflot-7","bmc_node_power_watt",494
"2021-03-24T12:52:19.293659+01:00","chifflot-7","bmc_node_power_watt",494
"2021-03-24T12:52:24.297738+01:00","chifflot-7","bmc_node_power_watt",494
"2021-03-24T12:52:29.297477+01:00","chifflot-7","bmc_node_power_watt",494
"2021-03-24T12:52:34.297943+01:00","chifflot-7","bmc_node_power_watt",494
"2021-03-24T12:52:39.298587+01:00","chifflot-7","bmc_node_power_watt",494
"2021-03-24T12:52:44.298559+01:00","chifflot-7","bmc_node_power_watt",494
"2021-03-24T12:52:49.299754+01:00","chifflot-7","bmc_node_power_watt",494
"2021-03-24T12:52:54.300371+01:00","chifflot-7","bmc_node_power_watt",494
"2021-03-24T12:52:59.301191+01:00","chifflot-7","bmc_node_power_watt",494
"2021-03-24T12:53:04.302096+01:00","chifflot-7","bmc_node_power_watt",494
"2021-03-24T12:53:09.30292+01:00","chifflot-7","bmc_node_power_watt",494
"2021-03-24T12:53:14.303248+01:00","chifflot-7","bmc_node_power_watt",494
"2021-03-24T12:53:19.303712+01:00","chifflot-7","bmc_node_power_watt",494
"2021-03-24T12:53:24.30422+01:00","chifflot-7","bmc_node_power_watt",494
"2021-03-24T12:53:29.304891+01:00","chifflot-7","bmc_node_power_watt",494
"2021-03-24T12:53:34.305791+01:00","chifflot-7","bmc_node_power_watt",494
"2021-03-24T12:53:39.306467+01:00","chifflot-7","bmc_node_power_watt",494
"2021-03-24T12:53:44.306737+01:00","chifflot-7","bmc_node_power_watt",494
"2021-03-24T12:53:49.308322+01:00","chifflot-7","bmc_node_power_watt",494
"2021-03-24T12:53:54.309649+01:00","chifflot-7","bmc_node_power_watt",494
"2021-03-24T12:53:59.309768+01:00","chifflot-7","bmc_node_power_watt",494
"2021-03-24T12:54:04.311652+01:00","chifflot-7","bmc_node_power_watt",494
"2021-03-24T12:54:09.312003+01:00","chifflot-7","bmc_node_power_watt",494
"2021-03-24T12:54:14.312864+01:00","chifflot-7","bmc_node_power_watt",494
"2021-03-24T12:54:19.313862+01:00","chifflot-7","bmc_node_power_watt",494
"2021-03-24T12:54:24.314744+01:00","chifflot-7","bmc_node_power_watt",494
"2021-03-24T12:54:29.314816+01:00","chifflot-7","bmc_node_power_watt",494
"2021-03-24T12:54:34.316016+01:00","chifflot-7","bmc_node_power_watt",494
"2021-03-24T12:54:39.316797+01:00","chifflot-7","bmc_node_power_watt",494
"2021-03-24T12:54:44.317412+01:00","chifflot-7","bmc_node_power_watt",494
"2021-03-24T12:54:49.318496+01:00","chifflot-7","bmc_node_power_watt",494
