172.16.36.7  : 23.84 13.76 13.83 13.82 13.75 13.79 13.74 13.84 13.87 13.94
172.16.66.62 : 0.08 0.17 0.16 0.14 0.14 0.10 0.17 0.19 0.20 0.17
172.16.66.63 : 0.21 0.21 0.21 0.21 0.23 0.20 0.19 0.20 0.20 0.20
172.16.66.64 : 0.11 0.13 0.13 0.15 0.16 0.20 0.20 0.22 0.16 0.20
172.16.66.65 : 0.14 0.20 0.21 0.20 0.21 0.21 0.21 0.20 0.19 0.18
172.16.66.66 : 0.19 0.21 0.20 0.21 0.22 0.20 0.22 0.20 0.21 0.18
172.16.66.67 : 0.20 0.23 0.19 0.22 0.21 0.19 0.17 0.20 0.22 0.20
172.16.66.68 : 0.20 0.17 0.20 0.20 0.22 0.20 0.21 0.21 0.20 0.20
172.16.66.69 : 0.19 0.21 0.20 0.21 0.22 0.21 0.21 0.22 0.18 0.21
172.16.66.7  : 0.16 0.21 0.21 0.20 0.18 0.20 0.21 0.20 0.21 0.20
172.16.66.70 : 0.20 0.21 0.18 0.21 0.21 0.20 0.21 0.21 0.21 0.20
172.16.66.71 : 0.20 0.21 0.20 0.18 0.19 0.18 0.20 0.20 0.22 0.20
172.16.66.72 : 0.21 0.22 0.21 0.21 0.21 0.20 0.21 0.22 0.21 0.20
172.16.66.73 : 0.19 0.21 0.20 0.20 0.21 0.20 0.21 0.18 0.20 0.20
172.16.66.74 : 0.19 0.22 0.22 0.20 0.21 0.20 0.20 0.22 0.20 0.20
172.16.66.75 : 0.19 0.20 0.13 0.20 0.21 0.20 0.21 0.20 0.21 0.21
172.16.66.76 : 0.20 0.20 0.20 0.18 0.21 0.21 0.21 0.18 0.22 0.20
172.16.66.77 : 0.22 0.22 0.21 0.22 0.21 0.21 0.21 0.20 0.19 0.21
172.16.66.78 : 0.22 0.22 0.20 0.19 0.21 0.16 0.17 0.16 0.17 0.16
172.16.66.79 : 0.29 0.20 0.20 0.20 0.21 0.21 0.20 0.20 0.18 0.21
172.16.66.8  : 0.04 0.03 0.03 0.03 0.03 0.03 0.03 0.03 0.04 0.03
172.16.66.80 : 0.33 0.21 0.20 0.20 0.21 0.15 0.09 0.04 0.13 0.14
172.16.66.81 : 0.33 0.21 0.20 0.18 0.21 0.21 0.21 0.21 0.20 0.20
172.16.66.82 : 0.23 0.16 0.17 0.17 0.20 0.22 0.21 0.20 0.21 0.22
172.16.66.83 : 0.34 0.21 0.22 0.21 0.20 0.20 0.19 0.21 0.12 0.21
172.16.66.84 : 0.34 0.18 0.21 0.21 0.20 0.21 0.21 0.21 0.21 0.18
172.16.66.85 : 0.32 0.19 0.20 0.19 0.21 0.21 0.18 0.21 0.21 0.20
172.16.66.86 : 0.38 0.21 0.20 0.20 0.19 0.18 0.18 0.21 0.20 0.21
172.16.66.87 : 0.35 0.21 0.21 0.19 0.17 0.20 0.21 0.20 0.21 0.22
172.16.66.88 : 0.34 0.20 0.21 0.21 0.22 0.21 0.18 0.21 0.21 0.20
172.16.66.89 : 0.35 0.15 0.20 0.20 0.20 0.20 0.18 0.19 0.19 0.21
172.16.66.9  : 0.31 0.20 0.21 0.18 0.21 0.20 0.20 0.22 0.21 0.20
172.16.66.90 : 0.34 0.21 0.20 0.21 0.20 0.21 0.21 0.21 0.20 0.21
172.16.66.91 : 0.36 0.21 0.21 0.20 0.20 0.20 0.20 0.20 0.20 0.22
172.16.66.92 : 0.32 0.20 0.21 0.21 0.20 0.19 0.18 0.21 0.20 0.21
172.16.66.93 : 0.32 0.22 0.18 0.20 0.21 0.21 0.21 0.18 0.21 0.21
172.16.66.94 : 0.31 0.20 0.22 0.19 0.22 0.21 0.20 0.22 0.20 0.19
172.16.66.95 : 0.33 0.21 0.20 0.19 0.18 0.20 0.21 0.21 0.21 0.17
172.16.66.96 : 0.30 0.20 0.20 0.24 0.21 0.13 0.20 0.19 0.19 0.22
172.16.66.97 : 0.32 0.14 0.21 0.20 0.21 0.21 0.18 0.21 0.21 0.21
172.16.66.98 : 0.34 0.20 0.21 0.20 0.16 0.15 0.13 0.16 0.16 0.15
172.16.66.99 : 0.32 0.20 0.20 0.21 0.21 0.20 0.20 0.20 0.21 0.19

      42 targets
      42 alive
       0 unreachable
       0 unknown addresses

       0 timeouts (waiting for response)
     420 ICMP Echos sent
     420 ICMP Echo Replies received
       0 other ICMP received

 0.03 ms (min round trip time)
 0.54 ms (avg round trip time)
 23.8 ms (max round trip time)
        9.419 sec (elapsed real time)

