172.16.36.7 : 4.42 4.36 4.29 4.24 4.24 4.29 4.34 - 4.27 4.26
172.16.39.8 : 0.03 0.01 0.01 0.01 0.01 0.01 0.01 0.01 0.01 0.01
172.16.39.6 : 0.23 0.10 0.18 0.14 0.12 0.18 0.09 0.19 0.13 0.14

       3 targets
       3 alive
       0 unreachable
       0 unknown addresses

       1 timeouts (waiting for response)
      30 ICMP Echos sent
      29 ICMP Echo Replies received
       0 other ICMP received

 0.01 ms (min round trip time)
 1.39 ms (avg round trip time)
 4.42 ms (max round trip time)
       10.012 sec (elapsed real time)

