"2021-03-24T05:57:28.304827+01:00","chifflot-8","bmc_node_power_watt",468
"2021-03-24T05:57:33.30808+01:00","chifflot-8","bmc_node_power_watt",468
"2021-03-24T05:57:38.308486+01:00","chifflot-8","bmc_node_power_watt",468
"2021-03-24T05:57:43.308907+01:00","chifflot-8","bmc_node_power_watt",468
"2021-03-24T05:57:48.311243+01:00","chifflot-8","bmc_node_power_watt",468
"2021-03-24T05:57:53.312104+01:00","chifflot-8","bmc_node_power_watt",468
"2021-03-24T05:57:58.314075+01:00","chifflot-8","bmc_node_power_watt",468
"2021-03-24T05:58:03.315341+01:00","chifflot-8","bmc_node_power_watt",468
"2021-03-24T05:58:08.317037+01:00","chifflot-8","bmc_node_power_watt",468
"2021-03-24T05:58:13.318188+01:00","chifflot-8","bmc_node_power_watt",468
"2021-03-24T05:58:18.319945+01:00","chifflot-8","bmc_node_power_watt",468
"2021-03-24T05:58:23.321368+01:00","chifflot-8","bmc_node_power_watt",468
"2021-03-24T05:58:28.321745+01:00","chifflot-8","bmc_node_power_watt",468
"2021-03-24T05:58:33.323073+01:00","chifflot-8","bmc_node_power_watt",468
"2021-03-24T05:58:38.324818+01:00","chifflot-8","bmc_node_power_watt",494
"2021-03-24T05:58:43.32501+01:00","chifflot-8","bmc_node_power_watt",494
"2021-03-24T05:58:48.326042+01:00","chifflot-8","bmc_node_power_watt",494
"2021-03-24T05:58:53.32784+01:00","chifflot-8","bmc_node_power_watt",494
"2021-03-24T05:58:58.32812+01:00","chifflot-8","bmc_node_power_watt",494
"2021-03-24T05:59:03.328993+01:00","chifflot-8","bmc_node_power_watt",494
"2021-03-24T05:59:08.330443+01:00","chifflot-8","bmc_node_power_watt",494
"2021-03-24T05:59:13.335899+01:00","chifflot-8","bmc_node_power_watt",494
"2021-03-24T05:59:18.337037+01:00","chifflot-8","bmc_node_power_watt",494
"2021-03-24T05:59:23.338026+01:00","chifflot-8","bmc_node_power_watt",468
"2021-03-24T05:59:28.339414+01:00","chifflot-8","bmc_node_power_watt",468
"2021-03-24T05:59:33.33964+01:00","chifflot-8","bmc_node_power_watt",468
"2021-03-24T05:59:38.341513+01:00","chifflot-8","bmc_node_power_watt",468
"2021-03-24T05:59:43.343839+01:00","chifflot-8","bmc_node_power_watt",468
"2021-03-24T05:59:48.344294+01:00","chifflot-8","bmc_node_power_watt",468
"2021-03-24T05:59:53.346184+01:00","chifflot-8","bmc_node_power_watt",468
"2021-03-24T05:59:58.347141+01:00","chifflot-8","bmc_node_power_watt",468
"2021-03-24T06:00:03.34845+01:00","chifflot-8","bmc_node_power_watt",468
"2021-03-24T06:00:08.349283+01:00","chifflot-8","bmc_node_power_watt",468
"2021-03-24T06:00:13.350824+01:00","chifflot-8","bmc_node_power_watt",468
"2021-03-24T06:00:18.352396+01:00","chifflot-8","bmc_node_power_watt",468
"2021-03-24T06:00:23.353568+01:00","chifflot-8","bmc_node_power_watt",468
"2021-03-24T06:00:28.355366+01:00","chifflot-8","bmc_node_power_watt",468
"2021-03-24T06:00:33.356816+01:00","chifflot-8","bmc_node_power_watt",468
"2021-03-24T06:00:38.357904+01:00","chifflot-8","bmc_node_power_watt",468
"2021-03-24T06:00:43.359527+01:00","chifflot-8","bmc_node_power_watt",468
"2021-03-24T06:00:48.359859+01:00","chifflot-8","bmc_node_power_watt",468
"2021-03-24T06:00:53.360013+01:00","chifflot-8","bmc_node_power_watt",468
"2021-03-24T06:00:58.361439+01:00","chifflot-8","bmc_node_power_watt",468
"2021-03-24T06:01:03.363118+01:00","chifflot-8","bmc_node_power_watt",468
"2021-03-24T06:01:08.364349+01:00","chifflot-8","bmc_node_power_watt",468
"2021-03-24T06:01:13.365677+01:00","chifflot-8","bmc_node_power_watt",468
"2021-03-24T06:01:18.365279+01:00","chifflot-8","bmc_node_power_watt",468
"2021-03-24T06:01:23.366311+01:00","chifflot-8","bmc_node_power_watt",468
"2021-03-24T06:01:28.368014+01:00","chifflot-8","bmc_node_power_watt",468
"2021-03-24T06:01:33.368689+01:00","chifflot-8","bmc_node_power_watt",468
"2021-03-24T06:01:38.369005+01:00","chifflot-8","bmc_node_power_watt",468
"2021-03-24T06:01:43.369782+01:00","chifflot-8","bmc_node_power_watt",468
"2021-03-24T06:01:48.370536+01:00","chifflot-8","bmc_node_power_watt",468
"2021-03-24T06:01:53.371872+01:00","chifflot-8","bmc_node_power_watt",468
"2021-03-24T06:01:58.372876+01:00","chifflot-8","bmc_node_power_watt",468
"2021-03-24T06:02:03.373656+01:00","chifflot-8","bmc_node_power_watt",468
"2021-03-24T06:02:08.373837+01:00","chifflot-8","bmc_node_power_watt",468
"2021-03-24T06:02:13.374453+01:00","chifflot-8","bmc_node_power_watt",468
"2021-03-24T06:02:18.374832+01:00","chifflot-8","bmc_node_power_watt",468
"2021-03-24T06:02:23.374968+01:00","chifflot-8","bmc_node_power_watt",468
"2021-03-24T06:02:28.375931+01:00","chifflot-8","bmc_node_power_watt",468
"2021-03-24T06:02:33.377337+01:00","chifflot-8","bmc_node_power_watt",468
"2021-03-24T06:02:38.37911+01:00","chifflot-8","bmc_node_power_watt",468
"2021-03-24T06:02:43.379755+01:00","chifflot-8","bmc_node_power_watt",468
"2021-03-24T06:02:48.380144+01:00","chifflot-8","bmc_node_power_watt",468
"2021-03-24T06:02:53.382356+01:00","chifflot-8","bmc_node_power_watt",468
"2021-03-24T06:02:58.383638+01:00","chifflot-8","bmc_node_power_watt",468
"2021-03-24T06:03:03.384005+01:00","chifflot-8","bmc_node_power_watt",468
"2021-03-24T06:03:08.385229+01:00","chifflot-8","bmc_node_power_watt",468
"2021-03-24T06:03:13.385844+01:00","chifflot-8","bmc_node_power_watt",468
"2021-03-24T06:03:18.386932+01:00","chifflot-8","bmc_node_power_watt",468
"2021-03-24T06:03:23.388548+01:00","chifflot-8","bmc_node_power_watt",468
"2021-03-24T06:03:28.388075+01:00","chifflot-8","bmc_node_power_watt",468
"2021-03-24T06:03:33.389581+01:00","chifflot-8","bmc_node_power_watt",468
"2021-03-24T06:03:38.390733+01:00","chifflot-8","bmc_node_power_watt",468
"2021-03-24T06:03:43.391402+01:00","chifflot-8","bmc_node_power_watt",468
"2021-03-24T06:03:48.393711+01:00","chifflot-8","bmc_node_power_watt",468
"2021-03-24T06:03:53.395898+01:00","chifflot-8","bmc_node_power_watt",468
"2021-03-24T06:03:58.396097+01:00","chifflot-8","bmc_node_power_watt",468
"2021-03-24T06:04:03.396474+01:00","chifflot-8","bmc_node_power_watt",468
"2021-03-24T06:04:08.397823+01:00","chifflot-8","bmc_node_power_watt",468
"2021-03-24T06:04:13.399852+01:00","chifflot-8","bmc_node_power_watt",468
"2021-03-24T06:04:18.399966+01:00","chifflot-8","bmc_node_power_watt",468
"2021-03-24T06:04:23.401739+01:00","chifflot-8","bmc_node_power_watt",468
"2021-03-24T06:04:28.403276+01:00","chifflot-8","bmc_node_power_watt",468
"2021-03-24T06:04:33.403306+01:00","chifflot-8","bmc_node_power_watt",468
"2021-03-24T06:04:38.404394+01:00","chifflot-8","bmc_node_power_watt",468
"2021-03-24T06:04:43.407532+01:00","chifflot-8","bmc_node_power_watt",468
"2021-03-24T06:04:48.409441+01:00","chifflot-8","bmc_node_power_watt",468
"2021-03-24T06:04:53.41254+01:00","chifflot-8","bmc_node_power_watt",468
"2021-03-24T06:04:58.415697+01:00","chifflot-8","bmc_node_power_watt",468
"2021-03-24T06:05:03.414278+01:00","chifflot-8","bmc_node_power_watt",468
"2021-03-24T06:05:08.417709+01:00","chifflot-8","bmc_node_power_watt",468
"2021-03-24T06:05:13.419934+01:00","chifflot-8","bmc_node_power_watt",468
"2021-03-24T06:05:18.42569+01:00","chifflot-8","bmc_node_power_watt",494
"2021-03-24T06:05:23.430259+01:00","chifflot-8","bmc_node_power_watt",494
"2021-03-24T06:05:28.434875+01:00","chifflot-8","bmc_node_power_watt",494
"2021-03-24T06:05:33.434036+01:00","chifflot-8","bmc_node_power_watt",494
"2021-03-24T06:05:38.435523+01:00","chifflot-8","bmc_node_power_watt",494
"2021-03-24T06:05:43.438549+01:00","chifflot-8","bmc_node_power_watt",468
"2021-03-24T06:05:48.440026+01:00","chifflot-8","bmc_node_power_watt",468
"2021-03-24T06:05:53.441106+01:00","chifflot-8","bmc_node_power_watt",468
"2021-03-24T06:05:58.442797+01:00","chifflot-8","bmc_node_power_watt",468
"2021-03-24T06:06:03.443535+01:00","chifflot-8","bmc_node_power_watt",468
"2021-03-24T06:06:08.443592+01:00","chifflot-8","bmc_node_power_watt",468
"2021-03-24T06:06:13.443955+01:00","chifflot-8","bmc_node_power_watt",468
"2021-03-24T06:06:18.444616+01:00","chifflot-8","bmc_node_power_watt",468
"2021-03-24T06:06:23.445261+01:00","chifflot-8","bmc_node_power_watt",468
"2021-03-24T06:06:28.446737+01:00","chifflot-8","bmc_node_power_watt",468
"2021-03-24T06:06:33.44743+01:00","chifflot-8","bmc_node_power_watt",468
"2021-03-24T06:06:38.44764+01:00","chifflot-8","bmc_node_power_watt",468
"2021-03-24T06:06:43.448026+01:00","chifflot-8","bmc_node_power_watt",468
"2021-03-24T06:06:48.448648+01:00","chifflot-8","bmc_node_power_watt",468
"2021-03-24T06:06:53.44929+01:00","chifflot-8","bmc_node_power_watt",468
"2021-03-24T06:06:58.449869+01:00","chifflot-8","bmc_node_power_watt",468
"2021-03-24T06:07:03.450576+01:00","chifflot-8","bmc_node_power_watt",468
"2021-03-24T06:07:08.452452+01:00","chifflot-8","bmc_node_power_watt",468
"2021-03-24T06:07:13.453118+01:00","chifflot-8","bmc_node_power_watt",468
"2021-03-24T06:07:18.454018+01:00","chifflot-8","bmc_node_power_watt",468
"2021-03-24T06:07:23.455122+01:00","chifflot-8","bmc_node_power_watt",468
"2021-03-24T06:07:28.456381+01:00","chifflot-8","bmc_node_power_watt",468
"2021-03-24T06:07:33.456822+01:00","chifflot-8","bmc_node_power_watt",468
"2021-03-24T06:07:38.458101+01:00","chifflot-8","bmc_node_power_watt",468
"2021-03-24T06:07:43.459593+01:00","chifflot-8","bmc_node_power_watt",494
"2021-03-24T06:07:48.460885+01:00","chifflot-8","bmc_node_power_watt",494
"2021-03-24T06:07:53.461555+01:00","chifflot-8","bmc_node_power_watt",494
"2021-03-24T06:07:58.462753+01:00","chifflot-8","bmc_node_power_watt",494
"2021-03-24T06:08:03.465675+01:00","chifflot-8","bmc_node_power_watt",494
"2021-03-24T06:08:08.46895+01:00","chifflot-8","bmc_node_power_watt",468
"2021-03-24T06:08:13.469999+01:00","chifflot-8","bmc_node_power_watt",468
"2021-03-24T06:08:18.470529+01:00","chifflot-8","bmc_node_power_watt",468
"2021-03-24T06:08:23.472122+01:00","chifflot-8","bmc_node_power_watt",468
"2021-03-24T06:08:28.472984+01:00","chifflot-8","bmc_node_power_watt",468
"2021-03-24T06:08:33.474666+01:00","chifflot-8","bmc_node_power_watt",468
"2021-03-24T06:08:38.476105+01:00","chifflot-8","bmc_node_power_watt",468
"2021-03-24T06:08:43.477852+01:00","chifflot-8","bmc_node_power_watt",468
"2021-03-24T06:08:48.478624+01:00","chifflot-8","bmc_node_power_watt",468
"2021-03-24T06:08:53.47976+01:00","chifflot-8","bmc_node_power_watt",468
"2021-03-24T06:08:58.481855+01:00","chifflot-8","bmc_node_power_watt",468
"2021-03-24T06:09:03.482968+01:00","chifflot-8","bmc_node_power_watt",468
"2021-03-24T06:09:08.484342+01:00","chifflot-8","bmc_node_power_watt",468
"2021-03-24T06:09:13.484268+01:00","chifflot-8","bmc_node_power_watt",468
"2021-03-24T06:09:18.486157+01:00","chifflot-8","bmc_node_power_watt",468
"2021-03-24T06:09:23.48671+01:00","chifflot-8","bmc_node_power_watt",468
"2021-03-24T06:09:28.488587+01:00","chifflot-8","bmc_node_power_watt",468
"2021-03-24T06:09:33.489985+01:00","chifflot-8","bmc_node_power_watt",468
"2021-03-24T06:09:38.490846+01:00","chifflot-8","bmc_node_power_watt",468
"2021-03-24T06:09:43.493231+01:00","chifflot-8","bmc_node_power_watt",468
"2021-03-24T06:09:48.494823+01:00","chifflot-8","bmc_node_power_watt",468
"2021-03-24T06:09:53.495509+01:00","chifflot-8","bmc_node_power_watt",468
"2021-03-24T06:09:58.497449+01:00","chifflot-8","bmc_node_power_watt",468
"2021-03-24T06:10:03.497731+01:00","chifflot-8","bmc_node_power_watt",468
"2021-03-24T06:10:08.500448+01:00","chifflot-8","bmc_node_power_watt",468
"2021-03-24T06:10:13.500279+01:00","chifflot-8","bmc_node_power_watt",468
"2021-03-24T06:10:18.504631+01:00","chifflot-8","bmc_node_power_watt",468
"2021-03-24T06:10:23.50452+01:00","chifflot-8","bmc_node_power_watt",468
"2021-03-24T06:10:28.505604+01:00","chifflot-8","bmc_node_power_watt",468
"2021-03-24T06:10:33.506633+01:00","chifflot-8","bmc_node_power_watt",468
"2021-03-24T06:10:38.510261+01:00","chifflot-8","bmc_node_power_watt",468
"2021-03-24T06:10:43.509553+01:00","chifflot-8","bmc_node_power_watt",468
"2021-03-24T06:10:48.510473+01:00","chifflot-8","bmc_node_power_watt",468
"2021-03-24T06:10:53.510957+01:00","chifflot-8","bmc_node_power_watt",494
"2021-03-24T06:10:58.513372+01:00","chifflot-8","bmc_node_power_watt",494
"2021-03-24T06:11:03.514471+01:00","chifflot-8","bmc_node_power_watt",494
"2021-03-24T06:11:08.514454+01:00","chifflot-8","bmc_node_power_watt",494
"2021-03-24T06:11:13.514498+01:00","chifflot-8","bmc_node_power_watt",494
"2021-03-24T06:11:18.51622+01:00","chifflot-8","bmc_node_power_watt",494
"2021-03-24T06:11:23.518161+01:00","chifflot-8","bmc_node_power_watt",494
"2021-03-24T06:11:28.520464+01:00","chifflot-8","bmc_node_power_watt",494
"2021-03-24T06:11:33.523443+01:00","chifflot-8","bmc_node_power_watt",494
"2021-03-24T06:11:38.526031+01:00","chifflot-8","bmc_node_power_watt",494
"2021-03-24T06:11:43.527304+01:00","chifflot-8","bmc_node_power_watt",494
"2021-03-24T06:11:48.527947+01:00","chifflot-8","bmc_node_power_watt",494
"2021-03-24T06:11:53.529148+01:00","chifflot-8","bmc_node_power_watt",494
"2021-03-24T06:11:58.529342+01:00","chifflot-8","bmc_node_power_watt",494
"2021-03-24T06:12:03.52987+01:00","chifflot-8","bmc_node_power_watt",468
"2021-03-24T06:12:08.532553+01:00","chifflot-8","bmc_node_power_watt",468
"2021-03-24T06:12:13.533736+01:00","chifflot-8","bmc_node_power_watt",468
"2021-03-24T06:12:18.534116+01:00","chifflot-8","bmc_node_power_watt",468
"2021-03-24T06:12:23.535221+01:00","chifflot-8","bmc_node_power_watt",468
"2021-03-24T06:12:28.537843+01:00","chifflot-8","bmc_node_power_watt",468
"2021-03-24T06:12:33.539438+01:00","chifflot-8","bmc_node_power_watt",468
"2021-03-24T06:12:38.539589+01:00","chifflot-8","bmc_node_power_watt",468
"2021-03-24T06:12:43.540932+01:00","chifflot-8","bmc_node_power_watt",468
"2021-03-24T06:12:48.541507+01:00","chifflot-8","bmc_node_power_watt",468
"2021-03-24T06:12:53.54425+01:00","chifflot-8","bmc_node_power_watt",468
"2021-03-24T06:12:58.545741+01:00","chifflot-8","bmc_node_power_watt",468
"2021-03-24T06:13:03.5467+01:00","chifflot-8","bmc_node_power_watt",468
"2021-03-24T06:13:08.549291+01:00","chifflot-8","bmc_node_power_watt",468
"2021-03-24T06:13:13.549307+01:00","chifflot-8","bmc_node_power_watt",468
"2021-03-24T06:13:18.549417+01:00","chifflot-8","bmc_node_power_watt",468
"2021-03-24T06:13:23.550152+01:00","chifflot-8","bmc_node_power_watt",468
"2021-03-24T06:13:28.553393+01:00","chifflot-8","bmc_node_power_watt",468
"2021-03-24T06:13:33.553992+01:00","chifflot-8","bmc_node_power_watt",468
"2021-03-24T06:13:38.555784+01:00","chifflot-8","bmc_node_power_watt",494
"2021-03-24T06:13:43.556219+01:00","chifflot-8","bmc_node_power_watt",494
"2021-03-24T06:13:48.557212+01:00","chifflot-8","bmc_node_power_watt",494
"2021-03-24T06:13:53.559179+01:00","chifflot-8","bmc_node_power_watt",494
"2021-03-24T06:13:58.561818+01:00","chifflot-8","bmc_node_power_watt",494
"2021-03-24T06:14:03.562274+01:00","chifflot-8","bmc_node_power_watt",494
"2021-03-24T06:14:08.56301+01:00","chifflot-8","bmc_node_power_watt",494
"2021-03-24T06:14:13.563171+01:00","chifflot-8","bmc_node_power_watt",494
"2021-03-24T06:14:18.5653+01:00","chifflot-8","bmc_node_power_watt",494
"2021-03-24T06:14:23.567187+01:00","chifflot-8","bmc_node_power_watt",494
"2021-03-24T06:14:28.567831+01:00","chifflot-8","bmc_node_power_watt",468
"2021-03-24T06:14:33.568708+01:00","chifflot-8","bmc_node_power_watt",468
"2021-03-24T06:14:38.568743+01:00","chifflot-8","bmc_node_power_watt",468
"2021-03-24T06:14:43.57199+01:00","chifflot-8","bmc_node_power_watt",468
"2021-03-24T06:14:48.573241+01:00","chifflot-8","bmc_node_power_watt",468
"2021-03-24T06:14:53.574358+01:00","chifflot-8","bmc_node_power_watt",468
"2021-03-24T06:14:58.574343+01:00","chifflot-8","bmc_node_power_watt",468
"2021-03-24T06:15:03.576621+01:00","chifflot-8","bmc_node_power_watt",468
"2021-03-24T06:15:08.577332+01:00","chifflot-8","bmc_node_power_watt",468
"2021-03-24T06:15:13.578846+01:00","chifflot-8","bmc_node_power_watt",468
"2021-03-24T06:15:18.580322+01:00","chifflot-8","bmc_node_power_watt",468
"2021-03-24T06:15:23.580651+01:00","chifflot-8","bmc_node_power_watt",468
"2021-03-24T06:15:28.583567+01:00","chifflot-8","bmc_node_power_watt",468
"2021-03-24T06:15:33.586166+01:00","chifflot-8","bmc_node_power_watt",468
"2021-03-24T06:15:38.586843+01:00","chifflot-8","bmc_node_power_watt",468
"2021-03-24T06:15:43.587196+01:00","chifflot-8","bmc_node_power_watt",468
"2021-03-24T06:15:48.587674+01:00","chifflot-8","bmc_node_power_watt",468
"2021-03-24T06:15:53.588969+01:00","chifflot-8","bmc_node_power_watt",468
"2021-03-24T06:15:58.591332+01:00","chifflot-8","bmc_node_power_watt",468
"2021-03-24T06:16:03.591435+01:00","chifflot-8","bmc_node_power_watt",468
"2021-03-24T06:16:08.59286+01:00","chifflot-8","bmc_node_power_watt",468
"2021-03-24T06:16:13.594144+01:00","chifflot-8","bmc_node_power_watt",468
"2021-03-24T06:16:18.596279+01:00","chifflot-8","bmc_node_power_watt",468
"2021-03-24T06:16:23.596419+01:00","chifflot-8","bmc_node_power_watt",468
"2021-03-24T06:16:28.596228+01:00","chifflot-8","bmc_node_power_watt",468
"2021-03-24T06:16:33.60184+01:00","chifflot-8","bmc_node_power_watt",468
"2021-03-24T06:16:38.600935+01:00","chifflot-8","bmc_node_power_watt",468
"2021-03-24T06:16:43.602762+01:00","chifflot-8","bmc_node_power_watt",468
"2021-03-24T06:16:48.602674+01:00","chifflot-8","bmc_node_power_watt",468
"2021-03-24T06:16:53.602999+01:00","chifflot-8","bmc_node_power_watt",468
"2021-03-24T06:16:58.606222+01:00","chifflot-8","bmc_node_power_watt",468
"2021-03-24T06:17:03.606383+01:00","chifflot-8","bmc_node_power_watt",468
"2021-03-24T06:17:08.607615+01:00","chifflot-8","bmc_node_power_watt",468
"2021-03-24T06:17:13.608979+01:00","chifflot-8","bmc_node_power_watt",494
"2021-03-24T06:17:18.610174+01:00","chifflot-8","bmc_node_power_watt",494
"2021-03-24T06:17:23.612913+01:00","chifflot-8","bmc_node_power_watt",494
"2021-03-24T06:17:28.612207+01:00","chifflot-8","bmc_node_power_watt",494
"2021-03-24T06:17:33.617615+01:00","chifflot-8","bmc_node_power_watt",494
"2021-03-24T06:17:38.617307+01:00","chifflot-8","bmc_node_power_watt",468
"2021-03-24T06:17:43.6177+01:00","chifflot-8","bmc_node_power_watt",468
"2021-03-24T06:17:48.61835+01:00","chifflot-8","bmc_node_power_watt",468
"2021-03-24T06:17:53.618554+01:00","chifflot-8","bmc_node_power_watt",468
"2021-03-24T06:17:58.619507+01:00","chifflot-8","bmc_node_power_watt",468
"2021-03-24T06:18:03.619742+01:00","chifflot-8","bmc_node_power_watt",468
"2021-03-24T06:18:08.621243+01:00","chifflot-8","bmc_node_power_watt",468
"2021-03-24T06:18:13.621516+01:00","chifflot-8","bmc_node_power_watt",468
"2021-03-24T06:18:18.622068+01:00","chifflot-8","bmc_node_power_watt",468
"2021-03-24T06:18:23.623015+01:00","chifflot-8","bmc_node_power_watt",468
"2021-03-24T06:18:28.625099+01:00","chifflot-8","bmc_node_power_watt",468
"2021-03-24T06:18:33.627622+01:00","chifflot-8","bmc_node_power_watt",468
"2021-03-24T06:18:38.628607+01:00","chifflot-8","bmc_node_power_watt",468
"2021-03-24T06:18:43.629376+01:00","chifflot-8","bmc_node_power_watt",468
"2021-03-24T06:18:48.629579+01:00","chifflot-8","bmc_node_power_watt",468
"2021-03-24T06:18:53.629769+01:00","chifflot-8","bmc_node_power_watt",468
"2021-03-24T06:18:58.630605+01:00","chifflot-8","bmc_node_power_watt",468
"2021-03-24T06:19:03.631033+01:00","chifflot-8","bmc_node_power_watt",468
"2021-03-24T06:19:08.632476+01:00","chifflot-8","bmc_node_power_watt",468
"2021-03-24T06:19:13.633063+01:00","chifflot-8","bmc_node_power_watt",468
"2021-03-24T06:19:18.633539+01:00","chifflot-8","bmc_node_power_watt",468
"2021-03-24T06:19:23.633903+01:00","chifflot-8","bmc_node_power_watt",468
"2021-03-24T06:19:28.634465+01:00","chifflot-8","bmc_node_power_watt",468
"2021-03-24T06:19:33.635183+01:00","chifflot-8","bmc_node_power_watt",468
"2021-03-24T06:19:38.636286+01:00","chifflot-8","bmc_node_power_watt",468
"2021-03-24T06:19:43.636386+01:00","chifflot-8","bmc_node_power_watt",468
"2021-03-24T06:19:48.636721+01:00","chifflot-8","bmc_node_power_watt",468
"2021-03-24T06:19:53.637397+01:00","chifflot-8","bmc_node_power_watt",468
"2021-03-24T06:19:58.637687+01:00","chifflot-8","bmc_node_power_watt",468
"2021-03-24T06:20:03.640051+01:00","chifflot-8","bmc_node_power_watt",468
"2021-03-24T06:20:08.639508+01:00","chifflot-8","bmc_node_power_watt",468
"2021-03-24T06:20:13.641568+01:00","chifflot-8","bmc_node_power_watt",468
"2021-03-24T06:20:18.643433+01:00","chifflot-8","bmc_node_power_watt",468
"2021-03-24T06:20:23.645301+01:00","chifflot-8","bmc_node_power_watt",494
