172.16.36.8 : 0.26 0.17 0.20 0.20 0.17 0.16 0.16 0.19 0.19 0.20
172.16.38.8 : 0.21 0.20 0.17 0.15 0.16 0.21 0.14 0.18 0.16 0.17
172.16.38.4 : 0.04 0.05 0.03 0.03 0.03 0.03 0.03 0.03 0.03 0.03

       3 targets
       3 alive
       0 unreachable
       0 unknown addresses

       0 timeouts (waiting for response)
      30 ICMP Echos sent
      30 ICMP Echo Replies received
       0 other ICMP received

 0.03 ms (min round trip time)
 0.13 ms (avg round trip time)
 0.26 ms (max round trip time)
        9.030 sec (elapsed real time)

